lucene-dev mailing list archives

Site index · List index
Message view « Date » · « Thread »
Top « Date » · « Thread »
From Policeman Jenkins Server <jenk...@thetaphi.de>
Subject [JENKINS] Lucene-Solr-master-Windows (64bit/jdk-10.0.1) - Build # 7683 - Unstable!
Date Tue, 08 Jan 2019 06:49:27 GMT
Build: https://jenkins.thetaphi.de/job/Lucene-Solr-master-Windows/7683/
Java: 64bit/jdk-10.0.1 -XX:-UseCompressedOops -XX:+UseParallelGC

13 tests failed.
FAILED:  org.apache.solr.client.solrj.request.TestUpdateRequestCodec.simple

Error Message:
doc#0 diff values for field: desc expected:<[one, 1]> but was:<[one, 1]>

Stack Trace:
junit.framework.AssertionFailedError: doc#0 diff values for field: desc expected:<[one, 1]> but was:<[one, 1]>
	at __randomizedtesting.SeedInfo.seed([7D78F1E62F9DCBA7:FE1147E048E09349]:0)
	at junit.framework.Assert.fail(Assert.java:57)
	at junit.framework.Assert.failNotEquals(Assert.java:329)
	at junit.framework.Assert.assertEquals(Assert.java:78)
	at org.apache.solr.client.solrj.request.TestUpdateRequestCodec.compareDocs(TestUpdateRequestCodec.java:254)
	at org.apache.solr.client.solrj.request.TestUpdateRequestCodec.simple(TestUpdateRequestCodec.java:103)
	at java.base/jdk.internal.reflect.NativeMethodAccessorImpl.invoke0(Native Method)
	at java.base/jdk.internal.reflect.NativeMethodAccessorImpl.invoke(NativeMethodAccessorImpl.java:62)
	at java.base/jdk.internal.reflect.DelegatingMethodAccessorImpl.invoke(DelegatingMethodAccessorImpl.java:43)
	at java.base/java.lang.reflect.Method.invoke(Method.java:564)
	at com.carrotsearch.randomizedtesting.RandomizedRunner.invoke(RandomizedRunner.java:1750)
	at com.carrotsearch.randomizedtesting.RandomizedRunner$8.evaluate(RandomizedRunner.java:938)
	at com.carrotsearch.randomizedtesting.RandomizedRunner$9.evaluate(RandomizedRunner.java:974)
	at com.carrotsearch.randomizedtesting.RandomizedRunner$10.evaluate(RandomizedRunner.java:988)
	at org.apache.lucene.util.TestRuleSetupTeardownChained$1.evaluate(TestRuleSetupTeardownChained.java:49)
	at org.apache.lucene.util.AbstractBeforeAfterRule$1.evaluate(AbstractBeforeAfterRule.java:45)
	at org.apache.lucene.util.TestRuleThreadAndTestName$1.evaluate(TestRuleThreadAndTestName.java:48)
	at org.apache.lucene.util.TestRuleIgnoreAfterMaxFailures$1.evaluate(TestRuleIgnoreAfterMaxFailures.java:64)
	at org.apache.lucene.util.TestRuleMarkFailure$1.evaluate(TestRuleMarkFailure.java:47)
	at com.carrotsearch.randomizedtesting.rules.StatementAdapter.evaluate(StatementAdapter.java:36)
	at com.carrotsearch.randomizedtesting.ThreadLeakControl$StatementRunner.run(ThreadLeakControl.java:368)
	at com.carrotsearch.randomizedtesting.ThreadLeakControl.forkTimeoutingTask(ThreadLeakControl.java:817)
	at com.carrotsearch.randomizedtesting.ThreadLeakControl$3.evaluate(ThreadLeakControl.java:468)
	at com.carrotsearch.randomizedtesting.RandomizedRunner.runSingleTest(RandomizedRunner.java:947)
	at com.carrotsearch.randomizedtesting.RandomizedRunner$5.evaluate(RandomizedRunner.java:832)
	at com.carrotsearch.randomizedtesting.RandomizedRunner$6.evaluate(RandomizedRunner.java:883)
	at com.carrotsearch.randomizedtesting.RandomizedRunner$7.evaluate(RandomizedRunner.java:894)
	at org.apache.lucene.util.AbstractBeforeAfterRule$1.evaluate(AbstractBeforeAfterRule.java:45)
	at com.carrotsearch.randomizedtesting.rules.StatementAdapter.evaluate(StatementAdapter.java:36)
	at org.apache.lucene.util.TestRuleStoreClassName$1.evaluate(TestRuleStoreClassName.java:41)
	at com.carrotsearch.randomizedtesting.rules.NoShadowingOrOverridesOnMethodsRule$1.evaluate(NoShadowingOrOverridesOnMethodsRule.java:40)
	at com.carrotsearch.randomizedtesting.rules.NoShadowingOrOverridesOnMethodsRule$1.evaluate(NoShadowingOrOverridesOnMethodsRule.java:40)
	at com.carrotsearch.randomizedtesting.rules.StatementAdapter.evaluate(StatementAdapter.java:36)
	at com.carrotsearch.randomizedtesting.rules.StatementAdapter.evaluate(StatementAdapter.java:36)
	at org.apache.lucene.util.TestRuleAssertionsRequired$1.evaluate(TestRuleAssertionsRequired.java:53)
	at org.apache.lucene.util.TestRuleMarkFailure$1.evaluate(TestRuleMarkFailure.java:47)
	at org.apache.lucene.util.TestRuleIgnoreAfterMaxFailures$1.evaluate(TestRuleIgnoreAfterMaxFailures.java:64)
	at org.apache.lucene.util.TestRuleIgnoreTestSuites$1.evaluate(TestRuleIgnoreTestSuites.java:54)
	at com.carrotsearch.randomizedtesting.rules.StatementAdapter.evaluate(StatementAdapter.java:36)
	at com.carrotsearch.randomizedtesting.ThreadLeakControl$StatementRunner.run(ThreadLeakControl.java:368)
	at java.base/java.lang.Thread.run(Thread.java:844)


FAILED:  org.apache.solr.client.solrj.request.TestUpdateRequestCodec.testBackCompat4_5

Error Message:
doc#0 diff values for field: desc expected:<[one, 1]> but was:<[one, 1]>

Stack Trace:
junit.framework.AssertionFailedError: doc#0 diff values for field: desc expected:<[one, 1]> but was:<[one, 1]>
	at __randomizedtesting.SeedInfo.seed([7D78F1E62F9DCBA7:F6C3C9F554CCF82E]:0)
	at junit.framework.Assert.fail(Assert.java:57)
	at junit.framework.Assert.failNotEquals(Assert.java:329)
	at junit.framework.Assert.assertEquals(Assert.java:78)
	at org.apache.solr.client.solrj.request.TestUpdateRequestCodec.compareDocs(TestUpdateRequestCodec.java:254)
	at org.apache.solr.client.solrj.request.TestUpdateRequestCodec.testBackCompat4_5(TestUpdateRequestCodec.java:222)
	at java.base/jdk.internal.reflect.NativeMethodAccessorImpl.invoke0(Native Method)
	at java.base/jdk.internal.reflect.NativeMethodAccessorImpl.invoke(NativeMethodAccessorImpl.java:62)
	at java.base/jdk.internal.reflect.DelegatingMethodAccessorImpl.invoke(DelegatingMethodAccessorImpl.java:43)
	at java.base/java.lang.reflect.Method.invoke(Method.java:564)
	at com.carrotsearch.randomizedtesting.RandomizedRunner.invoke(RandomizedRunner.java:1750)
	at com.carrotsearch.randomizedtesting.RandomizedRunner$8.evaluate(RandomizedRunner.java:938)
	at com.carrotsearch.randomizedtesting.RandomizedRunner$9.evaluate(RandomizedRunner.java:974)
	at com.carrotsearch.randomizedtesting.RandomizedRunner$10.evaluate(RandomizedRunner.java:988)
	at org.apache.lucene.util.TestRuleSetupTeardownChained$1.evaluate(TestRuleSetupTeardownChained.java:49)
	at org.apache.lucene.util.AbstractBeforeAfterRule$1.evaluate(AbstractBeforeAfterRule.java:45)
	at org.apache.lucene.util.TestRuleThreadAndTestName$1.evaluate(TestRuleThreadAndTestName.java:48)
	at org.apache.lucene.util.TestRuleIgnoreAfterMaxFailures$1.evaluate(TestRuleIgnoreAfterMaxFailures.java:64)
	at org.apache.lucene.util.TestRuleMarkFailure$1.evaluate(TestRuleMarkFailure.java:47)
	at com.carrotsearch.randomizedtesting.rules.StatementAdapter.evaluate(StatementAdapter.java:36)
	at com.carrotsearch.randomizedtesting.ThreadLeakControl$StatementRunner.run(ThreadLeakControl.java:368)
	at com.carrotsearch.randomizedtesting.ThreadLeakControl.forkTimeoutingTask(ThreadLeakControl.java:817)
	at com.carrotsearch.randomizedtesting.ThreadLeakControl$3.evaluate(ThreadLeakControl.java:468)
	at com.carrotsearch.randomizedtesting.RandomizedRunner.runSingleTest(RandomizedRunner.java:947)
	at com.carrotsearch.randomizedtesting.RandomizedRunner$5.evaluate(RandomizedRunner.java:832)
	at com.carrotsearch.randomizedtesting.RandomizedRunner$6.evaluate(RandomizedRunner.java:883)
	at com.carrotsearch.randomizedtesting.RandomizedRunner$7.evaluate(RandomizedRunner.java:894)
	at org.apache.lucene.util.AbstractBeforeAfterRule$1.evaluate(AbstractBeforeAfterRule.java:45)
	at com.carrotsearch.randomizedtesting.rules.StatementAdapter.evaluate(StatementAdapter.java:36)
	at org.apache.lucene.util.TestRuleStoreClassName$1.evaluate(TestRuleStoreClassName.java:41)
	at com.carrotsearch.randomizedtesting.rules.NoShadowingOrOverridesOnMethodsRule$1.evaluate(NoShadowingOrOverridesOnMethodsRule.java:40)
	at com.carrotsearch.randomizedtesting.rules.NoShadowingOrOverridesOnMethodsRule$1.evaluate(NoShadowingOrOverridesOnMethodsRule.java:40)
	at com.carrotsearch.randomizedtesting.rules.StatementAdapter.evaluate(StatementAdapter.java:36)
	at com.carrotsearch.randomizedtesting.rules.StatementAdapter.evaluate(StatementAdapter.java:36)
	at org.apache.lucene.util.TestRuleAssertionsRequired$1.evaluate(TestRuleAssertionsRequired.java:53)
	at org.apache.lucene.util.TestRuleMarkFailure$1.evaluate(TestRuleMarkFailure.java:47)
	at org.apache.lucene.util.TestRuleIgnoreAfterMaxFailures$1.evaluate(TestRuleIgnoreAfterMaxFailures.java:64)
	at org.apache.lucene.util.TestRuleIgnoreTestSuites$1.evaluate(TestRuleIgnoreTestSuites.java:54)
	at com.carrotsearch.randomizedtesting.rules.StatementAdapter.evaluate(StatementAdapter.java:36)
	at com.carrotsearch.randomizedtesting.ThreadLeakControl$StatementRunner.run(ThreadLeakControl.java:368)
	at java.base/java.lang.Thread.run(Thread.java:844)


FAILED:  org.apache.solr.client.solrj.request.TestUpdateRequestCodec.simple

Error Message:
doc#0 diff values for field: desc expected:<[one, 1]> but was:<[one, 1]>

Stack Trace:
junit.framework.AssertionFailedError: doc#0 diff values for field: desc expected:<[one, 1]> but was:<[one, 1]>
	at __randomizedtesting.SeedInfo.seed([7D78F1E62F9DCBA7:FE1147E048E09349]:0)
	at junit.framework.Assert.fail(Assert.java:57)
	at junit.framework.Assert.failNotEquals(Assert.java:329)
	at junit.framework.Assert.assertEquals(Assert.java:78)
	at org.apache.solr.client.solrj.request.TestUpdateRequestCodec.compareDocs(TestUpdateRequestCodec.java:254)
	at org.apache.solr.client.solrj.request.TestUpdateRequestCodec.simple(TestUpdateRequestCodec.java:103)
	at java.base/jdk.internal.reflect.NativeMethodAccessorImpl.invoke0(Native Method)
	at java.base/jdk.internal.reflect.NativeMethodAccessorImpl.invoke(NativeMethodAccessorImpl.java:62)
	at java.base/jdk.internal.reflect.DelegatingMethodAccessorImpl.invoke(DelegatingMethodAccessorImpl.java:43)
	at java.base/java.lang.reflect.Method.invoke(Method.java:564)
	at com.carrotsearch.randomizedtesting.RandomizedRunner.invoke(RandomizedRunner.java:1750)
	at com.carrotsearch.randomizedtesting.RandomizedRunner$8.evaluate(RandomizedRunner.java:938)
	at com.carrotsearch.randomizedtesting.RandomizedRunner$9.evaluate(RandomizedRunner.java:974)
	at com.carrotsearch.randomizedtesting.RandomizedRunner$10.evaluate(RandomizedRunner.java:988)
	at org.apache.lucene.util.TestRuleSetupTeardownChained$1.evaluate(TestRuleSetupTeardownChained.java:49)
	at org.apache.lucene.util.AbstractBeforeAfterRule$1.evaluate(AbstractBeforeAfterRule.java:45)
	at org.apache.lucene.util.TestRuleThreadAndTestName$1.evaluate(TestRuleThreadAndTestName.java:48)
	at org.apache.lucene.util.TestRuleIgnoreAfterMaxFailures$1.evaluate(TestRuleIgnoreAfterMaxFailures.java:64)
	at org.apache.lucene.util.TestRuleMarkFailure$1.evaluate(TestRuleMarkFailure.java:47)
	at com.carrotsearch.randomizedtesting.rules.StatementAdapter.evaluate(StatementAdapter.java:36)
	at com.carrotsearch.randomizedtesting.ThreadLeakControl$StatementRunner.run(ThreadLeakControl.java:368)
	at com.carrotsearch.randomizedtesting.ThreadLeakControl.forkTimeoutingTask(ThreadLeakControl.java:817)
	at com.carrotsearch.randomizedtesting.ThreadLeakControl$3.evaluate(ThreadLeakControl.java:468)
	at com.carrotsearch.randomizedtesting.RandomizedRunner.runSingleTest(RandomizedRunner.java:947)
	at com.carrotsearch.randomizedtesting.RandomizedRunner$5.evaluate(RandomizedRunner.java:832)
	at com.carrotsearch.randomizedtesting.RandomizedRunner$6.evaluate(RandomizedRunner.java:883)
	at com.carrotsearch.randomizedtesting.RandomizedRunner$7.evaluate(RandomizedRunner.java:894)
	at org.apache.lucene.util.AbstractBeforeAfterRule$1.evaluate(AbstractBeforeAfterRule.java:45)
	at com.carrotsearch.randomizedtesting.rules.StatementAdapter.evaluate(StatementAdapter.java:36)
	at org.apache.lucene.util.TestRuleStoreClassName$1.evaluate(TestRuleStoreClassName.java:41)
	at com.carrotsearch.randomizedtesting.rules.NoShadowingOrOverridesOnMethodsRule$1.evaluate(NoShadowingOrOverridesOnMethodsRule.java:40)
	at com.carrotsearch.randomizedtesting.rules.NoShadowingOrOverridesOnMethodsRule$1.evaluate(NoShadowingOrOverridesOnMethodsRule.java:40)
	at com.carrotsearch.randomizedtesting.rules.StatementAdapter.evaluate(StatementAdapter.java:36)
	at com.carrotsearch.randomizedtesting.rules.StatementAdapter.evaluate(StatementAdapter.java:36)
	at org.apache.lucene.util.TestRuleAssertionsRequired$1.evaluate(TestRuleAssertionsRequired.java:53)
	at org.apache.lucene.util.TestRuleMarkFailure$1.evaluate(TestRuleMarkFailure.java:47)
	at org.apache.lucene.util.TestRuleIgnoreAfterMaxFailures$1.evaluate(TestRuleIgnoreAfterMaxFailures.java:64)
	at org.apache.lucene.util.TestRuleIgnoreTestSuites$1.evaluate(TestRuleIgnoreTestSuites.java:54)
	at com.carrotsearch.randomizedtesting.rules.StatementAdapter.evaluate(StatementAdapter.java:36)
	at com.carrotsearch.randomizedtesting.ThreadLeakControl$StatementRunner.run(ThreadLeakControl.java:368)
	at java.base/java.lang.Thread.run(Thread.java:844)


FAILED:  org.apache.solr.client.solrj.request.TestUpdateRequestCodec.testBackCompat4_5

Error Message:
doc#0 diff values for field: desc expected:<[one, 1]> but was:<[one, 1]>

Stack Trace:
junit.framework.AssertionFailedError: doc#0 diff values for field: desc expected:<[one, 1]> but was:<[one, 1]>
	at __randomizedtesting.SeedInfo.seed([7D78F1E62F9DCBA7:F6C3C9F554CCF82E]:0)
	at junit.framework.Assert.fail(Assert.java:57)
	at junit.framework.Assert.failNotEquals(Assert.java:329)
	at junit.framework.Assert.assertEquals(Assert.java:78)
	at org.apache.solr.client.solrj.request.TestUpdateRequestCodec.compareDocs(TestUpdateRequestCodec.java:254)
	at org.apache.solr.client.solrj.request.TestUpdateRequestCodec.testBackCompat4_5(TestUpdateRequestCodec.java:222)
	at java.base/jdk.internal.reflect.NativeMethodAccessorImpl.invoke0(Native Method)
	at java.base/jdk.internal.reflect.NativeMethodAccessorImpl.invoke(NativeMethodAccessorImpl.java:62)
	at java.base/jdk.internal.reflect.DelegatingMethodAccessorImpl.invoke(DelegatingMethodAccessorImpl.java:43)
	at java.base/java.lang.reflect.Method.invoke(Method.java:564)
	at com.carrotsearch.randomizedtesting.RandomizedRunner.invoke(RandomizedRunner.java:1750)
	at com.carrotsearch.randomizedtesting.RandomizedRunner$8.evaluate(RandomizedRunner.java:938)
	at com.carrotsearch.randomizedtesting.RandomizedRunner$9.evaluate(RandomizedRunner.java:974)
	at com.carrotsearch.randomizedtesting.RandomizedRunner$10.evaluate(RandomizedRunner.java:988)
	at org.apache.lucene.util.TestRuleSetupTeardownChained$1.evaluate(TestRuleSetupTeardownChained.java:49)
	at org.apache.lucene.util.AbstractBeforeAfterRule$1.evaluate(AbstractBeforeAfterRule.java:45)
	at org.apache.lucene.util.TestRuleThreadAndTestName$1.evaluate(TestRuleThreadAndTestName.java:48)
	at org.apache.lucene.util.TestRuleIgnoreAfterMaxFailures$1.evaluate(TestRuleIgnoreAfterMaxFailures.java:64)
	at org.apache.lucene.util.TestRuleMarkFailure$1.evaluate(TestRuleMarkFailure.java:47)
	at com.carrotsearch.randomizedtesting.rules.StatementAdapter.evaluate(StatementAdapter.java:36)
	at com.carrotsearch.randomizedtesting.ThreadLeakControl$StatementRunner.run(ThreadLeakControl.java:368)
	at com.carrotsearch.randomizedtesting.ThreadLeakControl.forkTimeoutingTask(ThreadLeakControl.java:817)
	at com.carrotsearch.randomizedtesting.ThreadLeakControl$3.evaluate(ThreadLeakControl.java:468)
	at com.carrotsearch.randomizedtesting.RandomizedRunner.runSingleTest(RandomizedRunner.java:947)
	at com.carrotsearch.randomizedtesting.RandomizedRunner$5.evaluate(RandomizedRunner.java:832)
	at com.carrotsearch.randomizedtesting.RandomizedRunner$6.evaluate(RandomizedRunner.java:883)
	at com.carrotsearch.randomizedtesting.RandomizedRunner$7.evaluate(RandomizedRunner.java:894)
	at org.apache.lucene.util.AbstractBeforeAfterRule$1.evaluate(AbstractBeforeAfterRule.java:45)
	at com.carrotsearch.randomizedtesting.rules.StatementAdapter.evaluate(StatementAdapter.java:36)
	at org.apache.lucene.util.TestRuleStoreClassName$1.evaluate(TestRuleStoreClassName.java:41)
	at com.carrotsearch.randomizedtesting.rules.NoShadowingOrOverridesOnMethodsRule$1.evaluate(NoShadowingOrOverridesOnMethodsRule.java:40)
	at com.carrotsearch.randomizedtesting.rules.NoShadowingOrOverridesOnMethodsRule$1.evaluate(NoShadowingOrOverridesOnMethodsRule.java:40)
	at com.carrotsearch.randomizedtesting.rules.StatementAdapter.evaluate(StatementAdapter.java:36)
	at com.carrotsearch.randomizedtesting.rules.StatementAdapter.evaluate(StatementAdapter.java:36)
	at org.apache.lucene.util.TestRuleAssertionsRequired$1.evaluate(TestRuleAssertionsRequired.java:53)
	at org.apache.lucene.util.TestRuleMarkFailure$1.evaluate(TestRuleMarkFailure.java:47)
	at org.apache.lucene.util.TestRuleIgnoreAfterMaxFailures$1.evaluate(TestRuleIgnoreAfterMaxFailures.java:64)
	at org.apache.lucene.util.TestRuleIgnoreTestSuites$1.evaluate(TestRuleIgnoreTestSuites.java:54)
	at com.carrotsearch.randomizedtesting.rules.StatementAdapter.evaluate(StatementAdapter.java:36)
	at com.carrotsearch.randomizedtesting.ThreadLeakControl$StatementRunner.run(ThreadLeakControl.java:368)
	at java.base/java.lang.Thread.run(Thread.java:844)


FAILED:  org.apache.solr.client.solrj.request.TestUpdateRequestCodec.testIteratable

Error Message:
iterVal contents expected:<[iterItem1, iterItem2]> but was:<[iterItem1, iterItem2]>

Stack Trace:
junit.framework.AssertionFailedError: iterVal contents expected:<[iterItem1, iterItem2]> but was:<[iterItem1, iterItem2]>
	at __randomizedtesting.SeedInfo.seed([7D78F1E62F9DCBA7:65543AEE2A2B6195]:0)
	at junit.framework.Assert.fail(Assert.java:57)
	at junit.framework.Assert.failNotEquals(Assert.java:329)
	at junit.framework.Assert.assertEquals(Assert.java:78)
	at org.apache.solr.client.solrj.request.TestUpdateRequestCodec.testIteratable(TestUpdateRequestCodec.java:159)
	at java.base/jdk.internal.reflect.NativeMethodAccessorImpl.invoke0(Native Method)
	at java.base/jdk.internal.reflect.NativeMethodAccessorImpl.invoke(NativeMethodAccessorImpl.java:62)
	at java.base/jdk.internal.reflect.DelegatingMethodAccessorImpl.invoke(DelegatingMethodAccessorImpl.java:43)
	at java.base/java.lang.reflect.Method.invoke(Method.java:564)
	at com.carrotsearch.randomizedtesting.RandomizedRunner.invoke(RandomizedRunner.java:1750)
	at com.carrotsearch.randomizedtesting.RandomizedRunner$8.evaluate(RandomizedRunner.java:938)
	at com.carrotsearch.randomizedtesting.RandomizedRunner$9.evaluate(RandomizedRunner.java:974)
	at com.carrotsearch.randomizedtesting.RandomizedRunner$10.evaluate(RandomizedRunner.java:988)
	at org.apache.lucene.util.TestRuleSetupTeardownChained$1.evaluate(TestRuleSetupTeardownChained.java:49)
	at org.apache.lucene.util.AbstractBeforeAfterRule$1.evaluate(AbstractBeforeAfterRule.java:45)
	at org.apache.lucene.util.TestRuleThreadAndTestName$1.evaluate(TestRuleThreadAndTestName.java:48)
	at org.apache.lucene.util.TestRuleIgnoreAfterMaxFailures$1.evaluate(TestRuleIgnoreAfterMaxFailures.java:64)
	at org.apache.lucene.util.TestRuleMarkFailure$1.evaluate(TestRuleMarkFailure.java:47)
	at com.carrotsearch.randomizedtesting.rules.StatementAdapter.evaluate(StatementAdapter.java:36)
	at com.carrotsearch.randomizedtesting.ThreadLeakControl$StatementRunner.run(ThreadLeakControl.java:368)
	at com.carrotsearch.randomizedtesting.ThreadLeakControl.forkTimeoutingTask(ThreadLeakControl.java:817)
	at com.carrotsearch.randomizedtesting.ThreadLeakControl$3.evaluate(ThreadLeakControl.java:468)
	at com.carrotsearch.randomizedtesting.RandomizedRunner.runSingleTest(RandomizedRunner.java:947)
	at com.carrotsearch.randomizedtesting.RandomizedRunner$5.evaluate(RandomizedRunner.java:832)
	at com.carrotsearch.randomizedtesting.RandomizedRunner$6.evaluate(RandomizedRunner.java:883)
	at com.carrotsearch.randomizedtesting.RandomizedRunner$7.evaluate(RandomizedRunner.java:894)
	at org.apache.lucene.util.AbstractBeforeAfterRule$1.evaluate(AbstractBeforeAfterRule.java:45)
	at com.carrotsearch.randomizedtesting.rules.StatementAdapter.evaluate(StatementAdapter.java:36)
	at org.apache.lucene.util.TestRuleStoreClassName$1.evaluate(TestRuleStoreClassName.java:41)
	at com.carrotsearch.randomizedtesting.rules.NoShadowingOrOverridesOnMethodsRule$1.evaluate(NoShadowingOrOverridesOnMethodsRule.java:40)
	at com.carrotsearch.randomizedtesting.rules.NoShadowingOrOverridesOnMethodsRule$1.evaluate(NoShadowingOrOverridesOnMethodsRule.java:40)
	at com.carrotsearch.randomizedtesting.rules.StatementAdapter.evaluate(StatementAdapter.java:36)
	at com.carrotsearch.randomizedtesting.rules.StatementAdapter.evaluate(StatementAdapter.java:36)
	at org.apache.lucene.util.TestRuleAssertionsRequired$1.evaluate(TestRuleAssertionsRequired.java:53)
	at org.apache.lucene.util.TestRuleMarkFailure$1.evaluate(TestRuleMarkFailure.java:47)
	at org.apache.lucene.util.TestRuleIgnoreAfterMaxFailures$1.evaluate(TestRuleIgnoreAfterMaxFailures.java:64)
	at org.apache.lucene.util.TestRuleIgnoreTestSuites$1.evaluate(TestRuleIgnoreTestSuites.java:54)
	at com.carrotsearch.randomizedtesting.rules.StatementAdapter.evaluate(StatementAdapter.java:36)
	at com.carrotsearch.randomizedtesting.ThreadLeakControl$StatementRunner.run(ThreadLeakControl.java:368)
	at java.base/java.lang.Thread.run(Thread.java:844)


FAILED:  org.apache.solr.client.solrj.request.TestUpdateRequestCodec.simple

Error Message:
doc#0 diff values for field: desc expected:<[one, 1]> but was:<[one, 1]>

Stack Trace:
junit.framework.AssertionFailedError: doc#0 diff values for field: desc expected:<[one, 1]> but was:<[one, 1]>
	at __randomizedtesting.SeedInfo.seed([7D78F1E62F9DCBA7:FE1147E048E09349]:0)
	at junit.framework.Assert.fail(Assert.java:57)
	at junit.framework.Assert.failNotEquals(Assert.java:329)
	at junit.framework.Assert.assertEquals(Assert.java:78)
	at org.apache.solr.client.solrj.request.TestUpdateRequestCodec.compareDocs(TestUpdateRequestCodec.java:254)
	at org.apache.solr.client.solrj.request.TestUpdateRequestCodec.simple(TestUpdateRequestCodec.java:103)
	at java.base/jdk.internal.reflect.NativeMethodAccessorImpl.invoke0(Native Method)
	at java.base/jdk.internal.reflect.NativeMethodAccessorImpl.invoke(NativeMethodAccessorImpl.java:62)
	at java.base/jdk.internal.reflect.DelegatingMethodAccessorImpl.invoke(DelegatingMethodAccessorImpl.java:43)
	at java.base/java.lang.reflect.Method.invoke(Method.java:564)
	at com.carrotsearch.randomizedtesting.RandomizedRunner.invoke(RandomizedRunner.java:1750)
	at com.carrotsearch.randomizedtesting.RandomizedRunner$8.evaluate(RandomizedRunner.java:938)
	at com.carrotsearch.randomizedtesting.RandomizedRunner$9.evaluate(RandomizedRunner.java:974)
	at com.carrotsearch.randomizedtesting.RandomizedRunner$10.evaluate(RandomizedRunner.java:988)
	at org.apache.lucene.util.TestRuleSetupTeardownChained$1.evaluate(TestRuleSetupTeardownChained.java:49)
	at org.apache.lucene.util.AbstractBeforeAfterRule$1.evaluate(AbstractBeforeAfterRule.java:45)
	at org.apache.lucene.util.TestRuleThreadAndTestName$1.evaluate(TestRuleThreadAndTestName.java:48)
	at org.apache.lucene.util.TestRuleIgnoreAfterMaxFailures$1.evaluate(TestRuleIgnoreAfterMaxFailures.java:64)
	at org.apache.lucene.util.TestRuleMarkFailure$1.evaluate(TestRuleMarkFailure.java:47)
	at com.carrotsearch.randomizedtesting.rules.StatementAdapter.evaluate(StatementAdapter.java:36)
	at com.carrotsearch.randomizedtesting.ThreadLeakControl$StatementRunner.run(ThreadLeakControl.java:368)
	at com.carrotsearch.randomizedtesting.ThreadLeakControl.forkTimeoutingTask(ThreadLeakControl.java:817)
	at com.carrotsearch.randomizedtesting.ThreadLeakControl$3.evaluate(ThreadLeakControl.java:468)
	at com.carrotsearch.randomizedtesting.RandomizedRunner.runSingleTest(RandomizedRunner.java:947)
	at com.carrotsearch.randomizedtesting.RandomizedRunner$5.evaluate(RandomizedRunner.java:832)
	at com.carrotsearch.randomizedtesting.RandomizedRunner$6.evaluate(RandomizedRunner.java:883)
	at com.carrotsearch.randomizedtesting.RandomizedRunner$7.evaluate(RandomizedRunner.java:894)
	at org.apache.lucene.util.AbstractBeforeAfterRule$1.evaluate(AbstractBeforeAfterRule.java:45)
	at com.carrotsearch.randomizedtesting.rules.StatementAdapter.evaluate(StatementAdapter.java:36)
	at org.apache.lucene.util.TestRuleStoreClassName$1.evaluate(TestRuleStoreClassName.java:41)
	at com.carrotsearch.randomizedtesting.rules.NoShadowingOrOverridesOnMethodsRule$1.evaluate(NoShadowingOrOverridesOnMethodsRule.java:40)
	at com.carrotsearch.randomizedtesting.rules.NoShadowingOrOverridesOnMethodsRule$1.evaluate(NoShadowingOrOverridesOnMethodsRule.java:40)
	at com.carrotsearch.randomizedtesting.rules.StatementAdapter.evaluate(StatementAdapter.java:36)
	at com.carrotsearch.randomizedtesting.rules.StatementAdapter.evaluate(StatementAdapter.java:36)
	at org.apache.lucene.util.TestRuleAssertionsRequired$1.evaluate(TestRuleAssertionsRequired.java:53)
	at org.apache.lucene.util.TestRuleMarkFailure$1.evaluate(TestRuleMarkFailure.java:47)
	at org.apache.lucene.util.TestRuleIgnoreAfterMaxFailures$1.evaluate(TestRuleIgnoreAfterMaxFailures.java:64)
	at org.apache.lucene.util.TestRuleIgnoreTestSuites$1.evaluate(TestRuleIgnoreTestSuites.java:54)
	at com.carrotsearch.randomizedtesting.rules.StatementAdapter.evaluate(StatementAdapter.java:36)
	at com.carrotsearch.randomizedtesting.ThreadLeakControl$StatementRunner.run(ThreadLeakControl.java:368)
	at java.base/java.lang.Thread.run(Thread.java:844)


FAILED:  org.apache.solr.client.solrj.request.TestUpdateRequestCodec.testBackCompat4_5

Error Message:
doc#0 diff values for field: desc expected:<[one, 1]> but was:<[one, 1]>

Stack Trace:
junit.framework.AssertionFailedError: doc#0 diff values for field: desc expected:<[one, 1]> but was:<[one, 1]>
	at __randomizedtesting.SeedInfo.seed([7D78F1E62F9DCBA7:F6C3C9F554CCF82E]:0)
	at junit.framework.Assert.fail(Assert.java:57)
	at junit.framework.Assert.failNotEquals(Assert.java:329)
	at junit.framework.Assert.assertEquals(Assert.java:78)
	at org.apache.solr.client.solrj.request.TestUpdateRequestCodec.compareDocs(TestUpdateRequestCodec.java:254)
	at org.apache.solr.client.solrj.request.TestUpdateRequestCodec.testBackCompat4_5(TestUpdateRequestCodec.java:222)
	at java.base/jdk.internal.reflect.NativeMethodAccessorImpl.invoke0(Native Method)
	at java.base/jdk.internal.reflect.NativeMethodAccessorImpl.invoke(NativeMethodAccessorImpl.java:62)
	at java.base/jdk.internal.reflect.DelegatingMethodAccessorImpl.invoke(DelegatingMethodAccessorImpl.java:43)
	at java.base/java.lang.reflect.Method.invoke(Method.java:564)
	at com.carrotsearch.randomizedtesting.RandomizedRunner.invoke(RandomizedRunner.java:1750)
	at com.carrotsearch.randomizedtesting.RandomizedRunner$8.evaluate(RandomizedRunner.java:938)
	at com.carrotsearch.randomizedtesting.RandomizedRunner$9.evaluate(RandomizedRunner.java:974)
	at com.carrotsearch.randomizedtesting.RandomizedRunner$10.evaluate(RandomizedRunner.java:988)
	at org.apache.lucene.util.TestRuleSetupTeardownChained$1.evaluate(TestRuleSetupTeardownChained.java:49)
	at org.apache.lucene.util.AbstractBeforeAfterRule$1.evaluate(AbstractBeforeAfterRule.java:45)
	at org.apache.lucene.util.TestRuleThreadAndTestName$1.evaluate(TestRuleThreadAndTestName.java:48)
	at org.apache.lucene.util.TestRuleIgnoreAfterMaxFailures$1.evaluate(TestRuleIgnoreAfterMaxFailures.java:64)
	at org.apache.lucene.util.TestRuleMarkFailure$1.evaluate(TestRuleMarkFailure.java:47)
	at com.carrotsearch.randomizedtesting.rules.StatementAdapter.evaluate(StatementAdapter.java:36)
	at com.carrotsearch.randomizedtesting.ThreadLeakControl$StatementRunner.run(ThreadLeakControl.java:368)
	at com.carrotsearch.randomizedtesting.ThreadLeakControl.forkTimeoutingTask(ThreadLeakControl.java:817)
	at com.carrotsearch.randomizedtesting.ThreadLeakControl$3.evaluate(ThreadLeakControl.java:468)
	at com.carrotsearch.randomizedtesting.RandomizedRunner.runSingleTest(RandomizedRunner.java:947)
	at com.carrotsearch.randomizedtesting.RandomizedRunner$5.evaluate(RandomizedRunner.java:832)
	at com.carrotsearch.randomizedtesting.RandomizedRunner$6.evaluate(RandomizedRunner.java:883)
	at com.carrotsearch.randomizedtesting.RandomizedRunner$7.evaluate(RandomizedRunner.java:894)
	at org.apache.lucene.util.AbstractBeforeAfterRule$1.evaluate(AbstractBeforeAfterRule.java:45)
	at com.carrotsearch.randomizedtesting.rules.StatementAdapter.evaluate(StatementAdapter.java:36)
	at org.apache.lucene.util.TestRuleStoreClassName$1.evaluate(TestRuleStoreClassName.java:41)
	at com.carrotsearch.randomizedtesting.rules.NoShadowingOrOverridesOnMethodsRule$1.evaluate(NoShadowingOrOverridesOnMethodsRule.java:40)
	at com.carrotsearch.randomizedtesting.rules.NoShadowingOrOverridesOnMethodsRule$1.evaluate(NoShadowingOrOverridesOnMethodsRule.java:40)
	at com.carrotsearch.randomizedtesting.rules.StatementAdapter.evaluate(StatementAdapter.java:36)
	at com.carrotsearch.randomizedtesting.rules.StatementAdapter.evaluate(StatementAdapter.java:36)
	at org.apache.lucene.util.TestRuleAssertionsRequired$1.evaluate(TestRuleAssertionsRequired.java:53)
	at org.apache.lucene.util.TestRuleMarkFailure$1.evaluate(TestRuleMarkFailure.java:47)
	at org.apache.lucene.util.TestRuleIgnoreAfterMaxFailures$1.evaluate(TestRuleIgnoreAfterMaxFailures.java:64)
	at org.apache.lucene.util.TestRuleIgnoreTestSuites$1.evaluate(TestRuleIgnoreTestSuites.java:54)
	at com.carrotsearch.randomizedtesting.rules.StatementAdapter.evaluate(StatementAdapter.java:36)
	at com.carrotsearch.randomizedtesting.ThreadLeakControl$StatementRunner.run(ThreadLeakControl.java:368)
	at java.base/java.lang.Thread.run(Thread.java:844)


FAILED:  org.apache.solr.client.solrj.request.TestUpdateRequestCodec.simple

Error Message:
doc#0 diff values for field: desc expected:<[one, 1]> but was:<[one, 1]>

Stack Trace:
junit.framework.AssertionFailedError: doc#0 diff values for field: desc expected:<[one, 1]> but was:<[one, 1]>
	at __randomizedtesting.SeedInfo.seed([7D78F1E62F9DCBA7:FE1147E048E09349]:0)
	at junit.framework.Assert.fail(Assert.java:57)
	at junit.framework.Assert.failNotEquals(Assert.java:329)
	at junit.framework.Assert.assertEquals(Assert.java:78)
	at org.apache.solr.client.solrj.request.TestUpdateRequestCodec.compareDocs(TestUpdateRequestCodec.java:254)
	at org.apache.solr.client.solrj.request.TestUpdateRequestCodec.simple(TestUpdateRequestCodec.java:103)
	at java.base/jdk.internal.reflect.NativeMethodAccessorImpl.invoke0(Native Method)
	at java.base/jdk.internal.reflect.NativeMethodAccessorImpl.invoke(NativeMethodAccessorImpl.java:62)
	at java.base/jdk.internal.reflect.DelegatingMethodAccessorImpl.invoke(DelegatingMethodAccessorImpl.java:43)
	at java.base/java.lang.reflect.Method.invoke(Method.java:564)
	at com.carrotsearch.randomizedtesting.RandomizedRunner.invoke(RandomizedRunner.java:1750)
	at com.carrotsearch.randomizedtesting.RandomizedRunner$8.evaluate(RandomizedRunner.java:938)
	at com.carrotsearch.randomizedtesting.RandomizedRunner$9.evaluate(RandomizedRunner.java:974)
	at com.carrotsearch.randomizedtesting.RandomizedRunner$10.evaluate(RandomizedRunner.java:988)
	at org.apache.lucene.util.TestRuleSetupTeardownChained$1.evaluate(TestRuleSetupTeardownChained.java:49)
	at org.apache.lucene.util.AbstractBeforeAfterRule$1.evaluate(AbstractBeforeAfterRule.java:45)
	at org.apache.lucene.util.TestRuleThreadAndTestName$1.evaluate(TestRuleThreadAndTestName.java:48)
	at org.apache.lucene.util.TestRuleIgnoreAfterMaxFailures$1.evaluate(TestRuleIgnoreAfterMaxFailures.java:64)
	at org.apache.lucene.util.TestRuleMarkFailure$1.evaluate(TestRuleMarkFailure.java:47)
	at com.carrotsearch.randomizedtesting.rules.StatementAdapter.evaluate(StatementAdapter.java:36)
	at com.carrotsearch.randomizedtesting.ThreadLeakControl$StatementRunner.run(ThreadLeakControl.java:368)
	at com.carrotsearch.randomizedtesting.ThreadLeakControl.forkTimeoutingTask(ThreadLeakControl.java:817)
	at com.carrotsearch.randomizedtesting.ThreadLeakControl$3.evaluate(ThreadLeakControl.java:468)
	at com.carrotsearch.randomizedtesting.RandomizedRunner.runSingleTest(RandomizedRunner.java:947)
	at com.carrotsearch.randomizedtesting.RandomizedRunner$5.evaluate(RandomizedRunner.java:832)
	at com.carrotsearch.randomizedtesting.RandomizedRunner$6.evaluate(RandomizedRunner.java:883)
	at com.carrotsearch.randomizedtesting.RandomizedRunner$7.evaluate(RandomizedRunner.java:894)
	at org.apache.lucene.util.AbstractBeforeAfterRule$1.evaluate(AbstractBeforeAfterRule.java:45)
	at com.carrotsearch.randomizedtesting.rules.StatementAdapter.evaluate(StatementAdapter.java:36)
	at org.apache.lucene.util.TestRuleStoreClassName$1.evaluate(TestRuleStoreClassName.java:41)
	at com.carrotsearch.randomizedtesting.rules.NoShadowingOrOverridesOnMethodsRule$1.evaluate(NoShadowingOrOverridesOnMethodsRule.java:40)
	at com.carrotsearch.randomizedtesting.rules.NoShadowingOrOverridesOnMethodsRule$1.evaluate(NoShadowingOrOverridesOnMethodsRule.java:40)
	at com.carrotsearch.randomizedtesting.rules.StatementAdapter.evaluate(StatementAdapter.java:36)
	at com.carrotsearch.randomizedtesting.rules.StatementAdapter.evaluate(StatementAdapter.java:36)
	at org.apache.lucene.util.TestRuleAssertionsRequired$1.evaluate(TestRuleAssertionsRequired.java:53)
	at org.apache.lucene.util.TestRuleMarkFailure$1.evaluate(TestRuleMarkFailure.java:47)
	at org.apache.lucene.util.TestRuleIgnoreAfterMaxFailures$1.evaluate(TestRuleIgnoreAfterMaxFailures.java:64)
	at org.apache.lucene.util.TestRuleIgnoreTestSuites$1.evaluate(TestRuleIgnoreTestSuites.java:54)
	at com.carrotsearch.randomizedtesting.rules.StatementAdapter.evaluate(StatementAdapter.java:36)
	at com.carrotsearch.randomizedtesting.ThreadLeakControl$StatementRunner.run(ThreadLeakControl.java:368)
	at java.base/java.lang.Thread.run(Thread.java:844)


FAILED:  org.apache.solr.client.solrj.request.TestUpdateRequestCodec.testBackCompat4_5

Error Message:
doc#0 diff values for field: desc expected:<[one, 1]> but was:<[one, 1]>

Stack Trace:
junit.framework.AssertionFailedError: doc#0 diff values for field: desc expected:<[one, 1]> but was:<[one, 1]>
	at __randomizedtesting.SeedInfo.seed([7D78F1E62F9DCBA7:F6C3C9F554CCF82E]:0)
	at junit.framework.Assert.fail(Assert.java:57)
	at junit.framework.Assert.failNotEquals(Assert.java:329)
	at junit.framework.Assert.assertEquals(Assert.java:78)
	at org.apache.solr.client.solrj.request.TestUpdateRequestCodec.compareDocs(TestUpdateRequestCodec.java:254)
	at org.apache.solr.client.solrj.request.TestUpdateRequestCodec.testBackCompat4_5(TestUpdateRequestCodec.java:222)
	at java.base/jdk.internal.reflect.NativeMethodAccessorImpl.invoke0(Native Method)
	at java.base/jdk.internal.reflect.NativeMethodAccessorImpl.invoke(NativeMethodAccessorImpl.java:62)
	at java.base/jdk.internal.reflect.DelegatingMethodAccessorImpl.invoke(DelegatingMethodAccessorImpl.java:43)
	at java.base/java.lang.reflect.Method.invoke(Method.java:564)
	at com.carrotsearch.randomizedtesting.RandomizedRunner.invoke(RandomizedRunner.java:1750)
	at com.carrotsearch.randomizedtesting.RandomizedRunner$8.evaluate(RandomizedRunner.java:938)
	at com.carrotsearch.randomizedtesting.RandomizedRunner$9.evaluate(RandomizedRunner.java:974)
	at com.carrotsearch.randomizedtesting.RandomizedRunner$10.evaluate(RandomizedRunner.java:988)
	at org.apache.lucene.util.TestRuleSetupTeardownChained$1.evaluate(TestRuleSetupTeardownChained.java:49)
	at org.apache.lucene.util.AbstractBeforeAfterRule$1.evaluate(AbstractBeforeAfterRule.java:45)
	at org.apache.lucene.util.TestRuleThreadAndTestName$1.evaluate(TestRuleThreadAndTestName.java:48)
	at org.apache.lucene.util.TestRuleIgnoreAfterMaxFailures$1.evaluate(TestRuleIgnoreAfterMaxFailures.java:64)
	at org.apache.lucene.util.TestRuleMarkFailure$1.evaluate(TestRuleMarkFailure.java:47)
	at com.carrotsearch.randomizedtesting.rules.StatementAdapter.evaluate(StatementAdapter.java:36)
	at com.carrotsearch.randomizedtesting.ThreadLeakControl$StatementRunner.run(ThreadLeakControl.java:368)
	at com.carrotsearch.randomizedtesting.ThreadLeakControl.forkTimeoutingTask(ThreadLeakControl.java:817)
	at com.carrotsearch.randomizedtesting.ThreadLeakControl$3.evaluate(ThreadLeakControl.java:468)
	at com.carrotsearch.randomizedtesting.RandomizedRunner.runSingleTest(RandomizedRunner.java:947)
	at com.carrotsearch.randomizedtesting.RandomizedRunner$5.evaluate(RandomizedRunner.java:832)
	at com.carrotsearch.randomizedtesting.RandomizedRunner$6.evaluate(RandomizedRunner.java:883)
	at com.carrotsearch.randomizedtesting.RandomizedRunner$7.evaluate(RandomizedRunner.java:894)
	at org.apache.lucene.util.AbstractBeforeAfterRule$1.evaluate(AbstractBeforeAfterRule.java:45)
	at com.carrotsearch.randomizedtesting.rules.StatementAdapter.evaluate(StatementAdapter.java:36)
	at org.apache.lucene.util.TestRuleStoreClassName$1.evaluate(TestRuleStoreClassName.java:41)
	at com.carrotsearch.randomizedtesting.rules.NoShadowingOrOverridesOnMethodsRule$1.evaluate(NoShadowingOrOverridesOnMethodsRule.java:40)
	at com.carrotsearch.randomizedtesting.rules.NoShadowingOrOverridesOnMethodsRule$1.evaluate(NoShadowingOrOverridesOnMethodsRule.java:40)
	at com.carrotsearch.randomizedtesting.rules.StatementAdapter.evaluate(StatementAdapter.java:36)
	at com.carrotsearch.randomizedtesting.rules.StatementAdapter.evaluate(StatementAdapter.java:36)
	at org.apache.lucene.util.TestRuleAssertionsRequired$1.evaluate(TestRuleAssertionsRequired.java:53)
	at org.apache.lucene.util.TestRuleMarkFailure$1.evaluate(TestRuleMarkFailure.java:47)
	at org.apache.lucene.util.TestRuleIgnoreAfterMaxFailures$1.evaluate(TestRuleIgnoreAfterMaxFailures.java:64)
	at org.apache.lucene.util.TestRuleIgnoreTestSuites$1.evaluate(TestRuleIgnoreTestSuites.java:54)
	at com.carrotsearch.randomizedtesting.rules.StatementAdapter.evaluate(StatementAdapter.java:36)
	at com.carrotsearch.randomizedtesting.ThreadLeakControl$StatementRunner.run(ThreadLeakControl.java:368)
	at java.base/java.lang.Thread.run(Thread.java:844)


FAILED:  org.apache.solr.client.solrj.request.TestUpdateRequestCodec.testIteratable

Error Message:
iterVal contents expected:<[iterItem1, iterItem2]> but was:<[iterItem1, iterItem2]>

Stack Trace:
junit.framework.AssertionFailedError: iterVal contents expected:<[iterItem1, iterItem2]> but was:<[iterItem1, iterItem2]>
	at __randomizedtesting.SeedInfo.seed([7D78F1E62F9DCBA7:65543AEE2A2B6195]:0)
	at junit.framework.Assert.fail(Assert.java:57)
	at junit.framework.Assert.failNotEquals(Assert.java:329)
	at junit.framework.Assert.assertEquals(Assert.java:78)
	at org.apache.solr.client.solrj.request.TestUpdateRequestCodec.testIteratable(TestUpdateRequestCodec.java:159)
	at java.base/jdk.internal.reflect.NativeMethodAccessorImpl.invoke0(Native Method)
	at java.base/jdk.internal.reflect.NativeMethodAccessorImpl.invoke(NativeMethodAccessorImpl.java:62)
	at java.base/jdk.internal.reflect.DelegatingMethodAccessorImpl.invoke(DelegatingMethodAccessorImpl.java:43)
	at java.base/java.lang.reflect.Method.invoke(Method.java:564)
	at com.carrotsearch.randomizedtesting.RandomizedRunner.invoke(RandomizedRunner.java:1750)
	at com.carrotsearch.randomizedtesting.RandomizedRunner$8.evaluate(RandomizedRunner.java:938)
	at com.carrotsearch.randomizedtesting.RandomizedRunner$9.evaluate(RandomizedRunner.java:974)
	at com.carrotsearch.randomizedtesting.RandomizedRunner$10.evaluate(RandomizedRunner.java:988)
	at org.apache.lucene.util.TestRuleSetupTeardownChained$1.evaluate(TestRuleSetupTeardownChained.java:49)
	at org.apache.lucene.util.AbstractBeforeAfterRule$1.evaluate(AbstractBeforeAfterRule.java:45)
	at org.apache.lucene.util.TestRuleThreadAndTestName$1.evaluate(TestRuleThreadAndTestName.java:48)
	at org.apache.lucene.util.TestRuleIgnoreAfterMaxFailures$1.evaluate(TestRuleIgnoreAfterMaxFailures.java:64)
	at org.apache.lucene.util.TestRuleMarkFailure$1.evaluate(TestRuleMarkFailure.java:47)
	at com.carrotsearch.randomizedtesting.rules.StatementAdapter.evaluate(StatementAdapter.java:36)
	at com.carrotsearch.randomizedtesting.ThreadLeakControl$StatementRunner.run(ThreadLeakControl.java:368)
	at com.carrotsearch.randomizedtesting.ThreadLeakControl.forkTimeoutingTask(ThreadLeakControl.java:817)
	at com.carrotsearch.randomizedtesting.ThreadLeakControl$3.evaluate(ThreadLeakControl.java:468)
	at com.carrotsearch.randomizedtesting.RandomizedRunner.runSingleTest(RandomizedRunner.java:947)
	at com.carrotsearch.randomizedtesting.RandomizedRunner$5.evaluate(RandomizedRunner.java:832)
	at com.carrotsearch.randomizedtesting.RandomizedRunner$6.evaluate(RandomizedRunner.java:883)
	at com.carrotsearch.randomizedtesting.RandomizedRunner$7.evaluate(RandomizedRunner.java:894)
	at org.apache.lucene.util.AbstractBeforeAfterRule$1.evaluate(AbstractBeforeAfterRule.java:45)
	at com.carrotsearch.randomizedtesting.rules.StatementAdapter.evaluate(StatementAdapter.java:36)
	at org.apache.lucene.util.TestRuleStoreClassName$1.evaluate(TestRuleStoreClassName.java:41)
	at com.carrotsearch.randomizedtesting.rules.NoShadowingOrOverridesOnMethodsRule$1.evaluate(NoShadowingOrOverridesOnMethodsRule.java:40)
	at com.carrotsearch.randomizedtesting.rules.NoShadowingOrOverridesOnMethodsRule$1.evaluate(NoShadowingOrOverridesOnMethodsRule.java:40)
	at com.carrotsearch.randomizedtesting.rules.StatementAdapter.evaluate(StatementAdapter.java:36)
	at com.carrotsearch.randomizedtesting.rules.StatementAdapter.evaluate(StatementAdapter.java:36)
	at org.apache.lucene.util.TestRuleAssertionsRequired$1.evaluate(TestRuleAssertionsRequired.java:53)
	at org.apache.lucene.util.TestRuleMarkFailure$1.evaluate(TestRuleMarkFailure.java:47)
	at org.apache.lucene.util.TestRuleIgnoreAfterMaxFailures$1.evaluate(TestRuleIgnoreAfterMaxFailures.java:64)
	at org.apache.lucene.util.TestRuleIgnoreTestSuites$1.evaluate(TestRuleIgnoreTestSuites.java:54)
	at com.carrotsearch.randomizedtesting.rules.StatementAdapter.evaluate(StatementAdapter.java:36)
	at com.carrotsearch.randomizedtesting.ThreadLeakControl$StatementRunner.run(ThreadLeakControl.java:368)
	at java.base/java.lang.Thread.run(Thread.java:844)


FAILED:  org.apache.solr.client.solrj.request.TestUpdateRequestCodec.simple

Error Message:
doc#0 diff values for field: desc expected:<[one, 1]> but was:<[one, 1]>

Stack Trace:
junit.framework.AssertionFailedError: doc#0 diff values for field: desc expected:<[one, 1]> but was:<[one, 1]>
	at __randomizedtesting.SeedInfo.seed([7D78F1E62F9DCBA7:FE1147E048E09349]:0)
	at junit.framework.Assert.fail(Assert.java:57)
	at junit.framework.Assert.failNotEquals(Assert.java:329)
	at junit.framework.Assert.assertEquals(Assert.java:78)
	at org.apache.solr.client.solrj.request.TestUpdateRequestCodec.compareDocs(TestUpdateRequestCodec.java:254)
	at org.apache.solr.client.solrj.request.TestUpdateRequestCodec.simple(TestUpdateRequestCodec.java:103)
	at java.base/jdk.internal.reflect.NativeMethodAccessorImpl.invoke0(Native Method)
	at java.base/jdk.internal.reflect.NativeMethodAccessorImpl.invoke(NativeMethodAccessorImpl.java:62)
	at java.base/jdk.internal.reflect.DelegatingMethodAccessorImpl.invoke(DelegatingMethodAccessorImpl.java:43)
	at java.base/java.lang.reflect.Method.invoke(Method.java:564)
	at com.carrotsearch.randomizedtesting.RandomizedRunner.invoke(RandomizedRunner.java:1750)
	at com.carrotsearch.randomizedtesting.RandomizedRunner$8.evaluate(RandomizedRunner.java:938)
	at com.carrotsearch.randomizedtesting.RandomizedRunner$9.evaluate(RandomizedRunner.java:974)
	at com.carrotsearch.randomizedtesting.RandomizedRunner$10.evaluate(RandomizedRunner.java:988)
	at org.apache.lucene.util.TestRuleSetupTeardownChained$1.evaluate(TestRuleSetupTeardownChained.java:49)
	at org.apache.lucene.util.AbstractBeforeAfterRule$1.evaluate(AbstractBeforeAfterRule.java:45)
	at org.apache.lucene.util.TestRuleThreadAndTestName$1.evaluate(TestRuleThreadAndTestName.java:48)
	at org.apache.lucene.util.TestRuleIgnoreAfterMaxFailures$1.evaluate(TestRuleIgnoreAfterMaxFailures.java:64)
	at org.apache.lucene.util.TestRuleMarkFailure$1.evaluate(TestRuleMarkFailure.java:47)
	at com.carrotsearch.randomizedtesting.rules.StatementAdapter.evaluate(StatementAdapter.java:36)
	at com.carrotsearch.randomizedtesting.ThreadLeakControl$StatementRunner.run(ThreadLeakControl.java:368)
	at com.carrotsearch.randomizedtesting.ThreadLeakControl.forkTimeoutingTask(ThreadLeakControl.java:817)
	at com.carrotsearch.randomizedtesting.ThreadLeakControl$3.evaluate(ThreadLeakControl.java:468)
	at com.carrotsearch.randomizedtesting.RandomizedRunner.runSingleTest(RandomizedRunner.java:947)
	at com.carrotsearch.randomizedtesting.RandomizedRunner$5.evaluate(RandomizedRunner.java:832)
	at com.carrotsearch.randomizedtesting.RandomizedRunner$6.evaluate(RandomizedRunner.java:883)
	at com.carrotsearch.randomizedtesting.RandomizedRunner$7.evaluate(RandomizedRunner.java:894)
	at org.apache.lucene.util.AbstractBeforeAfterRule$1.evaluate(AbstractBeforeAfterRule.java:45)
	at com.carrotsearch.randomizedtesting.rules.StatementAdapter.evaluate(StatementAdapter.java:36)
	at org.apache.lucene.util.TestRuleStoreClassName$1.evaluate(TestRuleStoreClassName.java:41)
	at com.carrotsearch.randomizedtesting.rules.NoShadowingOrOverridesOnMethodsRule$1.evaluate(NoShadowingOrOverridesOnMethodsRule.java:40)
	at com.carrotsearch.randomizedtesting.rules.NoShadowingOrOverridesOnMethodsRule$1.evaluate(NoShadowingOrOverridesOnMethodsRule.java:40)
	at com.carrotsearch.randomizedtesting.rules.StatementAdapter.evaluate(StatementAdapter.java:36)
	at com.carrotsearch.randomizedtesting.rules.StatementAdapter.evaluate(StatementAdapter.java:36)
	at org.apache.lucene.util.TestRuleAssertionsRequired$1.evaluate(TestRuleAssertionsRequired.java:53)
	at org.apache.lucene.util.TestRuleMarkFailure$1.evaluate(TestRuleMarkFailure.java:47)
	at org.apache.lucene.util.TestRuleIgnoreAfterMaxFailures$1.evaluate(TestRuleIgnoreAfterMaxFailures.java:64)
	at org.apache.lucene.util.TestRuleIgnoreTestSuites$1.evaluate(TestRuleIgnoreTestSuites.java:54)
	at com.carrotsearch.randomizedtesting.rules.StatementAdapter.evaluate(StatementAdapter.java:36)
	at com.carrotsearch.randomizedtesting.ThreadLeakControl$StatementRunner.run(ThreadLeakControl.java:368)
	at java.base/java.lang.Thread.run(Thread.java:844)


FAILED:  org.apache.solr.client.solrj.request.TestUpdateRequestCodec.testBackCompat4_5

Error Message:
doc#0 diff values for field: desc expected:<[one, 1]> but was:<[one, 1]>

Stack Trace:
junit.framework.AssertionFailedError: doc#0 diff values for field: desc expected:<[one, 1]> but was:<[one, 1]>
	at __randomizedtesting.SeedInfo.seed([7D78F1E62F9DCBA7:F6C3C9F554CCF82E]:0)
	at junit.framework.Assert.fail(Assert.java:57)
	at junit.framework.Assert.failNotEquals(Assert.java:329)
	at junit.framework.Assert.assertEquals(Assert.java:78)
	at org.apache.solr.client.solrj.request.TestUpdateRequestCodec.compareDocs(TestUpdateRequestCodec.java:254)
	at org.apache.solr.client.solrj.request.TestUpdateRequestCodec.testBackCompat4_5(TestUpdateRequestCodec.java:222)
	at java.base/jdk.internal.reflect.NativeMethodAccessorImpl.invoke0(Native Method)
	at java.base/jdk.internal.reflect.NativeMethodAccessorImpl.invoke(NativeMethodAccessorImpl.java:62)
	at java.base/jdk.internal.reflect.DelegatingMethodAccessorImpl.invoke(DelegatingMethodAccessorImpl.java:43)
	at java.base/java.lang.reflect.Method.invoke(Method.java:564)
	at com.carrotsearch.randomizedtesting.RandomizedRunner.invoke(RandomizedRunner.java:1750)
	at com.carrotsearch.randomizedtesting.RandomizedRunner$8.evaluate(RandomizedRunner.java:938)
	at com.carrotsearch.randomizedtesting.RandomizedRunner$9.evaluate(RandomizedRunner.java:974)
	at com.carrotsearch.randomizedtesting.RandomizedRunner$10.evaluate(RandomizedRunner.java:988)
	at org.apache.lucene.util.TestRuleSetupTeardownChained$1.evaluate(TestRuleSetupTeardownChained.java:49)
	at org.apache.lucene.util.AbstractBeforeAfterRule$1.evaluate(AbstractBeforeAfterRule.java:45)
	at org.apache.lucene.util.TestRuleThreadAndTestName$1.evaluate(TestRuleThreadAndTestName.java:48)
	at org.apache.lucene.util.TestRuleIgnoreAfterMaxFailures$1.evaluate(TestRuleIgnoreAfterMaxFailures.java:64)
	at org.apache.lucene.util.TestRuleMarkFailure$1.evaluate(TestRuleMarkFailure.java:47)
	at com.carrotsearch.randomizedtesting.rules.StatementAdapter.evaluate(StatementAdapter.java:36)
	at com.carrotsearch.randomizedtesting.ThreadLeakControl$StatementRunner.run(ThreadLeakControl.java:368)
	at com.carrotsearch.randomizedtesting.ThreadLeakControl.forkTimeoutingTask(ThreadLeakControl.java:817)
	at com.carrotsearch.randomizedtesting.ThreadLeakControl$3.evaluate(ThreadLeakControl.java:468)
	at com.carrotsearch.randomizedtesting.RandomizedRunner.runSingleTest(RandomizedRunner.java:947)
	at com.carrotsearch.randomizedtesting.RandomizedRunner$5.evaluate(RandomizedRunner.java:832)
	at com.carrotsearch.randomizedtesting.RandomizedRunner$6.evaluate(RandomizedRunner.java:883)
	at com.carrotsearch.randomizedtesting.RandomizedRunner$7.evaluate(RandomizedRunner.java:894)
	at org.apache.lucene.util.AbstractBeforeAfterRule$1.evaluate(AbstractBeforeAfterRule.java:45)
	at com.carrotsearch.randomizedtesting.rules.StatementAdapter.evaluate(StatementAdapter.java:36)
	at org.apache.lucene.util.TestRuleStoreClassName$1.evaluate(TestRuleStoreClassName.java:41)
	at com.carrotsearch.randomizedtesting.rules.NoShadowingOrOverridesOnMethodsRule$1.evaluate(NoShadowingOrOverridesOnMethodsRule.java:40)
	at com.carrotsearch.randomizedtesting.rules.NoShadowingOrOverridesOnMethodsRule$1.evaluate(NoShadowingOrOverridesOnMethodsRule.java:40)
	at com.carrotsearch.randomizedtesting.rules.StatementAdapter.evaluate(StatementAdapter.java:36)
	at com.carrotsearch.randomizedtesting.rules.StatementAdapter.evaluate(StatementAdapter.java:36)
	at org.apache.lucene.util.TestRuleAssertionsRequired$1.evaluate(TestRuleAssertionsRequired.java:53)
	at org.apache.lucene.util.TestRuleMarkFailure$1.evaluate(TestRuleMarkFailure.java:47)
	at org.apache.lucene.util.TestRuleIgnoreAfterMaxFailures$1.evaluate(TestRuleIgnoreAfterMaxFailures.java:64)
	at org.apache.lucene.util.TestRuleIgnoreTestSuites$1.evaluate(TestRuleIgnoreTestSuites.java:54)
	at com.carrotsearch.randomizedtesting.rules.StatementAdapter.evaluate(StatementAdapter.java:36)
	at com.carrotsearch.randomizedtesting.ThreadLeakControl$StatementRunner.run(ThreadLeakControl.java:368)
	at java.base/java.lang.Thread.run(Thread.java:844)


FAILED:  org.apache.solr.client.solrj.request.TestUpdateRequestCodec.testIteratable

Error Message:
iterVal contents expected:<[iterItem1, iterItem2]> but was:<[iterItem1, iterItem2]>

Stack Trace:
junit.framework.AssertionFailedError: iterVal contents expected:<[iterItem1, iterItem2]> but was:<[iterItem1, iterItem2]>
	at __randomizedtesting.SeedInfo.seed([7D78F1E62F9DCBA7:65543AEE2A2B6195]:0)
	at junit.framework.Assert.fail(Assert.java:57)
	at junit.framework.Assert.failNotEquals(Assert.java:329)
	at junit.framework.Assert.assertEquals(Assert.java:78)
	at org.apache.solr.client.solrj.request.TestUpdateRequestCodec.testIteratable(TestUpdateRequestCodec.java:159)
	at java.base/jdk.internal.reflect.NativeMethodAccessorImpl.invoke0(Native Method)
	at java.base/jdk.internal.reflect.NativeMethodAccessorImpl.invoke(NativeMethodAccessorImpl.java:62)
	at java.base/jdk.internal.reflect.DelegatingMethodAccessorImpl.invoke(DelegatingMethodAccessorImpl.java:43)
	at java.base/java.lang.reflect.Method.invoke(Method.java:564)
	at com.carrotsearch.randomizedtesting.RandomizedRunner.invoke(RandomizedRunner.java:1750)
	at com.carrotsearch.randomizedtesting.RandomizedRunner$8.evaluate(RandomizedRunner.java:938)
	at com.carrotsearch.randomizedtesting.RandomizedRunner$9.evaluate(RandomizedRunner.java:974)
	at com.carrotsearch.randomizedtesting.RandomizedRunner$10.evaluate(RandomizedRunner.java:988)
	at org.apache.lucene.util.TestRuleSetupTeardownChained$1.evaluate(TestRuleSetupTeardownChained.java:49)
	at org.apache.lucene.util.AbstractBeforeAfterRule$1.evaluate(AbstractBeforeAfterRule.java:45)
	at org.apache.lucene.util.TestRuleThreadAndTestName$1.evaluate(TestRuleThreadAndTestName.java:48)
	at org.apache.lucene.util.TestRuleIgnoreAfterMaxFailures$1.evaluate(TestRuleIgnoreAfterMaxFailures.java:64)
	at org.apache.lucene.util.TestRuleMarkFailure$1.evaluate(TestRuleMarkFailure.java:47)
	at com.carrotsearch.randomizedtesting.rules.StatementAdapter.evaluate(StatementAdapter.java:36)
	at com.carrotsearch.randomizedtesting.ThreadLeakControl$StatementRunner.run(ThreadLeakControl.java:368)
	at com.carrotsearch.randomizedtesting.ThreadLeakControl.forkTimeoutingTask(ThreadLeakControl.java:817)
	at com.carrotsearch.randomizedtesting.ThreadLeakControl$3.evaluate(ThreadLeakControl.java:468)
	at com.carrotsearch.randomizedtesting.RandomizedRunner.runSingleTest(RandomizedRunner.java:947)
	at com.carrotsearch.randomizedtesting.RandomizedRunner$5.evaluate(RandomizedRunner.java:832)
	at com.carrotsearch.randomizedtesting.RandomizedRunner$6.evaluate(RandomizedRunner.java:883)
	at com.carrotsearch.randomizedtesting.RandomizedRunner$7.evaluate(RandomizedRunner.java:894)
	at org.apache.lucene.util.AbstractBeforeAfterRule$1.evaluate(AbstractBeforeAfterRule.java:45)
	at com.carrotsearch.randomizedtesting.rules.StatementAdapter.evaluate(StatementAdapter.java:36)
	at org.apache.lucene.util.TestRuleStoreClassName$1.evaluate(TestRuleStoreClassName.java:41)
	at com.carrotsearch.randomizedtesting.rules.NoShadowingOrOverridesOnMethodsRule$1.evaluate(NoShadowingOrOverridesOnMethodsRule.java:40)
	at com.carrotsearch.randomizedtesting.rules.NoShadowingOrOverridesOnMethodsRule$1.evaluate(NoShadowingOrOverridesOnMethodsRule.java:40)
	at com.carrotsearch.randomizedtesting.rules.StatementAdapter.evaluate(StatementAdapter.java:36)
	at com.carrotsearch.randomizedtesting.rules.StatementAdapter.evaluate(StatementAdapter.java:36)
	at org.apache.lucene.util.TestRuleAssertionsRequired$1.evaluate(TestRuleAssertionsRequired.java:53)
	at org.apache.lucene.util.TestRuleMarkFailure$1.evaluate(TestRuleMarkFailure.java:47)
	at org.apache.lucene.util.TestRuleIgnoreAfterMaxFailures$1.evaluate(TestRuleIgnoreAfterMaxFailures.java:64)
	at org.apache.lucene.util.TestRuleIgnoreTestSuites$1.evaluate(TestRuleIgnoreTestSuites.java:54)
	at com.carrotsearch.randomizedtesting.rules.StatementAdapter.evaluate(StatementAdapter.java:36)
	at com.carrotsearch.randomizedtesting.ThreadLeakControl$StatementRunner.run(ThreadLeakControl.java:368)
	at java.base/java.lang.Thread.run(Thread.java:844)




Build Log:
[...truncated 16400 lines...]
   [junit4] Suite: org.apache.solr.client.solrj.request.TestUpdateRequestCodec
   [junit4]   2> NOTE: reproduce with: ant test  -Dtestcase=TestUpdateRequestCodec -Dtests.method=simple -Dtests.seed=7D78F1E62F9DCBA7 -Dtests.slow=true -Dtests.locale=lv -Dtests.timezone=Australia/West -Dtests.asserts=true -Dtests.file.encoding=UTF-8
   [junit4] FAILURE 0.01s J1 | TestUpdateRequestCodec.simple <<<
   [junit4]    > Throwable #1: junit.framework.AssertionFailedError: doc#0 diff values for field: desc expected:<[one, 1]> but was:<[one, 1]>
   [junit4]    > 	at __randomizedtesting.SeedInfo.seed([7D78F1E62F9DCBA7:FE1147E048E09349]:0)
   [junit4]    > 	at junit.framework.Assert.fail(Assert.java:57)
   [junit4]    > 	at junit.framework.Assert.failNotEquals(Assert.java:329)
   [junit4]    > 	at junit.framework.Assert.assertEquals(Assert.java:78)
   [junit4]    > 	at org.apache.solr.client.solrj.request.TestUpdateRequestCodec.compareDocs(TestUpdateRequestCodec.java:254)
   [junit4]    > 	at org.apache.solr.client.solrj.request.TestUpdateRequestCodec.simple(TestUpdateRequestCodec.java:103)
   [junit4]    > 	at java.base/jdk.internal.reflect.NativeMethodAccessorImpl.invoke0(Native Method)
   [junit4]    > 	at java.base/jdk.internal.reflect.NativeMethodAccessorImpl.invoke(NativeMethodAccessorImpl.java:62)
   [junit4]    > 	at java.base/jdk.internal.reflect.DelegatingMethodAccessorImpl.invoke(DelegatingMethodAccessorImpl.java:43)
   [junit4]    > 	at java.base/java.lang.reflect.Method.invoke(Method.java:564)
   [junit4]    > 	at java.base/java.lang.Thread.run(Thread.java:844)
   [junit4]   2> 156486 WARN  (TEST-TestUpdateRequestCodec.testBackCompat4_5-seed#[7D78F1E62F9DCBA7]) [    ] o.a.s.c.u.JavaBinCodec Ignoring field boost: 2.0 as index-time boosts are not supported anymore
   [junit4]   2> DocSolrInputDocument(fields: [id=1, desc=[one, 1]]) ,commitWithin:null , override:null
   [junit4]   2> DocSolrInputDocument(fields: [id=2, desc=[two, 2]]) ,commitWithin:null , override:null
   [junit4]   2> DocSolrInputDocument(fields: [id=3, desc=[three, 3]]) ,commitWithin:null , override:null
   [junit4]   2> DocSolrInputDocument(fields: [foobar=[baz1, baz2]]) ,commitWithin:null , override:null
   [junit4]   2> {SolrInputDocument(fields: [id=1, desc=[one, 1]])=null, SolrInputDocument(fields: [id=2, desc=[two, 2]])=null, SolrInputDocument(fields: [id=3, desc=[three, 3]])=null, SolrInputDocument(fields: [foobar=[baz1, baz2]])=null}
   [junit4]   2> [SolrInputDocument(fields: [id=1, desc=[one, 1]]), SolrInputDocument(fields: [id=2, desc=[two, 2]]), SolrInputDocument(fields: [id=3, desc=[three, 3]]), SolrInputDocument(fields: [foobar=[baz1, baz2]])]
   [junit4]   2> NOTE: reproduce with: ant test  -Dtestcase=TestUpdateRequestCodec -Dtests.method=testBackCompat4_5 -Dtests.seed=7D78F1E62F9DCBA7 -Dtests.slow=true -Dtests.locale=lv -Dtests.timezone=Australia/West -Dtests.asserts=true -Dtests.file.encoding=UTF-8
   [junit4] FAILURE 0.00s J1 | TestUpdateRequestCodec.testBackCompat4_5 <<<
   [junit4]    > Throwable #1: junit.framework.AssertionFailedError: doc#0 diff values for field: desc expected:<[one, 1]> but was:<[one, 1]>
   [junit4]    > 	at __randomizedtesting.SeedInfo.seed([7D78F1E62F9DCBA7:F6C3C9F554CCF82E]:0)
   [junit4]    > 	at junit.framework.Assert.fail(Assert.java:57)
   [junit4]    > 	at junit.framework.Assert.failNotEquals(Assert.java:329)
   [junit4]    > 	at junit.framework.Assert.assertEquals(Assert.java:78)
   [junit4]    > 	at org.apache.solr.client.solrj.request.TestUpdateRequestCodec.compareDocs(TestUpdateRequestCodec.java:254)
   [junit4]    > 	at org.apache.solr.client.solrj.request.TestUpdateRequestCodec.testBackCompat4_5(TestUpdateRequestCodec.java:222)
   [junit4]    > 	at java.base/jdk.internal.reflect.NativeMethodAccessorImpl.invoke0(Native Method)
   [junit4]    > 	at java.base/jdk.internal.reflect.NativeMethodAccessorImpl.invoke(NativeMethodAccessorImpl.java:62)
   [junit4]    > 	at java.base/jdk.internal.reflect.DelegatingMethodAccessorImpl.invoke(DelegatingMethodAccessorImpl.java:43)
   [junit4]    > 	at java.base/java.lang.reflect.Method.invoke(Method.java:564)
   [junit4]    > 	at java.base/java.lang.Thread.run(Thread.java:844)
   [junit4]   2> NOTE: reproduce with: ant test  -Dtestcase=TestUpdateRequestCodec -Dtests.method=testIteratable -Dtests.seed=7D78F1E62F9DCBA7 -Dtests.slow=true -Dtests.locale=lv -Dtests.timezone=Australia/West -Dtests.asserts=true -Dtests.file.encoding=UTF-8
   [junit4] FAILURE 0.00s J1 | TestUpdateRequestCodec.testIteratable <<<
   [junit4]    > Throwable #1: junit.framework.AssertionFailedError: iterVal contents expected:<[iterItem1, iterItem2]> but was:<[iterItem1, iterItem2]>
   [junit4]    > 	at __randomizedtesting.SeedInfo.seed([7D78F1E62F9DCBA7:65543AEE2A2B6195]:0)
   [junit4]    > 	at junit.framework.Assert.fail(Assert.java:57)
   [junit4]    > 	at junit.framework.Assert.failNotEquals(Assert.java:329)
   [junit4]    > 	at junit.framework.Assert.assertEquals(Assert.java:78)
   [junit4]    > 	at org.apache.solr.client.solrj.request.TestUpdateRequestCodec.testIteratable(TestUpdateRequestCodec.java:159)
   [junit4]    > 	at java.base/jdk.internal.reflect.NativeMethodAccessorImpl.invoke0(Native Method)
   [junit4]    > 	at java.base/jdk.internal.reflect.NativeMethodAccessorImpl.invoke(NativeMethodAccessorImpl.java:62)
   [junit4]    > 	at java.base/jdk.internal.reflect.DelegatingMethodAccessorImpl.invoke(DelegatingMethodAccessorImpl.java:43)
   [junit4]    > 	at java.base/java.lang.reflect.Method.invoke(Method.java:564)
   [junit4]    > 	at java.base/java.lang.Thread.run(Thread.java:844)
   [junit4]   2> NOTE: test params are: codec=Lucene80, sim=Asserting(org.apache.lucene.search.similarities.AssertingSimilarity@430753fb), locale=lv, timezone=Australia/West
   [junit4]   2> NOTE: Windows 10 10.0 amd64/Oracle Corporation 10.0.1 (64-bit)/cpus=3,threads=1,free=154583288,total=371720192
   [junit4]   2> NOTE: All tests run in this JVM: [JsonQueryRequestIntegrationTest, StreamExpressionToExplanationTest, ConcurrentUpdateHttp2SolrClientTest, SolrExampleBinaryHttp2Test, ContentStreamTest, TestV2Request, LessThanEqualToEvaluatorTest, DocumentAnalysisResponseTest, QueryFacetMapTest, JsonQueryRequestFacetingIntegrationTest, ConcurrentUpdateSolrClientBuilderTest, SolrExampleXMLHttp2Test, EqualToEvaluatorTest, TestJavaBinCodec, TestLBHttpSolrClient, LargeVolumeJettyTest, LargeVolumeBinaryJettyTest, TestBatchUpdate, TestFastWriter, TangentEvaluatorTest, HttpSolrClientConPoolTest, RoundEvaluatorTest, GreaterThanEqualToEvaluatorTest, CommonParamsTest, FieldValueEvaluatorTest, Http2SolrClientTest, HyperbolicCosineEvaluatorTest, CloudSolrClientCacheTest, JDBCStreamTest, ConcurrentUpdateSolrClientTest, TestSolrProperties, AscEvaluatorTest, ModuloEvaluatorTest, TestPolicy2, QueryResponseTest, SolrExampleStreamingBinaryHttp2Test, GraphExpressionTest, TestUpdateRequestCodec]
   [junit4] Completed [89/184 (1!)] on J1 in 0.25s, 3 tests, 3 failures <<< FAILURES!

[...truncated 41630 lines...]
[repro] Jenkins log URL: https://jenkins.thetaphi.de/job/Lucene-Solr-master-Windows/7683/consoleText

[repro] Revision: 3932a4cc6cc4782cecd8d5f23771e3478485e906

[repro] Ant options: "-Dargs=-XX:-UseCompressedOops -XX:+UseParallelGC"

[repro] ant clean

[...truncated 6 lines...]
[repro] Test suites by module:
[repro]    solr\solrj
[repro]       TestUpdateRequestCodec
[repro] ant compile-test

[...truncated 2753 lines...]
[repro] ant test-nocompile -Dtests.dups=5 -Dtests.maxfailures=5 -Dtests.class="*.TestUpdateRequestCodec" -Dtests.showOutput=onerror "-Dargs=-XX:-UseCompressedOops -XX:+UseParallelGC" -Dtests.seed=7D78F1E62F9DCBA7 -Dtests.slow=true -Dtests.locale=lv -Dtests.timezone=Australia/West -Dtests.asserts=true -Dtests.file.encoding=UTF-8

[...truncated 32 lines...]
   [junit4] Suite: org.apache.solr.client.solrj.request.TestUpdateRequestCodec
   [junit4]   2> SLF4J: Class path contains multiple SLF4J bindings.
   [junit4]   2> SLF4J: Found binding in [jar:file:/C:/Users/jenkins/workspace/Lucene-Solr-master-Windows/solr/solrj/test-lib/log4j-slf4j-impl-2.11.0.jar!/org/slf4j/impl/StaticLoggerBinder.class]
   [junit4]   2> SLF4J: Found binding in [jar:file:/C:/Users/jenkins/workspace/Lucene-Solr-master-Windows/solr/core/lib/log4j-slf4j-impl-2.11.0.jar!/org/slf4j/impl/StaticLoggerBinder.class]
   [junit4]   2> SLF4J: See http://www.slf4j.org/codes.html#multiple_bindings for an explanation.
   [junit4]   2> SLF4J: Actual binding is of type [org.apache.logging.slf4j.Log4jLoggerFactory]
   [junit4]   2> NOTE: reproduce with: ant test  -Dtestcase=TestUpdateRequestCodec -Dtests.method=simple -Dtests.seed=7D78F1E62F9DCBA7 -Dtests.slow=true -Dtests.badapples=true -Dtests.locale=lv -Dtests.timezone=Australia/West -Dtests.asserts=true -Dtests.file.encoding=UTF-8
   [junit4] FAILURE 0.98s J1 | TestUpdateRequestCodec.simple <<<
   [junit4]    > Throwable #1: junit.framework.AssertionFailedError: doc#0 diff values for field: desc expected:<[one, 1]> but was:<[one, 1]>
   [junit4]    > 	at __randomizedtesting.SeedInfo.seed([7D78F1E62F9DCBA7:FE1147E048E09349]:0)
   [junit4]    > 	at junit.framework.Assert.fail(Assert.java:57)
   [junit4]    > 	at junit.framework.Assert.failNotEquals(Assert.java:329)
   [junit4]    > 	at junit.framework.Assert.assertEquals(Assert.java:78)
   [junit4]    > 	at org.apache.solr.client.solrj.request.TestUpdateRequestCodec.compareDocs(TestUpdateRequestCodec.java:254)
   [junit4]    > 	at org.apache.solr.client.solrj.request.TestUpdateRequestCodec.simple(TestUpdateRequestCodec.java:103)
   [junit4]    > 	at java.base/jdk.internal.reflect.NativeMethodAccessorImpl.invoke0(Native Method)
   [junit4]    > 	at java.base/jdk.internal.reflect.NativeMethodAccessorImpl.invoke(NativeMethodAccessorImpl.java:62)
   [junit4]    > 	at java.base/jdk.internal.reflect.DelegatingMethodAccessorImpl.invoke(DelegatingMethodAccessorImpl.java:43)
   [junit4]    > 	at java.base/java.lang.reflect.Method.invoke(Method.java:564)
   [junit4]    > 	at java.base/java.lang.Thread.run(Thread.java:844)
   [junit4]   2> 2282 WARN  (TEST-TestUpdateRequestCodec.testBackCompat4_5-seed#[7D78F1E62F9DCBA7]) [    ] o.a.s.c.u.JavaBinCodec Ignoring field boost: 2.0 as index-time boosts are not supported anymore
   [junit4]   2> DocSolrInputDocument(fields: [id=1, desc=[one, 1]]) ,commitWithin:null , override:null
   [junit4]   2> DocSolrInputDocument(fields: [id=2, desc=[two, 2]]) ,commitWithin:null , override:null
   [junit4]   2> DocSolrInputDocument(fields: [id=3, desc=[three, 3]]) ,commitWithin:null , override:null
   [junit4]   2> DocSolrInputDocument(fields: [foobar=[baz1, baz2]]) ,commitWithin:null , override:null
   [junit4]   2> {SolrInputDocument(fields: [id=1, desc=[one, 1]])=null, SolrInputDocument(fields: [id=2, desc=[two, 2]])=null, SolrInputDocument(fields: [id=3, desc=[three, 3]])=null, SolrInputDocument(fields: [foobar=[baz1, baz2]])=null}
   [junit4]   2> [SolrInputDocument(fields: [id=1, desc=[one, 1]]), SolrInputDocument(fields: [id=2, desc=[two, 2]]), SolrInputDocument(fields: [id=3, desc=[three, 3]]), SolrInputDocument(fields: [foobar=[baz1, baz2]])]
   [junit4]   2> NOTE: reproduce with: ant test  -Dtestcase=TestUpdateRequestCodec -Dtests.method=testBackCompat4_5 -Dtests.seed=7D78F1E62F9DCBA7 -Dtests.slow=true -Dtests.badapples=true -Dtests.locale=lv -Dtests.timezone=Australia/West -Dtests.asserts=true -Dtests.file.encoding=UTF-8
   [junit4] FAILURE 0.02s J1 | TestUpdateRequestCodec.testBackCompat4_5 <<<
   [junit4]    > Throwable #1: junit.framework.AssertionFailedError: doc#0 diff values for field: desc expected:<[one, 1]> but was:<[one, 1]>
   [junit4]    > 	at __randomizedtesting.SeedInfo.seed([7D78F1E62F9DCBA7:F6C3C9F554CCF82E]:0)
   [junit4]    > 	at junit.framework.Assert.fail(Assert.java:57)
   [junit4]    > 	at junit.framework.Assert.failNotEquals(Assert.java:329)
   [junit4]    > 	at junit.framework.Assert.assertEquals(Assert.java:78)
   [junit4]    > 	at org.apache.solr.client.solrj.request.TestUpdateRequestCodec.compareDocs(TestUpdateRequestCodec.java:254)
   [junit4]    > 	at org.apache.solr.client.solrj.request.TestUpdateRequestCodec.testBackCompat4_5(TestUpdateRequestCodec.java:222)
   [junit4]    > 	at java.base/jdk.internal.reflect.NativeMethodAccessorImpl.invoke0(Native Method)
   [junit4]    > 	at java.base/jdk.internal.reflect.NativeMethodAccessorImpl.invoke(NativeMethodAccessorImpl.java:62)
   [junit4]    > 	at java.base/jdk.internal.reflect.DelegatingMethodAccessorImpl.invoke(DelegatingMethodAccessorImpl.java:43)
   [junit4]    > 	at java.base/java.lang.reflect.Method.invoke(Method.java:564)
   [junit4]    > 	at java.base/java.lang.Thread.run(Thread.java:844)
   [junit4]   2> NOTE: reproduce with: ant test  -Dtestcase=TestUpdateRequestCodec -Dtests.method=testIteratable -Dtests.seed=7D78F1E62F9DCBA7 -Dtests.slow=true -Dtests.badapples=true -Dtests.locale=lv -Dtests.timezone=Australia/West -Dtests.asserts=true -Dtests.file.encoding=UTF-8
   [junit4] FAILURE 0.00s J1 | TestUpdateRequestCodec.testIteratable <<<
   [junit4]    > Throwable #1: junit.framework.AssertionFailedError: iterVal contents expected:<[iterItem1, iterItem2]> but was:<[iterItem1, iterItem2]>
   [junit4]    > 	at __randomizedtesting.SeedInfo.seed([7D78F1E62F9DCBA7:65543AEE2A2B6195]:0)
   [junit4]    > 	at junit.framework.Assert.fail(Assert.java:57)
   [junit4]    > 	at junit.framework.Assert.failNotEquals(Assert.java:329)
   [junit4]    > 	at junit.framework.Assert.assertEquals(Assert.java:78)
   [junit4]    > 	at org.apache.solr.client.solrj.request.TestUpdateRequestCodec.testIteratable(TestUpdateRequestCodec.java:159)
   [junit4]    > 	at java.base/jdk.internal.reflect.NativeMethodAccessorImpl.invoke0(Native Method)
   [junit4]    > 	at java.base/jdk.internal.reflect.NativeMethodAccessorImpl.invoke(NativeMethodAccessorImpl.java:62)
   [junit4]    > 	at java.base/jdk.internal.reflect.DelegatingMethodAccessorImpl.invoke(DelegatingMethodAccessorImpl.java:43)
   [junit4]    > 	at java.base/java.lang.reflect.Method.invoke(Method.java:564)
   [junit4]    > 	at java.base/java.lang.Thread.run(Thread.java:844)
   [junit4]   2> NOTE: test params are: codec=Lucene80, sim=Asserting(org.apache.lucene.search.similarities.AssertingSimilarity@6aad8f0d), locale=lv, timezone=Australia/West
   [junit4]   2> NOTE: Windows 10 10.0 amd64/Oracle Corporation 10.0.1 (64-bit)/cpus=3,threads=1,free=142636600,total=171966464
   [junit4]   2> NOTE: All tests run in this JVM: [TestUpdateRequestCodec]
   [junit4] Completed [1/5 (1!)] on J1 in 1.48s, 3 tests, 3 failures <<< FAILURES!

[...truncated 1 lines...]
   [junit4] Suite: org.apache.solr.client.solrj.request.TestUpdateRequestCodec
   [junit4]   2> NOTE: reproduce with: ant test  -Dtestcase=TestUpdateRequestCodec -Dtests.method=simple -Dtests.seed=7D78F1E62F9DCBA7 -Dtests.slow=true -Dtests.badapples=true -Dtests.locale=lv -Dtests.timezone=Australia/West -Dtests.asserts=true -Dtests.file.encoding=UTF-8
   [junit4] FAILURE 0.00s J1 | TestUpdateRequestCodec.simple <<<
   [junit4]    > Throwable #1: junit.framework.AssertionFailedError: doc#0 diff values for field: desc expected:<[one, 1]> but was:<[one, 1]>
   [junit4]    > 	at __randomizedtesting.SeedInfo.seed([7D78F1E62F9DCBA7:FE1147E048E09349]:0)
   [junit4]    > 	at junit.framework.Assert.fail(Assert.java:57)
   [junit4]    > 	at junit.framework.Assert.failNotEquals(Assert.java:329)
   [junit4]    > 	at junit.framework.Assert.assertEquals(Assert.java:78)
   [junit4]    > 	at org.apache.solr.client.solrj.request.TestUpdateRequestCodec.compareDocs(TestUpdateRequestCodec.java:254)
   [junit4]    > 	at org.apache.solr.client.solrj.request.TestUpdateRequestCodec.simple(TestUpdateRequestCodec.java:103)
   [junit4]    > 	at java.base/jdk.internal.reflect.NativeMethodAccessorImpl.invoke0(Native Method)
   [junit4]    > 	at java.base/jdk.internal.reflect.NativeMethodAccessorImpl.invoke(NativeMethodAccessorImpl.java:62)
   [junit4]    > 	at java.base/jdk.internal.reflect.DelegatingMethodAccessorImpl.invoke(DelegatingMethodAccessorImpl.java:43)
   [junit4]    > 	at java.base/java.lang.reflect.Method.invoke(Method.java:564)
   [junit4]    > 	at java.base/java.lang.Thread.run(Thread.java:844)
   [junit4]   2> DocSolrInputDocument(fields: [id=1, desc=[one, 1]]) ,commitWithin:null , override:null
   [junit4]   2> DocSolrInputDocument(fields: [id=2, desc=[two, 2]]) ,commitWithin:null , override:null
   [junit4]   2> DocSolrInputDocument(fields: [id=3, desc=[three, 3]]) ,commitWithin:null , override:null
   [junit4]   2> DocSolrInputDocument(fields: [foobar=[baz1, baz2]]) ,commitWithin:null , override:null
   [junit4]   2> {SolrInputDocument(fields: [id=1, desc=[one, 1]])=null, SolrInputDocument(fields: [id=2, desc=[two, 2]])=null, SolrInputDocument(fields: [id=3, desc=[three, 3]])=null, SolrInputDocument(fields: [foobar=[baz1, baz2]])=null}
   [junit4]   2> [SolrInputDocument(fields: [id=1, desc=[one, 1]]), SolrInputDocument(fields: [id=2, desc=[two, 2]]), SolrInputDocument(fields: [id=3, desc=[three, 3]]), SolrInputDocument(fields: [foobar=[baz1, baz2]])]
   [junit4]   2> NOTE: reproduce with: ant test  -Dtestcase=TestUpdateRequestCodec -Dtests.method=testBackCompat4_5 -Dtests.seed=7D78F1E62F9DCBA7 -Dtests.slow=true -Dtests.badapples=true -Dtests.locale=lv -Dtests.timezone=Australia/West -Dtests.asserts=true -Dtests.file.encoding=UTF-8
   [junit4] FAILURE 0.00s J1 | TestUpdateRequestCodec.testBackCompat4_5 <<<
   [junit4]    > Throwable #1: junit.framework.AssertionFailedError: doc#0 diff values for field: desc expected:<[one, 1]> but was:<[one, 1]>
   [junit4]    > 	at __randomizedtesting.SeedInfo.seed([7D78F1E62F9DCBA7:F6C3C9F554CCF82E]:0)
   [junit4]    > 	at junit.framework.Assert.fail(Assert.java:57)
   [junit4]    > 	at junit.framework.Assert.failNotEquals(Assert.java:329)
   [junit4]    > 	at junit.framework.Assert.assertEquals(Assert.java:78)
   [junit4]    > 	at org.apache.solr.client.solrj.request.TestUpdateRequestCodec.compareDocs(TestUpdateRequestCodec.java:254)
   [junit4]    > 	at org.apache.solr.client.solrj.request.TestUpdateRequestCodec.testBackCompat4_5(TestUpdateRequestCodec.java:222)
   [junit4]    > 	at java.base/jdk.internal.reflect.NativeMethodAccessorImpl.invoke0(Native Method)
   [junit4]    > 	at java.base/jdk.internal.reflect.NativeMethodAccessorImpl.invoke(NativeMethodAccessorImpl.java:62)
   [junit4]    > 	at java.base/jdk.internal.reflect.DelegatingMethodAccessorImpl.invoke(DelegatingMethodAccessorImpl.java:43)
   [junit4]    > 	at java.base/java.lang.reflect.Method.invoke(Method.java:564)
   [junit4]    > 	at java.base/java.lang.Thread.run(Thread.java:844)
   [junit4] IGNOR/A 0.00s J1 | TestUpdateRequestCodec.testIteratable
   [junit4]    > Assumption #1: Ignored, failures limit reached (5 >= 5).
   [junit4]   2> NOTE: test params are: codec=Lucene80, sim=Asserting(org.apache.lucene.search.similarities.AssertingSimilarity@5ccd6a33), locale=lv, timezone=Australia/West
   [junit4]   2> NOTE: Windows 10 10.0 amd64/Oracle Corporation 10.0.1 (64-bit)/cpus=3,threads=1,free=124045976,total=171966464
   [junit4]   2> NOTE: All tests run in this JVM: [TestUpdateRequestCodec, TestUpdateRequestCodec]
   [junit4] Completed [2/5 (2!)] on J1 in 0.40s, 3 tests, 2 failures, 1 skipped <<< FAILURES!

[...truncated 1 lines...]
   [junit4] Suite: org.apache.solr.client.solrj.request.TestUpdateRequestCodec
   [junit4]   2> SLF4J: Class path contains multiple SLF4J bindings.
   [junit4]   2> SLF4J: Found binding in [jar:file:/C:/Users/jenkins/workspace/Lucene-Solr-master-Windows/solr/solrj/test-lib/log4j-slf4j-impl-2.11.0.jar!/org/slf4j/impl/StaticLoggerBinder.class]
   [junit4]   2> SLF4J: Found binding in [jar:file:/C:/Users/jenkins/workspace/Lucene-Solr-master-Windows/solr/core/lib/log4j-slf4j-impl-2.11.0.jar!/org/slf4j/impl/StaticLoggerBinder.class]
   [junit4]   2> SLF4J: See http://www.slf4j.org/codes.html#multiple_bindings for an explanation.
   [junit4]   2> SLF4J: Actual binding is of type [org.apache.logging.slf4j.Log4jLoggerFactory]
   [junit4]   2> NOTE: reproduce with: ant test  -Dtestcase=TestUpdateRequestCodec -Dtests.method=simple -Dtests.seed=7D78F1E62F9DCBA7 -Dtests.slow=true -Dtests.badapples=true -Dtests.locale=lv -Dtests.timezone=Australia/West -Dtests.asserts=true -Dtests.file.encoding=UTF-8
   [junit4] FAILURE 1.21s J0 | TestUpdateRequestCodec.simple <<<
   [junit4]    > Throwable #1: junit.framework.AssertionFailedError: doc#0 diff values for field: desc expected:<[one, 1]> but was:<[one, 1]>
   [junit4]    > 	at __randomizedtesting.SeedInfo.seed([7D78F1E62F9DCBA7:FE1147E048E09349]:0)
   [junit4]    > 	at junit.framework.Assert.fail(Assert.java:57)
   [junit4]    > 	at junit.framework.Assert.failNotEquals(Assert.java:329)
   [junit4]    > 	at junit.framework.Assert.assertEquals(Assert.java:78)
   [junit4]    > 	at org.apache.solr.client.solrj.request.TestUpdateRequestCodec.compareDocs(TestUpdateRequestCodec.java:254)
   [junit4]    > 	at org.apache.solr.client.solrj.request.TestUpdateRequestCodec.simple(TestUpdateRequestCodec.java:103)
   [junit4]    > 	at java.base/jdk.internal.reflect.NativeMethodAccessorImpl.invoke0(Native Method)
   [junit4]    > 	at java.base/jdk.internal.reflect.NativeMethodAccessorImpl.invoke(NativeMethodAccessorImpl.java:62)
   [junit4]    > 	at java.base/jdk.internal.reflect.DelegatingMethodAccessorImpl.invoke(DelegatingMethodAccessorImpl.java:43)
   [junit4]    > 	at java.base/java.lang.reflect.Method.invoke(Method.java:564)
   [junit4]    > 	at java.base/java.lang.Thread.run(Thread.java:844)
   [junit4]   2> 2791 WARN  (TEST-TestUpdateRequestCodec.testBackCompat4_5-seed#[7D78F1E62F9DCBA7]) [    ] o.a.s.c.u.JavaBinCodec Ignoring field boost: 2.0 as index-time boosts are not supported anymore
   [junit4]   2> DocSolrInputDocument(fields: [id=1, desc=[one, 1]]) ,commitWithin:null , override:null
   [junit4]   2> DocSolrInputDocument(fields: [id=2, desc=[two, 2]]) ,commitWithin:null , override:null
   [junit4]   2> DocSolrInputDocument(fields: [id=3, desc=[three, 3]]) ,commitWithin:null , override:null
   [junit4]   2> DocSolrInputDocument(fields: [foobar=[baz1, baz2]]) ,commitWithin:null , override:null
   [junit4]   2> {SolrInputDocument(fields: [id=1, desc=[one, 1]])=null, SolrInputDocument(fields: [id=2, desc=[two, 2]])=null, SolrInputDocument(fields: [id=3, desc=[three, 3]])=null, SolrInputDocument(fields: [foobar=[baz1, baz2]])=null}
   [junit4]   2> [SolrInputDocument(fields: [id=1, desc=[one, 1]]), SolrInputDocument(fields: [id=2, desc=[two, 2]]), SolrInputDocument(fields: [id=3, desc=[three, 3]]), SolrInputDocument(fields: [foobar=[baz1, baz2]])]
   [junit4]   2> NOTE: reproduce with: ant test  -Dtestcase=TestUpdateRequestCodec -Dtests.method=testBackCompat4_5 -Dtests.seed=7D78F1E62F9DCBA7 -Dtests.slow=true -Dtests.badapples=true -Dtests.locale=lv -Dtests.timezone=Australia/West -Dtests.asserts=true -Dtests.file.encoding=UTF-8
   [junit4] FAILURE 0.02s J0 | TestUpdateRequestCodec.testBackCompat4_5 <<<
   [junit4]    > Throwable #1: junit.framework.AssertionFailedError: doc#0 diff values for field: desc expected:<[one, 1]> but was:<[one, 1]>
   [junit4]    > 	at __randomizedtesting.SeedInfo.seed([7D78F1E62F9DCBA7:F6C3C9F554CCF82E]:0)
   [junit4]    > 	at junit.framework.Assert.fail(Assert.java:57)
   [junit4]    > 	at junit.framework.Assert.failNotEquals(Assert.java:329)
   [junit4]    > 	at junit.framework.Assert.assertEquals(Assert.java:78)
   [junit4]    > 	at org.apache.solr.client.solrj.request.TestUpdateRequestCodec.compareDocs(TestUpdateRequestCodec.java:254)
   [junit4]    > 	at org.apache.solr.client.solrj.request.TestUpdateRequestCodec.testBackCompat4_5(TestUpdateRequestCodec.java:222)
   [junit4]    > 	at java.base/jdk.internal.reflect.NativeMethodAccessorImpl.invoke0(Native Method)
   [junit4]    > 	at java.base/jdk.internal.reflect.NativeMethodAccessorImpl.invoke(NativeMethodAccessorImpl.java:62)
   [junit4]    > 	at java.base/jdk.internal.reflect.DelegatingMethodAccessorImpl.invoke(DelegatingMethodAccessorImpl.java:43)
   [junit4]    > 	at java.base/java.lang.reflect.Method.invoke(Method.java:564)
   [junit4]    > 	at java.base/java.lang.Thread.run(Thread.java:844)
   [junit4]   2> NOTE: reproduce with: ant test  -Dtestcase=TestUpdateRequestCodec -Dtests.method=testIteratable -Dtests.seed=7D78F1E62F9DCBA7 -Dtests.slow=true -Dtests.badapples=true -Dtests.locale=lv -Dtests.timezone=Australia/West -Dtests.asserts=true -Dtests.file.encoding=UTF-8
   [junit4] FAILURE 0.00s J0 | TestUpdateRequestCodec.testIteratable <<<
   [junit4]    > Throwable #1: junit.framework.AssertionFailedError: iterVal contents expected:<[iterItem1, iterItem2]> but was:<[iterItem1, iterItem2]>
   [junit4]    > 	at __randomizedtesting.SeedInfo.seed([7D78F1E62F9DCBA7:65543AEE2A2B6195]:0)
   [junit4]    > 	at junit.framework.Assert.fail(Assert.java:57)
   [junit4]    > 	at junit.framework.Assert.failNotEquals(Assert.java:329)
   [junit4]    > 	at junit.framework.Assert.assertEquals(Assert.java:78)
   [junit4]    > 	at org.apache.solr.client.solrj.request.TestUpdateRequestCodec.testIteratable(TestUpdateRequestCodec.java:159)
   [junit4]    > 	at java.base/jdk.internal.reflect.NativeMethodAccessorImpl.invoke0(Native Method)
   [junit4]    > 	at java.base/jdk.internal.reflect.NativeMethodAccessorImpl.invoke(NativeMethodAccessorImpl.java:62)
   [junit4]    > 	at java.base/jdk.internal.reflect.DelegatingMethodAccessorImpl.invoke(DelegatingMethodAccessorImpl.java:43)
   [junit4]    > 	at java.base/java.lang.reflect.Method.invoke(Method.java:564)
   [junit4]    > 	at java.base/java.lang.Thread.run(Thread.java:844)
   [junit4]   2> NOTE: test params are: codec=Lucene80, sim=Asserting(org.apache.lucene.search.similarities.AssertingSimilarity@b5e1d69), locale=lv, timezone=Australia/West
   [junit4]   2> NOTE: Windows 10 10.0 amd64/Oracle Corporation 10.0.1 (64-bit)/cpus=3,threads=1,free=142731136,total=171966464
   [junit4]   2> NOTE: All tests run in this JVM: [TestUpdateRequestCodec]
   [junit4] Completed [3/5 (3!)] on J0 in 1.95s, 3 tests, 3 failures <<< FAILURES!

[...truncated 1 lines...]
   [junit4] Suite: org.apache.solr.client.solrj.request.TestUpdateRequestCodec
   [junit4]   2> NOTE: reproduce with: ant test  -Dtestcase=TestUpdateRequestCodec -Dtests.method=simple -Dtests.seed=7D78F1E62F9DCBA7 -Dtests.slow=true -Dtests.badapples=true -Dtests.locale=lv -Dtests.timezone=Australia/West -Dtests.asserts=true -Dtests.file.encoding=UTF-8
   [junit4] FAILURE 0.00s J0 | TestUpdateRequestCodec.simple <<<
   [junit4]    > Throwable #1: junit.framework.AssertionFailedError: doc#0 diff values for field: desc expected:<[one, 1]> but was:<[one, 1]>
   [junit4]    > 	at __randomizedtesting.SeedInfo.seed([7D78F1E62F9DCBA7:FE1147E048E09349]:0)
   [junit4]    > 	at junit.framework.Assert.fail(Assert.java:57)
   [junit4]    > 	at junit.framework.Assert.failNotEquals(Assert.java:329)
   [junit4]    > 	at junit.framework.Assert.assertEquals(Assert.java:78)
   [junit4]    > 	at org.apache.solr.client.solrj.request.TestUpdateRequestCodec.compareDocs(TestUpdateRequestCodec.java:254)
   [junit4]    > 	at org.apache.solr.client.solrj.request.TestUpdateRequestCodec.simple(TestUpdateRequestCodec.java:103)
   [junit4]    > 	at java.base/jdk.internal.reflect.NativeMethodAccessorImpl.invoke0(Native Method)
   [junit4]    > 	at java.base/jdk.internal.reflect.NativeMethodAccessorImpl.invoke(NativeMethodAccessorImpl.java:62)
   [junit4]    > 	at java.base/jdk.internal.reflect.DelegatingMethodAccessorImpl.invoke(DelegatingMethodAccessorImpl.java:43)
   [junit4]    > 	at java.base/java.lang.reflect.Method.invoke(Method.java:564)
   [junit4]    > 	at java.base/java.lang.Thread.run(Thread.java:844)
   [junit4]   2> DocSolrInputDocument(fields: [id=1, desc=[one, 1]]) ,commitWithin:null , override:null
   [junit4]   2> DocSolrInputDocument(fields: [id=2, desc=[two, 2]]) ,commitWithin:null , override:null
   [junit4]   2> DocSolrInputDocument(fields: [id=3, desc=[three, 3]]) ,commitWithin:null , override:null
   [junit4]   2> DocSolrInputDocument(fields: [foobar=[baz1, baz2]]) ,commitWithin:null , override:null
   [junit4]   2> {SolrInputDocument(fields: [id=1, desc=[one, 1]])=null, SolrInputDocument(fields: [id=2, desc=[two, 2]])=null, SolrInputDocument(fields: [id=3, desc=[three, 3]])=null, SolrInputDocument(fields: [foobar=[baz1, baz2]])=null}
   [junit4]   2> [SolrInputDocument(fields: [id=1, desc=[one, 1]]), SolrInputDocument(fields: [id=2, desc=[two, 2]]), SolrInputDocument(fields: [id=3, desc=[three, 3]]), SolrInputDocument(fields: [foobar=[baz1, baz2]])]
   [junit4]   2> NOTE: reproduce with: ant test  -Dtestcase=TestUpdateRequestCodec -Dtests.method=testBackCompat4_5 -Dtests.seed=7D78F1E62F9DCBA7 -Dtests.slow=true -Dtests.badapples=true -Dtests.locale=lv -Dtests.timezone=Australia/West -Dtests.asserts=true -Dtests.file.encoding=UTF-8
   [junit4] FAILURE 0.00s J0 | TestUpdateRequestCodec.testBackCompat4_5 <<<
   [junit4]    > Throwable #1: junit.framework.AssertionFailedError: doc#0 diff values for field: desc expected:<[one, 1]> but was:<[one, 1]>
   [junit4]    > 	at __randomizedtesting.SeedInfo.seed([7D78F1E62F9DCBA7:F6C3C9F554CCF82E]:0)
   [junit4]    > 	at junit.framework.Assert.fail(Assert.java:57)
   [junit4]    > 	at junit.framework.Assert.failNotEquals(Assert.java:329)
   [junit4]    > 	at junit.framework.Assert.assertEquals(Assert.java:78)
   [junit4]    > 	at org.apache.solr.client.solrj.request.TestUpdateRequestCodec.compareDocs(TestUpdateRequestCodec.java:254)
   [junit4]    > 	at org.apache.solr.client.solrj.request.TestUpdateRequestCodec.testBackCompat4_5(TestUpdateRequestCodec.java:222)
   [junit4]    > 	at java.base/jdk.internal.reflect.NativeMethodAccessorImpl.invoke0(Native Method)
   [junit4]    > 	at java.base/jdk.internal.reflect.NativeMethodAccessorImpl.invoke(NativeMethodAccessorImpl.java:62)
   [junit4]    > 	at java.base/jdk.internal.reflect.DelegatingMethodAccessorImpl.invoke(DelegatingMethodAccessorImpl.java:43)
   [junit4]    > 	at java.base/java.lang.reflect.Method.invoke(Method.java:564)
   [junit4]    > 	at java.base/java.lang.Thread.run(Thread.java:844)
   [junit4] IGNOR/A 0.00s J0 | TestUpdateRequestCodec.testIteratable
   [junit4]    > Assumption #1: Ignored, failures limit reached (5 >= 5).
   [junit4]   2> NOTE: test params are: codec=Lucene80, sim=Asserting(org.apache.lucene.search.similarities.AssertingSimilarity@40743188), locale=lv, timezone=Australia/West
   [junit4]   2> NOTE: Windows 10 10.0 amd64/Oracle Corporation 10.0.1 (64-bit)/cpus=3,threads=1,free=124477536,total=171966464
   [junit4]   2> NOTE: All tests run in this JVM: [TestUpdateRequestCodec, TestUpdateRequestCodec]
   [junit4] Completed [4/5 (4!)] on J0 in 0.28s, 3 tests, 2 failures, 1 skipped <<< FAILURES!

[...truncated 22 lines...]
BUILD FAILED
C:\Users\jenkins\workspace\Lucene-Solr-master-Windows\lucene\common-build.xml:1572: The following error occurred while executing this line:
C:\Users\jenkins\workspace\Lucene-Solr-master-Windows\lucene\common-build.xml:1099: There were test failures: 5 suites, 15 tests, 10 failures, 5 ignored (2 assumptions) [seed: 7D78F1E62F9DCBA7]

Total time: 5 seconds

[repro] Setting last failure code to 1

[repro] Failures:
[repro]   4/5 failed: org.apache.solr.client.solrj.request.TestUpdateRequestCodec
[repro] Exiting with code 1

C:\Users\jenkins\workspace\Lucene-Solr-master-Windows>IF EXIST lucene\build move /y lucene\build lucene\build.repro 
        1 dir(s) moved.

C:\Users\jenkins\workspace\Lucene-Solr-master-Windows>IF EXIST solr\build move /y solr\build solr\build.repro 
        1 dir(s) moved.

C:\Users\jenkins\workspace\Lucene-Solr-master-Windows>IF EXIST lucene\build.orig move /y lucene\build.orig lucene\build 
        1 dir(s) moved.

C:\Users\jenkins\workspace\Lucene-Solr-master-Windows>IF EXIST solr\build.orig move /y solr\build.orig solr\build 
        1 dir(s) moved.

C:\Users\jenkins\workspace\Lucene-Solr-master-Windows>exit 0 
Archiving artifacts
Setting ANT_1_8_2_HOME=C:\Users\jenkins\tools\hudson.tasks.Ant_AntInstallation\ANT_1.8.2
[WARNINGS] Parsing warnings in console log with parser Java Compiler (javac)
Setting ANT_1_8_2_HOME=C:\Users\jenkins\tools\hudson.tasks.Ant_AntInstallation\ANT_1.8.2
Setting ANT_1_8_2_HOME=C:\Users\jenkins\tools\hudson.tasks.Ant_AntInstallation\ANT_1.8.2
<Git Blamer> Using GitBlamer to create author and commit information for all warnings.
<Git Blamer> GIT_COMMIT=3932a4cc6cc4782cecd8d5f23771e3478485e906, workspace=C:\Users\jenkins\workspace\Lucene-Solr-master-Windows
[WARNINGS] Computing warning deltas based on reference build #7682
Recording test results
Setting ANT_1_8_2_HOME=C:\Users\jenkins\tools\hudson.tasks.Ant_AntInstallation\ANT_1.8.2
Build step 'Publish JUnit test result report' changed build result to UNSTABLE
Email was triggered for: Unstable (Test Failures)
Sending email for trigger: Unstable (Test Failures)
Setting ANT_1_8_2_HOME=C:\Users\jenkins\tools\hudson.tasks.Ant_AntInstallation\ANT_1.8.2
Setting ANT_1_8_2_HOME=C:\Users\jenkins\tools\hudson.tasks.Ant_AntInstallation\ANT_1.8.2
Setting ANT_1_8_2_HOME=C:\Users\jenkins\tools\hudson.tasks.Ant_AntInstallation\ANT_1.8.2
Setting ANT_1_8_2_HOME=C:\Users\jenkins\tools\hudson.tasks.Ant_AntInstallation\ANT_1.8.2

Mime
View raw message