lucene-dev mailing list archives

Site index · List index
Message view « Date » · « Thread »
Top « Date » · « Thread »
From Apache Jenkins Server <jenk...@builds.apache.org>
Subject [JENKINS] Lucene-Solr-BadApples-NightlyTests-7.x - Build # 44 - Still Unstable
Date Thu, 17 Jan 2019 04:18:25 GMT
Build: https://builds.apache.org/job/Lucene-Solr-BadApples-NightlyTests-7.x/44/

3 tests failed.
FAILED:  org.apache.solr.cloud.ChaosMonkeyNothingIsSafeTest.test

Error Message:
The Monkey ran for over 60 seconds and no jetties were stopped - this is worth investigating!

Stack Trace:
java.lang.AssertionError: The Monkey ran for over 60 seconds and no jetties were stopped - this is worth investigating!
	at __randomizedtesting.SeedInfo.seed([C3826F1E4C04A535:4BD650C4E2F8C8CD]:0)
	at org.junit.Assert.fail(Assert.java:88)
	at org.apache.solr.cloud.ChaosMonkey.stopTheMonkey(ChaosMonkey.java:541)
	at org.apache.solr.cloud.ChaosMonkeyNothingIsSafeTest.test(ChaosMonkeyNothingIsSafeTest.java:207)
	at sun.reflect.NativeMethodAccessorImpl.invoke0(Native Method)
	at sun.reflect.NativeMethodAccessorImpl.invoke(NativeMethodAccessorImpl.java:62)
	at sun.reflect.DelegatingMethodAccessorImpl.invoke(DelegatingMethodAccessorImpl.java:43)
	at java.lang.reflect.Method.invoke(Method.java:498)
	at com.carrotsearch.randomizedtesting.RandomizedRunner.invoke(RandomizedRunner.java:1750)
	at com.carrotsearch.randomizedtesting.RandomizedRunner$8.evaluate(RandomizedRunner.java:938)
	at com.carrotsearch.randomizedtesting.RandomizedRunner$9.evaluate(RandomizedRunner.java:974)
	at com.carrotsearch.randomizedtesting.RandomizedRunner$10.evaluate(RandomizedRunner.java:988)
	at org.apache.solr.BaseDistributedSearchTestCase$ShardsRepeatRule$ShardsFixedStatement.callStatement(BaseDistributedSearchTestCase.java:1075)
	at org.apache.solr.BaseDistributedSearchTestCase$ShardsRepeatRule$ShardsStatement.evaluate(BaseDistributedSearchTestCase.java:1047)
	at com.carrotsearch.randomizedtesting.rules.SystemPropertiesRestoreRule$1.evaluate(SystemPropertiesRestoreRule.java:57)
	at org.apache.lucene.util.TestRuleSetupTeardownChained$1.evaluate(TestRuleSetupTeardownChained.java:49)
	at org.apache.lucene.util.AbstractBeforeAfterRule$1.evaluate(AbstractBeforeAfterRule.java:45)
	at org.apache.lucene.util.TestRuleThreadAndTestName$1.evaluate(TestRuleThreadAndTestName.java:48)
	at org.apache.lucene.util.TestRuleIgnoreAfterMaxFailures$1.evaluate(TestRuleIgnoreAfterMaxFailures.java:64)
	at org.apache.lucene.util.TestRuleMarkFailure$1.evaluate(TestRuleMarkFailure.java:47)
	at com.carrotsearch.randomizedtesting.rules.StatementAdapter.evaluate(StatementAdapter.java:36)
	at com.carrotsearch.randomizedtesting.ThreadLeakControl$StatementRunner.run(ThreadLeakControl.java:368)
	at com.carrotsearch.randomizedtesting.ThreadLeakControl.forkTimeoutingTask(ThreadLeakControl.java:817)
	at com.carrotsearch.randomizedtesting.ThreadLeakControl$3.evaluate(ThreadLeakControl.java:468)
	at com.carrotsearch.randomizedtesting.RandomizedRunner.runSingleTest(RandomizedRunner.java:947)
	at com.carrotsearch.randomizedtesting.RandomizedRunner$5.evaluate(RandomizedRunner.java:832)
	at com.carrotsearch.randomizedtesting.RandomizedRunner$6.evaluate(RandomizedRunner.java:883)
	at com.carrotsearch.randomizedtesting.RandomizedRunner$7.evaluate(RandomizedRunner.java:894)
	at com.carrotsearch.randomizedtesting.rules.StatementAdapter.evaluate(StatementAdapter.java:36)
	at com.carrotsearch.randomizedtesting.rules.SystemPropertiesRestoreRule$1.evaluate(SystemPropertiesRestoreRule.java:57)
	at org.apache.lucene.util.AbstractBeforeAfterRule$1.evaluate(AbstractBeforeAfterRule.java:45)
	at com.carrotsearch.randomizedtesting.rules.StatementAdapter.evaluate(StatementAdapter.java:36)
	at org.apache.lucene.util.TestRuleStoreClassName$1.evaluate(TestRuleStoreClassName.java:41)
	at com.carrotsearch.randomizedtesting.rules.NoShadowingOrOverridesOnMethodsRule$1.evaluate(NoShadowingOrOverridesOnMethodsRule.java:40)
	at com.carrotsearch.randomizedtesting.rules.NoShadowingOrOverridesOnMethodsRule$1.evaluate(NoShadowingOrOverridesOnMethodsRule.java:40)
	at com.carrotsearch.randomizedtesting.rules.StatementAdapter.evaluate(StatementAdapter.java:36)
	at com.carrotsearch.randomizedtesting.rules.StatementAdapter.evaluate(StatementAdapter.java:36)
	at com.carrotsearch.randomizedtesting.rules.StatementAdapter.evaluate(StatementAdapter.java:36)
	at org.apache.lucene.util.TestRuleAssertionsRequired$1.evaluate(TestRuleAssertionsRequired.java:53)
	at org.apache.lucene.util.TestRuleMarkFailure$1.evaluate(TestRuleMarkFailure.java:47)
	at org.apache.lucene.util.TestRuleIgnoreAfterMaxFailures$1.evaluate(TestRuleIgnoreAfterMaxFailures.java:64)
	at org.apache.lucene.util.TestRuleIgnoreTestSuites$1.evaluate(TestRuleIgnoreTestSuites.java:54)
	at com.carrotsearch.randomizedtesting.rules.StatementAdapter.evaluate(StatementAdapter.java:36)
	at com.carrotsearch.randomizedtesting.ThreadLeakControl$StatementRunner.run(ThreadLeakControl.java:368)
	at java.lang.Thread.run(Thread.java:748)


FAILED:  junit.framework.TestSuite.org.apache.solr.cloud.ChaosMonkeyNothingIsSafeTest

Error Message:
4 threads leaked from SUITE scope at org.apache.solr.cloud.ChaosMonkeyNothingIsSafeTest:     1) Thread[id=7375, name=StoppableIndexingThread, state=TIMED_WAITING, group=TGRP-ChaosMonkeyNothingIsSafeTest]         at java.lang.Thread.sleep(Native Method)         at org.apache.solr.cloud.StoppableIndexingThread.run(StoppableIndexingThread.java:135)    2) Thread[id=7377, name=StoppableSearchThread, state=TIMED_WAITING, group=TGRP-ChaosMonkeyNothingIsSafeTest]         at java.lang.Thread.sleep(Native Method)         at org.apache.solr.cloud.StoppableSearchThread.run(StoppableSearchThread.java:65)    3) Thread[id=7376, name=StoppableIndexingThread, state=TIMED_WAITING, group=TGRP-ChaosMonkeyNothingIsSafeTest]         at java.lang.Thread.sleep(Native Method)         at org.apache.solr.cloud.StoppableIndexingThread.run(StoppableIndexingThread.java:135)    4) Thread[id=7374, name=StoppableIndexingThread, state=TIMED_WAITING, group=TGRP-ChaosMonkeyNothingIsSafeTest]         at java.lang.Thread.sleep(Native Method)         at org.apache.solr.cloud.StoppableIndexingThread.run(StoppableIndexingThread.java:135)

Stack Trace:
com.carrotsearch.randomizedtesting.ThreadLeakError: 4 threads leaked from SUITE scope at org.apache.solr.cloud.ChaosMonkeyNothingIsSafeTest: 
   1) Thread[id=7375, name=StoppableIndexingThread, state=TIMED_WAITING, group=TGRP-ChaosMonkeyNothingIsSafeTest]
        at java.lang.Thread.sleep(Native Method)
        at org.apache.solr.cloud.StoppableIndexingThread.run(StoppableIndexingThread.java:135)
   2) Thread[id=7377, name=StoppableSearchThread, state=TIMED_WAITING, group=TGRP-ChaosMonkeyNothingIsSafeTest]
        at java.lang.Thread.sleep(Native Method)
        at org.apache.solr.cloud.StoppableSearchThread.run(StoppableSearchThread.java:65)
   3) Thread[id=7376, name=StoppableIndexingThread, state=TIMED_WAITING, group=TGRP-ChaosMonkeyNothingIsSafeTest]
        at java.lang.Thread.sleep(Native Method)
        at org.apache.solr.cloud.StoppableIndexingThread.run(StoppableIndexingThread.java:135)
   4) Thread[id=7374, name=StoppableIndexingThread, state=TIMED_WAITING, group=TGRP-ChaosMonkeyNothingIsSafeTest]
        at java.lang.Thread.sleep(Native Method)
        at org.apache.solr.cloud.StoppableIndexingThread.run(StoppableIndexingThread.java:135)
	at __randomizedtesting.SeedInfo.seed([C3826F1E4C04A535]:0)


FAILED:  junit.framework.TestSuite.org.apache.solr.cloud.ChaosMonkeyNothingIsSafeTest

Error Message:
There are still zombie threads that couldn't be terminated:    1) Thread[id=7375, name=StoppableIndexingThread, state=BLOCKED, group=TGRP-ChaosMonkeyNothingIsSafeTest]         at java.io.PrintStream.println(PrintStream.java:805)         at org.apache.solr.cloud.StoppableIndexingThread.run(StoppableIndexingThread.java:120)    2) Thread[id=7377, name=StoppableSearchThread, state=RUNNABLE, group=TGRP-ChaosMonkeyNothingIsSafeTest]         at java.lang.Thread.holdsLock(Native Method)         at com.carrotsearch.ant.tasks.junit4.events.Serializer.flushQueue(Serializer.java:106)         at com.carrotsearch.ant.tasks.junit4.events.Serializer.serialize(Serializer.java:98)         at com.carrotsearch.ant.tasks.junit4.slave.SlaveMain$3$2.write(SlaveMain.java:498)         at java.io.BufferedOutputStream.flushBuffer(BufferedOutputStream.java:82)         at java.io.BufferedOutputStream.flush(BufferedOutputStream.java:140)         at java.io.PrintStream.flush(PrintStream.java:338)         at java.io.FilterOutputStream.flush(FilterOutputStream.java:140)         at java.io.PrintStream.write(PrintStream.java:482)         at org.apache.logging.log4j.core.util.CloseShieldOutputStream.write(CloseShieldOutputStream.java:53)         at org.apache.logging.log4j.core.appender.OutputStreamManager.writeToDestination(OutputStreamManager.java:263)         at org.apache.logging.log4j.core.appender.OutputStreamManager.flushBuffer(OutputStreamManager.java:295)         at org.apache.logging.log4j.core.appender.OutputStreamManager.flush(OutputStreamManager.java:304)         at org.apache.logging.log4j.core.appender.AbstractOutputStreamAppender.directEncodeEvent(AbstractOutputStreamAppender.java:179)         at org.apache.logging.log4j.core.appender.AbstractOutputStreamAppender.tryAppend(AbstractOutputStreamAppender.java:170)         at org.apache.logging.log4j.core.appender.AbstractOutputStreamAppender.append(AbstractOutputStreamAppender.java:161)         at org.apache.logging.log4j.core.config.AppenderControl.tryCallAppender(AppenderControl.java:156)         at org.apache.logging.log4j.core.config.AppenderControl.callAppender0(AppenderControl.java:129)         at org.apache.logging.log4j.core.config.AppenderControl.callAppenderPreventRecursion(AppenderControl.java:120)         at org.apache.logging.log4j.core.config.AppenderControl.callAppender(AppenderControl.java:84)         at org.apache.logging.log4j.core.config.LoggerConfig.callAppenders(LoggerConfig.java:448)         at org.apache.logging.log4j.core.config.LoggerConfig.processLogEvent(LoggerConfig.java:433)         at org.apache.logging.log4j.core.config.LoggerConfig.log(LoggerConfig.java:417)         at org.apache.logging.log4j.core.config.LoggerConfig.log(LoggerConfig.java:403)         at org.apache.logging.log4j.core.config.AwaitCompletionReliabilityStrategy.log(AwaitCompletionReliabilityStrategy.java:63)         at org.apache.logging.log4j.core.Logger.logMessage(Logger.java:146)         at org.apache.logging.log4j.spi.AbstractLogger.tryLogMessage(AbstractLogger.java:2170)         at org.apache.logging.log4j.spi.AbstractLogger.logMessageTrackRecursion(AbstractLogger.java:2125)         at org.apache.logging.log4j.spi.AbstractLogger.logMessageSafely(AbstractLogger.java:2108)         at org.apache.logging.log4j.spi.AbstractLogger.logMessage(AbstractLogger.java:2013)         at org.apache.logging.log4j.spi.AbstractLogger.logIfEnabled(AbstractLogger.java:1882)         at org.apache.logging.slf4j.Log4jLogger.error(Log4jLogger.java:314)         at org.apache.solr.client.solrj.impl.CloudSolrClient.requestWithRetryOnStaleState(CloudSolrClient.java:925)         at org.apache.solr.client.solrj.impl.CloudSolrClient.request(CloudSolrClient.java:817)         at org.apache.solr.client.solrj.SolrRequest.process(SolrRequest.java:194)         at org.apache.solr.client.solrj.SolrClient.query(SolrClient.java:983)         at org.apache.solr.client.solrj.SolrClient.query(SolrClient.java:998)         at org.apache.solr.cloud.StoppableSearchThread.run(StoppableSearchThread.java:54)    3) Thread[id=7376, name=StoppableIndexingThread, state=RUNNABLE, group=TGRP-ChaosMonkeyNothingIsSafeTest]         at org.apache.solr.cloud.StoppableIndexingThread.run(StoppableIndexingThread.java:107)    4) Thread[id=7374, name=StoppableIndexingThread, state=BLOCKED, group=TGRP-ChaosMonkeyNothingIsSafeTest]         at java.io.PrintStream.println(PrintStream.java:805)         at org.apache.solr.cloud.StoppableIndexingThread.run(StoppableIndexingThread.java:120)

Stack Trace:
com.carrotsearch.randomizedtesting.ThreadLeakError: There are still zombie threads that couldn't be terminated:
   1) Thread[id=7375, name=StoppableIndexingThread, state=BLOCKED, group=TGRP-ChaosMonkeyNothingIsSafeTest]
        at java.io.PrintStream.println(PrintStream.java:805)
        at org.apache.solr.cloud.StoppableIndexingThread.run(StoppableIndexingThread.java:120)
   2) Thread[id=7377, name=StoppableSearchThread, state=RUNNABLE, group=TGRP-ChaosMonkeyNothingIsSafeTest]
        at java.lang.Thread.holdsLock(Native Method)
        at com.carrotsearch.ant.tasks.junit4.events.Serializer.flushQueue(Serializer.java:106)
        at com.carrotsearch.ant.tasks.junit4.events.Serializer.serialize(Serializer.java:98)
        at com.carrotsearch.ant.tasks.junit4.slave.SlaveMain$3$2.write(SlaveMain.java:498)
        at java.io.BufferedOutputStream.flushBuffer(BufferedOutputStream.java:82)
        at java.io.BufferedOutputStream.flush(BufferedOutputStream.java:140)
        at java.io.PrintStream.flush(PrintStream.java:338)
        at java.io.FilterOutputStream.flush(FilterOutputStream.java:140)
        at java.io.PrintStream.write(PrintStream.java:482)
        at org.apache.logging.log4j.core.util.CloseShieldOutputStream.write(CloseShieldOutputStream.java:53)
        at org.apache.logging.log4j.core.appender.OutputStreamManager.writeToDestination(OutputStreamManager.java:263)
        at org.apache.logging.log4j.core.appender.OutputStreamManager.flushBuffer(OutputStreamManager.java:295)
        at org.apache.logging.log4j.core.appender.OutputStreamManager.flush(OutputStreamManager.java:304)
        at org.apache.logging.log4j.core.appender.AbstractOutputStreamAppender.directEncodeEvent(AbstractOutputStreamAppender.java:179)
        at org.apache.logging.log4j.core.appender.AbstractOutputStreamAppender.tryAppend(AbstractOutputStreamAppender.java:170)
        at org.apache.logging.log4j.core.appender.AbstractOutputStreamAppender.append(AbstractOutputStreamAppender.java:161)
        at org.apache.logging.log4j.core.config.AppenderControl.tryCallAppender(AppenderControl.java:156)
        at org.apache.logging.log4j.core.config.AppenderControl.callAppender0(AppenderControl.java:129)
        at org.apache.logging.log4j.core.config.AppenderControl.callAppenderPreventRecursion(AppenderControl.java:120)
        at org.apache.logging.log4j.core.config.AppenderControl.callAppender(AppenderControl.java:84)
        at org.apache.logging.log4j.core.config.LoggerConfig.callAppenders(LoggerConfig.java:448)
        at org.apache.logging.log4j.core.config.LoggerConfig.processLogEvent(LoggerConfig.java:433)
        at org.apache.logging.log4j.core.config.LoggerConfig.log(LoggerConfig.java:417)
        at org.apache.logging.log4j.core.config.LoggerConfig.log(LoggerConfig.java:403)
        at org.apache.logging.log4j.core.config.AwaitCompletionReliabilityStrategy.log(AwaitCompletionReliabilityStrategy.java:63)
        at org.apache.logging.log4j.core.Logger.logMessage(Logger.java:146)
        at org.apache.logging.log4j.spi.AbstractLogger.tryLogMessage(AbstractLogger.java:2170)
        at org.apache.logging.log4j.spi.AbstractLogger.logMessageTrackRecursion(AbstractLogger.java:2125)
        at org.apache.logging.log4j.spi.AbstractLogger.logMessageSafely(AbstractLogger.java:2108)
        at org.apache.logging.log4j.spi.AbstractLogger.logMessage(AbstractLogger.java:2013)
        at org.apache.logging.log4j.spi.AbstractLogger.logIfEnabled(AbstractLogger.java:1882)
        at org.apache.logging.slf4j.Log4jLogger.error(Log4jLogger.java:314)
        at org.apache.solr.client.solrj.impl.CloudSolrClient.requestWithRetryOnStaleState(CloudSolrClient.java:925)
        at org.apache.solr.client.solrj.impl.CloudSolrClient.request(CloudSolrClient.java:817)
        at org.apache.solr.client.solrj.SolrRequest.process(SolrRequest.java:194)
        at org.apache.solr.client.solrj.SolrClient.query(SolrClient.java:983)
        at org.apache.solr.client.solrj.SolrClient.query(SolrClient.java:998)
        at org.apache.solr.cloud.StoppableSearchThread.run(StoppableSearchThread.java:54)
   3) Thread[id=7376, name=StoppableIndexingThread, state=RUNNABLE, group=TGRP-ChaosMonkeyNothingIsSafeTest]
        at org.apache.solr.cloud.StoppableIndexingThread.run(StoppableIndexingThread.java:107)
   4) Thread[id=7374, name=StoppableIndexingThread, state=BLOCKED, group=TGRP-ChaosMonkeyNothingIsSafeTest]
        at java.io.PrintStream.println(PrintStream.java:805)
        at org.apache.solr.cloud.StoppableIndexingThread.run(StoppableIndexingThread.java:120)
	at __randomizedtesting.SeedInfo.seed([C3826F1E4C04A535]:0)




Build Log:
[...truncated 13469 lines...]
   [junit4] Suite: org.apache.solr.cloud.ChaosMonkeyNothingIsSafeTest
   [junit4]   2> 636934 INFO  (SUITE-ChaosMonkeyNothingIsSafeTest-seed#[C3826F1E4C04A535]-worker) [    ] o.a.s.SolrTestCaseJ4 SecureRandom sanity checks: test.solr.allowed.securerandom=null & java.security.egd=file:/dev/./urandom
   [junit4]   2> Creating dataDir: /x1/jenkins/jenkins-slave/workspace/Lucene-Solr-BadApples-NightlyTests-7.x/checkout/solr/build/solr-core/test/J0/temp/solr.cloud.ChaosMonkeyNothingIsSafeTest_C3826F1E4C04A535-001/init-core-data-001
   [junit4]   2> 636935 WARN  (SUITE-ChaosMonkeyNothingIsSafeTest-seed#[C3826F1E4C04A535]-worker) [    ] o.a.s.SolrTestCaseJ4 startTrackingSearchers: numOpens=30 numCloses=30
   [junit4]   2> 636935 INFO  (SUITE-ChaosMonkeyNothingIsSafeTest-seed#[C3826F1E4C04A535]-worker) [    ] o.a.s.SolrTestCaseJ4 Using PointFields (NUMERIC_POINTS_SYSPROP=true) w/NUMERIC_DOCVALUES_SYSPROP=true
   [junit4]   2> 636937 INFO  (SUITE-ChaosMonkeyNothingIsSafeTest-seed#[C3826F1E4C04A535]-worker) [    ] o.a.s.SolrTestCaseJ4 Randomized ssl (false) and clientAuth (false) via: @org.apache.solr.SolrTestCaseJ4$SuppressSSL(bugUrl=https://issues.apache.org/jira/browse/SOLR-5776)
   [junit4]   2> 636937 INFO  (SUITE-ChaosMonkeyNothingIsSafeTest-seed#[C3826F1E4C04A535]-worker) [    ] o.a.s.BaseDistributedSearchTestCase Setting hostContext system property: /
   [junit4]   2> 636942 INFO  (TEST-ChaosMonkeyNothingIsSafeTest.test-seed#[C3826F1E4C04A535]) [    ] o.a.s.c.ZkTestServer STARTING ZK TEST SERVER
   [junit4]   2> 636943 INFO  (ZkTestServer Run Thread) [    ] o.a.s.c.ZkTestServer client port:0.0.0.0/0.0.0.0:0
   [junit4]   2> 636943 INFO  (ZkTestServer Run Thread) [    ] o.a.s.c.ZkTestServer Starting server
   [junit4]   2> 637043 INFO  (TEST-ChaosMonkeyNothingIsSafeTest.test-seed#[C3826F1E4C04A535]) [    ] o.a.s.c.ZkTestServer start zk server on port:42694
   [junit4]   2> 637043 INFO  (TEST-ChaosMonkeyNothingIsSafeTest.test-seed#[C3826F1E4C04A535]) [    ] o.a.s.c.ZkTestServer parse host and port list: 127.0.0.1:42694
   [junit4]   2> 637043 INFO  (TEST-ChaosMonkeyNothingIsSafeTest.test-seed#[C3826F1E4C04A535]) [    ] o.a.s.c.ZkTestServer connecting to 127.0.0.1 42694
   [junit4]   2> 637048 INFO  (zkConnectionManagerCallback-1682-thread-1) [    ] o.a.s.c.c.ConnectionManager zkClient has connected
   [junit4]   2> 637052 INFO  (zkConnectionManagerCallback-1684-thread-1) [    ] o.a.s.c.c.ConnectionManager zkClient has connected
   [junit4]   2> 637054 INFO  (TEST-ChaosMonkeyNothingIsSafeTest.test-seed#[C3826F1E4C04A535]) [    ] o.a.s.c.ZkTestServer put /x1/jenkins/jenkins-slave/workspace/Lucene-Solr-BadApples-NightlyTests-7.x/checkout/solr/core/src/test-files/solr/collection1/conf/solrconfig-tlog.xml to /configs/conf1/solrconfig.xml
   [junit4]   2> 637056 INFO  (TEST-ChaosMonkeyNothingIsSafeTest.test-seed#[C3826F1E4C04A535]) [    ] o.a.s.c.ZkTestServer put /x1/jenkins/jenkins-slave/workspace/Lucene-Solr-BadApples-NightlyTests-7.x/checkout/solr/core/src/test-files/solr/collection1/conf/schema15.xml to /configs/conf1/schema.xml
   [junit4]   2> 637057 INFO  (TEST-ChaosMonkeyNothingIsSafeTest.test-seed#[C3826F1E4C04A535]) [    ] o.a.s.c.ZkTestServer put /x1/jenkins/jenkins-slave/workspace/Lucene-Solr-BadApples-NightlyTests-7.x/checkout/solr/core/src/test-files/solr/collection1/conf/solrconfig.snippet.randomindexconfig.xml to /configs/conf1/solrconfig.snippet.randomindexconfig.xml
   [junit4]   2> 637059 INFO  (TEST-ChaosMonkeyNothingIsSafeTest.test-seed#[C3826F1E4C04A535]) [    ] o.a.s.c.ZkTestServer put /x1/jenkins/jenkins-slave/workspace/Lucene-Solr-BadApples-NightlyTests-7.x/checkout/solr/core/src/test-files/solr/collection1/conf/stopwords.txt to /configs/conf1/stopwords.txt
   [junit4]   2> 637060 INFO  (TEST-ChaosMonkeyNothingIsSafeTest.test-seed#[C3826F1E4C04A535]) [    ] o.a.s.c.ZkTestServer put /x1/jenkins/jenkins-slave/workspace/Lucene-Solr-BadApples-NightlyTests-7.x/checkout/solr/core/src/test-files/solr/collection1/conf/protwords.txt to /configs/conf1/protwords.txt
   [junit4]   2> 637061 INFO  (TEST-ChaosMonkeyNothingIsSafeTest.test-seed#[C3826F1E4C04A535]) [    ] o.a.s.c.ZkTestServer put /x1/jenkins/jenkins-slave/workspace/Lucene-Solr-BadApples-NightlyTests-7.x/checkout/solr/core/src/test-files/solr/collection1/conf/currency.xml to /configs/conf1/currency.xml
   [junit4]   2> 637063 INFO  (TEST-ChaosMonkeyNothingIsSafeTest.test-seed#[C3826F1E4C04A535]) [    ] o.a.s.c.ZkTestServer put /x1/jenkins/jenkins-slave/workspace/Lucene-Solr-BadApples-NightlyTests-7.x/checkout/solr/core/src/test-files/solr/collection1/conf/enumsConfig.xml to /configs/conf1/enumsConfig.xml
   [junit4]   2> 637064 INFO  (TEST-ChaosMonkeyNothingIsSafeTest.test-seed#[C3826F1E4C04A535]) [    ] o.a.s.c.ZkTestServer put /x1/jenkins/jenkins-slave/workspace/Lucene-Solr-BadApples-NightlyTests-7.x/checkout/solr/core/src/test-files/solr/collection1/conf/open-exchange-rates.json to /configs/conf1/open-exchange-rates.json
   [junit4]   2> 637065 INFO  (TEST-ChaosMonkeyNothingIsSafeTest.test-seed#[C3826F1E4C04A535]) [    ] o.a.s.c.ZkTestServer put /x1/jenkins/jenkins-slave/workspace/Lucene-Solr-BadApples-NightlyTests-7.x/checkout/solr/core/src/test-files/solr/collection1/conf/mapping-ISOLatin1Accent.txt to /configs/conf1/mapping-ISOLatin1Accent.txt
   [junit4]   2> 637066 INFO  (TEST-ChaosMonkeyNothingIsSafeTest.test-seed#[C3826F1E4C04A535]) [    ] o.a.s.c.ZkTestServer put /x1/jenkins/jenkins-slave/workspace/Lucene-Solr-BadApples-NightlyTests-7.x/checkout/solr/core/src/test-files/solr/collection1/conf/old_synonyms.txt to /configs/conf1/old_synonyms.txt
   [junit4]   2> 637068 INFO  (TEST-ChaosMonkeyNothingIsSafeTest.test-seed#[C3826F1E4C04A535]) [    ] o.a.s.c.ZkTestServer put /x1/jenkins/jenkins-slave/workspace/Lucene-Solr-BadApples-NightlyTests-7.x/checkout/solr/core/src/test-files/solr/collection1/conf/synonyms.txt to /configs/conf1/synonyms.txt
   [junit4]   2> 637069 INFO  (TEST-ChaosMonkeyNothingIsSafeTest.test-seed#[C3826F1E4C04A535]) [    ] o.a.s.c.AbstractFullDistribZkTestBase Will use NRT replicas unless explicitly asked otherwise
   [junit4]   2> 637239 WARN  (TEST-ChaosMonkeyNothingIsSafeTest.test-seed#[C3826F1E4C04A535]) [    ] o.e.j.s.AbstractConnector Ignoring deprecated socket close linger time
   [junit4]   2> 637239 INFO  (TEST-ChaosMonkeyNothingIsSafeTest.test-seed#[C3826F1E4C04A535]) [    ] o.a.s.c.s.e.JettySolrRunner Start Jetty (original configured port=0)
   [junit4]   2> 637239 INFO  (TEST-ChaosMonkeyNothingIsSafeTest.test-seed#[C3826F1E4C04A535]) [    ] o.a.s.c.s.e.JettySolrRunner Trying to start Jetty on port 0 try number 1 ...
   [junit4]   2> 637239 INFO  (TEST-ChaosMonkeyNothingIsSafeTest.test-seed#[C3826F1E4C04A535]) [    ] o.e.j.s.Server jetty-9.4.14.v20181114; built: 2018-11-14T21:20:31.478Z; git: c4550056e785fb5665914545889f21dc136ad9e6; jvm 1.8.0_191-b12
   [junit4]   2> 637241 INFO  (TEST-ChaosMonkeyNothingIsSafeTest.test-seed#[C3826F1E4C04A535]) [    ] o.e.j.s.session DefaultSessionIdManager workerName=node0
   [junit4]   2> 637241 INFO  (TEST-ChaosMonkeyNothingIsSafeTest.test-seed#[C3826F1E4C04A535]) [    ] o.e.j.s.session No SessionScavenger set, using defaults
   [junit4]   2> 637241 INFO  (TEST-ChaosMonkeyNothingIsSafeTest.test-seed#[C3826F1E4C04A535]) [    ] o.e.j.s.session node0 Scavenging every 600000ms
   [junit4]   2> 637241 INFO  (TEST-ChaosMonkeyNothingIsSafeTest.test-seed#[C3826F1E4C04A535]) [    ] o.e.j.s.h.ContextHandler Started o.e.j.s.ServletContextHandler@54bd6257{/,null,AVAILABLE}
   [junit4]   2> 637248 INFO  (TEST-ChaosMonkeyNothingIsSafeTest.test-seed#[C3826F1E4C04A535]) [    ] o.e.j.s.AbstractConnector Started ServerConnector@626a6613{HTTP/1.1,[http/1.1]}{127.0.0.1:41540}
   [junit4]   2> 637248 INFO  (TEST-ChaosMonkeyNothingIsSafeTest.test-seed#[C3826F1E4C04A535]) [    ] o.e.j.s.Server Started @637305ms
   [junit4]   2> 637248 INFO  (TEST-ChaosMonkeyNothingIsSafeTest.test-seed#[C3826F1E4C04A535]) [    ] o.a.s.c.s.e.JettySolrRunner Jetty properties: {solr.data.dir=/x1/jenkins/jenkins-slave/workspace/Lucene-Solr-BadApples-NightlyTests-7.x/checkout/solr/build/solr-core/test/J0/temp/solr.cloud.ChaosMonkeyNothingIsSafeTest_C3826F1E4C04A535-001/tempDir-001/control/data, hostContext=/, hostPort=41540, coreRootDirectory=/x1/jenkins/jenkins-slave/workspace/Lucene-Solr-BadApples-NightlyTests-7.x/checkout/solr/build/solr-core/test/J0/../../../../../../../../../../../x1/jenkins/jenkins-slave/workspace/Lucene-Solr-BadApples-NightlyTests-7.x/checkout/solr/build/solr-core/test/J0/temp/solr.cloud.ChaosMonkeyNothingIsSafeTest_C3826F1E4C04A535-001/control-001/cores}
   [junit4]   2> 637248 ERROR (TEST-ChaosMonkeyNothingIsSafeTest.test-seed#[C3826F1E4C04A535]) [    ] o.a.s.u.StartupLoggingUtils Missing Java Option solr.log.dir. Logging may be missing or incomplete.
   [junit4]   2> 637249 INFO  (TEST-ChaosMonkeyNothingIsSafeTest.test-seed#[C3826F1E4C04A535]) [    ] o.a.s.s.SolrDispatchFilter Using logger factory org.apache.logging.slf4j.Log4jLoggerFactory
   [junit4]   2> 637249 INFO  (TEST-ChaosMonkeyNothingIsSafeTest.test-seed#[C3826F1E4C04A535]) [    ] o.a.s.s.SolrDispatchFilter  ___      _       Welcome to Apache Solr? version 7.7.0
   [junit4]   2> 637249 INFO  (TEST-ChaosMonkeyNothingIsSafeTest.test-seed#[C3826F1E4C04A535]) [    ] o.a.s.s.SolrDispatchFilter / __| ___| |_ _   Starting in cloud mode on port null
   [junit4]   2> 637249 INFO  (TEST-ChaosMonkeyNothingIsSafeTest.test-seed#[C3826F1E4C04A535]) [    ] o.a.s.s.SolrDispatchFilter \__ \/ _ \ | '_|  Install dir: null
   [junit4]   2> 637249 INFO  (TEST-ChaosMonkeyNothingIsSafeTest.test-seed#[C3826F1E4C04A535]) [    ] o.a.s.s.SolrDispatchFilter |___/\___/_|_|    Start time: 2019-01-17T03:24:50.183Z
   [junit4]   2> 637251 INFO  (zkConnectionManagerCallback-1686-thread-1) [    ] o.a.s.c.c.ConnectionManager zkClient has connected
   [junit4]   2> 637252 INFO  (TEST-ChaosMonkeyNothingIsSafeTest.test-seed#[C3826F1E4C04A535]) [    ] o.a.s.s.SolrDispatchFilter Loading solr.xml from SolrHome (not found in ZooKeeper)
   [junit4]   2> 637252 INFO  (TEST-ChaosMonkeyNothingIsSafeTest.test-seed#[C3826F1E4C04A535]) [    ] o.a.s.c.SolrXmlConfig Loading container configuration from /x1/jenkins/jenkins-slave/workspace/Lucene-Solr-BadApples-NightlyTests-7.x/checkout/solr/build/solr-core/test/J0/temp/solr.cloud.ChaosMonkeyNothingIsSafeTest_C3826F1E4C04A535-001/control-001/solr.xml
   [junit4]   2> 637257 INFO  (TEST-ChaosMonkeyNothingIsSafeTest.test-seed#[C3826F1E4C04A535]) [    ] o.a.s.c.SolrXmlConfig Configuration parameter autoReplicaFailoverWorkLoopDelay is ignored
   [junit4]   2> 637257 INFO  (TEST-ChaosMonkeyNothingIsSafeTest.test-seed#[C3826F1E4C04A535]) [    ] o.a.s.c.SolrXmlConfig Configuration parameter autoReplicaFailoverBadNodeExpiration is ignored
   [junit4]   2> 637259 INFO  (TEST-ChaosMonkeyNothingIsSafeTest.test-seed#[C3826F1E4C04A535]) [    ] o.a.s.c.SolrXmlConfig MBean server found: com.sun.jmx.mbeanserver.JmxMBeanServer@54c827b5, but no JMX reporters were configured - adding default JMX reporter.
   [junit4]   2> 637357 INFO  (TEST-ChaosMonkeyNothingIsSafeTest.test-seed#[C3826F1E4C04A535]) [    ] o.a.s.h.c.HttpShardHandlerFactory Host whitelist initialized: WhitelistHostChecker [whitelistHosts=null, whitelistHostCheckingEnabled=false]
   [junit4]   2> 637362 INFO  (TEST-ChaosMonkeyNothingIsSafeTest.test-seed#[C3826F1E4C04A535]) [    ] o.a.s.c.ZkContainer Zookeeper client=127.0.0.1:42694/solr
   [junit4]   2> 637364 INFO  (zkConnectionManagerCallback-1690-thread-1) [    ] o.a.s.c.c.ConnectionManager zkClient has connected
   [junit4]   2> 637366 INFO  (zkConnectionManagerCallback-1692-thread-1) [    ] o.a.s.c.c.ConnectionManager zkClient has connected
   [junit4]   2> 637471 INFO  (TEST-ChaosMonkeyNothingIsSafeTest.test-seed#[C3826F1E4C04A535]) [n:127.0.0.1:41540_    ] o.a.s.c.OverseerElectionContext I am going to be the leader 127.0.0.1:41540_
   [junit4]   2> 637471 INFO  (TEST-ChaosMonkeyNothingIsSafeTest.test-seed#[C3826F1E4C04A535]) [n:127.0.0.1:41540_    ] o.a.s.c.Overseer Overseer (id=72636293902368772-127.0.0.1:41540_-n_0000000000) starting
   [junit4]   2> 637479 INFO  (zkConnectionManagerCallback-1699-thread-1) [    ] o.a.s.c.c.ConnectionManager zkClient has connected
   [junit4]   2> 637482 INFO  (TEST-ChaosMonkeyNothingIsSafeTest.test-seed#[C3826F1E4C04A535]) [n:127.0.0.1:41540_    ] o.a.s.c.s.i.ZkClientClusterStateProvider Cluster at 127.0.0.1:42694/solr ready
   [junit4]   2> 637483 INFO  (OverseerStateUpdate-72636293902368772-127.0.0.1:41540_-n_0000000000) [n:127.0.0.1:41540_    ] o.a.s.c.Overseer Starting to work on the main queue : 127.0.0.1:41540_
   [junit4]   2> 637483 INFO  (TEST-ChaosMonkeyNothingIsSafeTest.test-seed#[C3826F1E4C04A535]) [n:127.0.0.1:41540_    ] o.a.s.c.ZkController Register node as live in ZooKeeper:/live_nodes/127.0.0.1:41540_
   [junit4]   2> 637491 INFO  (zkCallback-1691-thread-1) [    ] o.a.s.c.c.ZkStateReader Updated live nodes from ZooKeeper... (0) -> (1)
   [junit4]   2> 637493 INFO  (zkCallback-1698-thread-1) [    ] o.a.s.c.c.ZkStateReader Updated live nodes from ZooKeeper... (0) -> (1)
   [junit4]   2> 637522 INFO  (TEST-ChaosMonkeyNothingIsSafeTest.test-seed#[C3826F1E4C04A535]) [n:127.0.0.1:41540_    ] o.a.s.h.a.MetricsHistoryHandler No .system collection, keeping metrics history in memory.
   [junit4]   2> 637555 INFO  (TEST-ChaosMonkeyNothingIsSafeTest.test-seed#[C3826F1E4C04A535]) [n:127.0.0.1:41540_    ] o.a.s.m.r.SolrJmxReporter JMX monitoring for 'solr.node' (registry 'solr.node') enabled at server: com.sun.jmx.mbeanserver.JmxMBeanServer@54c827b5
   [junit4]   2> 637568 INFO  (TEST-ChaosMonkeyNothingIsSafeTest.test-seed#[C3826F1E4C04A535]) [n:127.0.0.1:41540_    ] o.a.s.m.r.SolrJmxReporter JMX monitoring for 'solr.jvm' (registry 'solr.jvm') enabled at server: com.sun.jmx.mbeanserver.JmxMBeanServer@54c827b5
   [junit4]   2> 637569 INFO  (TEST-ChaosMonkeyNothingIsSafeTest.test-seed#[C3826F1E4C04A535]) [n:127.0.0.1:41540_    ] o.a.s.m.r.SolrJmxReporter JMX monitoring for 'solr.jetty' (registry 'solr.jetty') enabled at server: com.sun.jmx.mbeanserver.JmxMBeanServer@54c827b5
   [junit4]   2> 637571 INFO  (TEST-ChaosMonkeyNothingIsSafeTest.test-seed#[C3826F1E4C04A535]) [n:127.0.0.1:41540_    ] o.a.s.c.CorePropertiesLocator Found 0 core definitions underneath /x1/jenkins/jenkins-slave/workspace/Lucene-Solr-BadApples-NightlyTests-7.x/checkout/solr/build/solr-core/test/J0/../../../../../../../../../../../x1/jenkins/jenkins-slave/workspace/Lucene-Solr-BadApples-NightlyTests-7.x/checkout/solr/build/solr-core/test/J0/temp/solr.cloud.ChaosMonkeyNothingIsSafeTest_C3826F1E4C04A535-001/control-001/cores
   [junit4]   2> 637600 INFO  (zkConnectionManagerCallback-1705-thread-1) [    ] o.a.s.c.c.ConnectionManager zkClient has connected
   [junit4]   2> 637602 INFO  (TEST-ChaosMonkeyNothingIsSafeTest.test-seed#[C3826F1E4C04A535]) [    ] o.a.s.c.c.ZkStateReader Updated live nodes from ZooKeeper... (0) -> (1)
   [junit4]   2> 637603 INFO  (TEST-ChaosMonkeyNothingIsSafeTest.test-seed#[C3826F1E4C04A535]) [    ] o.a.s.c.s.i.ZkClientClusterStateProvider Cluster at 127.0.0.1:42694/solr ready
   [junit4]   2> 637605 INFO  (qtp220298408-7059) [n:127.0.0.1:41540_    ] o.a.s.h.a.CollectionsHandler Invoked Collection Action :create with params collection.configName=conf1&name=control_collection&nrtReplicas=1&action=CREATE&numShards=1&createNodeSet=127.0.0.1:41540_&wt=javabin&version=2 and sendToOCPQueue=true
   [junit4]   2> 637608 INFO  (OverseerThreadFactory-1804-thread-1-processing-n:127.0.0.1:41540_) [n:127.0.0.1:41540_    ] o.a.s.c.a.c.CreateCollectionCmd Create collection control_collection
   [junit4]   2> 637718 INFO  (qtp220298408-7061) [n:127.0.0.1:41540_    ] o.a.s.s.HttpSolrCall [admin] webapp=null path=/admin/metrics params={prefix=CONTAINER.fs.usableSpace,CONTAINER.fs.totalSpace,CORE.coreName&wt=javabin&version=2&group=solr.node,solr.core} status=0 QTime=1
   [junit4]   2> 637720 INFO  (qtp220298408-7062) [n:127.0.0.1:41540_    ] o.a.s.s.HttpSolrCall [admin] webapp=null path=/admin/metrics params={prefix=CONTAINER.fs.usableSpace,CONTAINER.fs.totalSpace,CORE.coreName&wt=javabin&version=2&group=solr.node,solr.core} status=0 QTime=0
   [junit4]   2> 637721 INFO  (qtp220298408-7058) [n:127.0.0.1:41540_    ] o.a.s.s.HttpSolrCall [admin] webapp=null path=/admin/metrics params={prefix=CONTAINER.fs.usableSpace,CONTAINER.fs.totalSpace,CORE.coreName&wt=javabin&version=2&group=solr.node,solr.core} status=0 QTime=0
   [junit4]   2> 637722 INFO  (qtp220298408-7060) [n:127.0.0.1:41540_    ] o.a.s.s.HttpSolrCall [admin] webapp=null path=/admin/metrics params={prefix=CONTAINER.fs.usableSpace,CONTAINER.fs.totalSpace,CORE.coreName&wt=javabin&version=2&group=solr.node,solr.core} status=0 QTime=0
   [junit4]   2> 637724 INFO  (qtp220298408-7061) [n:127.0.0.1:41540_    ] o.a.s.s.HttpSolrCall [admin] webapp=null path=/admin/metrics params={prefix=CONTAINER.fs.usableSpace,CONTAINER.fs.totalSpace,CORE.coreName&wt=javabin&version=2&group=solr.node,solr.core} status=0 QTime=0
   [junit4]   2> 637728 INFO  (qtp220298408-7062) [n:127.0.0.1:41540_    x:control_collection_shard1_replica_n1] o.a.s.h.a.CoreAdminOperation core create command qt=/admin/cores&collection.configName=conf1&newCollection=true&name=control_collection_shard1_replica_n1&action=CREATE&numShards=1&collection=control_collection&shard=shard1&wt=javabin&version=2&replicaType=NRT
   [junit4]   2> 637728 INFO  (qtp220298408-7062) [n:127.0.0.1:41540_    x:control_collection_shard1_replica_n1] o.a.s.c.TransientSolrCoreCacheDefault Allocating transient cache for 4 transient cores
   [junit4]   2> 638754 INFO  (qtp220298408-7062) [n:127.0.0.1:41540_ c:control_collection s:shard1  x:control_collection_shard1_replica_n1] o.a.s.c.SolrConfig Using Lucene MatchVersion: 7.7.0
   [junit4]   2> 638769 INFO  (qtp220298408-7062) [n:127.0.0.1:41540_ c:control_collection s:shard1  x:control_collection_shard1_replica_n1] o.a.s.s.IndexSchema [control_collection_shard1_replica_n1] Schema name=test
   [junit4]   2> 638862 INFO  (qtp220298408-7062) [n:127.0.0.1:41540_ c:control_collection s:shard1  x:control_collection_shard1_replica_n1] o.a.s.s.IndexSchema Loaded schema test/1.6 with uniqueid field id
   [junit4]   2> 638882 INFO  (qtp220298408-7062) [n:127.0.0.1:41540_ c:control_collection s:shard1  x:control_collection_shard1_replica_n1] o.a.s.c.CoreContainer Creating SolrCore 'control_collection_shard1_replica_n1' using configuration from collection control_collection, trusted=true
   [junit4]   2> 638883 INFO  (qtp220298408-7062) [n:127.0.0.1:41540_ c:control_collection s:shard1  x:control_collection_shard1_replica_n1] o.a.s.m.r.SolrJmxReporter JMX monitoring for 'solr.core.control_collection.shard1.replica_n1' (registry 'solr.core.control_collection.shard1.replica_n1') enabled at server: com.sun.jmx.mbeanserver.JmxMBeanServer@54c827b5
   [junit4]   2> 638883 INFO  (qtp220298408-7062) [n:127.0.0.1:41540_ c:control_collection s:shard1  x:control_collection_shard1_replica_n1] o.a.s.c.SolrCore [[control_collection_shard1_replica_n1] ] Opening new SolrCore at [/x1/jenkins/jenkins-slave/workspace/Lucene-Solr-BadApples-NightlyTests-7.x/checkout/solr/build/solr-core/test/J0/temp/solr.cloud.ChaosMonkeyNothingIsSafeTest_C3826F1E4C04A535-001/control-001/cores/control_collection_shard1_replica_n1], dataDir=[/x1/jenkins/jenkins-slave/workspace/Lucene-Solr-BadApples-NightlyTests-7.x/checkout/solr/build/solr-core/test/J0/../../../../../../../../../../../x1/jenkins/jenkins-slave/workspace/Lucene-Solr-BadApples-NightlyTests-7.x/checkout/solr/build/solr-core/test/J0/temp/solr.cloud.ChaosMonkeyNothingIsSafeTest_C3826F1E4C04A535-001/control-001/cores/control_collection_shard1_replica_n1/data/]
   [junit4]   2> 638888 INFO  (qtp220298408-7062) [n:127.0.0.1:41540_ c:control_collection s:shard1  x:control_collection_shard1_replica_n1] o.a.s.u.RandomMergePolicy RandomMergePolicy wrapping class org.apache.lucene.index.MockRandomMergePolicy: org.apache.lucene.index.MockRandomMergePolicy@6fcacecb
   [junit4]   2> 638899 WARN  (qtp220298408-7062) [n:127.0.0.1:41540_ c:control_collection s:shard1  x:control_collection_shard1_replica_n1] o.a.s.c.RequestHandlers INVALID paramSet a in requestHandler {type = requestHandler,name = /dump,class = DumpRequestHandler,attributes = {initParams=a, name=/dump, class=DumpRequestHandler},args = {defaults={a=A,b=B}}}
   [junit4]   2> 638966 INFO  (qtp220298408-7062) [n:127.0.0.1:41540_ c:control_collection s:shard1  x:control_collection_shard1_replica_n1] o.a.s.u.UpdateHandler Using UpdateLog implementation: org.apache.solr.update.UpdateLog
   [junit4]   2> 638966 INFO  (qtp220298408-7062) [n:127.0.0.1:41540_ c:control_collection s:shard1  x:control_collection_shard1_replica_n1] o.a.s.u.UpdateLog Initializing UpdateLog: dataDir= defaultSyncLevel=FLUSH numRecordsToKeep=100 maxNumLogsToKeep=10 numVersionBuckets=65536
   [junit4]   2> 638969 INFO  (qtp220298408-7062) [n:127.0.0.1:41540_ c:control_collection s:shard1  x:control_collection_shard1_replica_n1] o.a.s.u.CommitTracker Hard AutoCommit: if uncommitted for 15000ms; 
   [junit4]   2> 638969 INFO  (qtp220298408-7062) [n:127.0.0.1:41540_ c:control_collection s:shard1  x:control_collection_shard1_replica_n1] o.a.s.u.CommitTracker Soft AutoCommit: disabled
   [junit4]   2> 638971 INFO  (qtp220298408-7062) [n:127.0.0.1:41540_ c:control_collection s:shard1  x:control_collection_shard1_replica_n1] o.a.s.u.RandomMergePolicy RandomMergePolicy wrapping class org.apache.lucene.index.MockRandomMergePolicy: org.apache.lucene.index.MockRandomMergePolicy@38f21de2
   [junit4]   2> 638972 INFO  (qtp220298408-7062) [n:127.0.0.1:41540_ c:control_collection s:shard1  x:control_collection_shard1_replica_n1] o.a.s.s.SolrIndexSearcher Opening [Searcher@144067b3[control_collection_shard1_replica_n1] main]
   [junit4]   2> 638973 INFO  (qtp220298408-7062) [n:127.0.0.1:41540_ c:control_collection s:shard1  x:control_collection_shard1_replica_n1] o.a.s.r.ManagedResourceStorage Configured ZooKeeperStorageIO with znodeBase: /configs/conf1
   [junit4]   2> 638974 INFO  (qtp220298408-7062) [n:127.0.0.1:41540_ c:control_collection s:shard1  x:control_collection_shard1_replica_n1] o.a.s.r.ManagedResourceStorage Loaded null at path _rest_managed.json using ZooKeeperStorageIO:path=/configs/conf1
   [junit4]   2> 638975 INFO  (qtp220298408-7062) [n:127.0.0.1:41540_ c:control_collection s:shard1  x:control_collection_shard1_replica_n1] o.a.s.h.ReplicationHandler Commits will be reserved for 10000ms.
   [junit4]   2> 638975 INFO  (qtp220298408-7062) [n:127.0.0.1:41540_ c:control_collection s:shard1  x:control_collection_shard1_replica_n1] o.a.s.u.UpdateLog Could not find max version in index or recent updates, using new clock 1622876348123971584
   [junit4]   2> 638980 INFO  (searcherExecutor-1809-thread-1-processing-n:127.0.0.1:41540_ x:control_collection_shard1_replica_n1 c:control_collection s:shard1) [n:127.0.0.1:41540_ c:control_collection s:shard1  x:control_collection_shard1_replica_n1] o.a.s.c.SolrCore [control_collection_shard1_replica_n1] Registered new searcher Searcher@144067b3[control_collection_shard1_replica_n1] main{ExitableDirectoryReader(UninvertingDirectoryReader())}
   [junit4]   2> 638984 INFO  (qtp220298408-7062) [n:127.0.0.1:41540_ c:control_collection s:shard1  x:control_collection_shard1_replica_n1] o.a.s.c.ZkShardTerms Successful update of terms at /collections/control_collection/terms/shard1 to Terms{values={core_node2=0}, version=0}
   [junit4]   2> 638984 INFO  (qtp220298408-7062) [n:127.0.0.1:41540_ c:control_collection s:shard1  x:control_collection_shard1_replica_n1] o.a.s.c.ShardLeaderElectionContextBase make sure parent is created /collections/control_collection/leaders/shard1
   [junit4]   2> 638988 INFO  (qtp220298408-7062) [n:127.0.0.1:41540_ c:control_collection s:shard1  x:control_collection_shard1_replica_n1] o.a.s.c.ShardLeaderElectionContext Enough replicas found to continue.
   [junit4]   2> 638988 INFO  (qtp220298408-7062) [n:127.0.0.1:41540_ c:control_collection s:shard1  x:control_collection_shard1_replica_n1] o.a.s.c.ShardLeaderElectionContext I may be the new leader - try and sync
   [junit4]   2> 638988 INFO  (qtp220298408-7062) [n:127.0.0.1:41540_ c:control_collection s:shard1  x:control_collection_shard1_replica_n1] o.a.s.c.SyncStrategy Sync replicas to http://127.0.0.1:41540/control_collection_shard1_replica_n1/
   [junit4]   2> 638988 INFO  (qtp220298408-7062) [n:127.0.0.1:41540_ c:control_collection s:shard1  x:control_collection_shard1_replica_n1] o.a.s.c.SyncStrategy Sync Success - now sync replicas to me
   [junit4]   2> 638988 INFO  (qtp220298408-7062) [n:127.0.0.1:41540_ c:control_collection s:shard1  x:control_collection_shard1_replica_n1] o.a.s.c.SyncStrategy http://127.0.0.1:41540/control_collection_shard1_replica_n1/ has no replicas
   [junit4]   2> 638988 INFO  (qtp220298408-7062) [n:127.0.0.1:41540_ c:control_collection s:shard1  x:control_collection_shard1_replica_n1] o.a.s.c.ShardLeaderElectionContext Found all replicas participating in election, clear LIR
   [junit4]   2> 638989 INFO  (qtp220298408-7062) [n:127.0.0.1:41540_ c:control_collection s:shard1  x:control_collection_shard1_replica_n1] o.a.s.c.ShardLeaderElectionContextBase Creating leader registration node /collections/control_collection/leaders/shard1/leader after winning as /collections/control_collection/leader_elect/shard1/election/72636293902368772-core_node2-n_0000000000
   [junit4]   2> 638991 INFO  (qtp220298408-7062) [n:127.0.0.1:41540_ c:control_collection s:shard1  x:control_collection_shard1_replica_n1] o.a.s.c.ShardLeaderElectionContext I am the new leader: http://127.0.0.1:41540/control_collection_shard1_replica_n1/ shard1
   [junit4]   2> 639093 INFO  (zkCallback-1691-thread-1) [    ] o.a.s.c.c.ZkStateReader A cluster state change: [WatchedEvent state:SyncConnected type:NodeDataChanged path:/collections/control_collection/state.json] for collection [control_collection] has occurred - updating... (live nodes size: [1])
   [junit4]   2> 639094 INFO  (zkCallback-1691-thread-2) [    ] o.a.s.c.c.ZkStateReader A cluster state change: [WatchedEvent state:SyncConnected type:NodeDataChanged path:/collections/control_collection/state.json] for collection [control_collection] has occurred - updating... (live nodes size: [1])
   [junit4]   2> 639095 INFO  (qtp220298408-7062) [n:127.0.0.1:41540_ c:control_collection s:shard1  x:control_collection_shard1_replica_n1] o.a.s.c.ZkController I am the leader, no recovery necessary
   [junit4]   2> 639104 INFO  (qtp220298408-7062) [n:127.0.0.1:41540_ c:control_collection s:shard1  x:control_collection_shard1_replica_n1] o.a.s.s.HttpSolrCall [admin] webapp=null path=/admin/cores params={qt=/admin/cores&collection.configName=conf1&newCollection=true&name=control_collection_shard1_replica_n1&action=CREATE&numShards=1&collection=control_collection&shard=shard1&wt=javabin&version=2&replicaType=NRT} status=0 QTime=1376
   [junit4]   2> 639109 INFO  (qtp220298408-7059) [n:127.0.0.1:41540_    ] o.a.s.h.a.CollectionsHandler Wait for new collection to be active for at most 45 seconds. Check all shard replicas
   [junit4]   2> 639200 INFO  (zkCallback-1691-thread-2) [    ] o.a.s.c.c.ZkStateReader A cluster state change: [WatchedEvent state:SyncConnected type:NodeDataChanged path:/collections/control_collection/state.json] for collection [control_collection] has occurred - updating... (live nodes size: [1])
   [junit4]   2> 639200 INFO  (zkCallback-1691-thread-1) [    ] o.a.s.c.c.ZkStateReader A cluster state change: [WatchedEvent state:SyncConnected type:NodeDataChanged path:/collections/control_collection/state.json] for collection [control_collection] has occurred - updating... (live nodes size: [1])
   [junit4]   2> 639200 INFO  (zkCallback-1691-thread-3) [    ] o.a.s.c.c.ZkStateReader A cluster state change: [WatchedEvent state:SyncConnected type:NodeDataChanged path:/collections/control_collection/state.json] for collection [control_collection] has occurred - updating... (live nodes size: [1])
   [junit4]   2> 639201 INFO  (qtp220298408-7059) [n:127.0.0.1:41540_    ] o.a.s.s.HttpSolrCall [admin] webapp=null path=/admin/collections params={collection.configName=conf1&name=control_collection&nrtReplicas=1&action=CREATE&numShards=1&createNodeSet=127.0.0.1:41540_&wt=javabin&version=2} status=0 QTime=1596
   [junit4]   2> 639208 INFO  (zkConnectionManagerCallback-1710-thread-1) [    ] o.a.s.c.c.ConnectionManager zkClient has connected
   [junit4]   2> 639210 INFO  (TEST-ChaosMonkeyNothingIsSafeTest.test-seed#[C3826F1E4C04A535]) [    ] o.a.s.c.c.ZkStateReader Updated live nodes from ZooKeeper... (0) -> (1)
   [junit4]   2> 639212 INFO  (TEST-ChaosMonkeyNothingIsSafeTest.test-seed#[C3826F1E4C04A535]) [    ] o.a.s.c.s.i.ZkClientClusterStateProvider Cluster at 127.0.0.1:42694/solr ready
   [junit4]   2> 639212 INFO  (TEST-ChaosMonkeyNothingIsSafeTest.test-seed#[C3826F1E4C04A535]) [    ] o.a.s.c.ChaosMonkey monkey: init - expire sessions:false cause connection loss:false
   [junit4]   2> 639213 INFO  (qtp220298408-7062) [n:127.0.0.1:41540_    ] o.a.s.h.a.CollectionsHandler Invoked Collection Action :create with params collection.configName=conf1&name=collection1&nrtReplicas=1&action=CREATE&numShards=5&createNodeSet=&stateFormat=1&wt=javabin&version=2 and sendToOCPQueue=true
   [junit4]   2> 639217 INFO  (OverseerThreadFactory-1804-thread-2-processing-n:127.0.0.1:41540_) [n:127.0.0.1:41540_    ] o.a.s.c.a.c.CreateCollectionCmd Create collection collection1
   [junit4]   2> 639218 INFO  (OverseerCollectionConfigSetProcessor-72636293902368772-127.0.0.1:41540_-n_0000000000) [n:127.0.0.1:41540_    ] o.a.s.c.OverseerTaskQueue Response ZK path: /overseer/collection-queue-work/qnr-0000000000 doesn't exist.  Requestor may have disconnected from ZooKeeper
   [junit4]   2> 639424 WARN  (OverseerThreadFactory-1804-thread-2-processing-n:127.0.0.1:41540_) [n:127.0.0.1:41540_    ] o.a.s.c.a.c.CreateCollectionCmd It is unusual to create a collection (collection1) without cores.
   [junit4]   2> 639428 INFO  (qtp220298408-7062) [n:127.0.0.1:41540_    ] o.a.s.h.a.CollectionsHandler Wait for new collection to be active for at most 45 seconds. Check all shard replicas
   [junit4]   2> 639429 INFO  (qtp220298408-7062) [n:127.0.0.1:41540_    ] o.a.s.s.HttpSolrCall [admin] webapp=null path=/admin/collections params={collection.configName=conf1&name=collection1&nrtReplicas=1&action=CREATE&numShards=5&createNodeSet=&stateFormat=1&wt=javabin&version=2} status=0 QTime=215
   [junit4]   2> 639430 INFO  (TEST-ChaosMonkeyNothingIsSafeTest.test-seed#[C3826F1E4C04A535]) [    ] o.a.s.c.AbstractFullDistribZkTestBase Creating jetty instances pullReplicaCount=0 numOtherReplicas=6
   [junit4]   2> 639595 INFO  (TEST-ChaosMonkeyNothingIsSafeTest.test-seed#[C3826F1E4C04A535]) [    ] o.a.s.c.AbstractFullDistribZkTestBase create jetty 1 in directory /x1/jenkins/jenkins-slave/workspace/Lucene-Solr-BadApples-NightlyTests-7.x/checkout/solr/build/solr-core/test/J0/temp/solr.cloud.ChaosMonkeyNothingIsSafeTest_C3826F1E4C04A535-001/shard-1-001 of type NRT
   [junit4]   2> 639595 WARN  (closeThreadPool-1711-thread-1) [    ] o.e.j.s.AbstractConnector Ignoring deprecated socket close linger time
   [junit4]   2> 639596 INFO  (closeThreadPool-1711-thread-1) [    ] o.a.s.c.s.e.JettySolrRunner Start Jetty (original configured port=0)
   [junit4]   2> 639596 INFO  (closeThreadPool-1711-thread-1) [    ] o.a.s.c.s.e.JettySolrRunner Trying to start Jetty on port 0 try number 1 ...
   [junit4]   2> 639596 INFO  (closeThreadPool-1711-thread-1) [    ] o.e.j.s.Server jetty-9.4.14.v20181114; built: 2018-11-14T21:20:31.478Z; git: c4550056e785fb5665914545889f21dc136ad9e6; jvm 1.8.0_191-b12
   [junit4]   2> 639598 INFO  (closeThreadPool-1711-thread-1) [    ] o.e.j.s.session DefaultSessionIdManager workerName=node0
   [junit4]   2> 639598 INFO  (closeThreadPool-1711-thread-1) [    ] o.e.j.s.session No SessionScavenger set, using defaults
   [junit4]   2> 639598 INFO  (closeThreadPool-1711-thread-1) [    ] o.e.j.s.session node0 Scavenging every 660000ms
   [junit4]   2> 639598 INFO  (closeThreadPool-1711-thread-1) [    ] o.e.j.s.h.ContextHandler Started o.e.j.s.ServletContextHandler@486a0079{/,null,AVAILABLE}
   [junit4]   2> 639600 INFO  (closeThreadPool-1711-thread-1) [    ] o.e.j.s.AbstractConnector Started ServerConnector@2df4406f{HTTP/1.1,[http/1.1]}{127.0.0.1:46787}
   [junit4]   2> 639600 INFO  (closeThreadPool-1711-thread-1) [    ] o.e.j.s.Server Started @639657ms
   [junit4]   2> 639600 INFO  (closeThreadPool-1711-thread-1) [    ] o.a.s.c.s.e.JettySolrRunner Jetty properties: {solr.data.dir=/x1/jenkins/jenkins-slave/workspace/Lucene-Solr-BadApples-NightlyTests-7.x/checkout/solr/build/solr-core/test/J0/temp/solr.cloud.ChaosMonkeyNothingIsSafeTest_C3826F1E4C04A535-001/tempDir-001/jetty1, solrconfig=solrconfig.xml, hostContext=/, hostPort=46787, coreRootDirectory=/x1/jenkins/jenkins-slave/workspace/Lucene-Solr-BadApples-NightlyTests-7.x/checkout/solr/build/solr-core/test/J0/../../../../../../../../../../../x1/jenkins/jenkins-slave/workspace/Lucene-Solr-BadApples-NightlyTests-7.x/checkout/solr/build/solr-core/test/J0/temp/solr.cloud.ChaosMonkeyNothingIsSafeTest_C3826F1E4C04A535-001/shard-1-001/cores}
   [junit4]   2> 639602 ERROR (closeThreadPool-1711-thread-1) [    ] o.a.s.u.StartupLoggingUtils Missing Java Option solr.log.dir. Logging may be missing or incomplete.
   [junit4]   2> 639602 INFO  (closeThreadPool-1711-thread-1) [    ] o.a.s.s.SolrDispatchFilter Using logger factory org.apache.logging.slf4j.Log4jLoggerFactory
   [junit4]   2> 639603 INFO  (closeThreadPool-1711-thread-1) [    ] o.a.s.s.SolrDispatchFilter  ___      _       Welcome to Apache Solr? version 7.7.0
   [junit4]   2> 639603 INFO  (closeThreadPool-1711-thread-1) [    ] o.a.s.s.SolrDispatchFilter / __| ___| |_ _   Starting in cloud mode on port null
   [junit4]   2> 639603 INFO  (closeThreadPool-1711-thread-1) [    ] o.a.s.s.SolrDispatchFilter \__ \/ _ \ | '_|  Install dir: null
   [junit4]   2> 639603 INFO  (closeThreadPool-1711-thread-1) [    ] o.a.s.s.SolrDispatchFilter |___/\___/_|_|    Start time: 2019-01-17T03:24:52.537Z
   [junit4]   2> 639605 INFO  (zkConnectionManagerCallback-1713-thread-1) [    ] o.a.s.c.c.ConnectionManager zkClient has connected
   [junit4]   2> 639606 INFO  (closeThreadPool-1711-thread-1) [    ] o.a.s.s.SolrDispatchFilter Loading solr.xml from SolrHome (not found in ZooKeeper)
   [junit4]   2> 639606 INFO  (closeThreadPool-1711-thread-1) [    ] o.a.s.c.SolrXmlConfig Loading container configuration from /x1/jenkins/jenkins-slave/workspace/Lucene-Solr-BadApples-NightlyTests-7.x/checkout/solr/build/solr-core/test/J0/temp/solr.cloud.ChaosMonkeyNothingIsSafeTest_C3826F1E4C04A535-001/shard-1-001/solr.xml
   [junit4]   2> 639611 INFO  (closeThreadPool-1711-thread-1) [    ] o.a.s.c.SolrXmlConfig Configuration parameter autoReplicaFailoverWorkLoopDelay is ignored
   [junit4]   2> 639611 INFO  (closeThreadPool-1711-thread-1) [    ] o.a.s.c.SolrXmlConfig Configuration parameter autoReplicaFailoverBadNodeExpiration is ignored
   [junit4]   2> 639613 INFO  (closeThreadPool-1711-thread-1) [    ] o.a.s.c.SolrXmlConfig MBean server found: com.sun.jmx.mbeanserver.JmxMBeanServer@54c827b5, but no JMX reporters were configured - adding default JMX reporter.
   [junit4]   2> 639782 INFO  (TEST-ChaosMonkeyNothingIsSafeTest.test-seed#[C3826F1E4C04A535]) [    ] o.a.s.c.AbstractFullDistribZkTestBase create jetty 2 in directory /x1/jenkins/jenkins-slave/workspace/Lucene-Solr-BadApples-NightlyTests-7.x/checkout/solr/build/solr-core/test/J0/temp/solr.cloud.ChaosMonkeyNothingIsSafeTest_C3826F1E4C04A535-001/shard-2-001 of type NRT
   [junit4]   2> 639783 WARN  (closeThreadPool-1711-thread-2) [    ] o.e.j.s.AbstractConnector Ignoring deprecated socket close linger time
   [junit4]   2> 639783 INFO  (closeThreadPool-1711-thread-2) [    ] o.a.s.c.s.e.JettySolrRunner Start Jetty (original configured port=0)
   [junit4]   2> 639783 INFO  (closeThreadPool-1711-thread-2) [    ] o.a.s.c.s.e.JettySolrRunner Trying to start Jetty on port 0 try number 1 ...
   [junit4]   2> 639784 INFO  (closeThreadPool-1711-thread-2) [    ] o.e.j.s.Server jetty-9.4.14.v20181114; built: 2018-11-14T21:20:31.478Z; git: c4550056e785fb5665914545889f21dc136ad9e6; jvm 1.8.0_191-b12
   [junit4]   2> 639785 INFO  (closeThreadPool-1711-thread-2) [    ] o.e.j.s.session DefaultSessionIdManager workerName=node0
   [junit4]   2> 639785 INFO  (closeThreadPool-1711-thread-2) [    ] o.e.j.s.session No SessionScavenger set, using defaults
   [junit4]   2> 639785 INFO  (closeThreadPool-1711-thread-2) [    ] o.e.j.s.session node0 Scavenging every 600000ms
   [junit4]   2> 639785 INFO  (closeThreadPool-1711-thread-2) [    ] o.e.j.s.h.ContextHandler Started o.e.j.s.ServletContextHandler@29e903d{/,null,AVAILABLE}
   [junit4]   2> 639787 INFO  (closeThreadPool-1711-thread-2) [    ] o.e.j.s.AbstractConnector Started ServerConnector@75c31fe7{HTTP/1.1,[http/1.1]}{127.0.0.1:33704}
   [junit4]   2> 639787 INFO  (closeThreadPool-1711-thread-2) [    ] o.e.j.s.Server Started @639844ms
   [junit4]   2> 639787 INFO  (closeThreadPool-1711-thread-2) [    ] o.a.s.c.s.e.JettySolrRunner Jetty properties: {solr.data.dir=/x1/jenkins/jenkins-slave/workspace/Lucene-Solr-BadApples-NightlyTests-7.x/checkout/solr/build/solr-core/test/J0/temp/solr.cloud.ChaosMonkeyNothingIsSafeTest_C3826F1E4C04A535-001/tempDir-001/jetty2, solrconfig=solrconfig.xml, hostContext=/, hostPort=33704, coreRootDirectory=/x1/jenkins/jenkins-slave/workspace/Lucene-Solr-BadApples-NightlyTests-7.x/checkout/solr/build/solr-core/test/J0/../../../../../../../../../../../x1/jenkins/jenkins-slave/workspace/Lucene-Solr-BadApples-NightlyTests-7.x/checkout/solr/build/solr-core/test/J0/temp/solr.cloud.ChaosMonkeyNothingIsSafeTest_C3826F1E4C04A535-001/shard-2-001/cores}
   [junit4]   2> 639788 ERROR (closeThreadPool-1711-thread-2) [    ] o.a.s.u.StartupLoggingUtils Missing Java Option solr.log.dir. Logging may be missing or incomplete.
   [junit4]   2> 639788 INFO  (closeThreadPool-1711-thread-2) [    ] o.a.s.s.SolrDispatchFilter Using logger factory org.apache.logging.slf4j.Log4jLoggerFactory
   [junit4]   2> 639788 INFO  (closeThreadPool-1711-thread-2) [    ] o.a.s.s.SolrDispatchFilter  ___      _       Welcome to Apache Solr? version 7.7.0
   [junit4]   2> 639788 INFO  (closeThreadPool-1711-thread-2) [    ] o.a.s.s.SolrDispatchFilter / __| ___| |_ _   Starting in cloud mode on port null
   [junit4]   2> 639788 INFO  (closeThreadPool-1711-thread-2) [    ] o.a.s.s.SolrDispatchFilter \__ \/ _ \ | '_|  Install dir: null
   [junit4]   2> 639788 INFO  (closeThreadPool-1711-thread-2) [    ] o.a.s.s.SolrDispatchFilter |___/\___/_|_|    Start time: 2019-01-17T03:24:52.722Z
   [junit4]   2> 639788 INFO  (closeThreadPool-1711-thread-1) [    ] o.a.s.h.c.HttpShardHandlerFactory Host whitelist initialized: WhitelistHostChecker [whitelistHosts=null, whitelistHostCheckingEnabled=false]
   [junit4]   2> 639794 INFO  (zkConnectionManagerCallback-1715-thread-1) [    ] o.a.s.c.c.ConnectionManager zkClient has connected
   [junit4]   2> 639798 INFO  (closeThreadPool-1711-thread-1) [    ] o.a.s.c.ZkContainer Zookeeper client=127.0.0.1:42694/solr
   [junit4]   2> 639798 INFO  (closeThreadPool-1711-thread-2) [    ] o.a.s.s.SolrDispatchFilter Loading solr.xml from SolrHome (not found in ZooKeeper)
   [junit4]   2> 639799 INFO  (closeThreadPool-1711-thread-2) [    ] o.a.s.c.SolrXmlConfig Loading container configuration from /x1/jenkins/jenkins-slave/workspace/Lucene-Solr-BadApples-NightlyTests-7.x/checkout/solr/build/solr-core/test/J0/temp/solr.cloud.ChaosMonkeyNothingIsSafeTest_C3826F1E4C04A535-001/shard-2-001/solr.xml
   [junit4]   2> 639804 INFO  (closeThreadPool-1711-thread-2) [    ] o.a.s.c.SolrXmlConfig Configuration parameter autoReplicaFailoverWorkLoopDelay is ignored
   [junit4]   2> 639804 INFO  (closeThreadPool-1711-thread-2) [    ] o.a.s.c.SolrXmlConfig Configuration parameter autoReplicaFailoverBadNodeExpiration is ignored
   [junit4]   2> 639805 INFO  (closeThreadPool-1711-thread-2) [    ] o.a.s.c.SolrXmlConfig MBean server found: com.sun.jmx.mbeanserver.JmxMBeanServer@54c827b5, but no JMX reporters were configured - adding default JMX reporter.
   [junit4]   2> 639832 INFO  (zkConnectionManagerCallback-1719-thread-1) [    ] o.a.s.c.c.ConnectionManager zkClient has connected
   [junit4]   2> 639865 INFO  (zkConnectionManagerCallback-1721-thread-1) [    ] o.a.s.c.c.ConnectionManager zkClient has connected
   [junit4]   2> 639870 INFO  (closeThreadPool-1711-thread-1) [n:127.0.0.1:46787_    ] o.a.s.c.c.ZkStateReader Updated live nodes from ZooKeeper... (0) -> (1)
   [junit4]   2> 639874 INFO  (closeThreadPool-1711-thread-1) [n:127.0.0.1:46787_    ] o.a.s.c.ZkController Publish node=127.0.0.1:46787_ as DOWN
   [junit4]   2> 639877 INFO  (closeThreadPool-1711-thread-1) [n:127.0.0.1:46787_    ] o.a.s.c.TransientSolrCoreCacheDefault Allocating transient cache for 4 transient cores
   [junit4]   2> 639877 INFO  (closeThreadPool-1711-thread-1) [n:127.0.0.1:46787_    ] o.a.s.c.ZkController Register node as live in ZooKeeper:/live_nodes/127.0.0.1:46787_
   [junit4]   2> 639879 INFO  (zkCallback-1709-thread-1) [    ] o.a.s.c.c.ZkStateReader Updated live nodes from ZooKeeper... (1) -> (2)
   [junit4]   2> 639879 INFO  (zkCallback-1691-thread-4) [    ] o.a.s.c.c.ZkStateReader Updated live nodes from ZooKeeper... (1) -> (2)
   [junit4]   2> 639879 INFO  (zkCallback-1698-thread-1) [    ] o.a.s.c.c.ZkStateReader Updated live nodes from ZooKeeper... (1) -> (2)
   [junit4]   2> 639886 INFO  (zkCallback-1720-thread-1) [    ] o.a.s.c.c.ZkStateReader Updated live nodes from ZooKeeper... (1) -> (2)
   [junit4]   2> 639926 INFO  (zkConnectionManagerCallback-1728-thread-1) [    ] o.a.s.c.c.ConnectionManager zkClient has connected
   [junit4]   2> 639928 INFO  (closeThreadPool-1711-thread-1) [n:127.0.0.1:46787_    ] o.a.s.c.c.ZkStateReader Updated live nodes from ZooKeeper... (0) -> (2)
   [junit4]   2> 639929 INFO  (closeThreadPool-1711-thread-1) [n:127.0.0.1:46787_    ] o.a.s.c.s.i.ZkClientClusterStateProvider Cluster at 127.0.0.1:42694/solr ready
   [junit4]   2> 639930 INFO  (closeThreadPool-1711-thread-1) [n:127.0.0.1:46787_    ] o.a.s.h.a.MetricsHistoryHandler No .system collection, keeping metrics history in memory.
   [junit4]   2> 639958 INFO  (closeThreadPool-1711-thread-1) [n:127.0.0.1:46787_    ] o.a.s.m.r.SolrJmxReporter JMX monitoring for 'solr.node' (registry 'solr.node') enabled at server: com.sun.jmx.mbeanserver.JmxMBeanServer@54c827b5
   [junit4]   2> 639975 INFO  (closeThreadPool-1711-thread-1) [n:127.0.0.1:46787_    ] o.a.s.m.r.SolrJmxReporter JMX monitoring for 'solr.jvm' (registry 'solr.jvm') enabled at server: com.sun.jmx.mbeanserver.JmxMBeanServer@54c827b5
   [junit4]   2> 639975 INFO  (closeThreadPool-1711-thread-1) [n:127.0.0.1:46787_    ] o.a.s.m.r.SolrJmxReporter JMX monitoring for 'solr.jetty' (registry 'solr.jetty') enabled at server: com.sun.jmx.mbeanserver.JmxMBeanServer@54c827b5
   [junit4]   2> 639977 INFO  (closeThreadPool-1711-thread-1) [n:127.0.0.1:46787_    ] o.a.s.c.CorePropertiesLocator Found 0 core definitions underneath /x1/jenkins/jenkins-slave/workspace/Lucene-Solr-BadApples-NightlyTests-7.x/checkout/solr/build/solr-core/test/J0/../../../../../../../../../../../x1/jenkins/jenkins-slave/workspace/Lucene-Solr-BadApples-NightlyTests-7.x/checkout/solr/build/solr-core/test/J0/temp/solr.cloud.ChaosMonkeyNothingIsSafeTest_C3826F1E4C04A535-001/shard-1-001/cores
   [junit4]   2> 640003 INFO  (TEST-ChaosMonkeyNothingIsSafeTest.test-seed#[C3826F1E4C04A535]) [    ] o.a.s.c.AbstractFullDistribZkTestBase create jetty 3 in directory /x1/jenkins/jenkins-slave/workspace/Lucene-Solr-BadApples-NightlyTests-7.x/checkout/solr/build/solr-core/test/J0/temp/solr.cloud.ChaosMonkeyNothingIsSafeTest_C3826F1E4C04A535-001/shard-3-001 of type NRT
   [junit4]   2> 640023 WARN  (closeThreadPool-1711-thread-3) [    ] o.e.j.s.AbstractConnector Ignoring deprecated socket close linger time
   [junit4]   2> 640023 INFO  (closeThreadPool-1711-thread-3) [    ] o.a.s.c.s.e.JettySolrRunner Start Jetty (original configured port=0)
   [junit4]   2> 640023 INFO  (closeThreadPool-1711-thread-3) [    ] o.a.s.c.s.e.JettySolrRunner Trying to start Jetty on port 0 try number 1 ...
   [junit4]   2> 640023 INFO  (closeThreadPool-1711-thread-3) [    ] o.e.j.s.Server jetty-9.4.14.v20181114; built: 2018-11-14T21:20:31.478Z; git: c4550056e785fb5665914545889f21dc136ad9e6; jvm 1.8.0_191-b12
   [junit4]   2> 640034 INFO  (closeThreadPool-1711-thread-3) [    ] o.e.j.s.session DefaultSessionIdManager workerName=node0
   [junit4]   2> 640034 INFO  (closeThreadPool-1711-thread-3) [    ] o.e.j.s.session No SessionScavenger set, using defaults
   [junit4]   2> 640034 INFO  (closeThreadPool-1711-thread-3) [    ] o.e.j.s.session node0 Scavenging every 660000ms
   [junit4]   2> 640035 INFO  (closeThreadPool-1711-thread-3) [    ] o.e.j.s.h.ContextHandler Started o.e.j.s.ServletContextHandler@34c24bd{/,null,AVAILABLE}
   [junit4]   2> 640037 INFO  (closeThreadPool-1711-thread-3) [    ] o.e.j.s.AbstractConnector Started ServerConnector@23f6e476{HTTP/1.1,[http/1.1]}{127.0.0.1:38484}
   [junit4]   2> 640037 INFO  (closeThreadPool-1711-thread-3) [    ] o.e.j.s.Server Started @640094ms
   [junit4]   2> 640037 INFO  (closeThreadPool-1711-thread-3) [    ] o.a.s.c.s.e.JettySolrRunner Jetty properties: {solr.data.dir=/x1/jenkins/jenkins-slave/workspace/Lucene-Solr-BadApples-NightlyTests-7.x/checkout/solr/build/solr-core/test/J0/temp/solr.cloud.ChaosMonkeyNothingIsSafeTest_C3826F1E4C04A535-001/tempDir-001/jetty3, solrconfig=solrconfig.xml, hostContext=/, hostPort=38484, coreRootDirectory=/x1/jenkins/jenkins-slave/workspace/Lucene-Solr-BadApples-NightlyTests-7.x/checkout/solr/build/solr-core/test/J0/../../../../../../../../../../../x1/jenkins/jenkins-slave/workspace/Lucene-Solr-BadApples-NightlyTests-7.x/checkout/solr/build/solr-core/test/J0/temp/solr.cloud.ChaosMonkeyNothingIsSafeTest_C3826F1E4C04A535-001/shard-3-001/cores}
   [junit4]   2> 640037 ERROR (closeThreadPool-1711-thread-3) [    ] o.a.s.u.StartupLoggingUtils Missing Java Option solr.log.dir. Logging may be missing or incomplete.
   [junit4]   2> 640037 INFO  (closeThreadPool-1711-thread-3) [    ] o.a.s.s.SolrDispatchFilter Using logger factory org.apache.logging.slf4j.Log4jLoggerFactory
   [junit4]   2> 640037 INFO  (closeThreadPool-1711-thread-3) [    ] o.a.s.s.SolrDispatchFilter  ___      _       Welcome to Apache Solr? version 7.7.0
   [junit4]   2> 640037 INFO  (closeThreadPool-1711-thread-3) [    ] o.a.s.s.SolrDispatchFilter / __| ___| |_ _   Starting in cloud mode on port null
   [junit4]   2> 640037 INFO  (closeThreadPool-1711-thread-3) [    ] o.a.s.s.SolrDispatchFilter \__ \/ _ \ | '_|  Install dir: null
   [junit4]   2> 640037 INFO  (closeThreadPool-1711-thread-3) [    ] o.a.s.s.SolrDispatchFilter |___/\___/_|_|    Start time: 2019-01-17T03:24:52.971Z
   [junit4]   2> 640059 INFO  (zkConnectionManagerCallback-1731-thread-1) [    ] o.a.s.c.c.ConnectionManager zkClient has connected
   [junit4]   2> 640061 INFO  (closeThreadPool-1711-thread-3) [    ] o.a.s.s.SolrDispatchFilter Loading solr.xml from SolrHome (not found in ZooKeeper)
   [junit4]   2> 640061 INFO  (closeThreadPool-1711-thread-3) [    ] o.a.s.c.SolrXmlConfig Loading container configuration from /x1/jenkins/jenkins-slave/workspace/Lucene-Solr-BadApples-NightlyTests-7.x/checkout/solr/build/solr-core/test/J0/temp/solr.cloud.ChaosMonkeyNothingIsSafeTest_C3826F1E4C04A535-001/shard-3-001/solr.xml
   [junit4]   2> 640066 INFO  (closeThreadPool-1711-thread-3) [    ] o.a.s.c.SolrXmlConfig Configuration parameter autoReplicaFailoverWorkLoopDelay is ignored
   [junit4]   2> 640066 INFO  (closeThreadPool-1711-thread-3) [    ] o.a.s.c.SolrXmlConfig Configuration parameter autoReplicaFailoverBadNodeExpiration is ignored
   [junit4]   2> 640068 INFO  (closeThreadPool-1711-thread-3) [    ] o.a.s.c.SolrXmlConfig MBean server found: com.sun.jmx.mbeanserver.JmxMBeanServer@54c827b5, but no JMX reporters were configured - adding default JMX reporter.
   [junit4]   2> 640179 INFO  (closeThreadPool-1711-thread-2) [    ] o.a.s.h.c.HttpShardHandlerFactory Host whitelist initialized: WhitelistHostChecker [whitelistHosts=null, whitelistHostCheckingEnabled=false]
   [junit4]   2> 640189 INFO  (closeThreadPool-1711-thread-2) [    ] o.a.s.c.ZkContainer Zookeeper client=127.0.0.1:42694/solr
   [junit4]   2> 640190 INFO  (zkConnectionManagerCallback-1735-thread-1) [    ] o.a.s.c.c.ConnectionManager zkClient has connected
   [junit4]   2> 640194 INFO  (zkConnectionManagerCallback-1737-thread-1) [    ] o.a.s.c.c.ConnectionManager zkClient has connected
   [junit4]   2> 640200 INFO  (closeThreadPool-1711-thread-2) [n:127.0.0.1:33704_    ] o.a.s.c.c.ZkStateReader Updated live nodes from ZooKeeper... (0) -> (2)
   [junit4]   2> 640204 INFO  (closeThreadPool-1711-thread-3) [    ] o.a.s.h.c.HttpShardHandlerFactory Host whitelist initialized: WhitelistHostChecker [whitelistHosts=null, whitelistHostCheckingEnabled=false]
   [junit4]   2> 640207 INFO  (closeThreadPool-1711-thread-2) [n:127.0.0.1:33704_    ] o.a.s.c.ZkController Publish node=127.0.0.1:33704_ as DOWN
   [junit4]   2> 640209 INFO  (closeThreadPool-1711-thread-3) [    ] o.a.s.c.ZkContainer Zookeeper client=127.0.0.1:42694/solr
   [junit4]   2> 640209 INFO  (closeThreadPool-1711-thread-2) [n:127.0.0.1:33704_    ] o.a.s.c.TransientSolrCoreCacheDefault Allocating transient cache for 4 transient cores
   [junit4]   2> 640209 INFO  (closeThreadPool-1711-thread-2) [n:127.0.0.1:33704_    ] o.a.s.c.ZkController Register node as live in ZooKeeper:/live_nodes/127.0.0.1:33704_
   [junit4]   2> 640231 INFO  (zkConnectionManagerCallback-1743-thread-1) [    ] o.a.s.c.c.ConnectionManager zkClient has connected
   [junit4]   2> 640234 INFO  (zkConnectionManagerCallback-1745-thread-1) [    ] o.a.s.c.c.ConnectionManager zkClient has connected
   [junit4]   2> 640237 INFO  (zkCallback-1720-thread-1) [    ] o.a.s.c.c.ZkStateReader Updated live nodes from ZooKeeper... (2) -> (3)
   [junit4]   2> 640237 INFO  (zkCallback-1698-thread-1) [    ] o.a.s.c.c.ZkStateReader Updated live nodes from ZooKeeper... (2) -> (3)
   [junit4]   2> 640237 INFO  (zkCallback-1709-thread-1) [    ] o.a.s.c.c.ZkStateReader Updated live nodes from ZooKeeper... (2) -> (3)
   [junit4]   2> 640237 INFO  (zkCallback-1691-thread-4) [    ] o.a.s.c.c.ZkStateReader Updated live nodes from ZooKeeper... (2) -> (3)
   [junit4]   2> 640242 INFO  (zkCallback-1736-thread-1) [    ] o.a.s.c.c.ZkStateReader Updated live nodes from ZooKeeper... (2) -> (3)
   [junit4]   2> 640245 INFO  (zkCallback-1727-thread-1) [    ] o.a.s.c.c.ZkStateReader Updated live nodes from ZooKeeper... (2) -> (3)
   [junit4]   2> 640247 INFO  (closeThreadPool-1711-thread-3) [n:127.0.0.1:38484_    ] o.a.s.c.c.ZkStateReader Updated live nodes from ZooKeeper... (0) -> (3)
   [junit4]   2> 640255 INFO  (closeThreadPool-1711-thread-3) [n:127.0.0.1:38484_    ] o.a.s.c.ZkController Publish node=127.0.0.1:38484_ as DOWN
   [junit4]   2> 640256 INFO  (closeThreadPool-1711-thread-3) [n:127.0.0.1:38484_    ] o.a.s.c.TransientSolrCoreCacheDefault Allocating transient cache for 4 transient cores
   [junit4]   2> 640256 INFO  (closeThreadPool-1711-thread-3) [n:127.0.0.1:38484_    ] o.a.s.c.ZkController Register node as live in ZooKeeper:/live_nodes/127.0.0.1:38484_
   [junit4]   2> 640260 INFO  (zkCallback-1720-thread-1) [    ] o.a.s.c.c.ZkStateReader Updated live nodes from ZooKeeper... (3) -> (4)
   [junit4]   2> 640260 INFO  (zkCallback-1709-thread-1) [    ] o.a.s.c.c.ZkStateReader Updated live nodes from ZooKeeper... (3) -> (4)
   [junit4]   2> 640260 INFO  (zkCallback-1698-thread-1) [    ] o.a.s.c.c.ZkStateReader Updated live nodes from ZooKeeper... (3) -> (4)
   [junit4]   2> 640260 INFO  (zkCallback-1691-thread-4) [    ] o.a.s.c.c.ZkStateReader Updated live nodes from ZooKeeper... (3) -> (4)
   [junit4]   2> 640260 INFO  (zkCallback-1736-thread-1) [    ] o.a.s.c.c.ZkStateReader Updated live nodes from ZooKeeper... (3) -> (4)
   [junit4]   2> 640261 INFO  (zkCallback-1727-thread-1) [    ] o.a.s.c.c.ZkStateReader Updated live nodes from ZooKeeper... (3) -> (4)
   [junit4]   2> 640262 INFO  (zkCallback-1744-thread-1) [    ] o.a.s.c.c.ZkStateReader Updated live nodes from ZooKeeper... (3) -> (4)
   [junit4]   2> 640276 INFO  (zkConnectionManagerCallback-1752-thread-1) [    ] o.a.s.c.c.ConnectionManager zkClient has connected
   [junit4]   2> 640278 INFO  (closeThreadPool-1711-thread-2) [n:127.0.0.1:33704_    ] o.a.s.c.c.ZkStateReader Updated live nodes from ZooKeeper... (0) -> (4)
   [junit4]   2> 640280 INFO  (TEST-ChaosMonkeyNothingIsSafeTest.test-seed#[C3826F1E4C04A535]) [    ] o.a.s.c.AbstractFullDistribZkTestBase create jetty 4 in directory /x1/jenkins/jenkins-slave/workspace/Lucene-Solr-BadApples-NightlyTests-7.x/checkout/solr/build/solr-core/test/J0/temp/solr.cloud.ChaosMonkeyNothingIsSafeTest_C3826F1E4C04A535-001/shard-4-001 of type NRT
   [junit4]   2> 640280 INFO  (closeThreadPool-1711-thread-2) [n:127.0.0.1:33704_    ] o.a.s.c.s.i.ZkClientClusterStateProvider Cluster at 127.0.0.1:42694/solr ready
   [junit4]   2> 640281 WARN  (closeThreadPool-1711-thread-1) [    ] o.e.j.s.AbstractConnector Ignoring deprecated socket close linger time
   [junit4]   2> 640281 INFO  (closeThreadPool-1711-thread-1) [    ] o.a.s.c.s.e.JettySolrRunner Start Jetty (original configured port=0)
   [junit4]   2> 640281 INFO  (closeThreadPool-1711-thread-1) [    ] o.a.s.c.s.e.JettySolrRunner Trying to start Jetty on port 0 try number 1 ...
   [junit4]   2> 640281 INFO  (closeThreadPool-1711-thread-1) [    ] o.e.j.s.Server jetty-9.4.14.v20181114; built: 2018-11-14T21:20:31.478Z; git: c4550056e785fb5665914545889f21dc136ad9e6; jvm 1.8.0_191-b12
   [junit4]   2> 640283 INFO  (closeThreadPool-1711-thread-1) [    ] o.e.j.s.session DefaultSessionIdManager workerName=node0
   [junit4]   2> 640283 INFO  (closeThreadPool-1711-thread-1) [    ] o.e.j.s.session No SessionScavenger set, using defaults
   [junit4]   2> 640283 INFO  (closeThreadPool-1711-thread-1) [    ] o.e.j.s.session node0 Scavenging every 600000ms
   [junit4]   2> 640284 INFO  (closeThreadPool-1711-thread-1) [    ] o.e.j.s.h.ContextHandler Started o.e.j.s.ServletContextHandler@b361d35{/,null,AVAILABLE}
   [junit4]   2> 640284 INFO  (closeThreadPool-1711-thread-2) [n:127.0.0.1:33704_    ] o.a.s.h.a.MetricsHistoryHandler No .system collection, keeping metrics history in memory.
   [junit4]   2> 640286 INFO  (closeThreadPool-1711-thread-1) [    ] o.e.j.s.AbstractConnector Started ServerConnector@2ba6f67e{HTTP/1.1,[http/1.1]}{127.0.0.1:41276}
   [junit4]   2> 640286 INFO  (closeThreadPool-1711-thread-1) [    ] o.e.j.s.Server Started @640343ms
   [junit4]   2> 640286 INFO  (closeThreadPool-1711-thread-1) [    ] o.a.s.c.s.e.JettySolrRunner Jetty properties: {solr.data.dir=/x1/jenkins/jenkins-slave/workspace/Lucene-Solr-BadApples-NightlyTests-7.x/checkout/solr/build/solr-core/test/J0/temp/solr.cloud.ChaosMonkeyNothingIsSafeTest_C3826F1E4C04A535-001/tempDir-001/jetty4, replicaType=NRT, solrconfig=solrconfig.xml, hostContext=/, hostPort=41276, coreRootDirectory=/x1/jenkins/jenkins-slave/workspace/Lucene-Solr-BadApples-NightlyTests-7.x/checkout/solr/build/solr-core/test/J0/temp/solr.cloud.ChaosMonkeyNothingIsSafeTest_C3826F1E4C04A535-001/shard-4-001/cores}
   [junit4]   2> 640287 ERROR (closeThreadPool-1711-thread-1) [    ] o.a.s.u.StartupLoggingUtils Missing Java Option solr.log.dir. Logging may be missing or incomplete.
   [junit4]   2> 640287 INFO  (closeThreadPool-1711-thread-1) [    ] o.a.s.s.SolrDispatchFilter Using logger factory org.apache.logging.slf4j.Log4jLoggerFactory
   [junit4]   2> 640287 INFO  (closeThreadPool-1711-thread-1) [    ] o.a.s.s.SolrDispatchFilter  ___      _       Welcome to Apache Solr? version 7.7.0
   [junit4]   2> 640287 INFO  (closeThreadPool-1711-thread-1) [    ] o.a.s.s.SolrDispatchFilter / __| ___| |_ _   Starting in cloud mode on port null
   [junit4]   2> 640287 INFO  (closeThreadPool-1711-thread-1) [    ] o.a.s.s.SolrDispatchFilter \__ \/ _ \ | '_|  Install dir: null
   [junit4]   2> 640287 INFO  (closeThreadPool-1711-thread-1) [    ] o.a.s.s.SolrDispatchFilter |___/\___/_|_|    Start time: 2019-01-17T03:24:53.221Z
   [junit4]   2> 640287 INFO  (zkConnectionManagerCallback-1757-thread-1) [    ] o.a.s.c.c.ConnectionManager zkClient has connected
   [junit4]   2> 640289 INFO  (zkConnectionManagerCallback-1760-thread-1) [    ] o.a.s.c.c.ConnectionManager zkClient has connected
   [junit4]   2> 640293 INFO  (closeThreadPool-1711-thread-1) [    ] o.a.s.s.SolrDispatchFilter Loading solr.xml from SolrHome (not found in ZooKeeper)
   [junit4]   2> 640294 INFO  (closeThreadPool-1711-thread-1) [    ] o.a.s.c.SolrXmlConfig Loading container configuration from /x1/jenkins/jenkins-slave/workspace/Lucene-Solr-BadApples-NightlyTests-7.x/checkout/solr/build/solr-core/test/J0/temp/solr.cloud.ChaosMonkeyNothingIsSafeTest_C3826F1E4C04A535-001/shard-4-001/solr.xml
   [junit4]   2> 640296 INFO  (closeThreadPool-1711-thread-3) [n:127.0.0.1:38484_    ] o.a.s.c.c.ZkStateReader Updated live nodes from ZooKeeper... (0) -> (4)
   [junit4]   2> 640298 INFO  (closeThreadPool-1711-thread-3) [n:127.0.0.1:38484_    ] o.a.s.c.s.i.ZkClientClusterStateProvider Cluster at 127.0.0.1:42694/solr ready
   [junit4]   2> 640299 INFO  (closeThreadPool-1711-thread-1) [    ] o.a.s.c.SolrXmlConfig Configuration parameter autoReplicaFailoverWorkLoopDelay is ignored
   [junit4]   2> 640299 INFO  (closeThreadPool-1711-thread-1) [    ] o.a.s.c.SolrXmlConfig Configuration parameter autoReplicaFailoverBadNodeExpiration is ignored
   [junit4]   2> 640299 INFO  (closeThreadPool-1711-thread-3) [n:127.0.0.1:38484_    ] o.a.s.h.a.MetricsHistoryHandler No .system collection, keeping metrics history in memory.
   [junit4]   2> 640307 INFO  (closeThreadPool-1711-thread-1) [    ] o.a.s.c.SolrXmlConfig MBean server found: com.sun.jmx.mbeanserver.JmxMBeanServer@54c827b5, but no JMX reporters were configured - adding default JMX reporter.
   [junit4]   2> 640317 INFO  (closeThreadPool-1711-thread-2) [n:127.0.0.1:33704_    ] o.a.s.m.r.SolrJmxReporter JMX monitoring for 'solr.node' (registry 'solr.node') enabled at server: com.sun.jmx.mbeanserver.JmxMBeanServer@54c827b5
   [junit4]   2> 640333 INFO  (closeThreadPool-1711-thread-2) [n:127.0.0.1:33704_    ] o.a.s.m.r.SolrJmxReporter JMX monitoring for 'solr.jvm' (registry 'solr.jvm') enabled at server: com.sun.jmx.mbeanserver.JmxMBeanServer@54c827b5
   [junit4]   2> 640334 INFO  (closeThreadPool-1711-thread-2) [n:127.0.0.1:33704_    ] o.a.s.m.r.SolrJmxReporter JMX monitoring for 'solr.jetty' (registry 'solr.jetty') enabled at server: com.sun.jmx.mbeanserver.JmxMBeanServer@54c827b5
   [junit4]   2> 640335 INFO  (closeThreadPool-1711-thread-3) [n:127.0.0.1:38484_    ] o.a.s.m.r.SolrJmxReporter JMX monitoring for 'solr.node' (registry 'solr.node') enabled at server: com.sun.jmx.mbeanserver.JmxMBeanServer@54c827b5
   [junit4]   2> 640336 INFO  (closeThreadPool-1711-thread-2) [n:127.0.0.1:33704_    ] o.a.s.c.CorePropertiesLocator Found 0 core definitions underneath /x1/jenkins/jenkins-slave/workspace/Lucene-Solr-BadApples-NightlyTests-7.x/checkout/solr/build/solr-core/test/J0/../../../../../../../../../../../x1/jenkins/jenkins-slave/workspace/Lucene-Solr-BadApples-NightlyTests-7.x/checkout/solr/build/solr-core/test/J0/temp/solr.cloud.ChaosMonkeyNothingIsSafeTest_C3826F1E4C04A535-001/shard-2-001/cores
   [junit4]   2> 640350 INFO  (closeThreadPool-1711-thread-3) [n:127.0.0.1:38484_    ] o.a.s.m.r.SolrJmxReporter JMX monitoring for 'solr.jvm' (registry 'solr.jvm') enabled at server: com.sun.jmx.mbeanserver.JmxMBeanServer@54c827b5
   [junit4]   2> 640350 INFO  (closeThreadPool-1711-thread-3) [n:127.0.0.1:38484_    ] o.a.s.m.r.SolrJmxReporter JMX monitoring for 'solr.jetty' (registry 'solr.jetty') enabled at server: com.sun.jmx.mbeanserver.JmxMBeanServer@54c827b5
   [junit4]   2> 640353 INFO  (closeThreadPool-1711-thread-3) [n:127.0.0.1:38484_    ] o.a.s.c.CorePropertiesLocator Found 0 core definitions underneath /x1/jenkins/jenkins-slave/workspace/Lucene-Solr-BadApples-NightlyTests-7.x/checkout/solr/build/solr-core/test/J0/../../../../../../../../../../../x1/jenkins/jenkins-slave/workspace/Lucene-Solr-BadApples-NightlyTests-7.x/checkout/solr/build/solr-core/test/J0/temp/solr.cloud.ChaosMonkeyNothingIsSafeTest_C3826F1E4C04A535-001/shard-3-001/cores
   [junit4]   2> 640428 INFO  (closeThreadPool-1711-thread-1) [    ] o.a.s.h.c.HttpShardHandlerFactory Host whitelist initialized: WhitelistHostChecker [whitelistHosts=null, whitelistHostCheckingEnabled=false]
   [junit4]   2> 640433 INFO  (closeThreadPool-1711-thread-1) [    ] o.a.s.c.ZkContainer Zookeeper client=127.0.0.1:42694/solr
   [junit4]   2> 640443 INFO  (zkConnectionManagerCallback-1765-thread-1) [    ] o.a.s.c.c.ConnectionManager zkClient has connected
   [junit4]   2> 640455 INFO  (zkConnectionManagerCallback-1767-thread-1) [    ] o.a.s.c.c.ConnectionManager zkClient has connected
   [junit4]   2> 640460 INFO  (closeThreadPool-1711-thread-1) [    ] o.a.s.c.c.ZkStateReader Updated live nodes from ZooKeeper... (0) -> (4)
   [junit4]   2> 640464 INFO  (closeThreadPool-1711-thread-1) [    ] o.a.s.c.ZkController Publish node=127.0.0.1:41276_ as DOWN
   [junit4]   2> 640465 INFO  (closeThreadPool-1711-thread-1) [    ] o.a.s.c.TransientSolrCoreCacheDefault Allocating transient cache for 4 transient cores
   [junit4]   2> 640465 INFO  (closeThreadPool-1711-thread-1) [    ] o.a.s.c.ZkController Register node as live in ZooKeeper:/live_nodes/127.0.0.1:41276_
   [junit4]   2> 640468 INFO  (zkCallback-1744-thread-1) [    ] o.a.s.c.c.ZkStateReader Updated live nodes from ZooKeeper... (4) -> (5)
   [junit4]   2> 640468 INFO  (zkCallback-1720-thread-1) [    ] o.a.s.c.c.ZkStateReader Updated live nodes from ZooKeeper... (4) -> (5)
   [junit4]   2> 640468 INFO  (zkCallback-1709-thread-1) [    ] o.a.s.c.c.ZkStateReader Updated live nodes from ZooKeeper... (4) -> (5)
   [junit4]   2> 640468 INFO  (zkCallback-1691-thread-4) [    ] o.a.s.c.c.ZkStateReader Updated live nodes from ZooKeeper... (4) -> (5)
   [junit4]   2> 640468 INFO  (zkCallback-1736-thread-1) [    ] o.a.s.c.c.ZkStateReader Updated live nodes from ZooKeeper... (4) -> (5)
   [junit4]   2> 640468 INFO  (zkCallback-1727-thread-1) [    ] o.a.s.c.c.ZkStateReader Updated live nodes from ZooKeeper... (4) -> (5)
   [junit4]   2> 640468 INFO  (zkCallback-1698-thread-1) [    ] o.a.s.c.c.ZkStateReader Updated live nodes from ZooKeeper... (4) -> (5)
   [junit4]   2> 640469 INFO  (zkCallback-1766-thread-1) [    ] o.a.s.c.c.ZkStateReader Updated live nodes from ZooKeeper... (4) -> (5)
   [junit4]   2> 640469 INFO  (zkCallback-1756-thread-1) [    ] o.a.s.c.c.ZkStateReader Updated live nodes from ZooKeeper... (4) -> (5)
   [junit4]   2> 640469 INFO  (zkCallback-1751-thread-1) [    ] o.a.s.c.c.ZkStateReader Updated live nodes from ZooKeeper... (4) -> (5)
   [junit4]   2> 640511 INFO  (TEST-ChaosMonkeyNothingIsSafeTest.test-seed#[C3826F1E4C04A535]) [    ] o.a.s.c.AbstractFullDistribZkTestBase create jetty 5 in directory /x1/jenkins/jenkins-slave/workspace/Lucene-Solr-BadApples-NightlyTests-7.x/checkout/solr/build/solr-core/test/J0/temp/solr.cloud.ChaosMonkeyNothingIsSafeTest_C3826F1E4C04A535-001/shard-5-001 of type NRT
   [junit4]   2> 640511 WARN  (closeThreadPool-1711-thread-3) [    ] o.e.j.s.AbstractConnector Ignoring deprecated socket close linger time
   [junit4]   2> 640512 INFO  (closeThreadPool-1711-thread-3) [    ] o.a.s.c.s.e.JettySolrRunner Start Jetty (original configured port=0)
   [junit4]   2> 640512 INFO  (closeThreadPool-1711-thread-3) [    ] o.a.s.c.s.e.JettySolrRunner Trying to start Jetty on port 0 try number 1 ...
   [junit4]   2> 640512 INFO  (closeThreadPool-1711-thread-3) [    ] o.e.j.s.Server jetty-9.4.14.v20181114; built: 2018-11-14T21:20:31.478Z; git: c4550056e785fb5665914545889f21dc136ad9e6; jvm 1.8.0_191-b12
   [junit4]   2> 640513 INFO  (zkConnectionManagerCallback-1774-thread-1) [    ] o.a.s.c.c.ConnectionManager zkClient has connected
   [junit4]   2> 640514 INFO  (closeThreadPool-1711-thread-3) [    ] o.e.j.s.session DefaultSessionIdManager workerName=node0
   [junit4]   2> 640514 INFO  (closeThreadPool-1711-thread-3) [    ] o.e.j.s.session No SessionScavenger set, using defaults
   [junit4]   2> 640514 INFO  (closeThreadPool-1711-thread-3) [    ] o.e.j.s.session node0 Scavenging every 660000ms
   [junit4]   2> 640514 INFO  (closeThreadPool-1711-thread-3) [    ] o.e.j.s.h.ContextHandler Started o.e.j.s.ServletContextHandler@5d7a42f3{/,null,AVAILABLE}
   [junit4]   2> 640515 INFO  (closeThreadPool-1711-thread-1) [    ] o.a.s.c.c.ZkStateReader Updated live nodes from ZooKeeper... (0) -> (5)
   [junit4]   2> 640523 INFO  (closeThreadPool-1711-thread-3) [    ] o.e.j.s.AbstractConnector Started ServerConnector@592b5b44{HTTP/1.1,[http/1.1]}{127.0.0.1:45584}
   [junit4]   2> 640523 INFO  (closeThreadPool-1711-thread-3) [    ] o.e.j.s.Server Started @640580ms
   [junit4]   2> 640523 INFO  (closeThreadPool-1711-thread-3) [    ] o.a.s.c.s.e.JettySolrRunner Jetty properties: {solr.data.dir=/x1/jenkins/jenkins-slave/workspace/Lucene-Solr-BadApples-NightlyTests-7.x/checkout/solr/build/solr-core/test/J0/temp/solr.cloud.ChaosMonkeyNothingIsSafeTest_C3826F1E4C04A535-001/tempDir-001/jetty5, replicaType=NRT, solrconfig=solrconfig.xml, hostContext=/, hostPort=45584, coreRootDirectory=/x1/jenkins/jenkins-slave/workspace/Lucene-Solr-BadApples-NightlyTests-7.x/checkout/solr/build/solr-core/test/J0/temp/solr.cloud.ChaosMonkeyNothingIsSafeTest_C3826F1E4C04A535-001/shard-5-001/cores}
   [junit4]   2> 640523 ERROR (closeThreadPool-1711-thread-3) [    ] o.a.s.u.StartupLoggingUtils Missing Java Option solr.log.dir. Logging may be missing or incomplete.
   [junit4]   2> 640523 INFO  (closeThreadPool-1711-thread-3) [    ] o.a.s.s.SolrDispatchFilter Using logger factory org.apache.logging.slf4j.Log4jLoggerFactory
   [junit4]   2> 640523 INFO  (closeThreadPool-1711-thread-3) [    ] o.a.s.s.SolrDispatchFilter  ___      _       Welcome to Apache Solr? version 7.7.0
   [junit4]   2> 640523 INFO  (closeThreadPool-1711-thread-3) [    ] o.a.s.s.SolrDispatchFilter / __| ___| |_ _   Starting in cloud mode on port null
   [junit4]   2> 640523 INFO  (closeThreadPool-1711-thread-3) [    ] o.a.s.s.SolrDispatchFilter \__ \/ _ \ | '_|  Install dir: null
   [junit4]   2> 640523 INFO  (closeThreadPool-1711-thread-3) [    ] o.a.s.s.SolrDispatchFilter |___/\___/_|_|    Start time: 2019-01-17T03:24:53.457Z
   [junit4]   2> 640524 INFO  (closeThreadPool-1711-thread-1) [    ] o.a.s.c.s.i.ZkClientClusterStateProvider Cluster at 127.0.0.1:42694/solr ready
   [junit4]   2> 640531 INFO  (closeThreadPool-1711-thread-1) [    ] o.a.s.h.a.MetricsHistoryHandler No .system collection, keeping metrics history in memory.
   [junit4]   2> 640531 INFO  (zkConnectionManagerCallback-1776-thread-1) [    ] o.a.s.c.c.ConnectionManager zkClient has connected
   [junit4]   2> 640532 INFO  (closeThreadPool-1711-thread-3) [    ] o.a.s.s.SolrDispatchFilter Loading solr.xml from SolrHome (not found in ZooKeeper)
   [junit4]   2> 640532 INFO  (closeThreadPool-1711-thread-3) [    ] o.a.s.c.SolrXmlConfig Loading container configuration from /x1/jenkins/jenkins-slave/workspace/Lucene-Solr-BadApples-NightlyTests-7.x/checkout/solr/build/solr-core/test/J0/temp/solr.cloud.ChaosMonkeyNothingIsSafeTest_C3826F1E4C04A535-001/shard-5-001/solr.xml
   [junit4]   2> 640537 INFO  (closeThreadPool-1711-thread-3) [    ] o.a.s.c.SolrXmlConfig Configuration parameter autoReplicaFailoverWorkLoopDelay is ignored
   [junit4]   2> 640537 INFO  (closeThreadPool-1711-thread-3) [    ] o.a.s.c.SolrXmlConfig Configuration parameter autoReplicaFailoverBadNodeExpiration is ignored
   [junit4]   2> 640539 INFO  (closeThreadPool-1711-thread-3) [    ] o.a.s.c.SolrXmlConfig MBean server found: com.sun.jmx.mbeanserver.JmxMBeanServer@54c827b5, but no JMX reporters were configured - adding default JMX reporter.
   [junit4]   2> 640558 INFO  (closeThreadPool-1711-thread-1) [    ] o.a.s.m.r.SolrJmxReporter JMX monitoring for 'solr.node' (registry 'solr.node') enabled at server: com.sun.jmx.mbeanserver.JmxMBeanServer@54c827b5
   [junit4]   2> 640574 INFO  (closeThreadPool-1711-thread-1) [    ] o.a.s.m.r.SolrJmxReporter JMX monitoring for 'solr.jvm' (registry 'solr.jvm') enabled at server: com.sun.jmx.mbeanserver.JmxMBeanServer@54c827b5
   [junit4]   2> 640574 INFO  (closeThreadPool-1711-thread-1) [    ] o.a.s.m.r.SolrJmxReporter JMX monitoring for 'solr.jetty' (registry 'solr.jetty') enabled at server: com.sun.jmx.mbeanserver.JmxMBeanServer@54c827b5
   [junit4]   2> 640577 INFO  (closeThreadPool-1711-thread-1) [    ] o.a.s.c.CorePropertiesLocator Found 0 core definitions underneath /x1/jenkins/jenkins-slave/workspace/Lucene-Solr-BadApples-NightlyTests-7.x/checkout/solr/build/solr-core/test/J0/temp/solr.cloud.ChaosMonkeyNothingIsSafeTest_C3826F1E4C04A535-001/shard-4-001/cores
   [junit4]   2> 640638 INFO  (closeThreadPool-1711-thread-3) [    ] o.a.s.h.c.HttpShardHandlerFactory Host whitelist initialized: WhitelistHostChecker [whitelistHosts=null, whitelistHostCheckingEnabled=false]
   [junit4]   2> 640645 INFO  (closeThreadPool-1711-thread-3) [    ] o.a.s.c.ZkContainer Zookeeper client=127.0.0.1:42694/solr
   [junit4]   2> 640650 INFO  (zkConnectionManagerCallback-1781-thread-1) [    ] o.a.s.c.c.ConnectionManager zkClient has connected
   [junit4]   2> 640662 INFO  (zkConnectionManagerCallback-1783-thread-1) [    ] o.a.s.c.c.ConnectionManager zkClient has connected
   [junit4]   2> 640668 INFO  (closeThreadPool-1711-thread-3) [    ] o.a.s.c.c.ZkStateReader Updated live nodes from ZooKeeper... (0) -> (5)
   [junit4]   2> 640672 INFO  (closeThreadPool-1711-thread-3) [    ] o.a.s.c.ZkController Publish node=127.0.0.1:45584_ as DOWN
   [junit4]   2> 640673 INFO  (closeThreadPool-1711-thread-3) [    ] o.a.s.c.TransientSolrCoreCacheDefault Allocating transient cache for 4 transient cores
   [junit4]   2> 640673 INFO  (closeThreadPool-1711-thread-3) [    ] o.a.s.c.ZkController Register node as live in ZooKeeper:/live_nodes/127.0.0.1:45584_
   [junit4]   2> 640675 INFO  (zkCallback-1744-thread-1) [    ] o.a.s.c.c.ZkStateReader Updated live nodes from ZooKeeper... (5) -> (6)
   [junit4]   2> 640675 INFO  (zkCallback-1751-thread-1) [    ] o.a.s.c.c.ZkStateReader Updated live nodes from ZooKeeper... (5) -> (6)
   [junit4]   2> 640675 INFO  (zkCallback-1766-thread-1) [    ] o.a.s.c.c.ZkStateReader Updated live nodes from ZooKeeper... (5) -> (6)
   [junit4]   2> 640676 INFO  (zkCallback-1720-thread-1) [    ] o.a.s.c.c.ZkStateReader Updated live nodes from ZooKeeper... (5) -> (6)
   [junit4]   2> 640676 INFO  (zkCallback-1736-thread-1) [    ] o.a.s.c.c.ZkStateReader Updated live nodes from ZooKeeper... (5) -> (6)
   [junit4]   2> 640676 INFO  (zkCallback-1709-thread-1) [    ] o.a.s.c.c.ZkStateReader Updated live nodes from ZooKeeper... (5) -> (6)
   [junit4]   2> 640676 INFO  (zkCallback-1698-thread-1) [    ] o.a.s.c.c.ZkStateReader Updated live nodes from ZooKeeper... (5) -> (6)
   [junit4]   2> 640676 INFO  (zkCallback-1727-thread-1) [    ] o.a.s.c.c.ZkStateReader Updated live nodes from ZooKeeper... (5) -> (6)
   [junit4]   2> 640676 INFO  (zkCallback-1756-thread-1) [    ] o.a.s.c.c.ZkStateReader Updated live nodes from ZooKeeper... (5) -> (6)
   [junit4]   2> 640676 INFO  (zkCallback-1691-thread-4) [    ] o.a.s.c.c.ZkStateReader Updated live nodes from ZooKeeper... (5) -> (6)
   [junit4]   2> 640676 INFO  (zkCallback-1773-thread-1) [    ] o.a.s.c.c.ZkStateReader Updated live nodes from ZooKeeper... (5) -> (6)
   [junit4]   2> 640677 INFO  (zkCallback-1782-thread-1) [    ] o.a.s.c.c.ZkStateReader Updated live nodes from ZooKeeper... (5) -> (6)
   [junit4]   2> 640697 INFO  (TEST-ChaosMonkeyNothingIsSafeTest.test-seed#[C3826F1E4C04A535]) [    ] o.a.s.c.AbstractFullDistribZkTestBase create jetty 6 in directory /x1/jenkins/jenkins-slave/workspace/Lucene-Solr-BadApples-NightlyTests-7.x/checkout/solr/build/solr-core/test/J0/temp/solr.cloud.ChaosMonkeyNothingIsSafeTest_C3826F1E4C04A535-001/shard-6-001 of type NRT
   [junit4]   2> 640697 WARN  (closeThreadPool-1711-thread-1) [    ] o.e.j.s.AbstractConnector Ignoring deprecated socket close linger time
   [junit4]   2> 640697 INFO  (closeThreadPool-1711-thread-1) [    ] o.a.s.c.s.e.JettySolrRunner Start Jetty (original configured port=0)
   [junit4]   2> 640697 INFO  (closeThreadPool-1711-thread-1) [    ] o.a.s.c.s.e.JettySolrRunner Trying to start Jetty on port 0 try number 1 ...
   [junit4]   2> 640697 INFO  (closeThreadPool-1711-thread-1) [    ] o.e.j.s.Server jetty-9.4.14.v20181114; built: 2018-11-14T21:20:31.478Z; git: c4550056e785fb5665914545889f21dc136ad9e6; jvm 1.8.0_191-b12
   [junit4]   2> 640699 INFO  (closeThreadPool-1711-thread-1) [    ] o.e.j.s.session DefaultSessionIdManager workerName=node0
   [junit4]   2> 640699 INFO  (closeThreadPool-1711-thread-1) [    ] o.e.j.s.session No SessionScavenger set, using defaults
   [junit4]   2> 640699 INFO  (closeThreadPool-1711-thr

[...truncated too long message...]

-configure:
[ivy:configure] :: loading settings :: file = /x1/jenkins/jenkins-slave/workspace/Lucene-Solr-BadApples-NightlyTests-7.x/checkout/lucene/top-level-ivy-settings.xml

resolve:

ivy-availability-check:
[loadresource] Do not set property disallowed.ivy.jars.list as its length is 0.

-ivy-fail-disallowed-ivy-version:

ivy-fail:

ivy-fail:

ivy-configure:
[ivy:configure] :: loading settings :: file = /x1/jenkins/jenkins-slave/workspace/Lucene-Solr-BadApples-NightlyTests-7.x/checkout/lucene/top-level-ivy-settings.xml

resolve:

ivy-availability-check:
[loadresource] Do not set property disallowed.ivy.jars.list as its length is 0.

-ivy-fail-disallowed-ivy-version:

ivy-fail:

ivy-configure:
[ivy:configure] :: loading settings :: file = /x1/jenkins/jenkins-slave/workspace/Lucene-Solr-BadApples-NightlyTests-7.x/checkout/lucene/top-level-ivy-settings.xml

resolve:

ivy-availability-check:
[loadresource] Do not set property disallowed.ivy.jars.list as its length is 0.

-ivy-fail-disallowed-ivy-version:

ivy-fail:

ivy-fail:

ivy-configure:
[ivy:configure] :: loading settings :: file = /x1/jenkins/jenkins-slave/workspace/Lucene-Solr-BadApples-NightlyTests-7.x/checkout/lucene/top-level-ivy-settings.xml

resolve:

ivy-availability-check:
[loadresource] Do not set property disallowed.ivy.jars.list as its length is 0.

-ivy-fail-disallowed-ivy-version:

ivy-fail:

ivy-fail:

ivy-configure:
[ivy:configure] :: loading settings :: file = /x1/jenkins/jenkins-slave/workspace/Lucene-Solr-BadApples-NightlyTests-7.x/checkout/lucene/top-level-ivy-settings.xml

resolve:

ivy-availability-check:
[loadresource] Do not set property disallowed.ivy.jars.list as its length is 0.

-ivy-fail-disallowed-ivy-version:

ivy-fail:

ivy-fail:

ivy-configure:
[ivy:configure] :: loading settings :: file = /x1/jenkins/jenkins-slave/workspace/Lucene-Solr-BadApples-NightlyTests-7.x/checkout/lucene/top-level-ivy-settings.xml

resolve:

ivy-availability-check:
[loadresource] Do not set property disallowed.ivy.jars.list as its length is 0.

-ivy-fail-disallowed-ivy-version:

ivy-fail:

ivy-fail:

ivy-configure:
[ivy:configure] :: loading settings :: file = /x1/jenkins/jenkins-slave/workspace/Lucene-Solr-BadApples-NightlyTests-7.x/checkout/lucene/top-level-ivy-settings.xml

resolve:

ivy-availability-check:
[loadresource] Do not set property disallowed.ivy.jars.list as its length is 0.

-ivy-fail-disallowed-ivy-version:

ivy-fail:

ivy-fail:

ivy-configure:
[ivy:configure] :: loading settings :: file = /x1/jenkins/jenkins-slave/workspace/Lucene-Solr-BadApples-NightlyTests-7.x/checkout/lucene/top-level-ivy-settings.xml

resolve:

ivy-availability-check:
[loadresource] Do not set property disallowed.ivy.jars.list as its length is 0.

-ivy-fail-disallowed-ivy-version:

ivy-fail:

ivy-fail:

ivy-configure:
[ivy:configure] :: loading settings :: file = /x1/jenkins/jenkins-slave/workspace/Lucene-Solr-BadApples-NightlyTests-7.x/checkout/lucene/top-level-ivy-settings.xml

resolve:

ivy-availability-check:
[loadresource] Do not set property disallowed.ivy.jars.list as its length is 0.

-ivy-fail-disallowed-ivy-version:

ivy-fail:

ivy-fail:

ivy-configure:
[ivy:configure] :: loading settings :: file = /x1/jenkins/jenkins-slave/workspace/Lucene-Solr-BadApples-NightlyTests-7.x/checkout/lucene/top-level-ivy-settings.xml

resolve:

ivy-availability-check:
[loadresource] Do not set property disallowed.ivy.jars.list as its length is 0.

-ivy-fail-disallowed-ivy-version:

ivy-fail:

ivy-fail:

ivy-configure:
[ivy:configure] :: loading settings :: file = /x1/jenkins/jenkins-slave/workspace/Lucene-Solr-BadApples-NightlyTests-7.x/checkout/lucene/top-level-ivy-settings.xml

resolve:

ivy-availability-check:
[loadresource] Do not set property disallowed.ivy.jars.list as its length is 0.

-ivy-fail-disallowed-ivy-version:

ivy-fail:

ivy-fail:

ivy-configure:
[ivy:configure] :: loading settings :: file = /x1/jenkins/jenkins-slave/workspace/Lucene-Solr-BadApples-NightlyTests-7.x/checkout/lucene/top-level-ivy-settings.xml

resolve:

ivy-availability-check:
[loadresource] Do not set property disallowed.ivy.jars.list as its length is 0.

-ivy-fail-disallowed-ivy-version:

ivy-fail:

ivy-fail:

ivy-configure:
[ivy:configure] :: loading settings :: file = /x1/jenkins/jenkins-slave/workspace/Lucene-Solr-BadApples-NightlyTests-7.x/checkout/lucene/top-level-ivy-settings.xml

resolve:

jar-checksums:
    [mkdir] Created dir: /x1/jenkins/jenkins-slave/workspace/Lucene-Solr-BadApples-NightlyTests-7.x/checkout/solr/null18152321
     [copy] Copying 242 files to /x1/jenkins/jenkins-slave/workspace/Lucene-Solr-BadApples-NightlyTests-7.x/checkout/solr/null18152321
   [delete] Deleting directory /x1/jenkins/jenkins-slave/workspace/Lucene-Solr-BadApples-NightlyTests-7.x/checkout/solr/null18152321

check-working-copy:
[ivy:cachepath] :: resolving dependencies :: org.eclipse.jgit#org.eclipse.jgit-caller;working
[ivy:cachepath] 	confs: [default]
[ivy:cachepath] 	found org.eclipse.jgit#org.eclipse.jgit;4.6.0.201612231935-r in public
[ivy:cachepath] 	found com.jcraft#jsch;0.1.53 in public
[ivy:cachepath] 	found com.googlecode.javaewah#JavaEWAH;1.1.6 in public
[ivy:cachepath] 	found org.apache.httpcomponents#httpclient;4.3.6 in public
[ivy:cachepath] 	found org.apache.httpcomponents#httpcore;4.3.3 in public
[ivy:cachepath] 	found commons-logging#commons-logging;1.1.3 in public
[ivy:cachepath] 	found commons-codec#commons-codec;1.6 in public
[ivy:cachepath] 	found org.slf4j#slf4j-api;1.7.2 in public
[ivy:cachepath] :: resolution report :: resolve 36ms :: artifacts dl 2ms
	---------------------------------------------------------------------
	|                  |            modules            ||   artifacts   |
	|       conf       | number| search|dwnlded|evicted|| number|dwnlded|
	---------------------------------------------------------------------
	|      default     |   8   |   0   |   0   |   0   ||   8   |   0   |
	---------------------------------------------------------------------
[wc-checker] Initializing working copy...
[wc-checker] SLF4J: Failed to load class "org.slf4j.impl.StaticLoggerBinder".
[wc-checker] SLF4J: Defaulting to no-operation (NOP) logger implementation
[wc-checker] SLF4J: See http://www.slf4j.org/codes.html#StaticLoggerBinder for further details.
[wc-checker] Checking working copy status...

-jenkins-base:

BUILD SUCCESSFUL
Total time: 280 minutes 9 seconds
Archiving artifacts
java.lang.InterruptedException: no matches found within 10000
	at hudson.FilePath$ValidateAntFileMask.hasMatch(FilePath.java:2847)
	at hudson.FilePath$ValidateAntFileMask.invoke(FilePath.java:2726)
	at hudson.FilePath$ValidateAntFileMask.invoke(FilePath.java:2707)
	at hudson.FilePath$FileCallableWrapper.call(FilePath.java:3086)
Also:   hudson.remoting.Channel$CallSiteStackTrace: Remote call to lucene
		at hudson.remoting.Channel.attachCallSiteStackTrace(Channel.java:1741)
		at hudson.remoting.UserRequest$ExceptionResponse.retrieve(UserRequest.java:357)
		at hudson.remoting.Channel.call(Channel.java:955)
		at hudson.FilePath.act(FilePath.java:1072)
		at hudson.FilePath.act(FilePath.java:1061)
		at hudson.FilePath.validateAntFileMask(FilePath.java:2705)
		at hudson.tasks.ArtifactArchiver.perform(ArtifactArchiver.java:243)
		at hudson.tasks.BuildStepCompatibilityLayer.perform(BuildStepCompatibilityLayer.java:81)
		at hudson.tasks.BuildStepMonitor$1.perform(BuildStepMonitor.java:20)
		at hudson.model.AbstractBuild$AbstractBuildExecution.perform(AbstractBuild.java:744)
		at hudson.model.AbstractBuild$AbstractBuildExecution.performAllBuildSteps(AbstractBuild.java:690)
		at hudson.model.Build$BuildExecution.post2(Build.java:186)
		at hudson.model.AbstractBuild$AbstractBuildExecution.post(AbstractBuild.java:635)
		at hudson.model.Run.execute(Run.java:1835)
		at hudson.model.FreeStyleBuild.run(FreeStyleBuild.java:43)
		at hudson.model.ResourceController.execute(ResourceController.java:97)
		at hudson.model.Executor.run(Executor.java:429)
Caused: hudson.FilePath$TunneledInterruptedException
	at hudson.FilePath$FileCallableWrapper.call(FilePath.java:3088)
	at hudson.remoting.UserRequest.perform(UserRequest.java:212)
	at hudson.remoting.UserRequest.perform(UserRequest.java:54)
	at hudson.remoting.Request$2.run(Request.java:369)
	at hudson.remoting.InterceptingExecutorService$1.call(InterceptingExecutorService.java:72)
	at java.util.concurrent.FutureTask.run(FutureTask.java:266)
	at java.util.concurrent.ThreadPoolExecutor.runWorker(ThreadPoolExecutor.java:1142)
	at java.util.concurrent.ThreadPoolExecutor$Worker.run(ThreadPoolExecutor.java:617)
	at java.lang.Thread.run(Thread.java:748)
Caused: java.lang.InterruptedException: java.lang.InterruptedException: no matches found within 10000
	at hudson.FilePath.act(FilePath.java:1074)
	at hudson.FilePath.act(FilePath.java:1061)
	at hudson.FilePath.validateAntFileMask(FilePath.java:2705)
	at hudson.tasks.ArtifactArchiver.perform(ArtifactArchiver.java:243)
	at hudson.tasks.BuildStepCompatibilityLayer.perform(BuildStepCompatibilityLayer.java:81)
	at hudson.tasks.BuildStepMonitor$1.perform(BuildStepMonitor.java:20)
	at hudson.model.AbstractBuild$AbstractBuildExecution.perform(AbstractBuild.java:744)
	at hudson.model.AbstractBuild$AbstractBuildExecution.performAllBuildSteps(AbstractBuild.java:690)
	at hudson.model.Build$BuildExecution.post2(Build.java:186)
	at hudson.model.AbstractBuild$AbstractBuildExecution.post(AbstractBuild.java:635)
	at hudson.model.Run.execute(Run.java:1835)
	at hudson.model.FreeStyleBuild.run(FreeStyleBuild.java:43)
	at hudson.model.ResourceController.execute(ResourceController.java:97)
	at hudson.model.Executor.run(Executor.java:429)
No artifacts found that match the file pattern "**/*.events,heapdumps/**,**/hs_err_pid*". Configuration error?
Recording test results
Build step 'Publish JUnit test result report' changed build result to UNSTABLE
Email was triggered for: Unstable (Test Failures)
Sending email for trigger: Unstable (Test Failures)

Mime
View raw message