lucene-dev mailing list archives

Site index · List index
Message view « Date » · « Thread »
Top « Date » · « Thread »
From Apache Jenkins Server <jenk...@builds.apache.org>
Subject [JENKINS] Lucene-Solr-NightlyTests-8.x - Build # 12 - Failure
Date Thu, 31 Jan 2019 21:21:45 GMT
Build: https://builds.apache.org/job/Lucene-Solr-NightlyTests-8.x/12/

1 tests failed.
FAILED:  org.apache.solr.cloud.hdfs.StressHdfsTest.test

Error Message:
There are still nodes recoverying - waited for 330 seconds

Stack Trace:
java.lang.AssertionError: There are still nodes recoverying - waited for 330 seconds
	at __randomizedtesting.SeedInfo.seed([8FB92E0E34FF0327:7ED11D49A036EDF]:0)
	at org.junit.Assert.fail(Assert.java:88)
	at org.apache.solr.cloud.AbstractDistribZkTestBase.waitForRecoveriesToFinish(AbstractDistribZkTestBase.java:195)
	at org.apache.solr.cloud.AbstractDistribZkTestBase.waitForRecoveriesToFinish(AbstractDistribZkTestBase.java:143)
	at org.apache.solr.cloud.AbstractDistribZkTestBase.waitForRecoveriesToFinish(AbstractDistribZkTestBase.java:138)
	at org.apache.solr.cloud.AbstractFullDistribZkTestBase.waitForRecoveriesToFinish(AbstractFullDistribZkTestBase.java:1032)
	at org.apache.solr.cloud.hdfs.StressHdfsTest.createAndDeleteCollection(StressHdfsTest.java:164)
	at org.apache.solr.cloud.hdfs.StressHdfsTest.test(StressHdfsTest.java:108)
	at sun.reflect.NativeMethodAccessorImpl.invoke0(Native Method)
	at sun.reflect.NativeMethodAccessorImpl.invoke(NativeMethodAccessorImpl.java:62)
	at sun.reflect.DelegatingMethodAccessorImpl.invoke(DelegatingMethodAccessorImpl.java:43)
	at java.lang.reflect.Method.invoke(Method.java:498)
	at com.carrotsearch.randomizedtesting.RandomizedRunner.invoke(RandomizedRunner.java:1750)
	at com.carrotsearch.randomizedtesting.RandomizedRunner$8.evaluate(RandomizedRunner.java:938)
	at com.carrotsearch.randomizedtesting.RandomizedRunner$9.evaluate(RandomizedRunner.java:974)
	at com.carrotsearch.randomizedtesting.RandomizedRunner$10.evaluate(RandomizedRunner.java:988)
	at org.apache.solr.BaseDistributedSearchTestCase$ShardsRepeatRule$ShardsFixedStatement.callStatement(BaseDistributedSearchTestCase.java:1082)
	at org.apache.solr.BaseDistributedSearchTestCase$ShardsRepeatRule$ShardsStatement.evaluate(BaseDistributedSearchTestCase.java:1054)
	at com.carrotsearch.randomizedtesting.rules.SystemPropertiesRestoreRule$1.evaluate(SystemPropertiesRestoreRule.java:57)
	at org.apache.lucene.util.TestRuleSetupTeardownChained$1.evaluate(TestRuleSetupTeardownChained.java:49)
	at org.apache.lucene.util.AbstractBeforeAfterRule$1.evaluate(AbstractBeforeAfterRule.java:45)
	at org.apache.lucene.util.TestRuleThreadAndTestName$1.evaluate(TestRuleThreadAndTestName.java:48)
	at org.apache.lucene.util.TestRuleIgnoreAfterMaxFailures$1.evaluate(TestRuleIgnoreAfterMaxFailures.java:64)
	at org.apache.lucene.util.TestRuleMarkFailure$1.evaluate(TestRuleMarkFailure.java:47)
	at com.carrotsearch.randomizedtesting.rules.StatementAdapter.evaluate(StatementAdapter.java:36)
	at com.carrotsearch.randomizedtesting.ThreadLeakControl$StatementRunner.run(ThreadLeakControl.java:368)
	at com.carrotsearch.randomizedtesting.ThreadLeakControl.forkTimeoutingTask(ThreadLeakControl.java:817)
	at com.carrotsearch.randomizedtesting.ThreadLeakControl$3.evaluate(ThreadLeakControl.java:468)
	at com.carrotsearch.randomizedtesting.RandomizedRunner.runSingleTest(RandomizedRunner.java:947)
	at com.carrotsearch.randomizedtesting.RandomizedRunner$5.evaluate(RandomizedRunner.java:832)
	at com.carrotsearch.randomizedtesting.RandomizedRunner$6.evaluate(RandomizedRunner.java:883)
	at com.carrotsearch.randomizedtesting.RandomizedRunner$7.evaluate(RandomizedRunner.java:894)
	at com.carrotsearch.randomizedtesting.rules.StatementAdapter.evaluate(StatementAdapter.java:36)
	at com.carrotsearch.randomizedtesting.rules.SystemPropertiesRestoreRule$1.evaluate(SystemPropertiesRestoreRule.java:57)
	at org.apache.lucene.util.AbstractBeforeAfterRule$1.evaluate(AbstractBeforeAfterRule.java:45)
	at com.carrotsearch.randomizedtesting.rules.StatementAdapter.evaluate(StatementAdapter.java:36)
	at org.apache.lucene.util.TestRuleStoreClassName$1.evaluate(TestRuleStoreClassName.java:41)
	at com.carrotsearch.randomizedtesting.rules.NoShadowingOrOverridesOnMethodsRule$1.evaluate(NoShadowingOrOverridesOnMethodsRule.java:40)
	at com.carrotsearch.randomizedtesting.rules.NoShadowingOrOverridesOnMethodsRule$1.evaluate(NoShadowingOrOverridesOnMethodsRule.java:40)
	at com.carrotsearch.randomizedtesting.rules.StatementAdapter.evaluate(StatementAdapter.java:36)
	at com.carrotsearch.randomizedtesting.rules.StatementAdapter.evaluate(StatementAdapter.java:36)
	at com.carrotsearch.randomizedtesting.rules.StatementAdapter.evaluate(StatementAdapter.java:36)
	at org.apache.lucene.util.TestRuleAssertionsRequired$1.evaluate(TestRuleAssertionsRequired.java:53)
	at org.apache.lucene.util.TestRuleMarkFailure$1.evaluate(TestRuleMarkFailure.java:47)
	at org.apache.lucene.util.TestRuleIgnoreAfterMaxFailures$1.evaluate(TestRuleIgnoreAfterMaxFailures.java:64)
	at org.apache.lucene.util.TestRuleIgnoreTestSuites$1.evaluate(TestRuleIgnoreTestSuites.java:54)
	at com.carrotsearch.randomizedtesting.rules.StatementAdapter.evaluate(StatementAdapter.java:36)
	at com.carrotsearch.randomizedtesting.ThreadLeakControl$StatementRunner.run(ThreadLeakControl.java:368)
	at java.lang.Thread.run(Thread.java:748)




Build Log:
[...truncated 14234 lines...]
   [junit4] Suite: org.apache.solr.uninverting.TestDocTermOrdsUninvertLimit
   [junit4]   2> NOTE: download the large Jenkins line-docs file by running 'ant get-jenkins-line-docs' in the lucene directory.
   [junit4]   2> NOTE: test params are: codec=CheapBastard, sim=Asserting(org.apache.lucene.search.similarities.AssertingSimilarity@72fa2fee), locale=ar-TN, timezone=America/Iqaluit
   [junit4]   2> NOTE: Linux 4.4.0-137-generic amd64/Oracle Corporation 1.8.0_191 (64-bit)/cpus=4,threads=1,free=399435824,total=477626368
   [junit4]   2> NOTE: All tests run in this JVM: [OverriddenZkACLAndCredentialsProvidersTest, ConfigSetsAPITest, TestHttpShardHandlerFactory, TestSolrDeletionPolicy2, ChangedSchemaMergeTest, OutputWriterTest, TestStressVersions, TestUseDocValuesAsStored2, SpatialRPTFieldTypeTest, TestConfigSetImmutable, SpellingQueryConverterTest, TestReqParamsAPI, MigrateRouteKeyTest, TestCoreContainer, TestPostingsSolrHighlighter, AlternateDirectoryTest, DocumentAnalysisRequestHandlerTest, TermsComponentTest, CreateRoutedAliasTest, SolrCloudReportersTest, TestBulkSchemaConcurrent, TestSchemaNameResource, BJQParserTest, TestSystemIdResolver, DOMUtilTest, SolrCoreMetricManagerTest, RecoveryZkTest, RandomizedTaggerTest, QueryElevationComponentTest, TestPayloadCheckQParserPlugin, ShardRoutingCustomTest, TestLMJelinekMercerSimilarityFactory, AssignTest, TestCustomStream, TestApiFramework, TestReload, FileUtilsTest, RegexBytesRefFilterTest, TestFuzzyAnalyzedSuggestions, TestFastOutputStream, SuggesterFSTTest, TestSQLHandlerNonCloud, CollectionStateFormat2Test, TestRequestStatusCollectionAPI, TestStressRecovery, TestMergePolicyConfig, DistributedFacetPivotLargeTest, MetricUtilsTest, HdfsDirectoryTest, TestDocumentBuilder, PropertiesRequestHandlerTest, DistributedFacetPivotSmallTest, AssignBackwardCompatibilityTest, DistributedFacetSimpleRefinementLongTailTest, TestTrie, SuggesterWFSTTest, ByteBuffersDirectoryFactoryTest, PeerSyncTest, TestSort, SpellCheckComponentTest, CoreSorterTest, TestBM25SimilarityFactory, SignificantTermsQParserPluginTest, TestSimDistribStateManager, HdfsChaosMonkeyNothingIsSafeTest, HdfsRecoverLeaseTest, TestOrdValues, SolrMetricsIntegrationTest, SolrCoreTest, PrimUtilsTest, TestLegacyNumericUtils, TestManagedSchema, TestConfigSetsAPIExclusivity, TestJsonFacets, BadCopyFieldTest, TestRemoteStreaming, TestCSVLoader, CustomHighlightComponentTest, BasicDistributedZkTest, DocValuesNotIndexedTest, FieldMutatingUpdateProcessorTest, TestExceedMaxTermLength, TestFieldResource, AnalysisErrorHandlingTest, DocValuesMultiTest, TestRTimerTree, TestSolrCloudWithKerberosAlt, RollingRestartTest, TestDeleteCollectionOnDownNodes, TestSolrCoreSnapshots, CollectionsAPIAsyncDistributedZkTest, HdfsUnloadDistributedZkTest, TestLuceneIndexBackCompat, TestRandomRequestDistribution, ShowFileRequestHandlerTest, TestDocTermOrdsUninvertLimit]
   [junit4] ERROR   0.00s J2 | TestDocTermOrdsUninvertLimit (suite) <<<
   [junit4]    > Throwable #1: java.lang.OutOfMemoryError: GC overhead limit exceeded
   [junit4]    > 	at __randomizedtesting.SeedInfo.seed([8FB92E0E34FF0327]:0)
   [junit4]    > 	at java.util.regex.Pattern$BitClass.<init>(Pattern.java:3319)
   [junit4]    > 	at java.util.regex.Pattern.clazz(Pattern.java:2486)
   [junit4]    > 	at java.util.regex.Pattern.sequence(Pattern.java:2065)
   [junit4]    > 	at java.util.regex.Pattern.expr(Pattern.java:1998)
   [junit4]    > 	at java.util.regex.Pattern.compile(Pattern.java:1698)
   [junit4]    > 	at java.util.regex.Pattern.<init>(Pattern.java:1351)
   [junit4]    > 	at java.util.regex.Pattern.compile(Pattern.java:1028)
   [junit4]    > 	at org.apache.lucene.util.RunListenerPrintReproduceInfo.addVmOpt(RunListenerPrintReproduceInfo.java:210)
   [junit4]    > 	at org.apache.lucene.util.RunListenerPrintReproduceInfo.reportAdditionalFailureInfo(RunListenerPrintReproduceInfo.java:162)
   [junit4]    > 	at org.apache.lucene.util.RunListenerPrintReproduceInfo.testFinished(RunListenerPrintReproduceInfo.java:94)
   [junit4]    > 	at com.carrotsearch.ant.tasks.junit4.slave.OrderedRunNotifier$7.notifyListener(OrderedRunNotifier.java:179)
   [junit4]    > 	at com.carrotsearch.ant.tasks.junit4.slave.OrderedRunNotifier$SafeNotifier.run(OrderedRunNotifier.java:63)
   [junit4]    > 	at com.carrotsearch.ant.tasks.junit4.slave.OrderedRunNotifier.fireTestFinished(OrderedRunNotifier.java:181)
   [junit4] Completed [356/840 (1!)] on J2 in 74.27s, 1 test, 1 error <<< FAILURES!

[...truncated 943 lines...]
   [junit4] Suite: org.apache.solr.cloud.hdfs.StressHdfsTest
   [junit4]   2> 3539800 INFO  (SUITE-StressHdfsTest-seed#[8FB92E0E34FF0327]-worker) [    ] o.a.s.SolrTestCaseJ4 SecureRandom sanity checks: test.solr.allowed.securerandom=null & java.security.egd=file:/dev/./urandom
   [junit4]   2> Creating dataDir: /x1/jenkins/jenkins-slave/workspace/Lucene-Solr-NightlyTests-8.x/checkout/solr/build/solr-core/test/J1/temp/solr.cloud.hdfs.StressHdfsTest_8FB92E0E34FF0327-001/init-core-data-001
   [junit4]   2> 3539801 WARN  (SUITE-StressHdfsTest-seed#[8FB92E0E34FF0327]-worker) [    ] o.a.s.SolrTestCaseJ4 startTrackingSearchers: numOpens=31 numCloses=31
   [junit4]   2> 3539801 INFO  (SUITE-StressHdfsTest-seed#[8FB92E0E34FF0327]-worker) [    ] o.a.s.SolrTestCaseJ4 Using TrieFields (NUMERIC_POINTS_SYSPROP=false) w/NUMERIC_DOCVALUES_SYSPROP=true
   [junit4]   2> 3539803 INFO  (SUITE-StressHdfsTest-seed#[8FB92E0E34FF0327]-worker) [    ] o.a.s.SolrTestCaseJ4 Randomized ssl (false) and clientAuth (false) via: @org.apache.solr.SolrTestCaseJ4$SuppressSSL(bugUrl=https://issues.apache.org/jira/browse/SOLR-5776)
   [junit4]   2> 3539803 INFO  (SUITE-StressHdfsTest-seed#[8FB92E0E34FF0327]-worker) [    ] o.a.s.BaseDistributedSearchTestCase Setting hostContext system property: /_c/n
   [junit4]   1> Formatting using clusterid: testClusterID
   [junit4]   2> 3539845 WARN  (SUITE-StressHdfsTest-seed#[8FB92E0E34FF0327]-worker) [    ] o.a.h.m.i.MetricsConfig Cannot locate configuration: tried hadoop-metrics2-namenode.properties,hadoop-metrics2.properties
   [junit4]   2> 3539856 WARN  (SUITE-StressHdfsTest-seed#[8FB92E0E34FF0327]-worker) [    ] o.a.h.h.HttpRequestLog Jetty request log can only be enabled using Log4j
   [junit4]   2> 3539858 INFO  (SUITE-StressHdfsTest-seed#[8FB92E0E34FF0327]-worker) [    ] o.m.log jetty-6.1.26
   [junit4]   2> 3539879 INFO  (SUITE-StressHdfsTest-seed#[8FB92E0E34FF0327]-worker) [    ] o.m.log Extract jar:file:/x1/jenkins/.ivy2/cache/org.apache.hadoop/hadoop-hdfs/tests/hadoop-hdfs-2.7.4-tests.jar!/webapps/hdfs to ./temp/Jetty_localhost_39916_hdfs____.qainoe/webapp
   [junit4]   2> 3540338 INFO  (SUITE-StressHdfsTest-seed#[8FB92E0E34FF0327]-worker) [    ] o.m.log Started HttpServer2$SelectChannelConnectorWithSafeStartup@localhost:39916
   [junit4]   2> 3540411 WARN  (SUITE-StressHdfsTest-seed#[8FB92E0E34FF0327]-worker) [    ] o.a.h.h.HttpRequestLog Jetty request log can only be enabled using Log4j
   [junit4]   2> 3540412 INFO  (SUITE-StressHdfsTest-seed#[8FB92E0E34FF0327]-worker) [    ] o.m.log jetty-6.1.26
   [junit4]   2> 3540433 INFO  (SUITE-StressHdfsTest-seed#[8FB92E0E34FF0327]-worker) [    ] o.m.log Extract jar:file:/x1/jenkins/.ivy2/cache/org.apache.hadoop/hadoop-hdfs/tests/hadoop-hdfs-2.7.4-tests.jar!/webapps/datanode to ./temp/Jetty_localhost_43915_datanode____.xil9ej/webapp
   [junit4]   2> 3540909 INFO  (SUITE-StressHdfsTest-seed#[8FB92E0E34FF0327]-worker) [    ] o.m.log Started HttpServer2$SelectChannelConnectorWithSafeStartup@localhost:43915
   [junit4]   2> 3540941 WARN  (SUITE-StressHdfsTest-seed#[8FB92E0E34FF0327]-worker) [    ] o.a.h.h.HttpRequestLog Jetty request log can only be enabled using Log4j
   [junit4]   2> 3540943 INFO  (SUITE-StressHdfsTest-seed#[8FB92E0E34FF0327]-worker) [    ] o.m.log jetty-6.1.26
   [junit4]   2> 3540969 INFO  (SUITE-StressHdfsTest-seed#[8FB92E0E34FF0327]-worker) [    ] o.m.log Extract jar:file:/x1/jenkins/.ivy2/cache/org.apache.hadoop/hadoop-hdfs/tests/hadoop-hdfs-2.7.4-tests.jar!/webapps/datanode to ./temp/Jetty_localhost_40941_datanode____.duyr33/webapp
   [junit4]   2> 3541007 ERROR (DataNode: [[[DISK]file:/x1/jenkins/jenkins-slave/workspace/Lucene-Solr-NightlyTests-8.x/checkout/solr/build/solr-core/test/J1/temp/solr.cloud.hdfs.StressHdfsTest_8FB92E0E34FF0327-001/tempDir-001/hdfsBaseDir/data/data1/, [DISK]file:/x1/jenkins/jenkins-slave/workspace/Lucene-Solr-NightlyTests-8.x/checkout/solr/build/solr-core/test/J1/temp/solr.cloud.hdfs.StressHdfsTest_8FB92E0E34FF0327-001/tempDir-001/hdfsBaseDir/data/data2/]]  heartbeating to localhost/127.0.0.1:44425) [    ] o.a.h.h.s.d.DirectoryScanner dfs.datanode.directoryscan.throttle.limit.ms.per.sec set to value below 1 ms/sec. Assuming default value of 1000
   [junit4]   2> 3541016 INFO  (Block report processor) [    ] BlockStateChange BLOCK* processReport 0x23e43c45741fad: from storage DS-1c64a229-4cef-4d23-a04f-88b9e531c1c6 node DatanodeRegistration(127.0.0.1:45903, datanodeUuid=076e8fd7-5276-4d81-81d1-85999b3fcb93, infoPort=34124, infoSecurePort=0, ipcPort=37831, storageInfo=lv=-56;cid=testClusterID;nsid=1699427593;c=0), blocks: 0, hasStaleStorage: true, processing time: 0 msecs
   [junit4]   2> 3541016 INFO  (Block report processor) [    ] BlockStateChange BLOCK* processReport 0x23e43c45741fad: from storage DS-f8981639-3919-4d4d-97e1-32e948c602c0 node DatanodeRegistration(127.0.0.1:45903, datanodeUuid=076e8fd7-5276-4d81-81d1-85999b3fcb93, infoPort=34124, infoSecurePort=0, ipcPort=37831, storageInfo=lv=-56;cid=testClusterID;nsid=1699427593;c=0), blocks: 0, hasStaleStorage: false, processing time: 0 msecs
   [junit4]   2> 3541448 INFO  (SUITE-StressHdfsTest-seed#[8FB92E0E34FF0327]-worker) [    ] o.m.log Started HttpServer2$SelectChannelConnectorWithSafeStartup@localhost:40941
   [junit4]   2> 3541534 ERROR (DataNode: [[[DISK]file:/x1/jenkins/jenkins-slave/workspace/Lucene-Solr-NightlyTests-8.x/checkout/solr/build/solr-core/test/J1/temp/solr.cloud.hdfs.StressHdfsTest_8FB92E0E34FF0327-001/tempDir-001/hdfsBaseDir/data/data3/, [DISK]file:/x1/jenkins/jenkins-slave/workspace/Lucene-Solr-NightlyTests-8.x/checkout/solr/build/solr-core/test/J1/temp/solr.cloud.hdfs.StressHdfsTest_8FB92E0E34FF0327-001/tempDir-001/hdfsBaseDir/data/data4/]]  heartbeating to localhost/127.0.0.1:44425) [    ] o.a.h.h.s.d.DirectoryScanner dfs.datanode.directoryscan.throttle.limit.ms.per.sec set to value below 1 ms/sec. Assuming default value of 1000
   [junit4]   2> 3541542 INFO  (Block report processor) [    ] BlockStateChange BLOCK* processReport 0x23e43c64d7c12b: from storage DS-0805cf07-e9c6-44f0-93a8-14f3c250fe8c node DatanodeRegistration(127.0.0.1:41670, datanodeUuid=bb97f7cc-bd24-4d5a-90e2-0a6e457b1a6c, infoPort=42323, infoSecurePort=0, ipcPort=39695, storageInfo=lv=-56;cid=testClusterID;nsid=1699427593;c=0), blocks: 0, hasStaleStorage: true, processing time: 0 msecs
   [junit4]   2> 3541542 INFO  (Block report processor) [    ] BlockStateChange BLOCK* processReport 0x23e43c64d7c12b: from storage DS-1c3246a9-3aa6-4417-bc70-e51a37679e24 node DatanodeRegistration(127.0.0.1:41670, datanodeUuid=bb97f7cc-bd24-4d5a-90e2-0a6e457b1a6c, infoPort=42323, infoSecurePort=0, ipcPort=39695, storageInfo=lv=-56;cid=testClusterID;nsid=1699427593;c=0), blocks: 0, hasStaleStorage: false, processing time: 0 msecs
   [junit4]   2> 3541618 INFO  (TEST-StressHdfsTest.test-seed#[8FB92E0E34FF0327]) [    ] o.a.s.c.ZkTestServer STARTING ZK TEST SERVER
   [junit4]   2> 3541618 INFO  (ZkTestServer Run Thread) [    ] o.a.s.c.ZkTestServer client port:0.0.0.0/0.0.0.0:0
   [junit4]   2> 3541618 INFO  (ZkTestServer Run Thread) [    ] o.a.s.c.ZkTestServer Starting server
   [junit4]   2> 3541718 INFO  (TEST-StressHdfsTest.test-seed#[8FB92E0E34FF0327]) [    ] o.a.s.c.ZkTestServer start zk server on port:35052
   [junit4]   2> 3541718 INFO  (TEST-StressHdfsTest.test-seed#[8FB92E0E34FF0327]) [    ] o.a.s.c.ZkTestServer parse host and port list: 127.0.0.1:35052
   [junit4]   2> 3541718 INFO  (TEST-StressHdfsTest.test-seed#[8FB92E0E34FF0327]) [    ] o.a.s.c.ZkTestServer connecting to 127.0.0.1 35052
   [junit4]   2> 3541723 INFO  (zkConnectionManagerCallback-72886-thread-1) [    ] o.a.s.c.c.ConnectionManager zkClient has connected
   [junit4]   2> 3541726 INFO  (zkConnectionManagerCallback-72888-thread-1) [    ] o.a.s.c.c.ConnectionManager zkClient has connected
   [junit4]   2> 3541727 INFO  (TEST-StressHdfsTest.test-seed#[8FB92E0E34FF0327]) [    ] o.a.s.c.ZkTestServer put /x1/jenkins/jenkins-slave/workspace/Lucene-Solr-NightlyTests-8.x/checkout/solr/core/src/test-files/solr/collection1/conf/solrconfig-tlog.xml to /configs/conf1/solrconfig.xml
   [junit4]   2> 3541728 INFO  (TEST-StressHdfsTest.test-seed#[8FB92E0E34FF0327]) [    ] o.a.s.c.ZkTestServer put /x1/jenkins/jenkins-slave/workspace/Lucene-Solr-NightlyTests-8.x/checkout/solr/core/src/test-files/solr/collection1/conf/schema.xml to /configs/conf1/schema.xml
   [junit4]   2> 3541730 INFO  (TEST-StressHdfsTest.test-seed#[8FB92E0E34FF0327]) [    ] o.a.s.c.ZkTestServer put /x1/jenkins/jenkins-slave/workspace/Lucene-Solr-NightlyTests-8.x/checkout/solr/core/src/test-files/solr/collection1/conf/solrconfig.snippet.randomindexconfig.xml to /configs/conf1/solrconfig.snippet.randomindexconfig.xml
   [junit4]   2> 3541731 INFO  (TEST-StressHdfsTest.test-seed#[8FB92E0E34FF0327]) [    ] o.a.s.c.ZkTestServer put /x1/jenkins/jenkins-slave/workspace/Lucene-Solr-NightlyTests-8.x/checkout/solr/core/src/test-files/solr/collection1/conf/stopwords.txt to /configs/conf1/stopwords.txt
   [junit4]   2> 3541732 INFO  (TEST-StressHdfsTest.test-seed#[8FB92E0E34FF0327]) [    ] o.a.s.c.ZkTestServer put /x1/jenkins/jenkins-slave/workspace/Lucene-Solr-NightlyTests-8.x/checkout/solr/core/src/test-files/solr/collection1/conf/protwords.txt to /configs/conf1/protwords.txt
   [junit4]   2> 3541733 INFO  (TEST-StressHdfsTest.test-seed#[8FB92E0E34FF0327]) [    ] o.a.s.c.ZkTestServer put /x1/jenkins/jenkins-slave/workspace/Lucene-Solr-NightlyTests-8.x/checkout/solr/core/src/test-files/solr/collection1/conf/currency.xml to /configs/conf1/currency.xml
   [junit4]   2> 3541735 INFO  (TEST-StressHdfsTest.test-seed#[8FB92E0E34FF0327]) [    ] o.a.s.c.ZkTestServer put /x1/jenkins/jenkins-slave/workspace/Lucene-Solr-NightlyTests-8.x/checkout/solr/core/src/test-files/solr/collection1/conf/enumsConfig.xml to /configs/conf1/enumsConfig.xml
   [junit4]   2> 3541736 INFO  (TEST-StressHdfsTest.test-seed#[8FB92E0E34FF0327]) [    ] o.a.s.c.ZkTestServer put /x1/jenkins/jenkins-slave/workspace/Lucene-Solr-NightlyTests-8.x/checkout/solr/core/src/test-files/solr/collection1/conf/open-exchange-rates.json to /configs/conf1/open-exchange-rates.json
   [junit4]   2> 3541737 INFO  (TEST-StressHdfsTest.test-seed#[8FB92E0E34FF0327]) [    ] o.a.s.c.ZkTestServer put /x1/jenkins/jenkins-slave/workspace/Lucene-Solr-NightlyTests-8.x/checkout/solr/core/src/test-files/solr/collection1/conf/mapping-ISOLatin1Accent.txt to /configs/conf1/mapping-ISOLatin1Accent.txt
   [junit4]   2> 3541738 INFO  (TEST-StressHdfsTest.test-seed#[8FB92E0E34FF0327]) [    ] o.a.s.c.ZkTestServer put /x1/jenkins/jenkins-slave/workspace/Lucene-Solr-NightlyTests-8.x/checkout/solr/core/src/test-files/solr/collection1/conf/old_synonyms.txt to /configs/conf1/old_synonyms.txt
   [junit4]   2> 3541739 INFO  (TEST-StressHdfsTest.test-seed#[8FB92E0E34FF0327]) [    ] o.a.s.c.ZkTestServer put /x1/jenkins/jenkins-slave/workspace/Lucene-Solr-NightlyTests-8.x/checkout/solr/core/src/test-files/solr/collection1/conf/synonyms.txt to /configs/conf1/synonyms.txt
   [junit4]   2> 3541740 INFO  (TEST-StressHdfsTest.test-seed#[8FB92E0E34FF0327]) [    ] o.a.s.c.AbstractFullDistribZkTestBase Will use NRT replicas unless explicitly asked otherwise
   [junit4]   2> 3541913 WARN  (TEST-StressHdfsTest.test-seed#[8FB92E0E34FF0327]) [    ] o.e.j.s.AbstractConnector Ignoring deprecated socket close linger time
   [junit4]   2> 3541913 INFO  (TEST-StressHdfsTest.test-seed#[8FB92E0E34FF0327]) [    ] o.a.s.c.s.e.JettySolrRunner Start Jetty (original configured port=0)
   [junit4]   2> 3541913 INFO  (TEST-StressHdfsTest.test-seed#[8FB92E0E34FF0327]) [    ] o.a.s.c.s.e.JettySolrRunner Trying to start Jetty on port 0 try number 1 ...
   [junit4]   2> 3541913 INFO  (TEST-StressHdfsTest.test-seed#[8FB92E0E34FF0327]) [    ] o.e.j.s.Server jetty-9.4.14.v20181114; built: 2018-11-14T21:20:31.478Z; git: c4550056e785fb5665914545889f21dc136ad9e6; jvm 1.8.0_191-b12
   [junit4]   2> 3541917 INFO  (TEST-StressHdfsTest.test-seed#[8FB92E0E34FF0327]) [    ] o.e.j.s.session DefaultSessionIdManager workerName=node0
   [junit4]   2> 3541917 INFO  (TEST-StressHdfsTest.test-seed#[8FB92E0E34FF0327]) [    ] o.e.j.s.session No SessionScavenger set, using defaults
   [junit4]   2> 3541917 INFO  (TEST-StressHdfsTest.test-seed#[8FB92E0E34FF0327]) [    ] o.e.j.s.session node0 Scavenging every 660000ms
   [junit4]   2> 3541920 INFO  (TEST-StressHdfsTest.test-seed#[8FB92E0E34FF0327]) [    ] o.e.j.s.h.ContextHandler Started o.e.j.s.ServletContextHandler@6e42e62{/_c/n,null,AVAILABLE}
   [junit4]   2> 3541920 INFO  (TEST-StressHdfsTest.test-seed#[8FB92E0E34FF0327]) [    ] o.e.j.s.AbstractConnector Started ServerConnector@3013fda0{HTTP/1.1,[http/1.1, h2c]}{127.0.0.1:39502}
   [junit4]   2> 3541920 INFO  (TEST-StressHdfsTest.test-seed#[8FB92E0E34FF0327]) [    ] o.e.j.s.Server Started @3542031ms
   [junit4]   2> 3541920 INFO  (TEST-StressHdfsTest.test-seed#[8FB92E0E34FF0327]) [    ] o.a.s.c.s.e.JettySolrRunner Jetty properties: {solr.data.dir=hdfs://localhost:44425/hdfs__localhost_44425__x1_jenkins_jenkins-slave_workspace_Lucene-Solr-NightlyTests-8.x_checkout_solr_build_solr-core_test_J1_temp_solr.cloud.hdfs.StressHdfsTest_8FB92E0E34FF0327-001_tempDir-002_control_data, replicaType=NRT, hostContext=/_c/n, hostPort=39502, coreRootDirectory=/x1/jenkins/jenkins-slave/workspace/Lucene-Solr-NightlyTests-8.x/checkout/solr/build/solr-core/test/J1/../../../../../../../../../../../x1/jenkins/jenkins-slave/workspace/Lucene-Solr-NightlyTests-8.x/checkout/solr/build/solr-core/test/J1/temp/solr.cloud.hdfs.StressHdfsTest_8FB92E0E34FF0327-001/control-001/cores}
   [junit4]   2> 3541921 ERROR (TEST-StressHdfsTest.test-seed#[8FB92E0E34FF0327]) [    ] o.a.s.u.StartupLoggingUtils Missing Java Option solr.log.dir. Logging may be missing or incomplete.
   [junit4]   2> 3541921 INFO  (TEST-StressHdfsTest.test-seed#[8FB92E0E34FF0327]) [    ] o.a.s.s.SolrDispatchFilter Using logger factory org.apache.logging.slf4j.Log4jLoggerFactory
   [junit4]   2> 3541921 INFO  (TEST-StressHdfsTest.test-seed#[8FB92E0E34FF0327]) [    ] o.a.s.s.SolrDispatchFilter  ___      _       Welcome to Apache Solr? version 8.0.0
   [junit4]   2> 3541921 INFO  (TEST-StressHdfsTest.test-seed#[8FB92E0E34FF0327]) [    ] o.a.s.s.SolrDispatchFilter / __| ___| |_ _   Starting in cloud mode on port null
   [junit4]   2> 3541921 INFO  (TEST-StressHdfsTest.test-seed#[8FB92E0E34FF0327]) [    ] o.a.s.s.SolrDispatchFilter \__ \/ _ \ | '_|  Install dir: null
   [junit4]   2> 3541921 INFO  (TEST-StressHdfsTest.test-seed#[8FB92E0E34FF0327]) [    ] o.a.s.s.SolrDispatchFilter |___/\___/_|_|    Start time: 2019-01-31T20:50:10.754Z
   [junit4]   2> 3541925 INFO  (zkConnectionManagerCallback-72890-thread-1) [    ] o.a.s.c.c.ConnectionManager zkClient has connected
   [junit4]   2> 3541926 INFO  (TEST-StressHdfsTest.test-seed#[8FB92E0E34FF0327]) [    ] o.a.s.s.SolrDispatchFilter Loading solr.xml from SolrHome (not found in ZooKeeper)
   [junit4]   2> 3541926 INFO  (TEST-StressHdfsTest.test-seed#[8FB92E0E34FF0327]) [    ] o.a.s.c.SolrXmlConfig Loading container configuration from /x1/jenkins/jenkins-slave/workspace/Lucene-Solr-NightlyTests-8.x/checkout/solr/build/solr-core/test/J1/temp/solr.cloud.hdfs.StressHdfsTest_8FB92E0E34FF0327-001/control-001/solr.xml
   [junit4]   2> 3541934 INFO  (TEST-StressHdfsTest.test-seed#[8FB92E0E34FF0327]) [    ] o.a.s.c.SolrXmlConfig Configuration parameter autoReplicaFailoverWorkLoopDelay is ignored
   [junit4]   2> 3541934 INFO  (TEST-StressHdfsTest.test-seed#[8FB92E0E34FF0327]) [    ] o.a.s.c.SolrXmlConfig Configuration parameter autoReplicaFailoverBadNodeExpiration is ignored
   [junit4]   2> 3541937 INFO  (TEST-StressHdfsTest.test-seed#[8FB92E0E34FF0327]) [    ] o.a.s.c.SolrXmlConfig MBean server found: com.sun.jmx.mbeanserver.JmxMBeanServer@30d2035f, but no JMX reporters were configured - adding default JMX reporter.
   [junit4]   2> 3542016 INFO  (TEST-StressHdfsTest.test-seed#[8FB92E0E34FF0327]) [    ] o.a.s.h.c.HttpShardHandlerFactory Host whitelist initialized: WhitelistHostChecker [whitelistHosts=null, whitelistHostCheckingEnabled=false]
   [junit4]   2> 3542018 WARN  (TEST-StressHdfsTest.test-seed#[8FB92E0E34FF0327]) [    ] o.e.j.u.s.S.config No Client EndPointIdentificationAlgorithm configured for SslContextFactory@3b6d55eb[provider=null,keyStore=null,trustStore=null]
   [junit4]   2> 3542023 WARN  (TEST-StressHdfsTest.test-seed#[8FB92E0E34FF0327]) [    ] o.e.j.u.s.S.config No Client EndPointIdentificationAlgorithm configured for SslContextFactory@4e987499[provider=null,keyStore=null,trustStore=null]
   [junit4]   2> 3542025 INFO  (TEST-StressHdfsTest.test-seed#[8FB92E0E34FF0327]) [    ] o.a.s.c.ZkContainer Zookeeper client=127.0.0.1:35052/solr
   [junit4]   2> 3542026 INFO  (zkConnectionManagerCallback-72896-thread-1) [    ] o.a.s.c.c.ConnectionManager zkClient has connected
   [junit4]   2> 3542029 INFO  (zkConnectionManagerCallback-72898-thread-1) [    ] o.a.s.c.c.ConnectionManager zkClient has connected
   [junit4]   2> 3542122 INFO  (TEST-StressHdfsTest.test-seed#[8FB92E0E34FF0327]) [n:127.0.0.1:39502__c%2Fn    ] o.a.s.c.OverseerElectionContext I am going to be the leader 127.0.0.1:39502__c%2Fn
   [junit4]   2> 3542123 INFO  (TEST-StressHdfsTest.test-seed#[8FB92E0E34FF0327]) [n:127.0.0.1:39502__c%2Fn    ] o.a.s.c.Overseer Overseer (id=72719676216442884-127.0.0.1:39502__c%2Fn-n_0000000000) starting
   [junit4]   2> 3542144 INFO  (zkConnectionManagerCallback-72905-thread-1) [    ] o.a.s.c.c.ConnectionManager zkClient has connected
   [junit4]   2> 3542146 INFO  (TEST-StressHdfsTest.test-seed#[8FB92E0E34FF0327]) [n:127.0.0.1:39502__c%2Fn    ] o.a.s.c.s.i.ZkClientClusterStateProvider Cluster at 127.0.0.1:35052/solr ready
   [junit4]   2> 3542148 INFO  (TEST-StressHdfsTest.test-seed#[8FB92E0E34FF0327]) [n:127.0.0.1:39502__c%2Fn    ] o.a.s.c.ZkController Register node as live in ZooKeeper:/live_nodes/127.0.0.1:39502__c%2Fn
   [junit4]   2> 3542150 INFO  (zkCallback-72897-thread-1) [    ] o.a.s.c.c.ZkStateReader Updated live nodes from ZooKeeper... (0) -> (1)
   [junit4]   2> 3542150 INFO  (OverseerStateUpdate-72719676216442884-127.0.0.1:39502__c%2Fn-n_0000000000) [n:127.0.0.1:39502__c%2Fn    ] o.a.s.c.Overseer Starting to work on the main queue : 127.0.0.1:39502__c%2Fn
   [junit4]   2> 3542151 INFO  (zkCallback-72904-thread-1) [    ] o.a.s.c.c.ZkStateReader Updated live nodes from ZooKeeper... (0) -> (1)
   [junit4]   2> 3542185 INFO  (TEST-StressHdfsTest.test-seed#[8FB92E0E34FF0327]) [n:127.0.0.1:39502__c%2Fn    ] o.a.s.h.a.MetricsHistoryHandler No .system collection, keeping metrics history in memory.
   [junit4]   2> 3542260 INFO  (TEST-StressHdfsTest.test-seed#[8FB92E0E34FF0327]) [n:127.0.0.1:39502__c%2Fn    ] o.a.s.m.r.SolrJmxReporter JMX monitoring for 'solr.node' (registry 'solr.node') enabled at server: com.sun.jmx.mbeanserver.JmxMBeanServer@30d2035f
   [junit4]   2> 3542279 INFO  (TEST-StressHdfsTest.test-seed#[8FB92E0E34FF0327]) [n:127.0.0.1:39502__c%2Fn    ] o.a.s.m.r.SolrJmxReporter JMX monitoring for 'solr.jvm' (registry 'solr.jvm') enabled at server: com.sun.jmx.mbeanserver.JmxMBeanServer@30d2035f
   [junit4]   2> 3542279 INFO  (TEST-StressHdfsTest.test-seed#[8FB92E0E34FF0327]) [n:127.0.0.1:39502__c%2Fn    ] o.a.s.m.r.SolrJmxReporter JMX monitoring for 'solr.jetty' (registry 'solr.jetty') enabled at server: com.sun.jmx.mbeanserver.JmxMBeanServer@30d2035f
   [junit4]   2> 3542281 INFO  (TEST-StressHdfsTest.test-seed#[8FB92E0E34FF0327]) [n:127.0.0.1:39502__c%2Fn    ] o.a.s.c.CorePropertiesLocator Found 0 core definitions underneath /x1/jenkins/jenkins-slave/workspace/Lucene-Solr-NightlyTests-8.x/checkout/solr/build/solr-core/test/J1/../../../../../../../../../../../x1/jenkins/jenkins-slave/workspace/Lucene-Solr-NightlyTests-8.x/checkout/solr/build/solr-core/test/J1/temp/solr.cloud.hdfs.StressHdfsTest_8FB92E0E34FF0327-001/control-001/cores
   [junit4]   2> 3542323 INFO  (zkConnectionManagerCallback-72911-thread-1) [    ] o.a.s.c.c.ConnectionManager zkClient has connected
   [junit4]   2> 3542325 INFO  (TEST-StressHdfsTest.test-seed#[8FB92E0E34FF0327]) [    ] o.a.s.c.c.ZkStateReader Updated live nodes from ZooKeeper... (0) -> (1)
   [junit4]   2> 3542326 INFO  (TEST-StressHdfsTest.test-seed#[8FB92E0E34FF0327]) [    ] o.a.s.c.s.i.ZkClientClusterStateProvider Cluster at 127.0.0.1:35052/solr ready
   [junit4]   2> 3542327 INFO  (qtp1874222727-200743) [n:127.0.0.1:39502__c%2Fn    ] o.a.s.h.a.CollectionsHandler Invoked Collection Action :create with params collection.configName=conf1&name=control_collection&nrtReplicas=1&action=CREATE&numShards=1&createNodeSet=127.0.0.1:39502__c%252Fn&wt=javabin&version=2 and sendToOCPQueue=true
   [junit4]   2> 3542331 INFO  (OverseerThreadFactory-15010-thread-1-processing-n:127.0.0.1:39502__c%2Fn) [n:127.0.0.1:39502__c%2Fn    ] o.a.s.c.a.c.CreateCollectionCmd Create collection control_collection
   [junit4]   2> 3542438 INFO  (qtp1874222727-200745) [n:127.0.0.1:39502__c%2Fn    ] o.a.s.s.HttpSolrCall [admin] webapp=null path=/admin/metrics params={prefix=CONTAINER.fs.usableSpace,CONTAINER.fs.totalSpace,CORE.coreName&wt=javabin&version=2&group=solr.node,solr.core} status=0 QTime=0
   [junit4]   2> 3542439 INFO  (qtp1874222727-200746) [n:127.0.0.1:39502__c%2Fn    ] o.a.s.s.HttpSolrCall [admin] webapp=null path=/admin/metrics params={prefix=CONTAINER.fs.usableSpace,CONTAINER.fs.totalSpace,CORE.coreName&wt=javabin&version=2&group=solr.node,solr.core} status=0 QTime=0
   [junit4]   2> 3542440 INFO  (qtp1874222727-200742) [n:127.0.0.1:39502__c%2Fn    ] o.a.s.s.HttpSolrCall [admin] webapp=null path=/admin/metrics params={prefix=CONTAINER.fs.usableSpace,CONTAINER.fs.totalSpace,CORE.coreName&wt=javabin&version=2&group=solr.node,solr.core} status=0 QTime=0
   [junit4]   2> 3542440 INFO  (qtp1874222727-200744) [n:127.0.0.1:39502__c%2Fn    ] o.a.s.s.HttpSolrCall [admin] webapp=null path=/admin/metrics params={prefix=CONTAINER.fs.usableSpace,CONTAINER.fs.totalSpace,CORE.coreName&wt=javabin&version=2&group=solr.node,solr.core} status=0 QTime=0
   [junit4]   2> 3542441 INFO  (qtp1874222727-200745) [n:127.0.0.1:39502__c%2Fn    ] o.a.s.s.HttpSolrCall [admin] webapp=null path=/admin/metrics params={prefix=CONTAINER.fs.usableSpace,CONTAINER.fs.totalSpace,CORE.coreName&wt=javabin&version=2&group=solr.node,solr.core} status=0 QTime=0
   [junit4]   2> 3542446 INFO  (qtp1874222727-200746) [n:127.0.0.1:39502__c%2Fn    x:control_collection_shard1_replica_n1] o.a.s.h.a.CoreAdminOperation core create command qt=/admin/cores&collection.configName=conf1&newCollection=true&name=control_collection_shard1_replica_n1&action=CREATE&numShards=1&collection=control_collection&shard=shard1&wt=javabin&version=2&replicaType=NRT
   [junit4]   2> 3542447 INFO  (qtp1874222727-200746) [n:127.0.0.1:39502__c%2Fn    x:control_collection_shard1_replica_n1] o.a.s.c.TransientSolrCoreCacheDefault Allocating transient cache for 4 transient cores
   [junit4]   2> 3543467 INFO  (qtp1874222727-200746) [n:127.0.0.1:39502__c%2Fn c:control_collection s:shard1  x:control_collection_shard1_replica_n1] o.a.s.c.SolrConfig Using Lucene MatchVersion: 8.0.0
   [junit4]   2> 3543484 INFO  (qtp1874222727-200746) [n:127.0.0.1:39502__c%2Fn c:control_collection s:shard1  x:control_collection_shard1_replica_n1] o.a.s.s.IndexSchema [control_collection_shard1_replica_n1] Schema name=test
   [junit4]   2> 3543633 INFO  (qtp1874222727-200746) [n:127.0.0.1:39502__c%2Fn c:control_collection s:shard1  x:control_collection_shard1_replica_n1] o.a.s.s.IndexSchema Loaded schema test/1.0 with uniqueid field id
   [junit4]   2> 3543652 INFO  (qtp1874222727-200746) [n:127.0.0.1:39502__c%2Fn c:control_collection s:shard1  x:control_collection_shard1_replica_n1] o.a.s.c.CoreContainer Creating SolrCore 'control_collection_shard1_replica_n1' using configuration from collection control_collection, trusted=true
   [junit4]   2> 3543652 INFO  (qtp1874222727-200746) [n:127.0.0.1:39502__c%2Fn c:control_collection s:shard1  x:control_collection_shard1_replica_n1] o.a.s.m.r.SolrJmxReporter JMX monitoring for 'solr.core.control_collection.shard1.replica_n1' (registry 'solr.core.control_collection.shard1.replica_n1') enabled at server: com.sun.jmx.mbeanserver.JmxMBeanServer@30d2035f
   [junit4]   2> 3543653 INFO  (qtp1874222727-200746) [n:127.0.0.1:39502__c%2Fn c:control_collection s:shard1  x:control_collection_shard1_replica_n1] o.a.s.c.HdfsDirectoryFactory solr.hdfs.home=hdfs://localhost:44425/solr_hdfs_home
   [junit4]   2> 3543653 INFO  (qtp1874222727-200746) [n:127.0.0.1:39502__c%2Fn c:control_collection s:shard1  x:control_collection_shard1_replica_n1] o.a.s.c.HdfsDirectoryFactory Solr Kerberos Authentication disabled
   [junit4]   2> 3543653 INFO  (qtp1874222727-200746) [n:127.0.0.1:39502__c%2Fn c:control_collection s:shard1  x:control_collection_shard1_replica_n1] o.a.s.c.SolrCore [[control_collection_shard1_replica_n1] ] Opening new SolrCore at [/x1/jenkins/jenkins-slave/workspace/Lucene-Solr-NightlyTests-8.x/checkout/solr/build/solr-core/test/J1/temp/solr.cloud.hdfs.StressHdfsTest_8FB92E0E34FF0327-001/control-001/cores/control_collection_shard1_replica_n1], dataDir=[hdfs://localhost:44425/solr_hdfs_home/control_collection/core_node2/data/]
   [junit4]   2> 3543654 INFO  (qtp1874222727-200746) [n:127.0.0.1:39502__c%2Fn c:control_collection s:shard1  x:control_collection_shard1_replica_n1] o.a.s.c.HdfsDirectoryFactory creating directory factory for path hdfs://localhost:44425/solr_hdfs_home/control_collection/core_node2/data/snapshot_metadata
   [junit4]   2> 3543664 INFO  (qtp1874222727-200746) [n:127.0.0.1:39502__c%2Fn c:control_collection s:shard1  x:control_collection_shard1_replica_n1] o.a.s.c.HdfsDirectoryFactory Number of slabs of block cache [1] with direct memory allocation set to [true]
   [junit4]   2> 3543664 INFO  (qtp1874222727-200746) [n:127.0.0.1:39502__c%2Fn c:control_collection s:shard1  x:control_collection_shard1_replica_n1] o.a.s.c.HdfsDirectoryFactory Block cache target memory usage, slab size of [8388608] will allocate [1] slabs and use ~[8388608] bytes
   [junit4]   2> 3543664 INFO  (qtp1874222727-200746) [n:127.0.0.1:39502__c%2Fn c:control_collection s:shard1  x:control_collection_shard1_replica_n1] o.a.s.c.HdfsDirectoryFactory Creating new single instance HDFS BlockCache
   [junit4]   2> 3543673 INFO  (qtp1874222727-200746) [n:127.0.0.1:39502__c%2Fn c:control_collection s:shard1  x:control_collection_shard1_replica_n1] o.a.s.s.b.BlockDirectory Block cache on write is disabled
   [junit4]   2> 3543674 INFO  (qtp1874222727-200746) [n:127.0.0.1:39502__c%2Fn c:control_collection s:shard1  x:control_collection_shard1_replica_n1] o.a.s.c.HdfsDirectoryFactory creating directory factory for path hdfs://localhost:44425/solr_hdfs_home/control_collection/core_node2/data
   [junit4]   2> 3543692 INFO  (qtp1874222727-200746) [n:127.0.0.1:39502__c%2Fn c:control_collection s:shard1  x:control_collection_shard1_replica_n1] o.a.s.c.HdfsDirectoryFactory creating directory factory for path hdfs://localhost:44425/solr_hdfs_home/control_collection/core_node2/data/index
   [junit4]   2> 3543699 INFO  (qtp1874222727-200746) [n:127.0.0.1:39502__c%2Fn c:control_collection s:shard1  x:control_collection_shard1_replica_n1] o.a.s.c.HdfsDirectoryFactory Number of slabs of block cache [1] with direct memory allocation set to [true]
   [junit4]   2> 3543700 INFO  (qtp1874222727-200746) [n:127.0.0.1:39502__c%2Fn c:control_collection s:shard1  x:control_collection_shard1_replica_n1] o.a.s.c.HdfsDirectoryFactory Block cache target memory usage, slab size of [8388608] will allocate [1] slabs and use ~[8388608] bytes
   [junit4]   2> 3543700 INFO  (qtp1874222727-200746) [n:127.0.0.1:39502__c%2Fn c:control_collection s:shard1  x:control_collection_shard1_replica_n1] o.a.s.c.HdfsDirectoryFactory Creating new single instance HDFS BlockCache
   [junit4]   2> 3543709 INFO  (qtp1874222727-200746) [n:127.0.0.1:39502__c%2Fn c:control_collection s:shard1  x:control_collection_shard1_replica_n1] o.a.s.s.b.BlockDirectory Block cache on write is disabled
   [junit4]   2> 3543709 INFO  (qtp1874222727-200746) [n:127.0.0.1:39502__c%2Fn c:control_collection s:shard1  x:control_collection_shard1_replica_n1] o.a.s.u.RandomMergePolicy RandomMergePolicy wrapping class org.apache.lucene.index.MockRandomMergePolicy: org.apache.lucene.index.MockRandomMergePolicy@74a8c50e
   [junit4]   2> 3543722 INFO  (Block report processor) [    ] BlockStateChange BLOCK* addStoredBlock: blockMap updated: 127.0.0.1:45903 is added to blk_1073741825_1001{UCState=UNDER_CONSTRUCTION, truncateBlock=null, primaryNodeIndex=-1, replicas=[ReplicaUC[[DISK]DS-0805cf07-e9c6-44f0-93a8-14f3c250fe8c:NORMAL:127.0.0.1:41670|RBW], ReplicaUC[[DISK]DS-1c64a229-4cef-4d23-a04f-88b9e531c1c6:NORMAL:127.0.0.1:45903|FINALIZED]]} size 0
   [junit4]   2> 3543723 INFO  (Block report processor) [    ] BlockStateChange BLOCK* addStoredBlock: blockMap updated: 127.0.0.1:41670 is added to blk_1073741825_1001{UCState=UNDER_CONSTRUCTION, truncateBlock=null, primaryNodeIndex=-1, replicas=[ReplicaUC[[DISK]DS-1c64a229-4cef-4d23-a04f-88b9e531c1c6:NORMAL:127.0.0.1:45903|FINALIZED], ReplicaUC[[DISK]DS-1c3246a9-3aa6-4417-bc70-e51a37679e24:NORMAL:127.0.0.1:41670|FINALIZED]]} size 0
   [junit4]   2> 3543727 WARN  (qtp1874222727-200746) [n:127.0.0.1:39502__c%2Fn c:control_collection s:shard1  x:control_collection_shard1_replica_n1] o.a.s.c.RequestHandlers INVALID paramSet a in requestHandler {type = requestHandler,name = /dump,class = DumpRequestHandler,attributes = {initParams=a, name=/dump, class=DumpRequestHandler},args = {defaults={a=A,b=B}}}
   [junit4]   2> 3543790 INFO  (qtp1874222727-200746) [n:127.0.0.1:39502__c%2Fn c:control_collection s:shard1  x:control_collection_shard1_replica_n1] o.a.s.u.UpdateHandler Using UpdateLog implementation: org.apache.solr.update.HdfsUpdateLog
   [junit4]   2> 3543790 INFO  (qtp1874222727-200746) [n:127.0.0.1:39502__c%2Fn c:control_collection s:shard1  x:control_collection_shard1_replica_n1] o.a.s.u.UpdateLog Initializing UpdateLog: dataDir= defaultSyncLevel=FLUSH numRecordsToKeep=100 maxNumLogsToKeep=10 numVersionBuckets=65536
   [junit4]   2> 3543790 INFO  (qtp1874222727-200746) [n:127.0.0.1:39502__c%2Fn c:control_collection s:shard1  x:control_collection_shard1_replica_n1] o.a.s.u.HdfsUpdateLog Initializing HdfsUpdateLog: tlogDfsReplication=2
   [junit4]   2> 3543804 INFO  (qtp1874222727-200746) [n:127.0.0.1:39502__c%2Fn c:control_collection s:shard1  x:control_collection_shard1_replica_n1] o.a.s.u.CommitTracker Hard AutoCommit: disabled
   [junit4]   2> 3543804 INFO  (qtp1874222727-200746) [n:127.0.0.1:39502__c%2Fn c:control_collection s:shard1  x:control_collection_shard1_replica_n1] o.a.s.u.CommitTracker Soft AutoCommit: disabled
   [junit4]   2> 3543806 INFO  (qtp1874222727-200746) [n:127.0.0.1:39502__c%2Fn c:control_collection s:shard1  x:control_collection_shard1_replica_n1] o.a.s.u.RandomMergePolicy RandomMergePolicy wrapping class org.apache.lucene.index.MockRandomMergePolicy: org.apache.lucene.index.MockRandomMergePolicy@74ff97dd
   [junit4]   2> 3543833 INFO  (qtp1874222727-200746) [n:127.0.0.1:39502__c%2Fn c:control_collection s:shard1  x:control_collection_shard1_replica_n1] o.a.s.s.SolrIndexSearcher Opening [Searcher@1f30ea55[control_collection_shard1_replica_n1] main]
   [junit4]   2> 3543835 INFO  (qtp1874222727-200746) [n:127.0.0.1:39502__c%2Fn c:control_collection s:shard1  x:control_collection_shard1_replica_n1] o.a.s.r.ManagedResourceStorage Configured ZooKeeperStorageIO with znodeBase: /configs/conf1
   [junit4]   2> 3543835 INFO  (qtp1874222727-200746) [n:127.0.0.1:39502__c%2Fn c:control_collection s:shard1  x:control_collection_shard1_replica_n1] o.a.s.r.ManagedResourceStorage Loaded null at path _rest_managed.json using ZooKeeperStorageIO:path=/configs/conf1
   [junit4]   2> 3543836 INFO  (qtp1874222727-200746) [n:127.0.0.1:39502__c%2Fn c:control_collection s:shard1  x:control_collection_shard1_replica_n1] o.a.s.h.ReplicationHandler Commits will be reserved for 10000ms.
   [junit4]   2> 3543836 INFO  (qtp1874222727-200746) [n:127.0.0.1:39502__c%2Fn c:control_collection s:shard1  x:control_collection_shard1_replica_n1] o.a.s.u.UpdateLog Could not find max version in index or recent updates, using new clock 1624210473137209344
   [junit4]   2> 3543840 INFO  (searcherExecutor-15015-thread-1-processing-n:127.0.0.1:39502__c%2Fn x:control_collection_shard1_replica_n1 c:control_collection s:shard1) [n:127.0.0.1:39502__c%2Fn c:control_collection s:shard1  x:control_collection_shard1_replica_n1] o.a.s.c.SolrCore [control_collection_shard1_replica_n1] Registered new searcher Searcher@1f30ea55[control_collection_shard1_replica_n1] main{ExitableDirectoryReader(UninvertingDirectoryReader())}
   [junit4]   2> 3543842 INFO  (qtp1874222727-200746) [n:127.0.0.1:39502__c%2Fn c:control_collection s:shard1  x:control_collection_shard1_replica_n1] o.a.s.c.ZkShardTerms Successful update of terms at /collections/control_collection/terms/shard1 to Terms{values={core_node2=0}, version=0}
   [junit4]   2> 3543842 INFO  (qtp1874222727-200746) [n:127.0.0.1:39502__c%2Fn c:control_collection s:shard1  x:control_collection_shard1_replica_n1] o.a.s.c.ShardLeaderElectionContextBase make sure parent is created /collections/control_collection/leaders/shard1
   [junit4]   2> 3543846 INFO  (qtp1874222727-200746) [n:127.0.0.1:39502__c%2Fn c:control_collection s:shard1  x:control_collection_shard1_replica_n1] o.a.s.c.ShardLeaderElectionContext Enough replicas found to continue.
   [junit4]   2> 3543846 INFO  (qtp1874222727-200746) [n:127.0.0.1:39502__c%2Fn c:control_collection s:shard1  x:control_collection_shard1_replica_n1] o.a.s.c.ShardLeaderElectionContext I may be the new leader - try and sync
   [junit4]   2> 3543846 INFO  (qtp1874222727-200746) [n:127.0.0.1:39502__c%2Fn c:control_collection s:shard1  x:control_collection_shard1_replica_n1] o.a.s.c.SyncStrategy Sync replicas to http://127.0.0.1:39502/_c/n/control_collection_shard1_replica_n1/
   [junit4]   2> 3543846 INFO  (qtp1874222727-200746) [n:127.0.0.1:39502__c%2Fn c:control_collection s:shard1  x:control_collection_shard1_replica_n1] o.a.s.c.SyncStrategy Sync Success - now sync replicas to me
   [junit4]   2> 3543847 INFO  (qtp1874222727-200746) [n:127.0.0.1:39502__c%2Fn c:control_collection s:shard1  x:control_collection_shard1_replica_n1] o.a.s.c.SyncStrategy http://127.0.0.1:39502/_c/n/control_collection_shard1_replica_n1/ has no replicas
   [junit4]   2> 3543847 INFO  (qtp1874222727-200746) [n:127.0.0.1:39502__c%2Fn c:control_collection s:shard1  x:control_collection_shard1_replica_n1] o.a.s.c.ShardLeaderElectionContextBase Creating leader registration node /collections/control_collection/leaders/shard1/leader after winning as /collections/control_collection/leader_elect/shard1/election/72719676216442884-core_node2-n_0000000000
   [junit4]   2> 3543849 INFO  (qtp1874222727-200746) [n:127.0.0.1:39502__c%2Fn c:control_collection s:shard1  x:control_collection_shard1_replica_n1] o.a.s.c.ShardLeaderElectionContext I am the new leader: http://127.0.0.1:39502/_c/n/control_collection_shard1_replica_n1/ shard1
   [junit4]   2> 3543951 INFO  (zkCallback-72897-thread-1) [    ] o.a.s.c.c.ZkStateReader A cluster state change: [WatchedEvent state:SyncConnected type:NodeDataChanged path:/collections/control_collection/state.json] for collection [control_collection] has occurred - updating... (live nodes size: [1])
   [junit4]   2> 3543951 INFO  (zkCallback-72897-thread-2) [    ] o.a.s.c.c.ZkStateReader A cluster state change: [WatchedEvent state:SyncConnected type:NodeDataChanged path:/collections/control_collection/state.json] for collection [control_collection] has occurred - updating... (live nodes size: [1])
   [junit4]   2> 3543952 INFO  (qtp1874222727-200746) [n:127.0.0.1:39502__c%2Fn c:control_collection s:shard1  x:control_collection_shard1_replica_n1] o.a.s.c.ZkController I am the leader, no recovery necessary
   [junit4]   2> 3543955 INFO  (qtp1874222727-200746) [n:127.0.0.1:39502__c%2Fn c:control_collection s:shard1  x:control_collection_shard1_replica_n1] o.a.s.s.HttpSolrCall [admin] webapp=null path=/admin/cores params={qt=/admin/cores&collection.configName=conf1&newCollection=true&name=control_collection_shard1_replica_n1&action=CREATE&numShards=1&collection=control_collection&shard=shard1&wt=javabin&version=2&replicaType=NRT} status=0 QTime=1508
   [junit4]   2> 3543959 INFO  (qtp1874222727-200743) [n:127.0.0.1:39502__c%2Fn    ] o.a.s.h.a.CollectionsHandler Wait for new collection to be active for at most 45 seconds. Check all shard replicas
   [junit4]   2> 3544055 INFO  (zkCallback-72897-thread-2) [    ] o.a.s.c.c.ZkStateReader A cluster state change: [WatchedEvent state:SyncConnected type:NodeDataChanged path:/collections/control_collection/state.json] for collection [control_collection] has occurred - updating... (live nodes size: [1])
   [junit4]   2> 3544055 INFO  (zkCallback-72897-thread-1) [    ] o.a.s.c.c.ZkStateReader A cluster state change: [WatchedEvent state:SyncConnected type:NodeDataChanged path:/collections/control_collection/state.json] for collection [control_collection] has occurred - updating... (live nodes size: [1])
   [junit4]   2> 3544056 INFO  (zkCallback-72897-thread-3) [    ] o.a.s.c.c.ZkStateReader A cluster state change: [WatchedEvent state:SyncConnected type:NodeDataChanged path:/collections/control_collection/state.json] for collection [control_collection] has occurred - updating... (live nodes size: [1])
   [junit4]   2> 3544056 INFO  (qtp1874222727-200743) [n:127.0.0.1:39502__c%2Fn    ] o.a.s.s.HttpSolrCall [admin] webapp=null path=/admin/collections params={collection.configName=conf1&name=control_collection&nrtReplicas=1&action=CREATE&numShards=1&createNodeSet=127.0.0.1:39502__c%252Fn&wt=javabin&version=2} status=0 QTime=1729
   [junit4]   2> 3544064 INFO  (zkConnectionManagerCallback-72917-thread-1) [    ] o.a.s.c.c.ConnectionManager zkClient has connected
   [junit4]   2> 3544065 INFO  (TEST-StressHdfsTest.test-seed#[8FB92E0E34FF0327]) [    ] o.a.s.c.c.ZkStateReader Updated live nodes from ZooKeeper... (0) -> (1)
   [junit4]   2> 3544067 INFO  (TEST-StressHdfsTest.test-seed#[8FB92E0E34FF0327]) [    ] o.a.s.c.s.i.ZkClientClusterStateProvider Cluster at 127.0.0.1:35052/solr ready
   [junit4]   2> 3544067 INFO  (TEST-StressHdfsTest.test-seed#[8FB92E0E34FF0327]) [    ] o.a.s.c.ChaosMonkey monkey: init - expire sessions:false cause connection loss:false
   [junit4]   2> 3544068 INFO  (qtp1874222727-200746) [n:127.0.0.1:39502__c%2Fn    ] o.a.s.h.a.CollectionsHandler Invoked Collection Action :create with params collection.configName=conf1&name=collection1&nrtReplicas=1&action=CREATE&numShards=1&createNodeSet=&stateFormat=1&wt=javabin&version=2 and sendToOCPQueue=true
   [junit4]   2> 3544072 INFO  (OverseerThreadFactory-15010-thread-2-processing-n:127.0.0.1:39502__c%2Fn) [n:127.0.0.1:39502__c%2Fn    ] o.a.s.c.a.c.CreateCollectionCmd Create collection collection1
   [junit4]   2> 3544072 INFO  (OverseerCollectionConfigSetProcessor-72719676216442884-127.0.0.1:39502__c%2Fn-n_0000000000) [n:127.0.0.1:39502__c%2Fn    ] o.a.s.c.OverseerTaskQueue Response ZK path: /overseer/collection-queue-work/qnr-0000000000 doesn't exist.  Requestor may have disconnected from ZooKeeper
   [junit4]   2> 3544276 WARN  (OverseerThreadFactory-15010-thread-2-processing-n:127.0.0.1:39502__c%2Fn) [n:127.0.0.1:39502__c%2Fn    ] o.a.s.c.a.c.CreateCollectionCmd It is unusual to create a collection (collection1) without cores.
   [junit4]   2> 3544280 INFO  (qtp1874222727-200746) [n:127.0.0.1:39502__c%2Fn    ] o.a.s.h.a.CollectionsHandler Wait for new collection to be active for at most 45 seconds. Check all shard replicas
   [junit4]   2> 3544281 INFO  (qtp1874222727-200746) [n:127.0.0.1:39502__c%2Fn    ] o.a.s.s.HttpSolrCall [admin] webapp=null path=/admin/collections params={collection.configName=conf1&name=collection1&nrtReplicas=1&action=CREATE&numShards=1&createNodeSet=&stateFormat=1&wt=javabin&version=2} status=0 QTime=213
   [junit4]   2> 3544282 INFO  (TEST-StressHdfsTest.test-seed#[8FB92E0E34FF0327]) [    ] o.a.s.c.AbstractFullDistribZkTestBase Creating jetty instances pullReplicaCount=0 numOtherReplicas=7
   [junit4]   2> 3544463 INFO  (TEST-StressHdfsTest.test-seed#[8FB92E0E34FF0327]) [    ] o.a.s.c.AbstractFullDistribZkTestBase create jetty 1 in directory /x1/jenkins/jenkins-slave/workspace/Lucene-Solr-NightlyTests-8.x/checkout/solr/build/solr-core/test/J1/temp/solr.cloud.hdfs.StressHdfsTest_8FB92E0E34FF0327-001/shard-1-001 of type NRT
   [junit4]   2> 3544464 WARN  (closeThreadPool-72918-thread-1) [    ] o.e.j.s.AbstractConnector Ignoring deprecated socket close linger time
   [junit4]   2> 3544464 INFO  (closeThreadPool-72918-thread-1) [    ] o.a.s.c.s.e.JettySolrRunner Start Jetty (original configured port=0)
   [junit4]   2> 3544464 INFO  (closeThreadPool-72918-thread-1) [    ] o.a.s.c.s.e.JettySolrRunner Trying to start Jetty on port 0 try number 1 ...
   [junit4]   2> 3544464 INFO  (closeThreadPool-72918-thread-1) [    ] o.e.j.s.Server jetty-9.4.14.v20181114; built: 2018-11-14T21:20:31.478Z; git: c4550056e785fb5665914545889f21dc136ad9e6; jvm 1.8.0_191-b12
   [junit4]   2> 3544466 INFO  (closeThreadPool-72918-thread-1) [    ] o.e.j.s.session DefaultSessionIdManager workerName=node0
   [junit4]   2> 3544466 INFO  (closeThreadPool-72918-thread-1) [    ] o.e.j.s.session No SessionScavenger set, using defaults
   [junit4]   2> 3544466 INFO  (closeThreadPool-72918-thread-1) [    ] o.e.j.s.session node0 Scavenging every 600000ms
   [junit4]   2> 3544466 INFO  (closeThreadPool-72918-thread-1) [    ] o.e.j.s.h.ContextHandler Started o.e.j.s.ServletContextHandler@3ae40f0f{/_c/n,null,AVAILABLE}
   [junit4]   2> 3544467 INFO  (closeThreadPool-72918-thread-1) [    ] o.e.j.s.AbstractConnector Started ServerConnector@3cfbdf3b{HTTP/1.1,[http/1.1, h2c]}{127.0.0.1:37410}
   [junit4]   2> 3544467 INFO  (closeThreadPool-72918-thread-1) [    ] o.e.j.s.Server Started @3544577ms
   [junit4]   2> 3544467 INFO  (closeThreadPool-72918-thread-1) [    ] o.a.s.c.s.e.JettySolrRunner Jetty properties: {solr.data.dir=hdfs://localhost:44425/hdfs__localhost_44425__x1_jenkins_jenkins-slave_workspace_Lucene-Solr-NightlyTests-8.x_checkout_solr_build_solr-core_test_J1_temp_solr.cloud.hdfs.StressHdfsTest_8FB92E0E34FF0327-001_tempDir-002_jetty1, solrconfig=solrconfig.xml, hostContext=/_c/n, hostPort=37410, coreRootDirectory=/x1/jenkins/jenkins-slave/workspace/Lucene-Solr-NightlyTests-8.x/checkout/solr/build/solr-core/test/J1/temp/solr.cloud.hdfs.StressHdfsTest_8FB92E0E34FF0327-001/shard-1-001/cores}
   [junit4]   2> 3544467 ERROR (closeThreadPool-72918-thread-1) [    ] o.a.s.u.StartupLoggingUtils Missing Java Option solr.log.dir. Logging may be missing or incomplete.
   [junit4]   2> 3544467 INFO  (closeThreadPool-72918-thread-1) [    ] o.a.s.s.SolrDispatchFilter Using logger factory org.apache.logging.slf4j.Log4jLoggerFactory
   [junit4]   2> 3544467 INFO  (closeThreadPool-72918-thread-1) [    ] o.a.s.s.SolrDispatchFilter  ___      _       Welcome to Apache Solr? version 8.0.0
   [junit4]   2> 3544467 INFO  (closeThreadPool-72918-thread-1) [    ] o.a.s.s.SolrDispatchFilter / __| ___| |_ _   Starting in cloud mode on port null
   [junit4]   2> 3544467 INFO  (closeThreadPool-72918-thread-1) [    ] o.a.s.s.SolrDispatchFilter \__ \/ _ \ | '_|  Install dir: null
   [junit4]   2> 3544467 INFO  (closeThreadPool-72918-thread-1) [    ] o.a.s.s.SolrDispatchFilter |___/\___/_|_|    Start time: 2019-01-31T20:50:13.300Z
   [junit4]   2> 3544469 INFO  (zkConnectionManagerCallback-72920-thread-1) [    ] o.a.s.c.c.ConnectionManager zkClient has connected
   [junit4]   2> 3544470 INFO  (closeThreadPool-72918-thread-1) [    ] o.a.s.s.SolrDispatchFilter Loading solr.xml from SolrHome (not found in ZooKeeper)
   [junit4]   2> 3544471 INFO  (closeThreadPool-72918-thread-1) [    ] o.a.s.c.SolrXmlConfig Loading container configuration from /x1/jenkins/jenkins-slave/workspace/Lucene-Solr-NightlyTests-8.x/checkout/solr/build/solr-core/test/J1/temp/solr.cloud.hdfs.StressHdfsTest_8FB92E0E34FF0327-001/shard-1-001/solr.xml
   [junit4]   2> 3544478 INFO  (closeThreadPool-72918-thread-1) [    ] o.a.s.c.SolrXmlConfig Configuration parameter autoReplicaFailoverWorkLoopDelay is ignored
   [junit4]   2> 3544478 INFO  (closeThreadPool-72918-thread-1) [    ] o.a.s.c.SolrXmlConfig Configuration parameter autoReplicaFailoverBadNodeExpiration is ignored
   [junit4]   2> 3544481 INFO  (closeThreadPool-72918-thread-1) [    ] o.a.s.c.SolrXmlConfig MBean server found: com.sun.jmx.mbeanserver.JmxMBeanServer@30d2035f, but no JMX reporters were configured - adding default JMX reporter.
   [junit4]   2> 3544619 INFO  (closeThreadPool-72918-thread-1) [    ] o.a.s.h.c.HttpShardHandlerFactory Host whitelist initialized: WhitelistHostChecker [whitelistHosts=null, whitelistHostCheckingEnabled=false]
   [junit4]   2> 3544621 WARN  (closeThreadPool-72918-thread-1) [    ] o.e.j.u.s.S.config No Client EndPointIdentificationAlgorithm configured for SslContextFactory@5d8c061a[provider=null,keyStore=null,trustStore=null]
   [junit4]   2> 3544626 WARN  (closeThreadPool-72918-thread-1) [    ] o.e.j.u.s.S.config No Client EndPointIdentificationAlgorithm configured for SslContextFactory@64568c40[provider=null,keyStore=null,trustStore=null]
   [junit4]   2> 3544627 INFO  (closeThreadPool-72918-thread-1) [    ] o.a.s.c.ZkContainer Zookeeper client=127.0.0.1:35052/solr
   [junit4]   2> 3544628 INFO  (zkConnectionManagerCallback-72926-thread-1) [    ] o.a.s.c.c.ConnectionManager zkClient has connected
   [junit4]   2> 3544631 INFO  (zkConnectionManagerCallback-72928-thread-1) [    ] o.a.s.c.c.ConnectionManager zkClient has connected
   [junit4]   2> 3544641 INFO  (closeThreadPool-72918-thread-1) [n:127.0.0.1:37410__c%2Fn    ] o.a.s.c.c.ZkStateReader Updated live nodes from ZooKeeper... (0) -> (1)
   [junit4]   2> 3544646 INFO  (closeThreadPool-72918-thread-1) [n:127.0.0.1:37410__c%2Fn    ] o.a.s.c.ZkController Publish node=127.0.0.1:37410__c%2Fn as DOWN
   [junit4]   2> 3544647 INFO  (closeThreadPool-72918-thread-1) [n:127.0.0.1:37410__c%2Fn    ] o.a.s.c.TransientSolrCoreCacheDefault Allocating transient cache for 4 transient cores
   [junit4]   2> 3544647 INFO  (closeThreadPool-72918-thread-1) [n:127.0.0.1:37410__c%2Fn    ] o.a.s.c.ZkController Register node as live in ZooKeeper:/live_nodes/127.0.0.1:37410__c%2Fn
   [junit4]   2> 3544649 INFO  (zkCallback-72916-thread-1) [    ] o.a.s.c.c.ZkStateReader Updated live nodes from ZooKeeper... (1) -> (2)
   [junit4]   2> 3544649 INFO  (zkCallback-72897-thread-3) [    ] o.a.s.c.c.ZkStateReader Updated live nodes from ZooKeeper... (1) -> (2)
   [junit4]   2> 3544649 INFO  (zkCallback-72904-thread-1) [    ] o.a.s.c.c.ZkStateReader Updated live nodes from ZooKeeper... (1) -> (2)
   [junit4]   2> 3544649 INFO  (zkCallback-72927-thread-1) [    ] o.a.s.c.c.ZkStateReader Updated live nodes from ZooKeeper... (1) -> (2)
   [junit4]   2> 3544660 INFO  (TEST-StressHdfsTest.test-seed#[8FB92E0E34FF0327]) [    ] o.a.s.c.AbstractFullDistribZkTestBase create jetty 2 in directory /x1/jenkins/jenkins-slave/workspace/Lucene-Solr-NightlyTests-8.x/checkout/solr/build/solr-core/test/J1/temp/solr.cloud.hdfs.StressHdfsTest_8FB92E0E34FF0327-001/shard-2-001 of type NRT
   [junit4]   2> 3544665 WARN  (closeThreadPool-72918-thread-2) [    ] o.e.j.s.AbstractConnector Ignoring deprecated socket close linger time
   [junit4]   2> 3544665 INFO  (closeThreadPool-72918-thread-2) [    ] o.a.s.c.s.e.JettySolrRunner Start Jetty (original configured port=0)
   [junit4]   2> 3544665 INFO  (closeThreadPool-72918-thread-2) [    ] o.a.s.c.s.e.JettySolrRunner Trying to start Jetty on port 0 try number 1 ...
   [junit4]   2> 3544665 INFO  (closeThreadPool-72918-thread-2) [    ] o.e.j.s.Server jetty-9.4.14.v20181114; built: 2018-11-14T21:20:31.478Z; git: c4550056e785fb5665914545889f21dc136ad9e6; jvm 1.8.0_191-b12
   [junit4]   2> 3544667 INFO  (closeThreadPool-72918-thread-2) [    ] o.e.j.s.session DefaultSessionIdManager workerName=node0
   [junit4]   2> 3544667 INFO  (closeThreadPool-72918-thread-2) [    ] o.e.j.s.session No SessionScavenger set, using defaults
   [junit4]   2> 3544667 INFO  (closeThreadPool-72918-thread-2) [    ] o.e.j.s.session node0 Scavenging every 660000ms
   [junit4]   2> 3544667 INFO  (closeThreadPool-72918-thread-2) [    ] o.e.j.s.h.ContextHandler Started o.e.j.s.ServletContextHandler@3c088e2b{/_c/n,null,AVAILABLE}
   [junit4]   2> 3544668 INFO  (closeThreadPool-72918-thread-2) [    ] o.e.j.s.AbstractConnector Started ServerConnector@7b992151{HTTP/1.1,[http/1.1, h2c]}{127.0.0.1:42811}
   [junit4]   2> 3544668 INFO  (closeThreadPool-72918-thread-2) [    ] o.e.j.s.Server Started @3544778ms
   [junit4]   2> 3544668 INFO  (closeThreadPool-72918-thread-2) [    ] o.a.s.c.s.e.JettySolrRunner Jetty properties: {solr.data.dir=hdfs://localhost:44425/hdfs__localhost_44425__x1_jenkins_jenkins-slave_workspace_Lucene-Solr-NightlyTests-8.x_checkout_solr_build_solr-core_test_J1_temp_solr.cloud.hdfs.StressHdfsTest_8FB92E0E34FF0327-001_tempDir-002_jetty2, solrconfig=solrconfig.xml, hostContext=/_c/n, hostPort=42811, coreRootDirectory=/x1/jenkins/jenkins-slave/workspace/Lucene-Solr-NightlyTests-8.x/checkout/solr/build/solr-core/test/J1/temp/solr.cloud.hdfs.StressHdfsTest_8FB92E0E34FF0327-001/shard-2-001/cores}
   [junit4]   2> 3544668 ERROR (closeThreadPool-72918-thread-2) [    ] o.a.s.u.StartupLoggingUtils Missing Java Option solr.log.dir. Logging may be missing or incomplete.
   [junit4]   2> 3544668 INFO  (closeThreadPool-72918-thread-2) [    ] o.a.s.s.SolrDispatchFilter Using logger factory org.apache.logging.slf4j.Log4jLoggerFactory
   [junit4]   2> 3544668 INFO  (closeThreadPool-72918-thread-2) [    ] o.a.s.s.SolrDispatchFilter  ___      _       Welcome to Apache Solr? version 8.0.0
   [junit4]   2> 3544668 INFO  (closeThreadPool-72918-thread-2) [    ] o.a.s.s.SolrDispatchFilter / __| ___| |_ _   Starting in cloud mode on port null
   [junit4]   2> 3544668 INFO  (closeThreadPool-72918-thread-2) [    ] o.a.s.s.SolrDispatchFilter \__ \/ _ \ | '_|  Install dir: null
   [junit4]   2> 3544668 INFO  (closeThreadPool-72918-thread-2) [    ] o.a.s.s.SolrDispatchFilter |___/\___/_|_|    Start time: 2019-01-31T20:50:13.501Z
   [junit4]   2> 3544670 INFO  (zkConnectionManagerCallback-72932-thread-1) [    ] o.a.s.c.c.ConnectionManager zkClient has connected
   [junit4]   2> 3544671 INFO  (closeThreadPool-72918-thread-2) [    ] o.a.s.s.SolrDispatchFilter Loading solr.xml from SolrHome (not found in ZooKeeper)
   [junit4]   2> 3544671 INFO  (closeThreadPool-72918-thread-2) [    ] o.a.s.c.SolrXmlConfig Loading container configuration from /x1/jenkins/jenkins-slave/workspace/Lucene-Solr-NightlyTests-8.x/checkout/solr/build/solr-core/test/J1/temp/solr.cloud.hdfs.StressHdfsTest_8FB92E0E34FF0327-001/shard-2-001/solr.xml
   [junit4]   2> 3544676 INFO  (closeThreadPool-72918-thread-2) [    ] o.a.s.c.SolrXmlConfig Configuration parameter autoReplicaFailoverWorkLoopDelay is ignored
   [junit4]   2> 3544676 INFO  (closeThreadPool-72918-thread-2) [    ] o.a.s.c.SolrXmlConfig Configuration parameter autoReplicaFailoverBadNodeExpiration is ignored
   [junit4]   2> 3544678 INFO  (zkConnectionManagerCallback-72937-thread-1) [    ] o.a.s.c.c.ConnectionManager zkClient has connected
   [junit4]   2> 3544678 INFO  (closeThreadPool-72918-thread-2) [    ] o.a.s.c.SolrXmlConfig MBean server found: com.sun.jmx.mbeanserver.JmxMBeanServer@30d2035f, but no JMX reporters were configured - adding default JMX reporter.
   [junit4]   2> 3544679 INFO  (closeThreadPool-72918-thread-1) [n:127.0.0.1:37410__c%2Fn    ] o.a.s.c.c.ZkStateReader Updated live nodes from ZooKeeper... (0) -> (2)
   [junit4]   2> 3544680 INFO  (closeThreadPool-72918-thread-1) [n:127.0.0.1:37410__c%2Fn    ] o.a.s.c.s.i.ZkClientClusterStateProvider Cluster at 127.0.0.1:35052/solr ready
   [junit4]   2> 3544680 INFO  (closeThreadPool-72918-thread-1) [n:127.0.0.1:37410__c%2Fn    ] o.a.s.h.a.MetricsHistoryHandler No .system collection, keeping metrics history in memory.
   [junit4]   2> 3544709 INFO  (closeThreadPool-72918-thread-1) [n:127.0.0.1:37410__c%2Fn    ] o.a.s.m.r.SolrJmxReporter JMX monitoring for 'solr.node' (registry 'solr.node') enabled at server: com.sun.jmx.mbeanserver.JmxMBeanServer@30d2035f
   [junit4]   2> 3544727 INFO  (closeThreadPool-72918-thread-1) [n:127.0.0.1:37410__c%2Fn    ] o.a.s.m.r.SolrJmxReporter JMX monitoring for 'solr.jvm' (registry 'solr.jvm') enabled at server: com.sun.jmx.mbeanserver.JmxMBeanServer@30d2035f
   [junit4]   2> 3544727 INFO  (closeThreadPool-72918-thread-1) [n:127.0.0.1:37410__c%2Fn    ] o.a.s.m.r.SolrJmxReporter JMX monitoring for 'solr.jetty' (registry 'solr.jetty') enabled at server: com.sun.jmx.mbeanserver.JmxMBeanServer@30d2035f
   [junit4]   2> 3544729 INFO  (closeThreadPool-72918-thread-1) [n:127.0.0.1:37410__c%2Fn    ] o.a.s.c.CorePropertiesLocator Found 0 core definitions underneath /x1/jenkins/jenkins-slave/workspace/Lucene-Solr-NightlyTests-8.x/checkout/solr/build/solr-core/test/J1/temp/solr.cloud.hdfs.StressHdfsTest_8FB92E0E34FF0327-001/shard-1-001/cores
   [junit4]   2> 3544828 INFO  (closeThreadPool-72918-thread-2) [    ] o.a.s.h.c.HttpShardHandlerFactory Host whitelist initialized: WhitelistHostChecker [whitelistHosts=null, whitelistHostCheckingEnabled=false]
   [junit4]   2> 3544830 WARN  (closeThreadPool-72918-thread-2) [    ] o.e.j.u.s.S.config No Client EndPointIdentificationAlgorithm configured for SslContextFactory@eae9fd0[provider=null,keyStore=null,trustStore=null]
   [junit4]   2> 3544834 WARN  (closeThreadPool-72918-thread-2) [    ] o.e.j.u.s.S.config No Client EndPointIdentificationAlgorithm configured for SslContextFactory@70dd9856[provider=null,keyStore=null,trustStore=null]
   [junit4]   2> 3544836 INFO  (closeThreadPool-72918-thread-2) [    ] o.a.s.c.ZkContainer Zookeeper client=127.0.0.1:35052/solr
   [junit4]   2> 3544837 INFO  (zkConnectionManagerCallback-72944-thread-1) [    ] o.a.s.c.c.ConnectionManager zkClient has connected
   [junit4]   2> 3544839 INFO  (zkConnectionManagerCallback-72946-thread-1) [    ] o.a.s.c.c.ConnectionManager zkClient has connected
   [junit4]   2> 3544851 INFO  (closeThreadPool-72918-thread-2) [n:127.0.0.1:42811__c%2Fn    ] o.a.s.c.c.ZkStateReader Updated live nodes from ZooKeeper... (0) -> (2)
   [junit4]   2> 3544855 INFO  (closeThreadPool-72918-thread-2) [n:127.0.0.1:42811__c%2Fn    ] o.a.s.c.ZkController Publish node=127.0.0.1:42811__c%2Fn as DOWN
   [junit4]   2> 3544856 INFO  (closeThreadPool-72918-thread-2) [n:127.0.0.1:42811__c%2Fn    ] o.a.s.c.TransientSolrCoreCacheDefault Allocating transient cache for 4 transient cores
   [junit4]   2> 3544856 INFO  (closeThreadPool-72918-thread-2) [n:127.0.0.1:42811__c%2Fn    ] o.a.s.c.ZkController Register node as live in ZooKeeper:/live_nodes/127.0.0.1:42811__c%2Fn
   [junit4]   2> 3544857 INFO  (zkCallback-72904-thread-1) [    ] o.a.s.c.c.ZkStateReader Updated live nodes from ZooKeeper... (2) -> (3)
   [junit4]   2> 3544857 INFO  (zkCallback-72927-thread-1) [    ] o.a.s.c.c.ZkStateReader Updated live nodes from ZooKeeper... (2) -> (3)
   [junit4]   2> 3544857 INFO  (zkCallback-72916-thread-1) [    ] o.a.s.c.c.ZkStateReader Updated live nodes from ZooKeeper... (2) -> (3)
   [junit4]   2> 3544857 INFO  (zkCallback-72897-thread-3) [    ] o.a.s.c.c.ZkStateReader Updated live nodes from ZooKeeper... (2) -> (3)
   [junit4]   2> 3544868 INFO  (zkCallback-72945-thread-1) [    ] o.a.s.c.c.ZkStateReader Updated live nodes from ZooKeeper... (2) -> (3)
   [junit4]   2> 3544880 INFO  (zkCallback-72936-thread-1) [    ] o.a.s.c.c.ZkStateReader Updated live nodes from ZooKeeper... (2) -> (3)
   [junit4]   2> 3544886 INFO  (TEST-StressHdfsTest.test-seed#[8FB92E0E34FF0327]) [    ] o.a.s.c.AbstractFullDistribZkTestBase create jetty 3 in directory /x1/jenkins/jenkins-slave/workspace/Lucene-Solr-NightlyTests-8.x/checkout/solr/build/solr-core/test/J1/temp/solr.cloud.hdfs.StressHdfsTest_8FB92E0E34FF0327-001/shard-3-001 of type NRT
   [junit4]   2> 3544887 WARN  (closeThreadPool-72918-thread-1) [    ] o.e.j.s.AbstractConnector Ignoring deprecated socket close linger time
   [junit4]   2> 3544887 INFO  (closeThreadPool-72918-thread-1) [    ] o.a.s.c.s.e.JettySolrRunner Start Jetty (original configured port=0)
   [junit4]   2> 3544887 INFO  (closeThreadPool-72918-thread-1) [    ] o.a.s.c.s.e.JettySolrRunner Trying to start Jetty on port 0 try number 1 ...
   [junit4]   2> 3544887 INFO  (closeThreadPool-72918-thread-1) [    ] o.e.j.s.Server jetty-9.4.14.v20181114; built: 2018-11-14T21:20:31.478Z; git: c4550056e785fb5665914545889f21dc136ad9e6; jvm 1.8.0_191-b12
   [junit4]   2> 3544913 INFO  (closeThreadPool-72918-thread-1) [    ] o.e.j.s.session DefaultSessionIdManager workerName=node0
   [junit4]   2> 3544913 INFO  (closeThreadPool-72918-thread-1) [    ] o.e.j.s.session No SessionScavenger set, using defaults
   [junit4]   2> 3544913 INFO  (closeThreadPool-72918-thread-1) [    ] o.e.j.s.session node0 Scavenging every 660000ms
   [junit4]   2> 3544913 INFO  (closeThreadPool-72918-thread-1) [    ] o.e.j.s.h.ContextHandler Started o.e.j.s.ServletContextHandler@1dc96637{/_c/n,null,AVAILABLE}
   [junit4]   2> 3544914 INFO  (closeThreadPool-72918-thread-1) [    ] o.e.j.s.AbstractConnector Started ServerConnector@7cee1f20{HTTP/1.1,[http/1.1, h2c]}{127.0.0.1:34547}
   [junit4]   2> 3544914 INFO  (closeThreadPool-72918-thread-1) [    ] o.e.j.s.Server Started @3545024ms
   [junit4]   2> 3544914 INFO  (closeThreadPool-72918-thread-1) [    ] o.a.s.c.s.e.JettySolrRunner Jetty properties: {solr.data.dir=hdfs://localhost:44425/hdfs__localhost_44425__x1_jenkins_jenkins-slave_workspace_Lucene-Solr-NightlyTests-8.x_checkout_solr_build_solr-core_test_J1_temp_solr.cloud.hdfs.StressHdfsTest_8FB92E0E34FF0327-001_tempDir-002_jetty3, replicaType=NRT, solrconfig=solrconfig.xml, hostContext=/_c/n, hostPort=34547, coreRootDirectory=/x1/jenkins/jenkins-slave/workspace/Lucene-Solr-NightlyTests-8.x/checkout/solr/build/solr-core/test/J1/temp/solr.cloud.hdfs.StressHdfsTest_8FB92E0E34FF0327-001/shard-3-001/cores}
   [junit4]   2> 3544914 ERROR (closeThreadPool-72918-thread-1) [    ] o.a.s.u.StartupLoggingUtils Missing Java Option solr.log.dir. Logging may be missing or incomplete.
   [junit4]   2> 3544914 INFO  (closeThreadPool-72918-thread-1) [    ] o.a.s.s.SolrDispatchFilter Using logger factory org.apache.logging.slf4j.Log4jLoggerFactory
   [junit4]   2> 3544914 INFO  (closeThreadPool-72918-thread-1) [    ] o.a.s.s.SolrDispatchFilter  ___      _       Welcome to Apache Solr? version 8.0.0
   [junit4]   2> 3544914 INFO  (closeThreadPool-72918-thread-1) [    ] o.a.s.s.SolrDispatchFilter / __| ___| |_ _   Starting in cloud mode on port null
   [junit4]   2> 3544914 INFO  (closeThreadPool-72918-thread-1) [    ] o.a.s.s.SolrDispatchFilter \__ \/ _ \ | '_|  Install dir: null
   [junit4]   2> 3544914 INFO  (closeThreadPool-72918-thread-1) [    ] o.a.s.s.SolrDispatchFilter |___/\___/_|_|    Start time: 2019-01-31T20:50:13.747Z
   [junit4]   2> 3544915 INFO  (zkConnectionManagerCallback-72953-thread-1) [    ] o.a.s.c.c.ConnectionManager zkClient has connected
   [junit4]   2> 3544916 INFO  (zkConnectionManagerCallback-72955-thread-1) [    ] o.a.s.c.c.ConnectionManager zkClient has connected
   [junit4]   2> 3544917 INFO  (closeThreadPool-72918-thread-2) [n:127.0.0.1:42811__c%2Fn    ] o.a.s.c.c.ZkStateReader Updated live nodes from ZooKeeper... (0) -> (3)
   [junit4]   2> 3544917 INFO  (closeThreadPool-72918-thread-1) [    ] o.a.s.s.SolrDispatchFilter Loading solr.xml from SolrHome (not found in ZooKeeper)
   [junit4]   2> 3544917 INFO  (closeThreadPool-72918-thread-1) [    ] o.a.s.c.SolrXmlConfig Loading container configuration from /x1/jenkins/jenkins-slave/workspace/Lucene-Solr-NightlyTests-8.x/checkout/solr/build/solr-core/test/J1/temp/solr.cloud.hdfs.StressHdfsTest_8FB92E0E34FF0327-001/shard-3-001/solr.xml
   [junit4]   2> 3544918 INFO  (closeThreadPool-72918-thread-2) [n:127.0.0.1:42811__c%2Fn    ] o.a.s.c.s.i.ZkClientClusterStateProvider Cluster at 127.0.0.1:35052/solr ready
   [junit4]   2> 3544920 INFO  (closeThreadPool-72918-thread-2) [n:127.0.0.1:42811__c%2Fn    ] o.a.s.h.a.MetricsHistoryHandler No .system collection, keeping metrics history in memory.
   [junit4]   2> 3544922 INFO  (closeThreadPool-72918-thread-1) [    ] o.a.s.c.SolrXmlConfig Configuration parameter autoReplicaFailoverWorkLoopDelay is ignored
   [junit4]   2> 3544922 INFO  (closeThreadPool-72918-thread-1) [    ] o.a.s.c.SolrXmlConfig Configuration parameter autoReplicaFailoverBadNodeExpiration is ignored
   [junit4]   2> 3544924 INFO  (closeThreadPool-72918-thread-1) [    ] o.a.s.c.SolrXmlConfig MBean server found: com.sun.jmx.mbeanserver.JmxMBeanServer@30d2035f, but no JMX reporters were configured - adding default JMX reporter.
   [junit4]   2> 3544950 INFO  (closeThreadPool-72918-thread-2) [n:127.0.0.1:42811__c%2Fn    ] o.a.s.m.r.SolrJmxReporter JMX monitoring for 'solr.node' (registry 'solr.node') enabled at server: com.sun.jmx.mbeanserver.JmxMBeanServer@30d2035f
   [junit4]   2> 3544968 INFO  (closeThreadPool-72918-thread-2) [n:127.0.0.1:42811__c%2Fn    ] o.a.s.m.r.SolrJmxReporter JMX monitoring for 'solr.jvm' (registry 'solr.jvm') enabled at server: com.sun.jmx.mbeanserver.JmxMBeanServer@30d2035f
   [junit4]   2> 3544968 INFO  (closeThreadPool-72918-thread-2) [n:127.0.0.1:42811__c%2Fn    ] o.a.s.m.r.SolrJmxReporter JMX monitoring for 'solr.jetty' (registry 'solr.jetty') enabled at server: com.sun.jmx.mbeanserver.JmxMBeanServer@30d2035f
   [junit4]   2> 3544970 INFO  (closeThreadPool-72918-thread-2) [n:127.0.0.1:42811__c%2Fn    ] o.a.s.c.CorePropertiesLocator Found 0 core definitions underneath /x1/jenkins/jenkins-slave/workspace/Lucene-Solr-NightlyTests-8.x/checkout/solr/build/solr-core/test/J1/temp/solr.cloud.hdfs.StressHdfsTest_8FB92E0E34FF0327-001/shard-2-001/cores
   [junit4]   2> 3545105 INFO  (closeThreadPool-72918-thread-1) [    ] o.a.s.h.c.HttpShardHandlerFactory Host whitelist initialized: WhitelistHostChecker [whitelistHosts=null, whitelistHostCheckingEnabled=false]
   [junit4]   2> 3545107 WARN  (closeThreadPool-72918-thread-1) [    ] o.e.j.u.s.S.config No Client EndPointIdentificationAlgorithm configured for SslContextFactory@7db363de[provider=null,keyStore=null,trustStore=null]
   [junit4]   2> 3545111 WARN  (closeThreadPool-72918-thread-1) [    ] o.e.j.u.s.S.config No Client EndPointIdentificationAlgorithm configured for SslContextFactory@1e855958[provider=null,keyStore=null,trustStore=null]
   [junit4]   2> 3545112 INFO  (closeThreadPool-72918-thread-1) [    ] o.a.s.c.ZkContainer Zookeeper client=127.0.0.1:35052/solr
   [junit4]   2> 3545114 INFO  (zkConnectionManagerCallback-72962-thread-1) [    ] o.a.s.c.c.ConnectionManager zkClient has connected
   [junit4]   2> 3545116 INFO  (zkConnectionManagerCallback-72964-thread-1) [    ] o.a.s.c.c.ConnectionManager zkClient has connected
   [junit4]   2> 3545125 INFO  (closeThreadPool-72918-thread-1) [    ] o.a.s.c.c.ZkStateReader Updated live nodes from ZooKeeper... (0) -> (3)
   [junit4]   2> 3545134 INFO  (closeThreadPool-72918-thread-1) [    ] o.a.s.c.ZkController Publish node=127.0.0.1:34547__c%2Fn as DOWN
   [junit4]   2> 3545135 INFO  (closeThreadPool-72918-thread-1) [    ] o.a.s.c.TransientSolrCoreCacheDefault Allocating transient cache for 4 transient cores
   [junit4]   2> 3545135 INFO  (closeThreadPool-72918-thread-1) [    ] o.a.s.c.ZkController Register node as live in ZooKeeper:/live_nodes/127.0.0.1:34547__c%2Fn
   [junit4]   2> 3545137 INFO  (zkCallback-72916-thread-1) [    ] o.a.s.c.c.ZkStateReader Updated live nodes from ZooKeeper... (3) -> (4)
   [junit4]   2> 3545137 INFO  (zkCallback-72927-thread-1) [    ] o.a.s.c.c.ZkStateReader Updated live nodes from ZooKeeper... (3) -> (4)
   [junit4]   2> 3545137 INFO  (zkCallback-72945-thread-1) [    ] o.a.s.c.c.ZkStateReader Updated live nodes from ZooKeeper... (3) -> (4)
   [junit4]   2> 3545137 INFO  (zkCallback-72904-thread-1) [    ] o.a.s.c.c.ZkStateReader Updated live nodes from ZooKeeper... (3) -> (4)
   [junit4]   2> 3545137 INFO  (zkCallback-72897-thread-3) [    ] o.a.s.c.c.ZkStateReader Updated live nodes from ZooKeeper... (3) -> (4)
   [junit4]   2> 3545137 INFO  (zkCallback-72936-thread-1) [    ] o.a.s.c.c.ZkStateReader Updated live nodes from ZooKeeper... (3) -> (4)
   [junit4]   2> 3545137 INFO  (zkCallback-72952-thread-1) [    ] o.a.s.c.c.ZkStateReader Updated live nodes from ZooKeeper... (3) -> (4)
   [junit4]   2> 3545137 INFO  (zkCallback-72963-thread-1) [    ] o.a.s.c.c.ZkStateReader Updated live nodes from ZooKeeper... (3) -> (4)
   [junit4]   2> 3545172 INFO  (zkConnectionManagerCallback-72971-thread-1) [    ] o.a.s.c.c.ConnectionManager zkClient has connected
   [junit4]   2> 3545173 INFO  (closeThreadPool-72918-thread-1) [    ] o.a.s.c.c.ZkStateReader Updated live nodes from ZooKeeper... (0) -> (4)
   [junit4]   2> 3545174 INFO  (closeThreadPool-72918-thread-1) [    ] o.a.s.c.s.i.ZkClientClusterStateProvider Cluster at 127.0.0.1:35052/solr ready
   [junit4]   2> 3545175 INFO  (closeThreadPool-72918-thread-1) [    ] o.a.s.h.a.MetricsHistoryHandler No .system collection, keeping metrics history in memory.
   [junit4]   2> 3545201 INFO  (TEST-StressHdfsTest.test-seed#[8FB92E0E34FF0327]) [    ] o.a.s.c.AbstractFullDistribZkTestBase create jetty 4 in directory /x1/jenkins/jenkins-slave/workspace/Lucene-Solr-NightlyTests-8.x/checkout/solr/build/solr-core/test/J1/temp/solr.cloud.hdfs.StressHdfsTest_8FB92E0E34FF0327-001/shard-4-001 of type NRT
   [junit4]   2> 3545202 WARN  (closeThreadPool-72918-thread-2) [    ] o.e.j.s.AbstractConnector Ignoring deprecated socket close linger time
   [junit4]   2> 3545202 INFO  (closeThreadPool-72918-thread-2) [    ] o.a.s.c.s.e.JettySolrRunner Start Jetty (original configured port=0)
   [junit4]   2> 3545202 INFO  (closeThreadPool-72918-thread-2) [    ] o.a.s.c.s.e.JettySolrRunner Trying to start Jetty on port 0 try number 1 ...
   [junit4]   2> 3545202 INFO  (closeThreadPool-72918-thread-2) [    ] o.e.j.s.Server jetty-9.4.14.v20181114; built: 2018-11-14T21:20:31.478Z; git: c4550056e785fb5665914545889f21dc136ad9e6; jvm 1.8.0_191-b12
   [junit4]   2> 3545204 INFO  (closeThreadPool-72918-thread-2) [    ] o.e.j.s.session DefaultSessionIdManager workerName=node0
   [junit4]   2> 3545204 INFO  (closeThreadPool-72918-thread-2) [    ] o.e.j.s.session No SessionScavenger set, using defaults
   [junit4]   2> 3545204 INFO  (closeThreadPool-72918-thread-2) [    ] o.e.j.s.session node0 Scavenging every 600000ms
   [junit4]   2> 3545204 INFO  (closeThreadPool-72918-thread-2) [    ] o.e.j.s.h.ContextHandler Started o.e.j.s.ServletContextHandler@56b0b659{/_c/n,null,AVAILABLE}
   [junit4]   2> 3545204 INFO  (closeThreadPool-72918-thread-1) [    ] o.a.s.m.r.SolrJmxReporter JMX monitoring for 'solr.node' (registry 'solr.node') enabled at server: com.sun.jmx.mbeanserver.JmxMBeanServer@30d2035f
   [junit4]   2> 3545205 INFO  (closeThreadPool-72918-thread-2) [    ] o.e.j.s.AbstractConnector Started ServerConnector@5b0caf2c{HTTP/1.1,[http/1.1, h2c]}{127.0.0.1:42367}
   [junit4]   2> 3545205 INFO  (closeThreadPool-72918-thread-2) [    ] o.e.j.s.Server Started @3545315ms
   [junit4]   2> 3545205 INFO  (closeThreadPool-72918-thread-2) [    ] o.a.s.c.s.e.JettySolrRunner Jetty properties: {solr.data.dir=hdfs://localhost:44425/hdfs__localhost_44425__x1_jenkins_jenkins-slave_workspace_Lucene-Solr-NightlyTests-8.x_checkout_solr_build_solr-core_test_J1_temp_solr.cloud.hdfs.StressHdfsTest_8FB92E0E34FF0327-001_tempDir-002_jetty4, replicaType=NRT, solrconfig=solrconfig.xml, hostContext=/_c/n, hostPort=42367, coreRootDirectory=/x1/jenkins/jenkins-slave/workspace/Lucene-Solr-NightlyTests-8.x/checkout/solr/build/solr-core/test/J1/temp/solr.cloud.hdfs.StressHdfsTest_8FB92E0E34FF0327-001/shard-4-001/cores}
   [junit4]   2> 3545205 ERROR (closeThreadPool-72918-thread-2) [    ] o.a.s.u.StartupLoggingUtils Missing Java Option solr.log.dir. Logging may be missing or incomplete.
   [junit4]   2> 3545205 INFO  (closeThreadPool-72918-thread-2) [    ] o.a.s.s.SolrDispatchFilter Using logger factory org.apache.logging.slf4j.Log4jLoggerFactory
   [junit4]   2> 3545205 INFO  (closeThreadPool-72918-thread-2) [    ] o.a.s.s.SolrDispatchFilter  ___      _       Welcome to Apache Solr? version 8.0.0
   [junit4]   2> 3545205 INFO  (closeThreadPool-72918-thread-2) [    ] o.a.s.s.SolrDispatchFilter / __| ___| |_ _   Starting in cloud mode on port null
   [junit4]   2> 3545205 INFO  (closeThreadPool-72918-thread-2) [    ] o.a.s.s.SolrDispatchFilter \__ \/ _ \ | '_|  Install dir: null
   [junit4]   2> 3545205 INFO  (closeThreadPool-72918-thread-2) [    ] o.a.s.s.SolrDispatchFilter |___/\___/_|_|    Start time: 2019-01-31T20:50:14.038Z
   [junit4]   2> 3545249 INFO  (zkConnectionManagerCallback-72974-thread-1) [    ] o.a.s.c.c.ConnectionManager zkClient has connected
   [junit4]   2> 3545257 INFO  (closeThreadPool-72918-thread-2) [    ] o.a.s.s.SolrDispatchFilter Loading solr.xml from SolrHome (not found in ZooKeeper)
   [junit4]   2> 3545257 INFO  (closeThreadPool-72918-thread-2) [    ] o.a.s.c.SolrXmlConfig Loading container configuration from /x1/jenkins/jenkins-slave/workspace/Lucene-Solr-NightlyTests-8.x/checkout/solr/build/solr-core/test/J1/temp/solr.cloud.hdfs.StressHdfsTest_8FB92E0E34FF0327-001/shard-4-001/solr.xml
   [junit4]   2> 3545262 INFO  (closeThreadPool-72918-thread-2) [    ] o.a.s.c.SolrXmlConfig Configuration parameter autoReplicaFailoverWorkLoopDelay is ignored
   [junit4]   2> 3545262 INFO  (closeThreadPool-72918-thread-2) [    ] o.a.s.c.SolrXmlConfig Configuration parameter autoReplicaFailoverBadNodeExpiration is ignored
   [junit4]   2> 3545263 INFO  (closeThreadPool-72918-thread-1) [    ] o.a.s.m.r.SolrJmxReporter JMX monitoring for 'solr.jvm' (registry 'solr.jvm') enabled at server: com.sun.jmx.mbeanserver.JmxMBeanServer@30d2035f
   [junit4]   2> 3545263 INFO  (closeThreadPool-72918-thread-1) [    ] o.a.s.m.r.SolrJmxReporter JMX monitoring for 'solr.jetty' (registry 'solr.jetty') enabled at server: com.sun.jmx.mbeanserver.JmxMBeanServer@30d2035f
   [junit4]   2> 3545265 INFO  (closeThreadPool-72918-thread-1) [    ] o.a.s.c.CorePropertiesLocator Found 0 core definitions underneath /x1/jenkins/jenkins-slave/workspace/Lucene-Solr-NightlyTests-8.x/checkout/solr/build/solr-core/test/J1/temp/solr.cloud.hdfs.StressHdfsTest_8FB92E0E34FF0327-001/shard-3-001/cores
   [junit4]   2> 3545271 INFO  (closeThreadPool-72918-thread-2) [    ] o.a.s.c.SolrXmlConfig MBean server found: com.sun.jmx.mbeanserver.JmxMBeanServer@30d2035f, but no JMX reporters were configured - adding default JMX reporter.
   [junit4]   2> 3545431 INFO  (closeThreadPool-72918-thread-2) [    ] o.a.s.h.c.HttpShardHandlerFactory Host whitelist initialized: WhitelistHostChecker [whitelistHosts=null, whitelistHostCheckingEnabled=false]
   [junit4]   2> 3545433 WARN  (closeThreadPool-72918-thread-2) [    ] o.e.j.u.s.S.config No Client EndPointIdentificationAlgorithm configured for SslContextFactory@7cd566ec[provider=null,keyStore=null,trustStore=null]
   [junit4]   2> 3545437 WARN  (closeThreadPool-72918-thread-2) [    ] o.e.j.u.s.S.config No Client EndPointIdentificationAlgorithm configured for SslContextFactory@7001eb4f[provider=null,keyStore=null,trustStore=null]
   [junit4]   2> 3545438 INFO  (closeThreadPool-72918-thread-2) [    ] o.a.s.c.ZkContainer Zookeeper client=127.0.0.1:35052/solr
   [junit4]   2> 3545440 INFO  (zkConnectionManagerCallback-72980-thread-1) [    ] o.a.s.c.c.ConnectionManager zkClient has connected
   [junit4]   2> 3545444 INFO  (zkConnectionManagerCallback-72982-thread-1) [    ] o.a.s.c.c.ConnectionManager zkClient has connected
   [junit4]   2> 3545447 INFO  (TEST-StressHdfsTest.test-seed#[8FB92E0E34FF0327]) [    ] o.a.s.c.AbstractFullDistribZkTestBase create jetty 5 in directory /x1/jenkins/jenkins-slave/workspace/Lucene-Solr-NightlyTests-8.x/checkout/solr/build/solr-core/test/J1/temp/solr.cloud.hdfs.StressHdfsTest_8FB92E0E34FF0327-001/shard-5-001 of type NRT
   [junit4]   2> 3545447 WARN  (closeThreadPool-72918-thread-1) [    ] o.e.j.s.AbstractConnector Ignoring deprecated socket close linger time
   [junit4]   2> 3545448 INFO  (closeThreadPool-72918-thread-1) [    ] o.a.s.c.s.e.JettySolrRunner Start Jetty (original configured port=0)
   [junit4]   2> 3545448 INFO  (closeThreadPool-72918-thread-1) [    ] o.a.s.c.s.e.JettySolrRunner Trying to start Jetty on port 0 try number 1 ...
   [junit4]   2> 3545448 INFO  (closeThreadPool-72918-thread-1) [    ] o.e.j.s.Server jetty-9.4.14.v20181114; built: 2018-11-14T21:20:31.478Z; git: c4550056e785fb5665914545889f21dc136ad9e6; jvm 1.8.0_191-b12
   [junit4]   2> 3545450 INFO  (closeThreadPool-72918-thread-2) [    ] o.a.s.c.c.ZkStateReader Updated live nodes from ZooKeeper... (0) -> (4)
   [junit4]   2> 3545458 INFO  (closeThreadPool-72918-thread-1) [    ] o.e.j.s.session DefaultSessionIdManager workerName=node0
   [junit4]   2> 3545458 INFO  (closeThreadPool-72918-thread-1) [    ] o.e.j.s.session No SessionScavenger set, using defaults
   [junit4]   2> 3545458 INFO  (closeThreadPool-72918-thread-1) [    ] o.e.j.s.session node0 Scavenging every 600000ms
   [junit4]   2> 3545459 INFO  (closeThreadPool-72918-thread-2) [    ] o.a.s.c.ZkController Publish node=127.0.0.1:42367__c%2Fn as DOWN
   [junit4]   2> 3545459 INFO  (closeThreadPool-72918-thread-1) [    ] o.e.j.s.h.ContextHandler Started o.e.j.s.ServletContextHandler@12fb7f42{/_c/n,null,AVAILABLE}
   [junit4]   2> 3545459 INFO  (closeThreadPool-72918-thread-1) [    ] o.e.j.s.AbstractConnector Started ServerConnector@62c281db{HTTP/1.1,[http/1.1, h2c]}{127.0.0.1:43613}
   [junit4]   2> 3545459 INFO  (closeThreadPool-72918-thread-1) [    ] o.e.j.s.Server Started @3545570ms
   [junit4]   2> 3545459 INFO  (closeThreadPool-72918-thread-1) [    ] o.a.s.c.s.e.JettySolrRunner Jetty properties: {solr.data.dir=hdfs://localhost:44425/hdfs__localhost_44425__x1_jenkins_jenkins-slave_workspace_Lucene-Solr-NightlyTests-8.x_checkout_solr_build_solr-core_test_J1_temp_solr.cloud.hdfs.StressHdfsTest_8FB92E0E34FF0327-001_tempDir-002_jetty5, replicaType=NRT, solrconfig=solrconfig.xml, hostContext=/_c/n, hostPort=43613, coreRootDirectory=/x1/jenkins/jenkins-slave/workspace/Lucene-Solr-NightlyTests-8.x/checkout/solr/build/solr-core/test/J1/temp/solr.cloud.hdfs.StressHdfsTest_8FB92E0E34FF0327-001/shard-5-001/cores}
   [junit4]   2> 3545460 ERROR (closeThreadPool-72918-thread-1) [    ] o.a.s.u.StartupLoggingUtils Missing Java Option solr.log.dir. Logging may be missing or incomplete.
   [junit4]   2> 3545460 INFO  (closeThreadPool-72918-thread-1) [    ] o.a.s.s.SolrDispatchFilter Using logger factory org.apache.logging.slf4j.Log4jLoggerFactory
   [junit4]   2> 3545460 INFO  (closeThreadPool-72918-thread-1) [    ] o.a.s.s.SolrDispatchFilter  ___      _       Welcome to Apache Solr? version 8.0.0
   [junit4]   2> 3545460 INFO  (closeThreadPool-72918-thread-1) [    ] o.a.s.s.SolrDispatchFilter / __| ___| |_ _   Starting in cloud mode on port null
   [junit4]   2> 3545460 INFO  (closeThreadPool-72918-thread-1) [    ] o.a.s.s.SolrDispatchFilter \__ \/ _ \ | '_|  Install dir: null
   [junit4]   2> 3545460 INFO  (closeThreadPool-72918-thread-1) [    ] o.a.s.s.SolrDispatchFilter |___/\___/_|_|    Start time: 2019-01-31T20:50:14.293Z
   [junit4]   2> 3545461 INFO  (closeThreadPool-72918-thread-2) [    ] o.a.s.c.TransientSolrCoreCacheDefault Allocating transient cache for 4 transient cores
   [junit4]   2> 3545461 INFO  (closeThreadPool-72918-thread-2) [    ] o.a.s.c.ZkController Register node as live in ZooKeeper:/live_nodes/127.0.0.1:42367__c%2Fn
   [junit4]   2> 3545463 INFO  (zkCallback-72936-thread-1) [    ] o.a.s.c.c.ZkStateReader Updated live nodes from ZooKeeper... (4) -> (5)
   [junit4]   2> 3545463 INFO  (zkCallback-72927-thread-1) [    ] o.a.s.c.c.ZkStateReader Updated live nodes from ZooKeeper... (4) -> (5)
   [junit4]   2> 3545463 INFO  (zkCallback-72916-thread-1) [    ] o.a.s.c.c.ZkStateReader Updated live nodes from ZooKeeper... (4) -> (5)
   [junit4]   2> 3545463 INFO  (zkCallback-72945-thread-1) [    ] o.a.s.c.c.ZkStateReader Updated live nodes from ZooKeeper... (4) -> (5)
   [junit4]   2> 3545463 INFO  (zkCallback-72904-thread-1) [    ] o.a.s.c.c.ZkStateReader Updated live nodes from ZooKeeper... (4) -> (5)
   [junit4]   2> 3545464 INFO  (zkCallback-72897-thread-3) [    ] o.a.s.c.c.ZkStateReader Updated live nodes from ZooKeeper... (4) -> (5)
   [junit4]   2> 3545468 INFO  (zkCallback-72952-thread-1) [    ] o.a.s.c.c.ZkStateReader Updated live nodes from ZooKeeper... (4) -> (5)
   [junit4]   2> 3545468 INFO  (zkCallback-72970-thread-1) [    ] o.a.s.c.c.ZkStateReader Updated live nodes from ZooKeeper... (4) -> (5)
   [junit4]   2> 3545468 INFO  (zkCallback-72963-thread-1) [    ] o.a.s.c.c.ZkStateReader Updated live nodes from ZooKeeper... (4) -> (5)
   [junit4]   2> 3545468 INFO  (zkCallback-72981-thread-1) [    ] o.a.s.c.c.ZkStateReader Updated live nodes from ZooKeeper... (4) -> (5)
   [junit4]   2> 3545468 INFO  (zkConnectionManagerCallback-72986-thread-1) [    ] o.a.s.c.c.ConnectionManager zkClient has connected
   [junit4]   2> 3545469 INFO  (closeThreadPool-72918-thread-1) [    ] o.a.s.s.SolrDispatchFilter Loading solr.xml from SolrHome (not found in ZooKeeper)
   [junit4]   2> 3545469 INFO  (closeThreadPool-72918-thread-1) [    ] o.a.s.c.SolrXmlConfig Loading container configuration from /x1/jenkins/jenkins-slave/workspace/Lucene-Solr-NightlyTests-8.x/checkout/solr/build/solr-core/test/J1/temp/solr.cloud.hdfs.StressHdfsTest_8FB92E0E34FF0327-001/shard-5-001/solr.xml
   [junit4]   2> 3545474 INFO  (closeThreadPool-72918-thread-1) [    ] o.a.s.c.SolrXmlConfig Configuration parameter autoReplicaFailoverWorkLoopDelay is ignored
   [junit4]   2> 3545474 INFO  (closeThreadPool-72918-thread-1) [    ] o.a.s.c.SolrXmlConfig Configuration parameter autoReplicaFailoverBadNodeExpiration is ignored
   [junit4]   2> 3545476 INFO  (closeThreadPool-72918-thread-1) [    ] o.a.s.c.SolrXmlConfig MBean server found: com.sun.jmx.mbeanserver.JmxMBeanServer@30d2035f, but no JMX reporters were configured - adding default JMX reporter.
   [junit4]   2> 3545495 INFO  (zkConnectionManagerCallback-72991-thread-1) [    ] o.a.s.c.c.ConnectionManager zkClient has connected
   [junit4]   2> 3545497 INFO  (closeThreadPool-72918-thread-2) [    ] o.a.s.c.c.ZkStateReader Updated live nodes from ZooKeeper... (0) -> (5)
   [junit4]   2> 3545498 INFO  (closeThreadPool-72918-thread-2) [    ] o.a.s.c.s.i.ZkClientClusterStateProvider Cluster at 127.0.0.1:35052/solr ready
   [junit4]   2> 3545504 INFO  (closeThreadPool-72918-thread-2) [    ] o.a.s.h.a.MetricsHistoryHandler No .system collection, keeping metrics history in memory.
   [junit4]   2> 3545561 INFO  (closeThreadPool-72918-thread-2) [    ] o.a.s.m.r.SolrJmxReporter JMX monitoring for 'solr.node' (registry 'solr.node') enabled at server: com.sun.jmx.mbeanserver.JmxMBeanServer@30d2035f
   [junit4]   2> 3545591 INFO  (closeThreadPool-72918-thread-2) [    ] o.a.s.m.r.SolrJmxReporter JMX monitoring for 'solr.jvm' (registry 'solr.jvm') enabled at server: com.sun.jmx.mbeanserver.JmxMBeanServer@30d2035f
   [junit4]   2> 3545591 INFO  (closeThreadPool-72918-thread-2) [    ] o.a.s.m.r.SolrJmxReporter JMX monitoring for 'solr.jetty' (registry 'solr.jetty') enabled at server: com.sun.jmx.mbeanserver.JmxMBeanServer@30d2035f
   [junit4]   2> 3545595 INFO  (closeThreadPool-72918-thread-2) [    ] o.a.s.c.CorePropertiesLocator Found 0 core definitions underneath /x1/jenkins/jenkins-slave/workspace/Lucene-Solr-NightlyTests-8.x/checkout/solr/build/solr-core/test/J1/temp/solr.cloud.hdfs.StressHdfsTest_8FB92E0E34FF0327-001/shard-4-001/cores
   [junit4]   2> 3545669 INFO  (closeThreadPool-72918-thread-1) [    ] o.a.s.h.c.HttpShardHandlerFactory Host whitelist initialized: WhitelistHostChecker [whitelistHosts=null, whitelistHostCheckingEnabled=false]
   [junit4]   2> 3545671 WARN  (closeThreadPool-72918-thread-1

[...truncated too long message...]

1 (64-bit)/cpus=4,threads=4,free=137686152,total=475529216
   [junit4]   2> NOTE: All tests run in this JVM: [OutOfBoxZkACLAndCredentialsProvidersTest, ConcurrentCreateRoutedAliasTest, TestExpandComponent, TestSolrDeletionPolicy1, BooleanFieldTest, MinimalSchemaTest, TestStressUserVersions, TestUseDocValuesAsStored, TestConfigOverlay, SpellPossibilityIteratorTest, TestReplicationHandlerBackup, MetricsHistoryIntegrationTest, TestConfigSets, HighlighterTest, RulesTest, CSVRequestHandlerTest, TermVectorComponentTest, CreateCollectionCleanupTest, SolrSlf4jReporterTest, TestBinaryField, TestFieldTypeResource, DistanceFunctionTest, TestSolrCLIRunExample, CircularListTest, MetricsConfigTest, RecoveryAfterSoftCommitTest, EmbeddedSolrNoSerializeTest, PhrasesIdentificationComponentTest, TestOverriddenPrefixQueryForCustomFieldType, SaslZkACLProviderTest, TestLMDirichletSimilarityFactory, ZkSolrClientTest, TestCorePropertiesReload, SystemInfoHandlerTest, TestRecoveryHdfs, DistanceUnitsTest, SolrRrdBackendFactoryTest, TestFreeTextSuggestions, SolrPluginUtilsTest, WordBreakSolrSpellCheckerTest, TestSQLHandler, CollectionPropsTest, TestReplicaProperties, TestStressLucene, TestLazyCores, DistributedFacetExistsSmallTest, SparseHLLTest, BufferStoreTest, TestDistributedSearch, MetricsHistoryHandlerTest, DistributedFacetPivotSmallAdvancedTest, AliasIntegrationTest, TestXmlQParserPlugin, TestTolerantSearch, SuggesterTest, MaxSizeAutoCommitTest, TestSolrQueryParser, ShufflingReplicaListTransformerTest, ConfigureRecoveryStrategyTest, SimpleMLTQParserTest, ReturnFieldsTest, TestSimComputePlanAction, HdfsBasicDistributedZkTest, HdfsNNFailoverTest, TestMinMaxOnMultiValuedField, SolrMetricReporterTest, SolrCoreCheckLockOnStartupTest, OrderedExecutorTest, TestLegacyFieldReuse, TestHalfAndHalfDocValues, TestConfigSetsAPI, TestJsonFacetRefinement, TestManagedSynonymGraphFilterFactory, TestIntervalFaceting, TestBlobHandler, BadComponentTest, BasicDistributedZk2Test, DistributedVersionInfoTest, DocExpirationUpdateProcessorFactoryTest, TestAtomicUpdateErrorCases, TestFieldCollectionResource, AddBlockUpdateTest, DocValuesMissingTest, TestObjectReleaseTracker, CheckHdfsIndexTest, TestSolrCloudWithDelegationTokens, RestartWhileUpdatingTest, TestCryptoKeys, TestSolrCloudSnapshots, CollectionTooManyReplicasTest, HdfsTlogReplayBufferedWhileIndexingTest, TokenizerChainTest, TestRandomFlRTGCloud, SegmentsInfoRequestHandlerTest, TestDocTermOrds, ScheduledMaintenanceTriggerTest, TestCloudSchemaless, TestSchemaManager, AddSchemaFieldsUpdateProcessorFactoryTest, TestCursorMarkWithoutUniqueKey, TestCloudNestedDocsSort, TestNumericTerms32, DebugComponentTest, FullSolrCloudDistribCmdsTest, ChaosMonkeySafeLeaderWithPullReplicasTest, TestUniqueKeyFieldResource, NoCacheHeaderTest, DeleteLastCustomShardedReplicaTest, MoveReplicaHDFSFailoverTest, TestSmileRequest, DistributedMLTComponentTest, NumericFieldsTest, TestConfigsApi, TestSimPolicyCloud, TestPhraseSuggestions, TestFieldCacheVsDocValues, MultiSolrCloudTestCaseTest, CdcrBidirectionalTest, TestRawTransformer, TaggerTest, TestPrepRecovery, TestShortCircuitedRequests, BigEndianAscendingWordSerializerTest, NodeLostTriggerTest, SolrInfoBeanTest, VMParamsZkACLAndCredentialsProvidersTest, TestGeoJSONResponseWriter, CdcrReplicationHandlerTest, SolrCloudExampleTest, TestSolrCoreParser, ZkStateWriterTest, TestNumericTokenStream, AutoAddReplicasPlanActionTest, TestSolrConfigHandlerConcurrent, LeaderTragicEventTest, TestRandomFaceting, PathHierarchyTokenizerFactoryTest, TestCharFilters, TestLuceneMatchVersion, TestEmbeddedSolrServerAdminHandler, TestEmbeddedSolrServerConstructors, TestEmbeddedSolrServerSchemaAPI, TestJettySolrRunner, ActionThrottleTest, ChaosMonkeyNothingIsSafeTest, DeleteStatusTest, DistribDocExpirationUpdateProcessorTest, LeaderElectionContextKeyTest, LeaderElectionIntegrationTest, OverseerCollectionConfigSetProcessorTest, OverseerModifyCollectionTest, OverseerRolesTest, OverseerStatusTest, OverseerTest, SharedFSAutoReplicaFailoverTest, SliceStateTest, SplitShardTest, TestAuthenticationFramework, TestCloudDeleteByQuery, TestCloudInspectUtil, TestCloudPhrasesIdentificationComponent, TestCloudPivotFacet, TestCloudRecovery, TestDistribDocBasedVersion, TestExclusionRuleCollectionAccess, TestLeaderElectionWithEmptyReplica, TestLockTree, TestRebalanceLeaders, TestStressInPlaceUpdates, TestStressLiveNodes, CustomCollectionTest, SimpleCollectionCreateDeleteTest, TestCollectionAPI, TestHdfsCloudBackupRestore, ComputePlanActionTest, MetricTriggerTest, NodeAddedTriggerTest, SearchRateTriggerTest, SystemLogListenerTest, TestPolicyCloud, TriggerEventQueueTest, TriggerIntegrationTest, HDFSCollectionsAPITest, HdfsRecoveryZkTest, HdfsRestartWhileUpdatingTest, HdfsSyncSliceTest, HdfsWriteToMultipleCollectionsTest, StressHdfsTest]
   [junit4] Completed [594/840 (2!)] on J1 in 396.71s, 1 test, 1 failure <<< FAILURES!

[...truncated 839 lines...]
   [junit4] JVM J2: stdout was not empty, see: /x1/jenkins/jenkins-slave/workspace/Lucene-Solr-NightlyTests-8.x/checkout/solr/build/solr-core/test/temp/junit4-J2-20190131_195108_6454089437810616637102.sysout
   [junit4] >>> JVM J2 emitted unexpected output (verbatim) ----
   [junit4] java.lang.OutOfMemoryError: GC overhead limit exceeded
   [junit4] Dumping heap to /x1/jenkins/jenkins-slave/workspace/Lucene-Solr-NightlyTests-8.x/checkout/heapdumps/java_pid10821.hprof ...
   [junit4] Heap dump file created [466744385 bytes in 1.311 secs]
   [junit4] <<< JVM J2: EOF ----

   [junit4] JVM J2: stderr was not empty, see: /x1/jenkins/jenkins-slave/workspace/Lucene-Solr-NightlyTests-8.x/checkout/solr/build/solr-core/test/temp/junit4-J2-20190131_195108_6455412283366714573240.syserr
   [junit4] >>> JVM J2 emitted unexpected output (verbatim) ----
   [junit4] WARN: Event serializer exception. -> java.lang.OutOfMemoryError: GC overhead limit exceeded
   [junit4] 	at java.lang.StackTraceElement.toString(StackTraceElement.java:172)
   [junit4] 	at java.lang.String.valueOf(String.java:2994)
   [junit4] 	at java.lang.StringBuilder.append(StringBuilder.java:131)
   [junit4] 	at java.lang.Throwable.printStackTrace(Throwable.java:658)
   [junit4] 	at java.lang.Throwable.printStackTrace(Throwable.java:721)
   [junit4] 	at org.junit.runner.notification.Failure.getTrace(Failure.java:75)
   [junit4] 	at com.carrotsearch.ant.tasks.junit4.events.mirrors.FailureMirror.<init>(FailureMirror.java:42)
   [junit4] 	at com.carrotsearch.ant.tasks.junit4.events.FailureEvent.setFailure(FailureEvent.java:27)
   [junit4] 	at com.carrotsearch.ant.tasks.junit4.events.TestFailureEvent.<init>(TestFailureEvent.java:12)
   [junit4] 	at com.carrotsearch.ant.tasks.junit4.slave.RunListenerEmitter.testFailure(RunListenerEmitter.java:54)
   [junit4] 	at com.carrotsearch.ant.tasks.junit4.slave.NoExceptionRunListenerDecorator.testFailure(NoExceptionRunListenerDecorator.java:55)
   [junit4] 	at com.carrotsearch.ant.tasks.junit4.slave.BeforeAfterRunListenerDecorator.testFailure(BeforeAfterRunListenerDecorator.java:60)
   [junit4] 	at com.carrotsearch.ant.tasks.junit4.slave.OrderedRunNotifier$4.notifyListener(OrderedRunNotifier.java:129)
   [junit4] 	at com.carrotsearch.ant.tasks.junit4.slave.OrderedRunNotifier$SafeNotifier.run(OrderedRunNotifier.java:63)
   [junit4] 	at com.carrotsearch.ant.tasks.junit4.slave.OrderedRunNotifier.fireTestFailure(OrderedRunNotifier.java:131)
   [junit4] 	at com.carrotsearch.randomizedtesting.ThreadLeakControl$SubNotifier.fireTestFailure(ThreadLeakControl.java:184)
   [junit4] 	at com.carrotsearch.randomizedtesting.RandomizedRunner.fireTestFailure(RandomizedRunner.java:865)
   [junit4] 	at com.carrotsearch.randomizedtesting.RandomizedRunner.runSingleTest(RandomizedRunner.java:953)
   [junit4] 	at com.carrotsearch.randomizedtesting.RandomizedRunner$5.evaluate(RandomizedRunner.java:832)
   [junit4] 	at com.carrotsearch.randomizedtesting.RandomizedRunner$6.evaluate(RandomizedRunner.java:883)
   [junit4] 	at com.carrotsearch.randomizedtesting.RandomizedRunner$7.evaluate(RandomizedRunner.java:894)
   [junit4] 	at org.apache.lucene.util.Abstra
   [junit4] ctBeforeAfterRule$1.evaluate(AbstractBeforeAfterRule.java:45)
   [junit4] 	at com.carrotsearch.randomizedtesting.rules.StatementAdapter.evaluate(StatementAdapter.java:36)
   [junit4] 	at org.apache.lucene.util.TestRuleStoreClassName$1.evaluate(TestRuleStoreClassName.java:41)
   [junit4] 	at com.carrotsearch.randomizedtesting.rules.NoShadowingOrOverridesOnMethodsRule$1.evaluate(NoShadowingOrOverridesOnMethodsRule.java:40)
   [junit4] 	at com.carrotsearch.randomizedtesting.rules.NoShadowingOrOverridesOnMethodsRule$1.evaluate(NoShadowingOrOverridesOnMethodsRule.java:40)
   [junit4] 	at com.carrotsearch.randomizedtesting.rules.StatementAdapter.evaluate(StatementAdapter.java:36)
   [junit4] 	at com.carrotsearch.randomizedtesting.rules.StatementAdapter.evaluate(StatementAdapter.java:36)
   [junit4] 	at com.carrotsearch.randomizedtesting.rules.StatementAdapter.evaluate(StatementAdapter.java:36)
   [junit4] 	at org.apache.lucene.util.TestRuleAssertionsRequired$1.evaluate(TestRuleAssertionsRequired.java:53)
   [junit4] 	at org.apache.lucene.util.TestRuleMarkFailure$1.evaluate(TestRuleMarkFailure.java:47)
   [junit4] 	at org.apache.lucene.util.TestRuleIgnoreAfterMaxFailures$1.evaluate(TestRuleIgnoreAfterMaxFailures.java:64)
   [junit4] <<< JVM J2: EOF ----

[...truncated 8920 lines...]
BUILD FAILED
/x1/jenkins/jenkins-slave/workspace/Lucene-Solr-NightlyTests-8.x/checkout/build.xml:651: The following error occurred while executing this line:
/x1/jenkins/jenkins-slave/workspace/Lucene-Solr-NightlyTests-8.x/checkout/build.xml:585: Some of the tests produced a heap dump, but did not fail. Maybe a suppressed OutOfMemoryError? Dumps created:
* java_pid10821.hprof

Total time: 274 minutes 56 seconds
Build step 'Invoke Ant' marked build as failure
Archiving artifacts
Recording test results
Email was triggered for: Failure - Any
Sending email for trigger: Failure - Any

Mime
View raw message