lucene-dev mailing list archives

Site index · List index
Message view « Date » · « Thread »
Top « Date » · « Thread »
From Policeman Jenkins Server <jenk...@thetaphi.de>
Subject [JENKINS] Lucene-Solr-7.x-Windows (64bit/jdk1.8.0_172) - Build # 949 - Failure!
Date Wed, 09 Jan 2019 07:10:00 GMT
Build: https://jenkins.thetaphi.de/job/Lucene-Solr-7.x-Windows/949/
Java: 64bit/jdk1.8.0_172 -XX:-UseCompressedOops -XX:+UseG1GC

1 tests failed.
FAILED:  org.apache.solr.handler.TestSQLHandler.doTest

Error Message:


Stack Trace:
java.lang.AssertionError
	at __randomizedtesting.SeedInfo.seed([6D2A49D52AAA9387:CA6EF1714711803E]:0)
	at org.apache.solr.handler.TestSQLHandler.testBasicSelect(TestSQLHandler.java:236)
	at org.apache.solr.handler.TestSQLHandler.doTest(TestSQLHandler.java:93)
	at sun.reflect.NativeMethodAccessorImpl.invoke0(Native Method)
	at sun.reflect.NativeMethodAccessorImpl.invoke(NativeMethodAccessorImpl.java:62)
	at sun.reflect.DelegatingMethodAccessorImpl.invoke(DelegatingMethodAccessorImpl.java:43)
	at java.lang.reflect.Method.invoke(Method.java:498)
	at com.carrotsearch.randomizedtesting.RandomizedRunner.invoke(RandomizedRunner.java:1750)
	at com.carrotsearch.randomizedtesting.RandomizedRunner$8.evaluate(RandomizedRunner.java:938)
	at com.carrotsearch.randomizedtesting.RandomizedRunner$9.evaluate(RandomizedRunner.java:974)
	at com.carrotsearch.randomizedtesting.RandomizedRunner$10.evaluate(RandomizedRunner.java:988)
	at org.apache.solr.BaseDistributedSearchTestCase$ShardsRepeatRule$ShardsFixedStatement.callStatement(BaseDistributedSearchTestCase.java:1063)
	at org.apache.solr.BaseDistributedSearchTestCase$ShardsRepeatRule$ShardsStatement.evaluate(BaseDistributedSearchTestCase.java:1035)
	at com.carrotsearch.randomizedtesting.rules.SystemPropertiesRestoreRule$1.evaluate(SystemPropertiesRestoreRule.java:57)
	at org.apache.lucene.util.TestRuleSetupTeardownChained$1.evaluate(TestRuleSetupTeardownChained.java:49)
	at org.apache.lucene.util.AbstractBeforeAfterRule$1.evaluate(AbstractBeforeAfterRule.java:45)
	at org.apache.lucene.util.TestRuleThreadAndTestName$1.evaluate(TestRuleThreadAndTestName.java:48)
	at org.apache.lucene.util.TestRuleIgnoreAfterMaxFailures$1.evaluate(TestRuleIgnoreAfterMaxFailures.java:64)
	at org.apache.lucene.util.TestRuleMarkFailure$1.evaluate(TestRuleMarkFailure.java:47)
	at com.carrotsearch.randomizedtesting.rules.StatementAdapter.evaluate(StatementAdapter.java:36)
	at com.carrotsearch.randomizedtesting.ThreadLeakControl$StatementRunner.run(ThreadLeakControl.java:368)
	at com.carrotsearch.randomizedtesting.ThreadLeakControl.forkTimeoutingTask(ThreadLeakControl.java:817)
	at com.carrotsearch.randomizedtesting.ThreadLeakControl$3.evaluate(ThreadLeakControl.java:468)
	at com.carrotsearch.randomizedtesting.RandomizedRunner.runSingleTest(RandomizedRunner.java:947)
	at com.carrotsearch.randomizedtesting.RandomizedRunner$5.evaluate(RandomizedRunner.java:832)
	at com.carrotsearch.randomizedtesting.RandomizedRunner$6.evaluate(RandomizedRunner.java:883)
	at com.carrotsearch.randomizedtesting.RandomizedRunner$7.evaluate(RandomizedRunner.java:894)
	at com.carrotsearch.randomizedtesting.rules.StatementAdapter.evaluate(StatementAdapter.java:36)
	at com.carrotsearch.randomizedtesting.rules.SystemPropertiesRestoreRule$1.evaluate(SystemPropertiesRestoreRule.java:57)
	at org.apache.lucene.util.AbstractBeforeAfterRule$1.evaluate(AbstractBeforeAfterRule.java:45)
	at com.carrotsearch.randomizedtesting.rules.StatementAdapter.evaluate(StatementAdapter.java:36)
	at org.apache.lucene.util.TestRuleStoreClassName$1.evaluate(TestRuleStoreClassName.java:41)
	at com.carrotsearch.randomizedtesting.rules.NoShadowingOrOverridesOnMethodsRule$1.evaluate(NoShadowingOrOverridesOnMethodsRule.java:40)
	at com.carrotsearch.randomizedtesting.rules.NoShadowingOrOverridesOnMethodsRule$1.evaluate(NoShadowingOrOverridesOnMethodsRule.java:40)
	at com.carrotsearch.randomizedtesting.rules.StatementAdapter.evaluate(StatementAdapter.java:36)
	at com.carrotsearch.randomizedtesting.rules.StatementAdapter.evaluate(StatementAdapter.java:36)
	at com.carrotsearch.randomizedtesting.rules.StatementAdapter.evaluate(StatementAdapter.java:36)
	at org.apache.lucene.util.TestRuleAssertionsRequired$1.evaluate(TestRuleAssertionsRequired.java:53)
	at org.apache.lucene.util.TestRuleMarkFailure$1.evaluate(TestRuleMarkFailure.java:47)
	at org.apache.lucene.util.TestRuleIgnoreAfterMaxFailures$1.evaluate(TestRuleIgnoreAfterMaxFailures.java:64)
	at org.apache.lucene.util.TestRuleIgnoreTestSuites$1.evaluate(TestRuleIgnoreTestSuites.java:54)
	at com.carrotsearch.randomizedtesting.rules.StatementAdapter.evaluate(StatementAdapter.java:36)
	at com.carrotsearch.randomizedtesting.ThreadLeakControl$StatementRunner.run(ThreadLeakControl.java:368)
	at java.lang.Thread.run(Thread.java:748)




Build Log:
[...truncated 13929 lines...]
   [junit4] Suite: org.apache.solr.handler.TestSQLHandler
   [junit4]   2> Creating dataDir: C:\Users\jenkins\workspace\Lucene-Solr-7.x-Windows\solr\build\solr-core\test\J1\temp\solr.handler.TestSQLHandler_6D2A49D52AAA9387-001\init-core-data-001
   [junit4]   2> 1501036 WARN  (SUITE-TestSQLHandler-seed#[6D2A49D52AAA9387]-worker) [    ] o.a.s.SolrTestCaseJ4 startTrackingSearchers: numOpens=4 numCloses=4
   [junit4]   2> 1501036 INFO  (SUITE-TestSQLHandler-seed#[6D2A49D52AAA9387]-worker) [    ] o.a.s.SolrTestCaseJ4 Using PointFields (NUMERIC_POINTS_SYSPROP=true) w/NUMERIC_DOCVALUES_SYSPROP=false
   [junit4]   2> 1501036 INFO  (SUITE-TestSQLHandler-seed#[6D2A49D52AAA9387]-worker) [    ] o.a.s.SolrTestCaseJ4 Randomized ssl (false) and clientAuth (false) via: @org.apache.solr.SolrTestCaseJ4$SuppressSSL(bugUrl=None)
   [junit4]   2> 1501036 INFO  (SUITE-TestSQLHandler-seed#[6D2A49D52AAA9387]-worker) [    ] o.a.s.SolrTestCaseJ4 SecureRandom sanity checks: test.solr.allowed.securerandom=null & java.security.egd=file:/dev/./urandom
   [junit4]   2> 1501036 INFO  (SUITE-TestSQLHandler-seed#[6D2A49D52AAA9387]-worker) [    ] o.a.s.BaseDistributedSearchTestCase Setting hostContext system property: /
   [junit4]   2> 1501052 INFO  (TEST-TestSQLHandler.doTest-seed#[6D2A49D52AAA9387]) [    ] o.a.s.c.ZkTestServer STARTING ZK TEST SERVER
   [junit4]   2> 1501052 INFO  (ZkTestServer Run Thread) [    ] o.a.s.c.ZkTestServer client port:0.0.0.0/0.0.0.0:0
   [junit4]   2> 1501052 INFO  (ZkTestServer Run Thread) [    ] o.a.s.c.ZkTestServer Starting server
   [junit4]   2> 1501159 INFO  (TEST-TestSQLHandler.doTest-seed#[6D2A49D52AAA9387]) [    ] o.a.s.c.ZkTestServer start zk server on port:62540
   [junit4]   2> 1501159 INFO  (TEST-TestSQLHandler.doTest-seed#[6D2A49D52AAA9387]) [    ] o.a.s.c.ZkTestServer parse host and port list: 127.0.0.1:62540
   [junit4]   2> 1501159 INFO  (TEST-TestSQLHandler.doTest-seed#[6D2A49D52AAA9387]) [    ] o.a.s.c.ZkTestServer connecting to 127.0.0.1 62540
   [junit4]   2> 1501159 INFO  (zkConnectionManagerCallback-7708-thread-1) [    ] o.a.s.c.c.ConnectionManager zkClient has connected
   [junit4]   2> 1501159 INFO  (zkConnectionManagerCallback-7710-thread-1) [    ] o.a.s.c.c.ConnectionManager zkClient has connected
   [junit4]   2> 1501159 INFO  (TEST-TestSQLHandler.doTest-seed#[6D2A49D52AAA9387]) [    ] o.a.s.c.ZkTestServer put C:\Users\jenkins\workspace\Lucene-Solr-7.x-Windows\solr\core\src\test-files\solr\collection1\conf\solrconfig-sql.xml to /configs/conf1/solrconfig.xml
   [junit4]   2> 1501159 INFO  (TEST-TestSQLHandler.doTest-seed#[6D2A49D52AAA9387]) [    ] o.a.s.c.ZkTestServer put C:\Users\jenkins\workspace\Lucene-Solr-7.x-Windows\solr\core\src\test-files\solr\collection1\conf\schema-sql.xml to /configs/conf1/schema.xml
   [junit4]   2> 1501175 INFO  (TEST-TestSQLHandler.doTest-seed#[6D2A49D52AAA9387]) [    ] o.a.s.c.ZkTestServer put C:\Users\jenkins\workspace\Lucene-Solr-7.x-Windows\solr\core\src\test-files\solr\collection1\conf\solrconfig.snippet.randomindexconfig.xml to /configs/conf1/solrconfig.snippet.randomindexconfig.xml
   [junit4]   2> 1501175 INFO  (TEST-TestSQLHandler.doTest-seed#[6D2A49D52AAA9387]) [    ] o.a.s.c.ZkTestServer put C:\Users\jenkins\workspace\Lucene-Solr-7.x-Windows\solr\core\src\test-files\solr\collection1\conf\stopwords.txt to /configs/conf1/stopwords.txt
   [junit4]   2> 1501175 INFO  (TEST-TestSQLHandler.doTest-seed#[6D2A49D52AAA9387]) [    ] o.a.s.c.ZkTestServer put C:\Users\jenkins\workspace\Lucene-Solr-7.x-Windows\solr\core\src\test-files\solr\collection1\conf\protwords.txt to /configs/conf1/protwords.txt
   [junit4]   2> 1501175 INFO  (TEST-TestSQLHandler.doTest-seed#[6D2A49D52AAA9387]) [    ] o.a.s.c.ZkTestServer put C:\Users\jenkins\workspace\Lucene-Solr-7.x-Windows\solr\core\src\test-files\solr\collection1\conf\currency.xml to /configs/conf1/currency.xml
   [junit4]   2> 1501175 INFO  (TEST-TestSQLHandler.doTest-seed#[6D2A49D52AAA9387]) [    ] o.a.s.c.ZkTestServer put C:\Users\jenkins\workspace\Lucene-Solr-7.x-Windows\solr\core\src\test-files\solr\collection1\conf\enumsConfig.xml to /configs/conf1/enumsConfig.xml
   [junit4]   2> 1501175 INFO  (TEST-TestSQLHandler.doTest-seed#[6D2A49D52AAA9387]) [    ] o.a.s.c.ZkTestServer put C:\Users\jenkins\workspace\Lucene-Solr-7.x-Windows\solr\core\src\test-files\solr\collection1\conf\open-exchange-rates.json to /configs/conf1/open-exchange-rates.json
   [junit4]   2> 1501175 INFO  (TEST-TestSQLHandler.doTest-seed#[6D2A49D52AAA9387]) [    ] o.a.s.c.ZkTestServer put C:\Users\jenkins\workspace\Lucene-Solr-7.x-Windows\solr\core\src\test-files\solr\collection1\conf\mapping-ISOLatin1Accent.txt to /configs/conf1/mapping-ISOLatin1Accent.txt
   [junit4]   2> 1501175 INFO  (TEST-TestSQLHandler.doTest-seed#[6D2A49D52AAA9387]) [    ] o.a.s.c.ZkTestServer put C:\Users\jenkins\workspace\Lucene-Solr-7.x-Windows\solr\core\src\test-files\solr\collection1\conf\old_synonyms.txt to /configs/conf1/old_synonyms.txt
   [junit4]   2> 1501175 INFO  (TEST-TestSQLHandler.doTest-seed#[6D2A49D52AAA9387]) [    ] o.a.s.c.ZkTestServer put C:\Users\jenkins\workspace\Lucene-Solr-7.x-Windows\solr\core\src\test-files\solr\collection1\conf\synonyms.txt to /configs/conf1/synonyms.txt
   [junit4]   2> 1501175 INFO  (TEST-TestSQLHandler.doTest-seed#[6D2A49D52AAA9387]) [    ] o.a.s.c.AbstractFullDistribZkTestBase Will use NRT replicas unless explicitly asked otherwise
   [junit4]   2> 1501748 WARN  (TEST-TestSQLHandler.doTest-seed#[6D2A49D52AAA9387]) [    ] o.e.j.s.AbstractConnector Ignoring deprecated socket close linger time
   [junit4]   2> 1501748 INFO  (TEST-TestSQLHandler.doTest-seed#[6D2A49D52AAA9387]) [    ] o.a.s.c.s.e.JettySolrRunner Start Jetty (original configured port=0)
   [junit4]   2> 1501748 INFO  (TEST-TestSQLHandler.doTest-seed#[6D2A49D52AAA9387]) [    ] o.a.s.c.s.e.JettySolrRunner Trying to start Jetty on port 0 try number 1 ...
   [junit4]   2> 1501748 INFO  (TEST-TestSQLHandler.doTest-seed#[6D2A49D52AAA9387]) [    ] o.e.j.s.Server jetty-9.4.14.v20181114; built: 2018-11-14T21:20:31.478Z; git: c4550056e785fb5665914545889f21dc136ad9e6; jvm 1.8.0_172-b11
   [junit4]   2> 1501748 INFO  (TEST-TestSQLHandler.doTest-seed#[6D2A49D52AAA9387]) [    ] o.e.j.s.session DefaultSessionIdManager workerName=node0
   [junit4]   2> 1501748 INFO  (TEST-TestSQLHandler.doTest-seed#[6D2A49D52AAA9387]) [    ] o.e.j.s.session No SessionScavenger set, using defaults
   [junit4]   2> 1501748 INFO  (TEST-TestSQLHandler.doTest-seed#[6D2A49D52AAA9387]) [    ] o.e.j.s.session node0 Scavenging every 660000ms
   [junit4]   2> 1501748 INFO  (TEST-TestSQLHandler.doTest-seed#[6D2A49D52AAA9387]) [    ] o.e.j.s.h.ContextHandler Started o.e.j.s.ServletContextHandler@68b357ee{/,null,AVAILABLE}
   [junit4]   2> 1501748 INFO  (TEST-TestSQLHandler.doTest-seed#[6D2A49D52AAA9387]) [    ] o.e.j.s.AbstractConnector Started ServerConnector@6d21a864{HTTP/1.1,[http/1.1]}{127.0.0.1:62558}
   [junit4]   2> 1501748 INFO  (TEST-TestSQLHandler.doTest-seed#[6D2A49D52AAA9387]) [    ] o.e.j.s.Server Started @1486704ms
   [junit4]   2> 1501748 INFO  (TEST-TestSQLHandler.doTest-seed#[6D2A49D52AAA9387]) [    ] o.a.s.c.s.e.JettySolrRunner Jetty properties: {solr.data.dir=C:\Users\jenkins\workspace\Lucene-Solr-7.x-Windows\solr\build\solr-core\test\J1\temp\solr.handler.TestSQLHandler_6D2A49D52AAA9387-001\tempDir-001/control/data, hostContext=/, hostPort=62558, coreRootDirectory=C:\Users\jenkins\workspace\Lucene-Solr-7.x-Windows\solr\build\solr-core\test\J1\temp\solr.handler.TestSQLHandler_6D2A49D52AAA9387-001\control-001\cores}
   [junit4]   2> 1501748 ERROR (TEST-TestSQLHandler.doTest-seed#[6D2A49D52AAA9387]) [    ] o.a.s.u.StartupLoggingUtils Missing Java Option solr.log.dir. Logging may be missing or incomplete.
   [junit4]   2> 1501748 INFO  (TEST-TestSQLHandler.doTest-seed#[6D2A49D52AAA9387]) [    ] o.a.s.s.SolrDispatchFilter Using logger factory org.apache.logging.slf4j.Log4jLoggerFactory
   [junit4]   2> 1501748 INFO  (TEST-TestSQLHandler.doTest-seed#[6D2A49D52AAA9387]) [    ] o.a.s.s.SolrDispatchFilter  ___      _       Welcome to Apache Solr™ version 7.7.0
   [junit4]   2> 1501748 INFO  (TEST-TestSQLHandler.doTest-seed#[6D2A49D52AAA9387]) [    ] o.a.s.s.SolrDispatchFilter / __| ___| |_ _   Starting in cloud mode on port null
   [junit4]   2> 1501748 INFO  (TEST-TestSQLHandler.doTest-seed#[6D2A49D52AAA9387]) [    ] o.a.s.s.SolrDispatchFilter \__ \/ _ \ | '_|  Install dir: null
   [junit4]   2> 1501748 INFO  (TEST-TestSQLHandler.doTest-seed#[6D2A49D52AAA9387]) [    ] o.a.s.s.SolrDispatchFilter |___/\___/_|_|    Start time: 2019-01-09T06:09:57.958Z
   [junit4]   2> 1501763 INFO  (zkConnectionManagerCallback-7712-thread-1) [    ] o.a.s.c.c.ConnectionManager zkClient has connected
   [junit4]   2> 1501763 INFO  (TEST-TestSQLHandler.doTest-seed#[6D2A49D52AAA9387]) [    ] o.a.s.s.SolrDispatchFilter Loading solr.xml from SolrHome (not found in ZooKeeper)
   [junit4]   2> 1501763 INFO  (TEST-TestSQLHandler.doTest-seed#[6D2A49D52AAA9387]) [    ] o.a.s.c.SolrXmlConfig Loading container configuration from C:\Users\jenkins\workspace\Lucene-Solr-7.x-Windows\solr\build\solr-core\test\J1\temp\solr.handler.TestSQLHandler_6D2A49D52AAA9387-001\control-001\solr.xml
   [junit4]   2> 1501763 INFO  (TEST-TestSQLHandler.doTest-seed#[6D2A49D52AAA9387]) [    ] o.a.s.c.SolrXmlConfig Configuration parameter autoReplicaFailoverWorkLoopDelay is ignored
   [junit4]   2> 1501763 INFO  (TEST-TestSQLHandler.doTest-seed#[6D2A49D52AAA9387]) [    ] o.a.s.c.SolrXmlConfig Configuration parameter autoReplicaFailoverBadNodeExpiration is ignored
   [junit4]   2> 1501779 INFO  (TEST-TestSQLHandler.doTest-seed#[6D2A49D52AAA9387]) [    ] o.a.s.c.SolrXmlConfig MBean server found: com.sun.jmx.mbeanserver.JmxMBeanServer@70f43ff6, but no JMX reporters were configured - adding default JMX reporter.
   [junit4]   2> 1502150 INFO  (TEST-TestSQLHandler.doTest-seed#[6D2A49D52AAA9387]) [    ] o.a.s.c.ZkContainer Zookeeper client=127.0.0.1:62540/solr
   [junit4]   2> 1502150 INFO  (zkConnectionManagerCallback-7716-thread-1) [    ] o.a.s.c.c.ConnectionManager zkClient has connected
   [junit4]   2> 1502150 INFO  (zkConnectionManagerCallback-7718-thread-1) [    ] o.a.s.c.c.ConnectionManager zkClient has connected
   [junit4]   2> 1502243 INFO  (TEST-TestSQLHandler.doTest-seed#[6D2A49D52AAA9387]) [n:127.0.0.1:62558_    ] o.a.s.c.OverseerElectionContext I am going to be the leader 127.0.0.1:62558_
   [junit4]   2> 1502243 INFO  (TEST-TestSQLHandler.doTest-seed#[6D2A49D52AAA9387]) [n:127.0.0.1:62558_    ] o.a.s.c.Overseer Overseer (id=72164565903343620-127.0.0.1:62558_-n_0000000000) starting
   [junit4]   2> 1502258 INFO  (zkConnectionManagerCallback-7725-thread-1) [    ] o.a.s.c.c.ConnectionManager zkClient has connected
   [junit4]   2> 1502258 INFO  (TEST-TestSQLHandler.doTest-seed#[6D2A49D52AAA9387]) [n:127.0.0.1:62558_    ] o.a.s.c.s.i.ZkClientClusterStateProvider Cluster at 127.0.0.1:62540/solr ready
   [junit4]   2> 1502258 INFO  (TEST-TestSQLHandler.doTest-seed#[6D2A49D52AAA9387]) [n:127.0.0.1:62558_    ] o.a.s.c.ZkController Register node as live in ZooKeeper:/live_nodes/127.0.0.1:62558_
   [junit4]   2> 1502258 INFO  (OverseerStateUpdate-72164565903343620-127.0.0.1:62558_-n_0000000000) [n:127.0.0.1:62558_    ] o.a.s.c.Overseer Starting to work on the main queue : 127.0.0.1:62558_
   [junit4]   2> 1502258 INFO  (OverseerStateUpdate-72164565903343620-127.0.0.1:62558_-n_0000000000) [n:127.0.0.1:62558_    ] o.a.s.c.c.ZkStateReader Updated live nodes from ZooKeeper... (0) -> (1)
   [junit4]   2> 1502258 INFO  (zkCallback-7724-thread-1) [    ] o.a.s.c.c.ZkStateReader Updated live nodes from ZooKeeper... (0) -> (1)
   [junit4]   2> 1502335 INFO  (TEST-TestSQLHandler.doTest-seed#[6D2A49D52AAA9387]) [n:127.0.0.1:62558_    ] o.a.s.h.a.MetricsHistoryHandler No .system collection, keeping metrics history in memory.
   [junit4]   2> 1502367 INFO  (TEST-TestSQLHandler.doTest-seed#[6D2A49D52AAA9387]) [n:127.0.0.1:62558_    ] o.a.s.m.r.SolrJmxReporter JMX monitoring for 'solr.node' (registry 'solr.node') enabled at server: com.sun.jmx.mbeanserver.JmxMBeanServer@70f43ff6
   [junit4]   2> 1502383 INFO  (TEST-TestSQLHandler.doTest-seed#[6D2A49D52AAA9387]) [n:127.0.0.1:62558_    ] o.a.s.m.r.SolrJmxReporter JMX monitoring for 'solr.jvm' (registry 'solr.jvm') enabled at server: com.sun.jmx.mbeanserver.JmxMBeanServer@70f43ff6
   [junit4]   2> 1502383 INFO  (TEST-TestSQLHandler.doTest-seed#[6D2A49D52AAA9387]) [n:127.0.0.1:62558_    ] o.a.s.m.r.SolrJmxReporter JMX monitoring for 'solr.jetty' (registry 'solr.jetty') enabled at server: com.sun.jmx.mbeanserver.JmxMBeanServer@70f43ff6
   [junit4]   2> 1502383 INFO  (TEST-TestSQLHandler.doTest-seed#[6D2A49D52AAA9387]) [n:127.0.0.1:62558_    ] o.a.s.c.CorePropertiesLocator Found 0 core definitions underneath C:\Users\jenkins\workspace\Lucene-Solr-7.x-Windows\solr\build\solr-core\test\J1\temp\solr.handler.TestSQLHandler_6D2A49D52AAA9387-001\control-001\cores
   [junit4]   2> 1502413 INFO  (zkConnectionManagerCallback-7731-thread-1) [    ] o.a.s.c.c.ConnectionManager zkClient has connected
   [junit4]   2> 1502413 INFO  (TEST-TestSQLHandler.doTest-seed#[6D2A49D52AAA9387]) [    ] o.a.s.c.c.ZkStateReader Updated live nodes from ZooKeeper... (0) -> (1)
   [junit4]   2> 1502413 INFO  (TEST-TestSQLHandler.doTest-seed#[6D2A49D52AAA9387]) [    ] o.a.s.c.s.i.ZkClientClusterStateProvider Cluster at 127.0.0.1:62540/solr ready
   [junit4]   2> 1502413 INFO  (qtp1247230541-24926) [n:127.0.0.1:62558_    ] o.a.s.h.a.CollectionsHandler Invoked Collection Action :create with params collection.configName=conf1&name=control_collection&nrtReplicas=1&action=CREATE&numShards=1&createNodeSet=127.0.0.1:62558_&wt=javabin&version=2 and sendToOCPQueue=true
   [junit4]   2> 1502413 INFO  (OverseerThreadFactory-8724-thread-1-processing-n:127.0.0.1:62558_) [n:127.0.0.1:62558_    ] o.a.s.c.a.c.CreateCollectionCmd Create collection control_collection
   [junit4]   2> 1502567 INFO  (qtp1247230541-24928) [n:127.0.0.1:62558_    ] o.a.s.s.HttpSolrCall [admin] webapp=null path=/admin/metrics params={prefix=CONTAINER.fs.usableSpace,CONTAINER.fs.totalSpace,CORE.coreName&wt=javabin&version=2&group=solr.node,solr.core} status=0 QTime=12
   [junit4]   2> 1502567 INFO  (qtp1247230541-24929) [n:127.0.0.1:62558_    ] o.a.s.s.HttpSolrCall [admin] webapp=null path=/admin/metrics params={prefix=CONTAINER.fs.usableSpace,CONTAINER.fs.totalSpace,CORE.coreName&wt=javabin&version=2&group=solr.node,solr.core} status=0 QTime=3
   [junit4]   2> 1502567 INFO  (qtp1247230541-24929) [n:127.0.0.1:62558_    ] o.a.s.s.HttpSolrCall [admin] webapp=null path=/admin/metrics params={prefix=CONTAINER.fs.usableSpace,CONTAINER.fs.totalSpace,CORE.coreName&wt=javabin&version=2&group=solr.node,solr.core} status=0 QTime=2
   [junit4]   2> 1502567 INFO  (qtp1247230541-24930) [n:127.0.0.1:62558_    ] o.a.s.s.HttpSolrCall [admin] webapp=null path=/admin/metrics params={prefix=CONTAINER.fs.usableSpace,CONTAINER.fs.totalSpace,CORE.coreName&wt=javabin&version=2&group=solr.node,solr.core} status=0 QTime=2
   [junit4]   2> 1502567 INFO  (qtp1247230541-24925) [n:127.0.0.1:62558_    ] o.a.s.s.HttpSolrCall [admin] webapp=null path=/admin/metrics params={prefix=CONTAINER.fs.usableSpace,CONTAINER.fs.totalSpace,CORE.coreName&wt=javabin&version=2&group=solr.node,solr.core} status=0 QTime=3
   [junit4]   2> 1502583 INFO  (qtp1247230541-24927) [n:127.0.0.1:62558_    x:control_collection_shard1_replica_n1] o.a.s.h.a.CoreAdminOperation core create command qt=/admin/cores&collection.configName=conf1&newCollection=true&name=control_collection_shard1_replica_n1&action=CREATE&numShards=1&collection=control_collection&shard=shard1&wt=javabin&version=2&replicaType=NRT
   [junit4]   2> 1502583 INFO  (qtp1247230541-24927) [n:127.0.0.1:62558_    x:control_collection_shard1_replica_n1] o.a.s.c.TransientSolrCoreCacheDefault Allocating transient cache for 4 transient cores
   [junit4]   2> 1503620 INFO  (qtp1247230541-24927) [n:127.0.0.1:62558_ c:control_collection s:shard1  x:control_collection_shard1_replica_n1] o.a.s.c.SolrConfig Using Lucene MatchVersion: 7.7.0
   [junit4]   2> 1503620 INFO  (qtp1247230541-24927) [n:127.0.0.1:62558_ c:control_collection s:shard1  x:control_collection_shard1_replica_n1] o.a.s.s.IndexSchema [control_collection_shard1_replica_n1] Schema name=test
   [junit4]   2> 1503697 WARN  (qtp1247230541-24927) [n:127.0.0.1:62558_ c:control_collection s:shard1  x:control_collection_shard1_replica_n1] o.a.s.s.IndexSchema Field lowerfilt1and2 is not multivalued and destination for multiple copyFields (2)
   [junit4]   2> 1503697 WARN  (qtp1247230541-24927) [n:127.0.0.1:62558_ c:control_collection s:shard1  x:control_collection_shard1_replica_n1] o.a.s.s.IndexSchema Field text is not multivalued and destination for multiple copyFields (3)
   [junit4]   2> 1503713 INFO  (qtp1247230541-24927) [n:127.0.0.1:62558_ c:control_collection s:shard1  x:control_collection_shard1_replica_n1] o.a.s.s.IndexSchema Loaded schema test/1.6 with uniqueid field id
   [junit4]   2> 1503713 INFO  (qtp1247230541-24927) [n:127.0.0.1:62558_ c:control_collection s:shard1  x:control_collection_shard1_replica_n1] o.a.s.c.CoreContainer Creating SolrCore 'control_collection_shard1_replica_n1' using configuration from collection control_collection, trusted=true
   [junit4]   2> 1503713 INFO  (qtp1247230541-24927) [n:127.0.0.1:62558_ c:control_collection s:shard1  x:control_collection_shard1_replica_n1] o.a.s.m.r.SolrJmxReporter JMX monitoring for 'solr.core.control_collection.shard1.replica_n1' (registry 'solr.core.control_collection.shard1.replica_n1') enabled at server: com.sun.jmx.mbeanserver.JmxMBeanServer@70f43ff6
   [junit4]   2> 1503713 INFO  (qtp1247230541-24927) [n:127.0.0.1:62558_ c:control_collection s:shard1  x:control_collection_shard1_replica_n1] o.a.s.c.SolrCore [[control_collection_shard1_replica_n1] ] Opening new SolrCore at [C:\Users\jenkins\workspace\Lucene-Solr-7.x-Windows\solr\build\solr-core\test\J1\temp\solr.handler.TestSQLHandler_6D2A49D52AAA9387-001\control-001\cores\control_collection_shard1_replica_n1], dataDir=[C:\Users\jenkins\workspace\Lucene-Solr-7.x-Windows\solr\build\solr-core\test\J1\temp\solr.handler.TestSQLHandler_6D2A49D52AAA9387-001\control-001\cores\control_collection_shard1_replica_n1\data\]
   [junit4]   2> 1503806 INFO  (qtp1247230541-24927) [n:127.0.0.1:62558_ c:control_collection s:shard1  x:control_collection_shard1_replica_n1] o.a.s.u.UpdateHandler Using UpdateLog implementation: org.apache.solr.update.UpdateLog
   [junit4]   2> 1503806 INFO  (qtp1247230541-24927) [n:127.0.0.1:62558_ c:control_collection s:shard1  x:control_collection_shard1_replica_n1] o.a.s.u.UpdateLog Initializing UpdateLog: dataDir= defaultSyncLevel=FLUSH numRecordsToKeep=100 maxNumLogsToKeep=10 numVersionBuckets=65536
   [junit4]   2> 1503821 INFO  (qtp1247230541-24927) [n:127.0.0.1:62558_ c:control_collection s:shard1  x:control_collection_shard1_replica_n1] o.a.s.u.CommitTracker Hard AutoCommit: disabled
   [junit4]   2> 1503821 INFO  (qtp1247230541-24927) [n:127.0.0.1:62558_ c:control_collection s:shard1  x:control_collection_shard1_replica_n1] o.a.s.u.CommitTracker Soft AutoCommit: disabled
   [junit4]   2> 1503821 INFO  (qtp1247230541-24927) [n:127.0.0.1:62558_ c:control_collection s:shard1  x:control_collection_shard1_replica_n1] o.a.s.s.SolrIndexSearcher Opening [Searcher@4f6ef05a[control_collection_shard1_replica_n1] main]
   [junit4]   2> 1503821 INFO  (qtp1247230541-24927) [n:127.0.0.1:62558_ c:control_collection s:shard1  x:control_collection_shard1_replica_n1] o.a.s.r.ManagedResourceStorage Configured ZooKeeperStorageIO with znodeBase: /configs/conf1
   [junit4]   2> 1503821 INFO  (qtp1247230541-24927) [n:127.0.0.1:62558_ c:control_collection s:shard1  x:control_collection_shard1_replica_n1] o.a.s.r.ManagedResourceStorage Loaded null at path _rest_managed.json using ZooKeeperStorageIO:path=/configs/conf1
   [junit4]   2> 1503821 INFO  (qtp1247230541-24927) [n:127.0.0.1:62558_ c:control_collection s:shard1  x:control_collection_shard1_replica_n1] o.a.s.u.UpdateLog Could not find max version in index or recent updates, using new clock 1622161961811705856
   [junit4]   2> 1503821 INFO  (searcherExecutor-8729-thread-1-processing-n:127.0.0.1:62558_ x:control_collection_shard1_replica_n1 c:control_collection s:shard1) [n:127.0.0.1:62558_ c:control_collection s:shard1  x:control_collection_shard1_replica_n1] o.a.s.c.SolrCore [control_collection_shard1_replica_n1] Registered new searcher Searcher@4f6ef05a[control_collection_shard1_replica_n1] main{ExitableDirectoryReader(UninvertingDirectoryReader())}
   [junit4]   2> 1503821 INFO  (qtp1247230541-24927) [n:127.0.0.1:62558_ c:control_collection s:shard1  x:control_collection_shard1_replica_n1] o.a.s.c.ZkShardTerms Successful update of terms at /collections/control_collection/terms/shard1 to Terms{values={core_node2=0}, version=0}
   [junit4]   2> 1503821 INFO  (qtp1247230541-24927) [n:127.0.0.1:62558_ c:control_collection s:shard1  x:control_collection_shard1_replica_n1] o.a.s.c.ShardLeaderElectionContextBase make sure parent is created /collections/control_collection/leaders/shard1
   [junit4]   2> 1503837 INFO  (qtp1247230541-24927) [n:127.0.0.1:62558_ c:control_collection s:shard1  x:control_collection_shard1_replica_n1] o.a.s.c.ShardLeaderElectionContext Enough replicas found to continue.
   [junit4]   2> 1503837 INFO  (qtp1247230541-24927) [n:127.0.0.1:62558_ c:control_collection s:shard1  x:control_collection_shard1_replica_n1] o.a.s.c.ShardLeaderElectionContext I may be the new leader - try and sync
   [junit4]   2> 1503837 INFO  (qtp1247230541-24927) [n:127.0.0.1:62558_ c:control_collection s:shard1  x:control_collection_shard1_replica_n1] o.a.s.c.SyncStrategy Sync replicas to http://127.0.0.1:62558/control_collection_shard1_replica_n1/
   [junit4]   2> 1503837 INFO  (qtp1247230541-24927) [n:127.0.0.1:62558_ c:control_collection s:shard1  x:control_collection_shard1_replica_n1] o.a.s.c.SyncStrategy Sync Success - now sync replicas to me
   [junit4]   2> 1503837 INFO  (qtp1247230541-24927) [n:127.0.0.1:62558_ c:control_collection s:shard1  x:control_collection_shard1_replica_n1] o.a.s.c.SyncStrategy http://127.0.0.1:62558/control_collection_shard1_replica_n1/ has no replicas
   [junit4]   2> 1503837 INFO  (qtp1247230541-24927) [n:127.0.0.1:62558_ c:control_collection s:shard1  x:control_collection_shard1_replica_n1] o.a.s.c.ShardLeaderElectionContext Found all replicas participating in election, clear LIR
   [junit4]   2> 1503837 INFO  (qtp1247230541-24927) [n:127.0.0.1:62558_ c:control_collection s:shard1  x:control_collection_shard1_replica_n1] o.a.s.c.ShardLeaderElectionContextBase Creating leader registration node /collections/control_collection/leaders/shard1/leader after winning as /collections/control_collection/leader_elect/shard1/election/72164565903343620-core_node2-n_0000000000
   [junit4]   2> 1503837 INFO  (qtp1247230541-24927) [n:127.0.0.1:62558_ c:control_collection s:shard1  x:control_collection_shard1_replica_n1] o.a.s.c.ShardLeaderElectionContext I am the new leader: http://127.0.0.1:62558/control_collection_shard1_replica_n1/ shard1
   [junit4]   2> 1503945 INFO  (zkCallback-7717-thread-1) [    ] o.a.s.c.c.ZkStateReader A cluster state change: [WatchedEvent state:SyncConnected type:NodeDataChanged path:/collections/control_collection/state.json] for collection [control_collection] has occurred - updating... (live nodes size: [1])
   [junit4]   2> 1503945 INFO  (qtp1247230541-24927) [n:127.0.0.1:62558_ c:control_collection s:shard1  x:control_collection_shard1_replica_n1] o.a.s.c.ZkController I am the leader, no recovery necessary
   [junit4]   2> 1503945 INFO  (qtp1247230541-24927) [n:127.0.0.1:62558_ c:control_collection s:shard1  x:control_collection_shard1_replica_n1] o.a.s.s.HttpSolrCall [admin] webapp=null path=/admin/cores params={qt=/admin/cores&collection.configName=conf1&newCollection=true&name=control_collection_shard1_replica_n1&action=CREATE&numShards=1&collection=control_collection&shard=shard1&wt=javabin&version=2&replicaType=NRT} status=0 QTime=1363
   [junit4]   2> 1503945 INFO  (qtp1247230541-24926) [n:127.0.0.1:62558_    ] o.a.s.h.a.CollectionsHandler Wait for new collection to be active for at most 45 seconds. Check all shard replicas
   [junit4]   2> 1504069 INFO  (zkCallback-7717-thread-2) [    ] o.a.s.c.c.ZkStateReader A cluster state change: [WatchedEvent state:SyncConnected type:NodeDataChanged path:/collections/control_collection/state.json] for collection [control_collection] has occurred - updating... (live nodes size: [1])
   [junit4]   2> 1504069 INFO  (zkCallback-7717-thread-3) [    ] o.a.s.c.c.ZkStateReader A cluster state change: [WatchedEvent state:SyncConnected type:NodeDataChanged path:/collections/control_collection/state.json] for collection [control_collection] has occurred - updating... (live nodes size: [1])
   [junit4]   2> 1504069 INFO  (qtp1247230541-24926) [n:127.0.0.1:62558_    ] o.a.s.s.HttpSolrCall [admin] webapp=null path=/admin/collections params={collection.configName=conf1&name=control_collection&nrtReplicas=1&action=CREATE&numShards=1&createNodeSet=127.0.0.1:62558_&wt=javabin&version=2} status=0 QTime=1647
   [junit4]   2> 1504069 INFO  (zkConnectionManagerCallback-7736-thread-1) [    ] o.a.s.c.c.ConnectionManager zkClient has connected
   [junit4]   2> 1504069 INFO  (TEST-TestSQLHandler.doTest-seed#[6D2A49D52AAA9387]) [    ] o.a.s.c.c.ZkStateReader Updated live nodes from ZooKeeper... (0) -> (1)
   [junit4]   2> 1504069 INFO  (TEST-TestSQLHandler.doTest-seed#[6D2A49D52AAA9387]) [    ] o.a.s.c.s.i.ZkClientClusterStateProvider Cluster at 127.0.0.1:62540/solr ready
   [junit4]   2> 1504069 INFO  (TEST-TestSQLHandler.doTest-seed#[6D2A49D52AAA9387]) [    ] o.a.s.c.ChaosMonkey monkey: init - expire sessions:false cause connection loss:false
   [junit4]   2> 1504084 INFO  (qtp1247230541-24925) [n:127.0.0.1:62558_    ] o.a.s.h.a.CollectionsHandler Invoked Collection Action :create with params collection.configName=conf1&name=collection1&nrtReplicas=1&action=CREATE&numShards=2&createNodeSet=&stateFormat=2&wt=javabin&version=2 and sendToOCPQueue=true
   [junit4]   2> 1504084 INFO  (OverseerThreadFactory-8724-thread-2-processing-n:127.0.0.1:62558_) [n:127.0.0.1:62558_    ] o.a.s.c.a.c.CreateCollectionCmd Create collection collection1
   [junit4]   2> 1504084 INFO  (OverseerCollectionConfigSetProcessor-72164565903343620-127.0.0.1:62558_-n_0000000000) [n:127.0.0.1:62558_    ] o.a.s.c.OverseerTaskQueue Response ZK path: /overseer/collection-queue-work/qnr-0000000000 doesn't exist.  Requestor may have disconnected from ZooKeeper
   [junit4]   2> 1504301 WARN  (OverseerThreadFactory-8724-thread-2-processing-n:127.0.0.1:62558_) [n:127.0.0.1:62558_    ] o.a.s.c.a.c.CreateCollectionCmd It is unusual to create a collection (collection1) without cores.
   [junit4]   2> 1504301 INFO  (qtp1247230541-24925) [n:127.0.0.1:62558_    ] o.a.s.h.a.CollectionsHandler Wait for new collection to be active for at most 45 seconds. Check all shard replicas
   [junit4]   2> 1504301 INFO  (qtp1247230541-24925) [n:127.0.0.1:62558_    ] o.a.s.s.HttpSolrCall [admin] webapp=null path=/admin/collections params={collection.configName=conf1&name=collection1&nrtReplicas=1&action=CREATE&numShards=2&createNodeSet=&stateFormat=2&wt=javabin&version=2} status=0 QTime=219
   [junit4]   2> 1504301 INFO  (TEST-TestSQLHandler.doTest-seed#[6D2A49D52AAA9387]) [    ] o.a.s.c.AbstractFullDistribZkTestBase Creating jetty instances pullReplicaCount=0 numOtherReplicas=4
   [junit4]   2> 1504301 INFO  (OverseerCollectionConfigSetProcessor-72164565903343620-127.0.0.1:62558_-n_0000000000) [n:127.0.0.1:62558_    ] o.a.s.c.OverseerTaskQueue Response ZK path: /overseer/collection-queue-work/qnr-0000000002 doesn't exist.  Requestor may have disconnected from ZooKeeper
   [junit4]   2> 1504935 INFO  (TEST-TestSQLHandler.doTest-seed#[6D2A49D52AAA9387]) [    ] o.a.s.c.AbstractFullDistribZkTestBase create jetty 1 in directory C:\Users\jenkins\workspace\Lucene-Solr-7.x-Windows\solr\build\solr-core\test\J1\temp\solr.handler.TestSQLHandler_6D2A49D52AAA9387-001\shard-1-001 of type NRT
   [junit4]   2> 1504935 WARN  (closeThreadPool-7737-thread-1) [    ] o.e.j.s.AbstractConnector Ignoring deprecated socket close linger time
   [junit4]   2> 1504935 INFO  (closeThreadPool-7737-thread-1) [    ] o.a.s.c.s.e.JettySolrRunner Start Jetty (original configured port=0)
   [junit4]   2> 1504935 INFO  (closeThreadPool-7737-thread-1) [    ] o.a.s.c.s.e.JettySolrRunner Trying to start Jetty on port 0 try number 1 ...
   [junit4]   2> 1504935 INFO  (closeThreadPool-7737-thread-1) [    ] o.e.j.s.Server jetty-9.4.14.v20181114; built: 2018-11-14T21:20:31.478Z; git: c4550056e785fb5665914545889f21dc136ad9e6; jvm 1.8.0_172-b11
   [junit4]   2> 1504935 INFO  (closeThreadPool-7737-thread-1) [    ] o.e.j.s.session DefaultSessionIdManager workerName=node0
   [junit4]   2> 1504935 INFO  (closeThreadPool-7737-thread-1) [    ] o.e.j.s.session No SessionScavenger set, using defaults
   [junit4]   2> 1504935 INFO  (closeThreadPool-7737-thread-1) [    ] o.e.j.s.session node0 Scavenging every 600000ms
   [junit4]   2> 1504935 INFO  (closeThreadPool-7737-thread-1) [    ] o.e.j.s.h.ContextHandler Started o.e.j.s.ServletContextHandler@240217e7{/,null,AVAILABLE}
   [junit4]   2> 1504935 INFO  (closeThreadPool-7737-thread-1) [    ] o.e.j.s.AbstractConnector Started ServerConnector@c7371f3{HTTP/1.1,[http/1.1]}{127.0.0.1:62585}
   [junit4]   2> 1504935 INFO  (closeThreadPool-7737-thread-1) [    ] o.e.j.s.Server Started @1489887ms
   [junit4]   2> 1504935 INFO  (closeThreadPool-7737-thread-1) [    ] o.a.s.c.s.e.JettySolrRunner Jetty properties: {solr.data.dir=C:\Users\jenkins\workspace\Lucene-Solr-7.x-Windows\solr\build\solr-core\test\J1\temp\solr.handler.TestSQLHandler_6D2A49D52AAA9387-001\tempDir-001/jetty1, solrconfig=solrconfig.xml, hostContext=/, hostPort=62585, coreRootDirectory=C:\Users\jenkins\workspace\Lucene-Solr-7.x-Windows\solr\build\solr-core\test\J1\temp\solr.handler.TestSQLHandler_6D2A49D52AAA9387-001\shard-1-001\cores}
   [junit4]   2> 1504935 ERROR (closeThreadPool-7737-thread-1) [    ] o.a.s.u.StartupLoggingUtils Missing Java Option solr.log.dir. Logging may be missing or incomplete.
   [junit4]   2> 1504935 INFO  (closeThreadPool-7737-thread-1) [    ] o.a.s.s.SolrDispatchFilter Using logger factory org.apache.logging.slf4j.Log4jLoggerFactory
   [junit4]   2> 1504935 INFO  (closeThreadPool-7737-thread-1) [    ] o.a.s.s.SolrDispatchFilter  ___      _       Welcome to Apache Solr™ version 7.7.0
   [junit4]   2> 1504935 INFO  (closeThreadPool-7737-thread-1) [    ] o.a.s.s.SolrDispatchFilter / __| ___| |_ _   Starting in cloud mode on port null
   [junit4]   2> 1504935 INFO  (closeThreadPool-7737-thread-1) [    ] o.a.s.s.SolrDispatchFilter \__ \/ _ \ | '_|  Install dir: null
   [junit4]   2> 1504935 INFO  (closeThreadPool-7737-thread-1) [    ] o.a.s.s.SolrDispatchFilter |___/\___/_|_|    Start time: 2019-01-09T06:10:01.145Z
   [junit4]   2> 1504950 INFO  (zkConnectionManagerCallback-7739-thread-1) [    ] o.a.s.c.c.ConnectionManager zkClient has connected
   [junit4]   2> 1504950 INFO  (closeThreadPool-7737-thread-1) [    ] o.a.s.s.SolrDispatchFilter Loading solr.xml from SolrHome (not found in ZooKeeper)
   [junit4]   2> 1504950 INFO  (closeThreadPool-7737-thread-1) [    ] o.a.s.c.SolrXmlConfig Loading container configuration from C:\Users\jenkins\workspace\Lucene-Solr-7.x-Windows\solr\build\solr-core\test\J1\temp\solr.handler.TestSQLHandler_6D2A49D52AAA9387-001\shard-1-001\solr.xml
   [junit4]   2> 1504966 INFO  (closeThreadPool-7737-thread-1) [    ] o.a.s.c.SolrXmlConfig Configuration parameter autoReplicaFailoverWorkLoopDelay is ignored
   [junit4]   2> 1504966 INFO  (closeThreadPool-7737-thread-1) [    ] o.a.s.c.SolrXmlConfig Configuration parameter autoReplicaFailoverBadNodeExpiration is ignored
   [junit4]   2> 1504966 INFO  (closeThreadPool-7737-thread-1) [    ] o.a.s.c.SolrXmlConfig MBean server found: com.sun.jmx.mbeanserver.JmxMBeanServer@70f43ff6, but no JMX reporters were configured - adding default JMX reporter.
   [junit4]   2> 1505121 INFO  (closeThreadPool-7737-thread-1) [    ] o.a.s.c.ZkContainer Zookeeper client=127.0.0.1:62540/solr
   [junit4]   2> 1505121 INFO  (zkConnectionManagerCallback-7743-thread-1) [    ] o.a.s.c.c.ConnectionManager zkClient has connected
   [junit4]   2> 1505121 WARN  (NIOServerCxn.Factory:0.0.0.0/0.0.0.0:0) [    ] o.a.z.s.NIOServerCnxn Unable to read additional data from client sessionid 0x100614a540a0009, likely client has closed socket
   [junit4]   2> 1505121 INFO  (zkConnectionManagerCallback-7745-thread-1) [    ] o.a.s.c.c.ConnectionManager zkClient has connected
   [junit4]   2> 1505136 INFO  (closeThreadPool-7737-thread-1) [n:127.0.0.1:62585_    ] o.a.s.c.c.ZkStateReader Updated live nodes from ZooKeeper... (0) -> (1)
   [junit4]   2> 1505136 INFO  (closeThreadPool-7737-thread-1) [n:127.0.0.1:62585_    ] o.a.s.c.ZkController Publish node=127.0.0.1:62585_ as DOWN
   [junit4]   2> 1505136 INFO  (closeThreadPool-7737-thread-1) [n:127.0.0.1:62585_    ] o.a.s.c.TransientSolrCoreCacheDefault Allocating transient cache for 4 transient cores
   [junit4]   2> 1505136 INFO  (closeThreadPool-7737-thread-1) [n:127.0.0.1:62585_    ] o.a.s.c.ZkController Register node as live in ZooKeeper:/live_nodes/127.0.0.1:62585_
   [junit4]   2> 1505136 INFO  (zkCallback-7717-thread-3) [    ] o.a.s.c.c.ZkStateReader Updated live nodes from ZooKeeper... (1) -> (2)
   [junit4]   2> 1505136 INFO  (zkCallback-7724-thread-1) [    ] o.a.s.c.c.ZkStateReader Updated live nodes from ZooKeeper... (1) -> (2)
   [junit4]   2> 1505136 INFO  (zkCallback-7744-thread-1) [    ] o.a.s.c.c.ZkStateReader Updated live nodes from ZooKeeper... (1) -> (2)
   [junit4]   2> 1505136 INFO  (zkCallback-7735-thread-1) [    ] o.a.s.c.c.ZkStateReader Updated live nodes from ZooKeeper... (1) -> (2)
   [junit4]   2> 1505213 INFO  (zkConnectionManagerCallback-7752-thread-1) [    ] o.a.s.c.c.ConnectionManager zkClient has connected
   [junit4]   2> 1505213 INFO  (closeThreadPool-7737-thread-1) [n:127.0.0.1:62585_    ] o.a.s.c.c.ZkStateReader Updated live nodes from ZooKeeper... (0) -> (2)
   [junit4]   2> 1505213 INFO  (closeThreadPool-7737-thread-1) [n:127.0.0.1:62585_    ] o.a.s.c.s.i.ZkClientClusterStateProvider Cluster at 127.0.0.1:62540/solr ready
   [junit4]   2> 1505213 INFO  (closeThreadPool-7737-thread-1) [n:127.0.0.1:62585_    ] o.a.s.h.a.MetricsHistoryHandler No .system collection, keeping metrics history in memory.
   [junit4]   2> 1505260 INFO  (closeThreadPool-7737-thread-1) [n:127.0.0.1:62585_    ] o.a.s.m.r.SolrJmxReporter JMX monitoring for 'solr.node' (registry 'solr.node') enabled at server: com.sun.jmx.mbeanserver.JmxMBeanServer@70f43ff6
   [junit4]   2> 1505260 INFO  (closeThreadPool-7737-thread-1) [n:127.0.0.1:62585_    ] o.a.s.m.r.SolrJmxReporter JMX monitoring for 'solr.jvm' (registry 'solr.jvm') enabled at server: com.sun.jmx.mbeanserver.JmxMBeanServer@70f43ff6
   [junit4]   2> 1505260 INFO  (closeThreadPool-7737-thread-1) [n:127.0.0.1:62585_    ] o.a.s.m.r.SolrJmxReporter JMX monitoring for 'solr.jetty' (registry 'solr.jetty') enabled at server: com.sun.jmx.mbeanserver.JmxMBeanServer@70f43ff6
   [junit4]   2> 1505275 INFO  (closeThreadPool-7737-thread-1) [n:127.0.0.1:62585_    ] o.a.s.c.CorePropertiesLocator Found 0 core definitions underneath C:\Users\jenkins\workspace\Lucene-Solr-7.x-Windows\solr\build\solr-core\test\J1\temp\solr.handler.TestSQLHandler_6D2A49D52AAA9387-001\shard-1-001\cores
   [junit4]   2> 1505663 INFO  (TEST-TestSQLHandler.doTest-seed#[6D2A49D52AAA9387]) [    ] o.a.s.c.AbstractFullDistribZkTestBase create jetty 2 in directory C:\Users\jenkins\workspace\Lucene-Solr-7.x-Windows\solr\build\solr-core\test\J1\temp\solr.handler.TestSQLHandler_6D2A49D52AAA9387-001\shard-2-001 of type NRT
   [junit4]   2> 1505663 WARN  (closeThreadPool-7737-thread-1) [    ] o.e.j.s.AbstractConnector Ignoring deprecated socket close linger time
   [junit4]   2> 1505663 INFO  (closeThreadPool-7737-thread-1) [    ] o.a.s.c.s.e.JettySolrRunner Start Jetty (original configured port=0)
   [junit4]   2> 1505663 INFO  (closeThreadPool-7737-thread-1) [    ] o.a.s.c.s.e.JettySolrRunner Trying to start Jetty on port 0 try number 1 ...
   [junit4]   2> 1505663 INFO  (closeThreadPool-7737-thread-1) [    ] o.e.j.s.Server jetty-9.4.14.v20181114; built: 2018-11-14T21:20:31.478Z; git: c4550056e785fb5665914545889f21dc136ad9e6; jvm 1.8.0_172-b11
   [junit4]   2> 1505663 INFO  (closeThreadPool-7737-thread-1) [    ] o.e.j.s.session DefaultSessionIdManager workerName=node0
   [junit4]   2> 1505663 INFO  (closeThreadPool-7737-thread-1) [    ] o.e.j.s.session No SessionScavenger set, using defaults
   [junit4]   2> 1505663 INFO  (closeThreadPool-7737-thread-1) [    ] o.e.j.s.session node0 Scavenging every 600000ms
   [junit4]   2> 1505663 INFO  (closeThreadPool-7737-thread-1) [    ] o.e.j.s.h.ContextHandler Started o.e.j.s.ServletContextHandler@3e4a6f1b{/,null,AVAILABLE}
   [junit4]   2> 1505678 INFO  (closeThreadPool-7737-thread-1) [    ] o.e.j.s.AbstractConnector Started ServerConnector@5bb36ec4{HTTP/1.1,[http/1.1]}{127.0.0.1:62601}
   [junit4]   2> 1505678 INFO  (closeThreadPool-7737-thread-1) [    ] o.e.j.s.Server Started @1490622ms
   [junit4]   2> 1505678 INFO  (closeThreadPool-7737-thread-1) [    ] o.a.s.c.s.e.JettySolrRunner Jetty properties: {solr.data.dir=C:\Users\jenkins\workspace\Lucene-Solr-7.x-Windows\solr\build\solr-core\test\J1\temp\solr.handler.TestSQLHandler_6D2A49D52AAA9387-001\tempDir-001/jetty2, solrconfig=solrconfig.xml, hostContext=/, hostPort=62601, coreRootDirectory=C:\Users\jenkins\workspace\Lucene-Solr-7.x-Windows\solr\build\solr-core\test\J1\temp\solr.handler.TestSQLHandler_6D2A49D52AAA9387-001\shard-2-001\cores}
   [junit4]   2> 1505678 ERROR (closeThreadPool-7737-thread-1) [    ] o.a.s.u.StartupLoggingUtils Missing Java Option solr.log.dir. Logging may be missing or incomplete.
   [junit4]   2> 1505678 INFO  (closeThreadPool-7737-thread-1) [    ] o.a.s.s.SolrDispatchFilter Using logger factory org.apache.logging.slf4j.Log4jLoggerFactory
   [junit4]   2> 1505678 INFO  (closeThreadPool-7737-thread-1) [    ] o.a.s.s.SolrDispatchFilter  ___      _       Welcome to Apache Solr™ version 7.7.0
   [junit4]   2> 1505678 INFO  (closeThreadPool-7737-thread-1) [    ] o.a.s.s.SolrDispatchFilter / __| ___| |_ _   Starting in cloud mode on port null
   [junit4]   2> 1505678 INFO  (closeThreadPool-7737-thread-1) [    ] o.a.s.s.SolrDispatchFilter \__ \/ _ \ | '_|  Install dir: null
   [junit4]   2> 1505678 INFO  (closeThreadPool-7737-thread-1) [    ] o.a.s.s.SolrDispatchFilter |___/\___/_|_|    Start time: 2019-01-09T06:10:01.888Z
   [junit4]   2> 1505678 INFO  (zkConnectionManagerCallback-7755-thread-1) [    ] o.a.s.c.c.ConnectionManager zkClient has connected
   [junit4]   2> 1505694 INFO  (closeThreadPool-7737-thread-1) [    ] o.a.s.s.SolrDispatchFilter Loading solr.xml from SolrHome (not found in ZooKeeper)
   [junit4]   2> 1505694 INFO  (closeThreadPool-7737-thread-1) [    ] o.a.s.c.SolrXmlConfig Loading container configuration from C:\Users\jenkins\workspace\Lucene-Solr-7.x-Windows\solr\build\solr-core\test\J1\temp\solr.handler.TestSQLHandler_6D2A49D52AAA9387-001\shard-2-001\solr.xml
   [junit4]   2> 1505694 INFO  (closeThreadPool-7737-thread-1) [    ] o.a.s.c.SolrXmlConfig Configuration parameter autoReplicaFailoverWorkLoopDelay is ignored
   [junit4]   2> 1505694 INFO  (closeThreadPool-7737-thread-1) [    ] o.a.s.c.SolrXmlConfig Configuration parameter autoReplicaFailoverBadNodeExpiration is ignored
   [junit4]   2> 1505694 INFO  (closeThreadPool-7737-thread-1) [    ] o.a.s.c.SolrXmlConfig MBean server found: com.sun.jmx.mbeanserver.JmxMBeanServer@70f43ff6, but no JMX reporters were configured - adding default JMX reporter.
   [junit4]   2> 1505849 INFO  (closeThreadPool-7737-thread-1) [    ] o.a.s.c.ZkContainer Zookeeper client=127.0.0.1:62540/solr
   [junit4]   2> 1505849 INFO  (zkConnectionManagerCallback-7759-thread-1) [    ] o.a.s.c.c.ConnectionManager zkClient has connected
   [junit4]   2> 1505849 WARN  (NIOServerCxn.Factory:0.0.0.0/0.0.0.0:0) [    ] o.a.z.s.NIOServerCnxn Unable to read additional data from client sessionid 0x100614a540a000d, likely client has closed socket
   [junit4]   2> 1505849 INFO  (zkConnectionManagerCallback-7761-thread-1) [    ] o.a.s.c.c.ConnectionManager zkClient has connected
   [junit4]   2> 1505864 INFO  (closeThreadPool-7737-thread-1) [    ] o.a.s.c.c.ZkStateReader Updated live nodes from ZooKeeper... (0) -> (2)
   [junit4]   2> 1505864 INFO  (closeThreadPool-7737-thread-1) [    ] o.a.s.c.ZkController Publish node=127.0.0.1:62601_ as DOWN
   [junit4]   2> 1505864 INFO  (closeThreadPool-7737-thread-1) [    ] o.a.s.c.TransientSolrCoreCacheDefault Allocating transient cache for 4 transient cores
   [junit4]   2> 1505864 INFO  (closeThreadPool-7737-thread-1) [    ] o.a.s.c.ZkController Register node as live in ZooKeeper:/live_nodes/127.0.0.1:62601_
   [junit4]   2> 1505864 INFO  (zkCallback-7735-thread-1) [    ] o.a.s.c.c.ZkStateReader Updated live nodes from ZooKeeper... (2) -> (3)
   [junit4]   2> 1505864 INFO  (zkCallback-7717-thread-3) [    ] o.a.s.c.c.ZkStateReader Updated live nodes from ZooKeeper... (2) -> (3)
   [junit4]   2> 1505864 INFO  (zkCallback-7724-thread-1) [    ] o.a.s.c.c.ZkStateReader Updated live nodes from ZooKeeper... (2) -> (3)
   [junit4]   2> 1505864 INFO  (zkCallback-7744-thread-1) [    ] o.a.s.c.c.ZkStateReader Updated live nodes from ZooKeeper... (2) -> (3)
   [junit4]   2> 1505864 INFO  (zkCallback-7760-thread-1) [    ] o.a.s.c.c.ZkStateReader Updated live nodes from ZooKeeper... (2) -> (3)
   [junit4]   2> 1505864 INFO  (zkCallback-7751-thread-1) [    ] o.a.s.c.c.ZkStateReader Updated live nodes from ZooKeeper... (2) -> (3)
   [junit4]   2> 1505956 INFO  (zkConnectionManagerCallback-7768-thread-1) [    ] o.a.s.c.c.ConnectionManager zkClient has connected
   [junit4]   2> 1505956 INFO  (closeThreadPool-7737-thread-1) [    ] o.a.s.c.c.ZkStateReader Updated live nodes from ZooKeeper... (0) -> (3)
   [junit4]   2> 1505956 INFO  (closeThreadPool-7737-thread-1) [    ] o.a.s.c.s.i.ZkClientClusterStateProvider Cluster at 127.0.0.1:62540/solr ready
   [junit4]   2> 1505956 INFO  (closeThreadPool-7737-thread-1) [    ] o.a.s.h.a.MetricsHistoryHandler No .system collection, keeping metrics history in memory.
   [junit4]   2> 1505987 INFO  (closeThreadPool-7737-thread-1) [    ] o.a.s.m.r.SolrJmxReporter JMX monitoring for 'solr.node' (registry 'solr.node') enabled at server: com.sun.jmx.mbeanserver.JmxMBeanServer@70f43ff6
   [junit4]   2> 1505987 INFO  (closeThreadPool-7737-thread-1) [    ] o.a.s.m.r.SolrJmxReporter JMX monitoring for 'solr.jvm' (registry 'solr.jvm') enabled at server: com.sun.jmx.mbeanserver.JmxMBeanServer@70f43ff6
   [junit4]   2> 1506003 INFO  (closeThreadPool-7737-thread-1) [    ] o.a.s.m.r.SolrJmxReporter JMX monitoring for 'solr.jetty' (registry 'solr.jetty') enabled at server: com.sun.jmx.mbeanserver.JmxMBeanServer@70f43ff6
   [junit4]   2> 1506003 INFO  (closeThreadPool-7737-thread-1) [    ] o.a.s.c.CorePropertiesLocator Found 0 core definitions underneath C:\Users\jenkins\workspace\Lucene-Solr-7.x-Windows\solr\build\solr-core\test\J1\temp\solr.handler.TestSQLHandler_6D2A49D52AAA9387-001\shard-2-001\cores
   [junit4]   2> 1506297 INFO  (TEST-TestSQLHandler.doTest-seed#[6D2A49D52AAA9387]) [    ] o.a.s.c.AbstractFullDistribZkTestBase create jetty 3 in directory C:\Users\jenkins\workspace\Lucene-Solr-7.x-Windows\solr\build\solr-core\test\J1\temp\solr.handler.TestSQLHandler_6D2A49D52AAA9387-001\shard-3-001 of type NRT
   [junit4]   2> 1506297 WARN  (closeThreadPool-7737-thread-1) [    ] o.e.j.s.AbstractConnector Ignoring deprecated socket close linger time
   [junit4]   2> 1506297 INFO  (closeThreadPool-7737-thread-1) [    ] o.a.s.c.s.e.JettySolrRunner Start Jetty (original configured port=0)
   [junit4]   2> 1506297 INFO  (closeThreadPool-7737-thread-1) [    ] o.a.s.c.s.e.JettySolrRunner Trying to start Jetty on port 0 try number 1 ...
   [junit4]   2> 1506297 INFO  (closeThreadPool-7737-thread-1) [    ] o.e.j.s.Server jetty-9.4.14.v20181114; built: 2018-11-14T21:20:31.478Z; git: c4550056e785fb5665914545889f21dc136ad9e6; jvm 1.8.0_172-b11
   [junit4]   2> 1506297 INFO  (closeThreadPool-7737-thread-1) [    ] o.e.j.s.session DefaultSessionIdManager workerName=node0
   [junit4]   2> 1506297 INFO  (closeThreadPool-7737-thread-1) [    ] o.e.j.s.session No SessionScavenger set, using defaults
   [junit4]   2> 1506297 INFO  (closeThreadPool-7737-thread-1) [    ] o.e.j.s.session node0 Scavenging every 600000ms
   [junit4]   2> 1506297 INFO  (closeThreadPool-7737-thread-1) [    ] o.e.j.s.h.ContextHandler Started o.e.j.s.ServletContextHandler@7a94189{/,null,AVAILABLE}
   [junit4]   2> 1506297 INFO  (closeThreadPool-7737-thread-1) [    ] o.e.j.s.AbstractConnector Started ServerConnector@325a098f{HTTP/1.1,[http/1.1]}{127.0.0.1:62616}
   [junit4]   2> 1506297 INFO  (closeThreadPool-7737-thread-1) [    ] o.e.j.s.Server Started @1491253ms
   [junit4]   2> 1506297 INFO  (closeThreadPool-7737-thread-1) [    ] o.a.s.c.s.e.JettySolrRunner Jetty properties: {solr.data.dir=C:\Users\jenkins\workspace\Lucene-Solr-7.x-Windows\solr\build\solr-core\test\J1\temp\solr.handler.TestSQLHandler_6D2A49D52AAA9387-001\tempDir-001/jetty3, solrconfig=solrconfig.xml, hostContext=/, hostPort=62616, coreRootDirectory=C:\Users\jenkins\workspace\Lucene-Solr-7.x-Windows\solr\build\solr-core\test\J1\..\..\..\..\..\..\..\..\..\Users\jenkins\workspace\Lucene-Solr-7.x-Windows\solr\build\solr-core\test\J1\temp\solr.handler.TestSQLHandler_6D2A49D52AAA9387-001\shard-3-001\cores}
   [junit4]   2> 1506297 ERROR (closeThreadPool-7737-thread-1) [    ] o.a.s.u.StartupLoggingUtils Missing Java Option solr.log.dir. Logging may be missing or incomplete.
   [junit4]   2> 1506297 INFO  (closeThreadPool-7737-thread-1) [    ] o.a.s.s.SolrDispatchFilter Using logger factory org.apache.logging.slf4j.Log4jLoggerFactory
   [junit4]   2> 1506297 INFO  (closeThreadPool-7737-thread-1) [    ] o.a.s.s.SolrDispatchFilter  ___      _       Welcome to Apache Solr™ version 7.7.0
   [junit4]   2> 1506297 INFO  (closeThreadPool-7737-thread-1) [    ] o.a.s.s.SolrDispatchFilter / __| ___| |_ _   Starting in cloud mode on port null
   [junit4]   2> 1506297 INFO  (closeThreadPool-7737-thread-1) [    ] o.a.s.s.SolrDispatchFilter \__ \/ _ \ | '_|  Install dir: null
   [junit4]   2> 1506297 INFO  (closeThreadPool-7737-thread-1) [    ] o.a.s.s.SolrDispatchFilter |___/\___/_|_|    Start time: 2019-01-09T06:10:02.507Z
   [junit4]   2> 1506312 INFO  (zkConnectionManagerCallback-7771-thread-1) [    ] o.a.s.c.c.ConnectionManager zkClient has connected
   [junit4]   2> 1506312 INFO  (closeThreadPool-7737-thread-1) [    ] o.a.s.s.SolrDispatchFilter Loading solr.xml from SolrHome (not found in ZooKeeper)
   [junit4]   2> 1506312 INFO  (closeThreadPool-7737-thread-1) [    ] o.a.s.c.SolrXmlConfig Loading container configuration from C:\Users\jenkins\workspace\Lucene-Solr-7.x-Windows\solr\build\solr-core\test\J1\temp\solr.handler.TestSQLHandler_6D2A49D52AAA9387-001\shard-3-001\solr.xml
   [junit4]   2> 1506312 WARN  (NIOServerCxn.Factory:0.0.0.0/0.0.0.0:0) [    ] o.a.z.s.NIOServerCnxn Unable to read additional data from client sessionid 0x100614a540a0010, likely client has closed socket
   [junit4]   2> 1506312 INFO  (closeThreadPool-7737-thread-1) [    ] o.a.s.c.SolrXmlConfig Configuration parameter autoReplicaFailoverWorkLoopDelay is ignored
   [junit4]   2> 1506312 INFO  (closeThreadPool-7737-thread-1) [    ] o.a.s.c.SolrXmlConfig Configuration parameter autoReplicaFailoverBadNodeExpiration is ignored
   [junit4]   2> 1506312 INFO  (closeThreadPool-7737-thread-1) [    ] o.a.s.c.SolrXmlConfig MBean server found: com.sun.jmx.mbeanserver.JmxMBeanServer@70f43ff6, but no JMX reporters were configured - adding default JMX reporter.
   [junit4]   2> 1506405 INFO  (closeThreadPool-7737-thread-1) [    ] o.a.s.c.ZkContainer Zookeeper client=127.0.0.1:62540/solr
   [junit4]   2> 1506405 INFO  (zkConnectionManagerCallback-7775-thread-1) [    ] o.a.s.c.c.ConnectionManager zkClient has connected
   [junit4]   2> 1506405 INFO  (zkConnectionManagerCallback-7777-thread-1) [    ] o.a.s.c.c.ConnectionManager zkClient has connected
   [junit4]   2> 1506405 INFO  (closeThreadPool-7737-thread-1) [    ] o.a.s.c.c.ZkStateReader Updated live nodes from ZooKeeper... (0) -> (3)
   [junit4]   2> 1506420 INFO  (closeThreadPool-7737-thread-1) [    ] o.a.s.c.ZkController Publish node=127.0.0.1:62616_ as DOWN
   [junit4]   2> 1506420 INFO  (closeThreadPool-7737-thread-1) [    ] o.a.s.c.TransientSolrCoreCacheDefault Allocating transient cache for 4 transient cores
   [junit4]   2> 1506420 INFO  (closeThreadPool-7737-thread-1) [    ] o.a.s.c.ZkController Register node as live in ZooKeeper:/live_nodes/127.0.0.1:62616_
   [junit4]   2> 1506420 INFO  (zkCallback-7744-thread-1) [    ] o.a.s.c.c.ZkStateReader Updated live nodes from ZooKeeper... (3) -> (4)
   [junit4]   2> 1506420 INFO  (zkCallback-7760-thread-1) [    ] o.a.s.c.c.ZkStateReader Updated live nodes from ZooKeeper... (3) -> (4)
   [junit4]   2> 1506420 INFO  (zkCallback-7717-thread-3) [    ] o.a.s.c.c.ZkStateReader Updated live nodes from ZooKeeper... (3) -> (4)
   [junit4]   2> 1506420 INFO  (zkCallback-7735-thread-1) [    ] o.a.s.c.c.ZkStateReader Updated live nodes from ZooKeeper... (3) -> (4)
   [junit4]   2> 1506420 INFO  (zkCallback-7751-thread-1) [    ] o.a.s.c.c.ZkStateReader Updated live nodes from ZooKeeper... (3) -> (4)
   [junit4]   2> 1506420 INFO  (zkCallback-7724-thread-1) [    ] o.a.s.c.c.ZkStateReader Updated live nodes from ZooKeeper... (3) -> (4)
   [junit4]   2> 1506420 INFO  (zkCallback-7776-thread-1) [    ] o.a.s.c.c.ZkStateReader Updated live nodes from ZooKeeper... (3) -> (4)
   [junit4]   2> 1506420 INFO  (zkCallback-7767-thread-1) [    ] o.a.s.c.c.ZkStateReader Updated live nodes from ZooKeeper... (3) -> (4)
   [junit4]   2> 1506482 INFO  (zkConnectionManagerCallback-7784-thread-1) [    ] o.a.s.c.c.ConnectionManager zkClient has connected
   [junit4]   2> 1506482 INFO  (closeThreadPool-7737-thread-1) [    ] o.a.s.c.c.ZkStateReader Updated live nodes from ZooKeeper... (0) -> (4)
   [junit4]   2> 1506482 INFO  (closeThreadPool-7737-thread-1) [    ] o.a.s.c.s.i.ZkClientClusterStateProvider Cluster at 127.0.0.1:62540/solr ready
   [junit4]   2> 1506482 INFO  (closeThreadPool-7737-thread-1) [    ] o.a.s.h.a.MetricsHistoryHandler No .system collection, keeping metrics history in memory.
   [junit4]   2> 1506513 INFO  (closeThreadPool-7737-thread-1) [    ] o.a.s.m.r.SolrJmxReporter JMX monitoring for 'solr.node' (registry 'solr.node') enabled at server: com.sun.jmx.mbeanserver.JmxMBeanServer@70f43ff6
   [junit4]   2> 1506513 INFO  (closeThreadPool-7737-thread-1) [    ] o.a.s.m.r.SolrJmxReporter JMX monitoring for 'solr.jvm' (registry 'solr.jvm') enabled at server: com.sun.jmx.mbeanserver.JmxMBeanServer@70f43ff6
   [junit4]   2> 1506513 INFO  (closeThreadPool-7737-thread-1) [    ] o.a.s.m.r.SolrJmxReporter JMX monitoring for 'solr.jetty' (registry 'solr.jetty') enabled at server: com.sun.jmx.mbeanserver.JmxMBeanServer@70f43ff6
   [junit4]   2> 1506529 INFO  (closeThreadPool-7737-thread-1) [    ] o.a.s.c.CorePropertiesLocator Found 0 core definitions underneath C:\Users\jenkins\workspace\Lucene-Solr-7.x-Windows\solr\build\solr-core\test\J1\..\..\..\..\..\..\..\..\..\Users\jenkins\workspace\Lucene-Solr-7.x-Windows\solr\build\solr-core\test\J1\temp\solr.handler.TestSQLHandler_6D2A49D52AAA9387-001\shard-3-001\cores
   [junit4]   2> 1506838 INFO  (TEST-TestSQLHandler.doTest-seed#[6D2A49D52AAA9387]) [    ] o.a.s.c.AbstractFullDistribZkTestBase create jetty 4 in directory C:\Users\jenkins\workspace\Lucene-Solr-7.x-Windows\solr\build\solr-core\test\J1\temp\solr.handler.TestSQLHandler_6D2A49D52AAA9387-001\shard-4-001 of type NRT
   [junit4]   2> 1506838 WARN  (closeThreadPool-7737-thread-1) [    ] o.e.j.s.AbstractConnector Ignoring deprecated socket close linger time
   [junit4]   2> 1506838 INFO  (closeThreadPool-7737-thread-1) [    ] o.a.s.c.s.e.JettySolrRunner Start Jetty (original configured port=0)
   [junit4]   2> 1506838 INFO  (closeThreadPool-7737-thread-1) [    ] o.a.s.c.s.e.JettySolrRunner Trying to start Jetty on port 0 try number 1 ...
   [junit4]   2> 1506838 INFO  (closeThreadPool-7737-thread-1) [    ] o.e.j.s.Server jetty-9.4.14.v20181114; built: 2018-11-14T21:20:31.478Z; git: c4550056e785fb5665914545889f21dc136ad9e6; jvm 1.8.0_172-b11
   [junit4]   2> 1506838 INFO  (closeThreadPool-7737-thread-1) [    ] o.e.j.s.session DefaultSessionIdManager workerName=node0
   [junit4]   2> 1506838 INFO  (closeThreadPool-7737-thread-1) [    ] o.e.j.s.session No SessionScavenger set, using defaults
   [junit4]   2> 1506838 INFO  (closeThreadPool-7737-thread-1) [    ] o.e.j.s.session node0 Scavenging every 660000ms
   [junit4]   2> 1506838 INFO  (closeThreadPool-7737-thread-1) [    ] o.e.j.s.h.ContextHandler Started o.e.j.s.ServletContextHandler@5a37b9b9{/,null,AVAILABLE}
   [junit4]   2> 1506838 INFO  (closeThreadPool-7737-thread-1) [    ] o.e.j.s.AbstractConnector Started ServerConnector@1745dc81{HTTP/1.1,[http/1.1]}{127.0.0.1:62631}
   [junit4]   2> 1506838 INFO  (closeThreadPool-7737-thread-1) [    ] o.e.j.s.Server Started @1491794ms
   [junit4]   2> 1506838 INFO  (closeThreadPool-7737-thread-1) [    ] o.a.s.c.s.e.JettySolrRunner Jetty properties: {solr.data.dir=C:\Users\jenkins\workspace\Lucene-Solr-7.x-Windows\solr\build\solr-core\test\J1\temp\solr.handler.TestSQLHandler_6D2A49D52AAA9387-001\tempDir-001/jetty4, replicaType=NRT, solrconfig=solrconfig.xml, hostContext=/, hostPort=62631, coreRootDirectory=C:\Users\jenkins\workspace\Lucene-Solr-7.x-Windows\solr\build\solr-core\test\J1\..\..\..\..\..\..\..\..\..\Users\jenkins\workspace\Lucene-Solr-7.x-Windows\solr\build\solr-core\test\J1\temp\solr.handler.TestSQLHandler_6D2A49D52AAA9387-001\shard-4-001\cores}
   [junit4]   2> 1506838 ERROR (closeThreadPool-7737-thread-1) [    ] o.a.s.u.StartupLoggingUtils Missing Java Option solr.log.dir. Logging may be missing or incomplete.
   [junit4]   2> 1506838 INFO  (closeThreadPool-7737-thread-1) [    ] o.a.s.s.SolrDispatchFilter Using logger factory org.apache.logging.slf4j.Log4jLoggerFactory
   [junit4]   2> 1506838 INFO  (closeThreadPool-7737-thread-1) [    ] o.a.s.s.SolrDispatchFilter  ___      _       Welcome to Apache Solr™ version 7.7.0
   [junit4]   2> 1506838 INFO  (closeThreadPool-7737-thread-1) [    ] o.a.s.s.SolrDispatchFilter / __| ___| |_ _   Starting in cloud mode on port null
   [junit4]   2> 1506838 INFO  (closeThreadPool-7737-thread-1) [    ] o.a.s.s.SolrDispatchFilter \__ \/ _ \ | '_|  Install dir: null
   [junit4]   2> 1506838 INFO  (closeThreadPool-7737-thread-1) [    ] o.a.s.s.SolrDispatchFilter |___/\___/_|_|    Start time: 2019-01-09T06:10:03.048Z
   [junit4]   2> 1506854 INFO  (zkConnectionManagerCallback-7787-thread-1) [    ] o.a.s.c.c.ConnectionManager zkClient has connected
   [junit4]   2> 1506854 INFO  (closeThreadPool-7737-thread-1) [    ] o.a.s.s.SolrDispatchFilter Loading solr.xml from SolrHome (not found in ZooKeeper)
   [junit4]   2> 1506854 INFO  (closeThreadPool-7737-thread-1) [    ] o.a.s.c.SolrXmlConfig Loading container configuration from C:\Users\jenkins\workspace\Lucene-Solr-7.x-Windows\solr\build\solr-core\test\J1\temp\solr.handler.TestSQLHandler_6D2A49D52AAA9387-001\shard-4-001\solr.xml
   [junit4]   2> 1506854 INFO  (closeThreadPool-7737-thread-1) [    ] o.a.s.c.SolrXmlConfig Configuration parameter autoReplicaFailoverWorkLoopDelay is ignored
   [junit4]   2> 1506854 INFO  (closeThreadPool-7737-thread-1) [    ] o.a.s.c.SolrXmlConfig Configuration parameter autoReplicaFailoverBadNodeExpiration is ignored
   [junit4]   2> 1506854 INFO  (closeThreadPool-7737-thread-1) [    ] o.a.s.c.SolrXmlConfig MBean server found: com.sun.jmx.mbeanserver.JmxMBeanServer@70f43ff6, but no JMX reporters were configured - adding default JMX reporter.
   [junit4]   2> 1507179 INFO  (closeThreadPool-7737-thread-1) [    ] o.a.s.c.ZkContainer Zookeeper client=127.0.0.1:62540/solr
   [junit4]   2> 1507179 INFO  (zkConnectionManagerCallback-7791-thread-1) [    ] o.a.s.c.c.ConnectionManager zkClient has connected
   [junit4]   2> 1507195 INFO  (zkConnectionManagerCallback-7793-thread-1) [    ] o.a.s.c.c.ConnectionManager zkClient has connected
   [junit4]   2> 1507195 INFO  (closeThreadPool-7737-thread-1) [    ] o.a.s.c.c.ZkStateReader Updated live nodes from ZooKeeper... (0) -> (4)
   [junit4]   2> 1507195 INFO  (closeThreadPool-7737-thread-1) [    ] o.a.s.c.ZkController Publish node=127.0.0.1:62631_ as DOWN
   [junit4]   2> 1507195 INFO  (closeThreadPool-7737-thread-1) [    ] o.a.s.c.TransientSolrCoreCacheDefault Allocating transient cache for 4 transient cores
   [junit4]   2> 1507195 INFO  (closeThreadPool-7737-thread-1) [    ] o.a.s.c.ZkController Register node as live in ZooKeeper:/live_nodes/127.0.0.1:62631_
   [junit4]   2> 1507195 INFO  (zkCallback-7744-thread-1) [    ] o.a.s.c.c.ZkStateReader Updated live nodes from ZooKeeper... (4) -> (5)
   [junit4]   2> 1507195 INFO  (zkCallback-7735-thread-1) [    ] o.a.s.c.c.ZkStateReader Updated live nodes from ZooKeeper... (4) -> (5)
   [junit4]   2> 1507195 INFO  (zkCallback-7760-thread-1) [    ] o.a.s.c.c.ZkStateReader Updated live nodes from ZooKeeper... (4) -> (5)
   [junit4]   2> 1507195 INFO  (zkCallback-7767-thread-1) [    ] o.a.s.c.c.ZkStateReader Updated live nodes from ZooKeeper... (4) -> (5)
   [junit4]   2> 1507195 INFO  (zkCallback-7776-thread-1) [    ] o.a.s.c.c.ZkStateReader Updated live nodes from ZooKeeper... (4) -> (5)
   [junit4]   2> 1507195 INFO  (zkCallback-7717-thread-3) [    ] o.a.s.c.c.ZkStateReader Updated live nodes from ZooKeeper... (4) -> (5)
   [junit4]   2> 1507195 INFO  (zkCallback-7724-thread-1) [    ] o.a.s.c.c.ZkStateReader Updated live nodes from ZooKeeper... (4) -> (5)
   [junit4]   2> 1507195 INFO  (zkCallback-7751-thread-1) [    ] o.a.s.c.c.ZkStateReader Updated live nodes from ZooKeeper... (4) -> (5)
   [junit4]   2> 1507195 INFO  (zkCallback-7792-thread-1) [    ] o.a.s.c.c.ZkStateReader Updated live nodes from ZooKeeper... (4) -> (5)
   [junit4]   2> 1507195 INFO  (zkCallback-7783-thread-1) [    ] o.a.s.c.c.ZkStateReader Updated live nodes from ZooKeeper... (4) -> (5)
   [junit4]   2> 1507256 INFO  (zkConnectionManagerCallback-7800-thread-1) [    ] o.a.s.c.c.ConnectionManager zkClient has connected
   [junit4]   2> 1507256 INFO  (closeThreadPool-7737-thread-1) [    ] o.a.s.c.c.ZkStateReader Updated live nodes from ZooKeeper... (0) -> (5)
   [junit4]   2> 1507256 INFO  (closeThreadPool-7737-thread-1) [    ] o.a.s.c.s.i.ZkClientClusterStateProvider Cluster at 127.0.0.1:62540/solr ready
   [junit4]   2> 1507256 INFO  (closeThreadPool-7737-thread-1) [    ] o.a.s.h.a.MetricsHistoryHandler No .system collection, keeping metrics history in memory.
   [junit4]   2> 1507287 INFO  (closeThreadPool-7737-thread-1) [    ] o.a.s.m.r.SolrJmxReporter JMX monitoring for 'solr.node' (registry 'solr.node') enabled at server: com.sun.jmx.mbeanserver.JmxMBeanServer@70f43ff6
   [junit4]   2> 1507287 INFO  (closeThreadPool-7737-thread-1) [    ] o.a.s.m.r.SolrJmxReporter JMX monitoring for 'solr.jvm' (registry 'solr.jvm') enabled at server: com.sun.jmx.mbeanserver.JmxMBeanServer@70f43ff6
   [junit4]   2> 1507287 INFO  (closeThreadPool-7737-thread-1) [    ] o.a.s.m.r.SolrJmxReporter JMX monitoring for 'solr.jetty' (registry 'solr.jetty') enabled at server: com.sun.jmx.mbeanserver.JmxMBeanServer@70f43ff6
   [junit4]   2> 1507287 INFO  (closeThreadPool-7737-thread-1) [    ] o.a.s.c.CorePropertiesLocator Found 0 core definitions underneath C:\Users\jenkins\workspace\Lucene-Solr-7.x-Windows\solr\build\solr-core\test\J1\..\..\..\..\..\..\..\..\..\Users\jenkins\workspace\Lucene-Solr-7.x-Windows\solr\build\solr-core\test\J1\temp\solr.handler.TestSQLHandler_6D2A49D52AAA9387-001\shard-4-001\cores
   [junit4]   2> 1507334 INFO  (qtp1247230541-24930) [n:127.0.0.1:62558_    ] o.a.s.h.a.CollectionsHandler Invoked Collection Action :addreplica with params node=127.0.0.1:62631_&action=ADDREPLICA&collection=collection1&shard=shard1&type=NRT&wt=javabin&version=2 and sendToOCPQueue=true
   [junit4]   2> 1507334 INFO  (qtp1247230541-24929) [n:127.0.0.1:62558_    ] o.a.s.h.a.CollectionsHandler Invoked Collection Action :addreplica with params node=127.0.0.1:62601_&action=ADDREPLICA&collection=collection1&shard=shard1&type=NRT&wt=javabin&version=2 and sendToOCPQueue=true
   [junit4]   2> 1507334 INFO  (qtp1247230541-24925) [n:127.0.0.1:62558_    ] o.a.s.h.a.CollectionsHandler Invoked Collection Action :addreplica with params node=127.0.0.1:62616_&action=ADDREPLICA&collection=collection1&shard=shard2&type=NRT&wt=javabin&version=2 and sendToOCPQueue=true
   [junit4]   2> 1507365 INFO  (qtp1247230541-24928) [n:127.0.0.1:62558_    ] o.a.s.h.a.CollectionsHandler Invoked Collection Action :addreplica with params node=127.0.0.1:62585_&action=ADDREPLICA&collection=collection1&shard=shard2&type=NRT&wt=javabin&version=2 and sendToOCPQueue=true
   [junit4]   2> 1507365 INFO  (qtp1247230541-24926) [n:127.0.0.1:62558_    ] o.a.s.s.HttpSolrCall [admin] webapp=null path=/admin/metrics params={wt=javabin&version=2&key=solr.core.control_collection.shard1.replica_n1:INDEX.sizeInBytes} status=0 QTime=0
   [junit4]   2> 1507365 INFO  (qtp1247230541-24927) [n:127.0.0.1:62558_    ] o.a.s.s.HttpSolrCall [admin] webapp=null path=/admin/metrics params={wt=javabin&version=2&key=solr.core.control_collection.shard1.replica_n1:INDEX.sizeInBytes} status=0 QTime=0
   [junit4]   2> 1507365 INFO  (qtp1247230541-24926) [n:127.0.0.1:62558_    ] o.a.s.s.HttpSolrCall [admin] webapp=null path=/admin/metrics params={wt=javabin&version=2&key=solr.core.control_collection.shard1.replica_n1:INDEX.sizeInBytes} status=0 QTime=0
   [junit4]   2> 1507365 INFO  (qtp1247230541-24927) [n:127.0.0.1:62558_    ] o.a.s.s.HttpSolrCall [admin] webapp=null path=/admin/metrics params={prefix=CONTAINER.fs.usableSpace,CONTAINER.fs.totalSpace,CORE.coreName&wt=javabin&version=2&group=solr.node,solr.core} status=0 QTime=3
   [junit4]   2> 1507365 INFO  (qtp1247230541-24926) [n:127.0.0.1:62558_    ] o.a.s.s.HttpSolrCall [admin] webapp=null path=/admin/metrics params={prefix=CONTAINER.fs.usableSpace,CONTAINER.fs.totalSpace,CORE.coreName&wt=javabin&version=2&group=solr.node,solr.core} status=0 QTime=3
   [junit4]   2> 1507365 INFO  (qtp1247230541-24927) [n:127.0.0.1:62558_    ] o.a.s.s.HttpSolrCall [admin] webapp=null path=/admin/metrics params={prefix=CONTAINER.fs.usableSpace,CONTAINER.fs.totalSpace,CORE.coreName&wt=javabin&version=2&group=solr.node,solr.core} status=0 QTime=3
   [junit4]   2> 1507380 INFO  (qtp1247230541-24926) [n:127.0.0.1:62558_    ] o.a.s.s.HttpSolrCall [admin] webapp=null path=/admin/metrics params={prefix=CONTAINER.fs.usableSpace,CONTAINER.fs.totalSpace,CORE.coreName&wt=javabin&version=2&group=solr.node,solr.core} status=0 QTime=3
   [junit4]   2> 1507380 INFO  (qtp1247230541-24927) [n:127.0.0.1:62558_    ] o.a.s.s.HttpSolrCall [admin] webapp=null path=/admin/metrics params={prefix=CONTAINER.fs.usableSpace,CONTAINER.fs.totalSpace,CORE.coreName&wt=javabin&version=2&group=solr.node,solr.core} status=0 QTime=2
   [junit4]   2> 1507380 INFO  (qtp1753065118-24986) [n:127.0.0.1:62585_    ] o.a.s.s.HttpSolrCall [admin] webapp=null path=/admin/metrics params={prefix=CONTAINER.fs.usableSpace,CONTAINER.fs.totalSpace,CORE.coreName&wt=javabin&version=2&group=solr.node,solr.core} status=0 QTime=2
   [junit4]   2> 1507380 INFO  (qtp1753065118-24987) [n:127.0.0.1:62585_    ] o.a.s.s.HttpSolrCall [admin] webapp=null path=/admin/metrics params={prefix=CONTAINER.fs.usableSpace,CONTAINER.fs.totalSpace,CORE.coreName&wt=javabin&version=2&group=solr.node,solr.core} status=0 QTime=3
   [junit4]   2> 1507380 INFO  (qtp1753065118-24988) [n:127.0.0.1:62585_    ] o.a.s.s.HttpSolrCall [admin] webapp=null path=/admin/metrics params={prefix=CONTAINER.fs.usableSpace,CONTAINER.fs.totalSpace,CORE.coreName&wt=javabin&version=2&group=solr.node,solr.core} status=0 QTime=2
   [junit4]   2> 1507395 INFO  (qtp1753065118-24989) [n:127.0.0.1:62585_    ] o.a.s.s.HttpSolrCall [admin] webapp=null path=/admin/metrics params={prefix=CONTAINER.fs.usableSpace,CONTAINER.fs.totalSpace,CORE.coreName&wt=javabin&version=2&group=solr.node,solr.core} status=0 QTime=3
   [junit4]   2> 1507395 INFO  (qtp1753065118-24990) [n:127.0.0.1:62585_    ] o.a.s.s.HttpSolrCall [admin] webapp=null path=/admin/metrics params={prefix=CONTAINER.fs.usableSpace,CONTAINER.fs.totalSpace,CORE.coreName&wt=javabin&version=2&group=solr.node,solr.core} status=0 QTime=2
   [junit4]   2> 1507395 INFO  (qtp619413055-25021) [n:127.0.0.1:62601_    ] o.a.s.s.HttpSolrCall [admin] webapp=null path=/admin/metrics params={prefix=CONTAINER.fs.usableSpace,CONTAINER.fs.totalSpace,CORE.coreName&wt=javabin&version=2&group=solr.node,solr.core} status=0 QTime=2
   [junit4]   2> 1507395 INFO  (qtp619413055-25022) [n:127.0.0.1:62601_    ] o.a.s.s.HttpSolrCall [admin] webapp=null path=/admin/metrics params={prefix=CONTAINER.fs.usableSpace,CONTAINER.fs.totalSpace,CORE.coreName&wt=javabin&version=2&group=solr.node,solr.core} status=0 QTime=2
   [junit4]   2> 1507411 INFO  (qtp619413055-25023) [n:127.0.0.1:62601_    ] o.a.s.s.HttpSolrCall [admin] webapp=null path=/admin/metrics params={prefix=CONTAINER.fs.usableSpace,CONTAINER.fs.totalSpace,CORE.coreName&wt=javabin&version=2&group=solr.node,solr.core} status=0 QTime=2
   [junit4]   2> 1507411 INFO  (qtp619413055-25024) [n:127.0.0.1:62601_    ] o.a.s.s.HttpSolrCall [admin] webapp=null path=/admin/metrics params={prefix=CONTAINER.fs.usableSpace,CONTAINER.fs.totalSpace,CORE.coreName&wt=javabin&version=2&group=solr.node,solr.core} status=0 QTime=2
   [junit4]   2> 1507411 INFO  (qtp619413055-25025) [n:127.0.0.1:62601_    ] o.a.s.s.HttpSolrCall [admin] webapp=null path=/admin/metrics params={prefix=CONTAINER.fs.usableSpace,CONTAINER.fs.totalSpace,CORE.coreName&wt=javabin&version=2&group=solr.node,solr.core} status=0 QTime=2
   [junit4]   2> 1507411 INFO  (qtp1417504475-25054) [n:127.0.0.1:62616_    ] o.a.s.s.HttpSolrCall [admin] webapp=null path=/admin/metrics params={prefix=CONTAINER.fs.usableSpace,CONTAINER.fs.totalSpace,CORE.coreName&wt=javabin&version=2&group=solr.node,solr.core} status=0 QTime=4
   [junit4]   2> 1507411 INFO  (qtp1417504475-25055) [n:127.0.0.1:62616_    ] o.a.s.s.HttpSolrCall [admin] webapp=null path=/admin/metrics params={prefix=CONTAINER.fs.usableSpace,CONTAINER.fs.totalSpace,CORE.coreName&wt=javabin&version=2&group=solr.node,solr.core} status=0 QTime=2
   [junit4]   2> 1507426 INFO  (qtp1417504475-25056) [n:127.0.0.1:62616_    ] o.a.s.s.HttpSolrCall [admin] webapp=null path=/admin/metrics params={prefix=CONTAINER.fs.usableSpace,CONTAINER.fs.totalSpace,CORE.coreName&wt=javabin&version=2&group=solr.node,solr.core} status=0 QTime=1
   [junit4]   2> 1507426 INFO  (qtp1417504475-25057) [n:127.0.0.1:62616_    ] o.a.s.s.HttpSolrCall [admin] webapp=null path=/admin/metrics params={prefix=CONTAINER.fs.usableSpace,CONTAINER.fs.totalSpace,CORE.coreName&wt=javabin&version=2&group=solr.node,solr.core} status=0 QTime=3
   [junit4]   2> 1507426 INFO  (qtp1417504475-25058) [n:127.0.0.1:62616_    ] o.a.s.s.HttpSolrCall [admin] webapp=null path=/admin/metrics params={prefix=CONTAINER.fs.usableSpace,CONTAINER.fs.totalSpace,CORE.coreName&wt=javabin&version=2&group=solr.node,solr.core} status=0 QTime=1
   [junit4]   2> 1507426 INFO  (qtp906203001-25087) [n:127.0.0.1:62631_    ] o.a.s.s.HttpSolrCall [admin] webapp=null path=/admin/metrics params={prefix=CONTAINER.fs.usableSpace,CONTAINER.fs.totalSpace,CORE.coreName&wt=javabin&version=2&group=solr.node,solr.core} status=0 QTime=2
   [junit4]   2> 1507426 INFO  (qtp906203001-25088) [n:127.0.0.1:62631_    ] o.a.s.s.HttpSolrCall [admin] webapp=null path=/admin/metrics params={prefix=CONTAINER.fs.usableSpace,CONTAINER.fs.totalSpace,CORE.coreName&wt=javabin&version=2&group=solr.node,solr.core} status=0 QTime=2
   [junit4]   2> 1507426 INFO  (qtp906203001-25089) [n:127.0.0.1:62631_    ] o.a.s.s.HttpSolrCall [admin] webapp=null path=/admin/metrics params={prefix=CONTAINER.fs.usableSpace,CONTAINER.fs.totalSpace,CORE.coreName&wt=javabin&version=2&group=solr.node,solr.core} status=0 QTime=2
   [junit4]   2> 1507442 INFO  (qtp906203001-25090) [n:127.0.0.1:62631_    ] o.a.s.s.HttpSolrCall [admin] webapp=null path=/admin/metrics params={prefix=CONTAINER.fs.usableSpace,CONTAINER.fs.totalSpace,CORE.coreName&wt=javabin&version=2&group=solr.node,solr.core} status=0 QTime=3
   [junit4]   2> 1507442 INFO  (qtp906203001-25091) [n:127.0.0.1:62631_    ] o.a.s.s.HttpSolrCall [admin] webapp=null path=/admin/metrics params={prefix=CONTAINER.fs.usableSpace,CONTAINER.fs.totalSpace,CORE.coreName&wt=javabin&version=2&group=solr.node,solr.core} status=0 QTime=3
   [junit4]   2> 1507442 INFO  (OverseerThreadFactory-8724-thread-4-processing-n:127.0.0.1:62558_) [n:127.0.0.1:62558_ c:collection1 s:shard2  ] o.a.s.c.a.c.AddReplicaCmd Node Identified 127.0.0.1:62616_ for creating new replica of shard shard2 for collection collection1
   [junit4]   2> 1507442 INFO  (OverseerThreadFactory-8724-thread-3-processing-n:127.0.0.1:62558_) [n:127.0.0.1:62558_ c:collection1 s:shard1  ] o.a.s.c.a.c.AddReplicaCmd Node Identified 127.0.0.1:62601_ for creating new replica of shard shard1 for collection collection1
   [junit4]   2> 1507442 INFO  (OverseerThreadFactory-8724-thread-4-processing-n:127.0.0.1:62558_) [n:127.0.0.1:62558_ c:collection1 s:shard2  ] o.a.s.c.a.c.AddReplicaCmd Returning CreateReplica command.
   [junit4]   2> 1507442 INFO  (OverseerThreadFactory-8724-thread-3-processing-n:127.0.0.1:62558_) [n:127.0.0.1:62558_ c:collection1 s:shard1  ] o.a.s.c.a.c.AddReplicaCmd Returning CreateReplica command.
   [junit4]   2> 1507442 INFO  (qtp1417504475-25054) [n:127.0.0.1:62616_    x:collection1_shard2_replica_n1] o.a.s.h.a.CoreAdminOperation core create command qt=/admin/cores&collection.configName=conf1&name=collection1_shard2_replica_n1&action=CREATE&collection=collection1&shard=shard2&wt=javabin&version=2&replicaType=NRT
   [junit4]   2> 1507442 INFO  (qtp619413055-25021) [n:127.0.0.1:62601_    x:collection1_shard1_replica_n2] o.a.s.h.a.CoreAdminOperation core create command qt=/admin/cores&collection.configName=conf1&name=collection1_shard1_replica_n2&action=CREATE&collection=collection1&shard=shard1&wt=javabin&version=2&replicaType=NRT
   [junit4]   2> 1508495 INFO  (qtp619413055-25021) [n:127.0.0.1:62601_ c:collection1 s:shard1  x:collection1_shard1_replica_n2] o.a.s.c.SolrConfig Using Lucene MatchVersion: 7.7.0
   [junit4]   2> 1508495 INFO  (qtp1417504475-25054) [n:127.0.0.1:62616_ c:collection1 s:shard2  x:collection1_shard2_replica_n1] o.a.s.c.SolrConfig Using Lucene MatchVersion: 7.7.0
   [junit4]   2> 1508541 INFO  (qtp1417504475-25054) [n:127.0.0.1:62616_ c:collection1 s:shard2  x:collection1_shard2_replica_n1] o.a.s.s.IndexSchema [collection1_shard2_replica_n1] Schema name=test
   [junit4]   2> 1508541 INFO  (qtp619413055-25021) [n:127.0.0.1:62601_ c:collection1 s:shard1  x:collection1_shard1_replica_n2] o.a.s.s.IndexSchema [collection1_shard1_replica_n2] Schema name=test
   [junit4]   2> 1508618 WARN  (qtp1417504475-25054) [n:127.0.0.1:62616_ c:collection1 s:shard2  x:collection1_shard2_replica_n1] o.a.s.s.IndexSchema Field lowerfilt1and2 is not multivalued and destination for multiple copyFields (2)
   [junit4]   2> 1508618 WARN  (qtp1417504475-25054) [n:127.0.0.1:62616_ c:collection1 s:shard2  x:collection1_shard2_replica_n1] o.a.s.s.IndexSchema Field text is not multivalued and destination for multiple copyFields (3)
   [junit4]   2> 1508618 INFO  (qtp1417504475-25054) [n:127.0.0.1:62616_ c:collection1 s:shard2  x:collection1_shard2_replica_n1] o.a.s.s.IndexSchema Loaded schema test/1.6 with uniqueid field id
   [junit4]   2> 1508618 INFO  (qtp1417504475-25054) [n:127.0.0.1:62616_ c:collection1 s:shard2  x:collection1_shard2_replica_n1] o.a.s.c.CoreContainer Creating SolrCore 'collection1_shard2_replica_n1' using configuration from collection collection1, trusted=true
   [junit4]   2> 1508618 INFO  (qtp1417504475-25054) [n:127.0.0.1:62616_ c:collection1 s:shard2  x:collection1_shard2_replica_n1] o.a.s.m.r.SolrJmxReporter JMX monitoring for 'solr.core.collection1.shard2.replica_n1' (registry 'solr.core.collection1.shard2.replica_n1') enabled at server: com.sun.jmx.mbeanserver.JmxMBeanServer@70f43ff6
   [junit4]   2> 1508618 INFO  (qtp1417504475-25054) [n:127.0.0.1:62616_ c:collection1 s:shard2  x:collection1_shard2_replica_n1] o.a.s.c.SolrCore [[collection1_shard2_replica_n1] ] Opening new SolrCore at [C:\Users\jenkins\workspace\Lucene-Solr-7.x-Windows\solr\build\solr-core\test\J1\temp\solr.handler.TestSQLHandler_6D2A49D52AAA9387-001\shard-3-001\cores\collection1_shard2_replica_n1], dataDir=[C:\Users\jenkins\workspace\Lucene-Solr-7.x-Windows\solr\build\solr-core\test\J1\..\..\..\..\..\..\..\..\..\Users\jenkins\workspace\Lucene-Solr-7.x-Windows\solr\build\solr-core\test\J1\temp\solr.handler.TestSQLHandler_6D2A49D52AAA9387-001\shard-3-001\cores\collection1_shard2_replica_n1\data\]
   [junit4]   2> 1508618 WARN  (qtp619413055-25021) [n:127.0.0.1:62601_ c:collection1 s:shard1  x:collection1_shard1_replica_n2] o.a.s.s.IndexSchema Field lowerfilt1and2 is not multivalued and destination for multiple copyFields (2)
   [junit4]   2> 1508618 WARN  (qtp619413055-25021) [n:127.0.0.1:62601_ c:collection1 s:shard1  x:collection1_shard1_replica_n2] o.a.s.s.IndexSchema Field text is not multivalued and destination for multiple copyFields (3)
   [junit4]   2> 1508618 INFO  (qtp619413055-25021) [n:127.0.0.1:62601_ c:collection1 s:shard1  x:collection1_shard1_replica_n2] o.a.s.s.IndexSchema Loaded schema test/1.6 with uniqueid field id
   [junit4]   2> 1508618 INFO  (qtp619413055-25021) [n:127.0.0.1:62601_ c:collection1 s:shard1  x:collection1_shard1_replica_n2] o.a.s.c.CoreContainer Creating SolrCore 'collection1_shard1_replica_n2' using configuration from collection collection1, trusted=true
   [junit4]   2> 1508618 INFO  (qtp619413055-25021) [n:127.0.0.1:62601_ c:collection1 s:shard1  x:collection1_shard1_replica_n2] o.a.s.m.r.SolrJmxReporter JMX monitoring for 'solr.core.collection1.shard1.replica_n2' (registry 'solr.core.collection1.shard1.replica_n2') enabled at server: com.sun.jmx.mbeanserver.JmxMBeanServer@70f43ff6
   [junit4]   2> 1508618 INFO  (qtp619413055-25021) [n:127.0.0.1:62601_ c:collection1 s:shard1  x:collection1_shard1_replica_n2] o.a.s.c.SolrCore [[collection1_shard1_replica_n2] ] Opening new SolrCore at [C:\Users\jenkins\workspace\Lucene-Solr-7.x-Windows\solr\build\solr-core\test\J1\temp\solr.handler.TestSQLHandler_6D2A49D52AAA9387-001\shard-2-001\cores\collection1_shard1_replica_n2], dataDir=[C:\Users\jenkins\workspace\Lucene-Solr-7.x-Windows\solr\build\solr-core\test\J1\temp\solr.handler.TestSQLHandler_6D2A49D52AAA9387-001\shard-2-001\cores\collection1_shard1_replica_n2\data\]
   [junit4]   2> 1508726 INFO  (qtp1417504475-25054) [n:127.0.0.1:62616_ c:collection1 s:shard2  x:collection1_shard2_replica_n1] o.a.s.u.UpdateHandler Using UpdateLog implementation: org.apache.solr.update.UpdateLog
   [junit4]   2> 1508726 INFO  (qtp1417504475-25054) [n:127.0.0.1:62616_ c:collection1 s:shard2  x:collection1_shard2_replica_n1] o.a.s.u.UpdateLog Initializing UpdateLog: dataDir= defaultSyncLevel=FLUSH numRecordsToKeep=100 maxNumLogsToKeep=10 numVersionBuckets=65536
   [junit4]   2> 1508726 INFO  (qtp1417504475-25054) [n:127.0.0.1:62616_ c:collection1 s:shard2  x:collection1_shard2_replica_n1] o.a.s.u.CommitTracker Hard AutoCommit: disabled
   [junit4]   2> 1508726 INFO  (qtp1417504475-25054) [n:127.0.0.1:62616_ c:collection1 s:shard2  x:collection1_shard2_replica_n1] o.a.s.u.CommitTracker Soft AutoCommit: disabled
   [junit4]   2> 1508726 INFO  (qtp1417504475-25054) [n:127.0.0.1:62616_ c:collection1 s:shard2  x:collection1_shard2_replica_n1] o.a.s.s.SolrIndexSearcher Opening [Searcher@4f651587[collection1_shard2_replica_n1] main]
   [junit4]   2> 1508726 INFO  (qtp619413055-25021) [n:127.0.0.1:62601_ c:collection1 s:shard1  x:collection1_shard1_replica_n2] o.a.s.u.UpdateHandler Using UpdateLog implementation: org.apache.solr.update.UpdateLog
   [junit4]   2> 1508726 INFO  (qtp619413055-25021) [n:127.0.0.1:62601_ c:collection1 s:shard1  x:collection1_shard1_replica_n2] o.a.s.u.UpdateLog Initializing UpdateLog: dataDir= defaultSyncLevel=FLUSH numRecordsToKeep=100 maxNumLogsToKeep=10 numVersionBuckets=65536
   [junit4]   2> 1508726 INFO  (qtp1417504475-25054) [n:127.0.0.1:62616_ c:collection1 s:shard2  x:collection1_shard2_replica_n1] o.a.s.r.ManagedResourceStorage Configured ZooKeeperStorageIO with znodeBase: /configs/conf1
   [junit4]   2> 1508726 INFO  (qtp1417504475-25054) [n:127.0.0.1:62616_ c:collection1 s:shard2  x:collection1_shard2_replica_n1] o.a.s.r.ManagedResourceStorage Loaded null at path _rest_managed.json using ZooKeeperStorageIO:path=/configs/conf1
   [junit4]   2> 1508726 INFO  (qtp1417504475-25054) [n:127.0.0.1:62616_ c:collection1 s:shard2  x:collection1_shard2_replica_n1] o.a.s.u.UpdateLog Could not find max version in index or recent updates, using new clock 1622161966954971136
   [junit4]   2> 1508726 INFO  (qtp619413055-25021) [n:127.0.0.1:62601_ c:collection1 s:shard1  x:collection1_shard1_replica_n2] o.a.s.u.CommitTracker Hard AutoCommit: disabled
   [junit4]   2> 1508726 INFO  (qtp619413055-25021) [n:127.0.0.1:62601_ c:collection1 s:shard1  x:collection1_shard1_replica_n2] o.a.s.u.CommitTracker Soft AutoCommit: disabled
   [junit4]   2> 1508726 INFO  (qtp619413055-25021) [n:127.0.0.1:62601_ c:collection1 s:shard1  x:collection1_shard1_replica_n2] o.a.s.s.SolrIndexSearcher Opening [Searcher@7593e024[collection1_shard1_replica_n2] main]
   [junit4]   2> 1508726 INFO  (searcherExecutor-8769-thread-1-processing-n:127.0.0.1:62616_ x:collection1_shard2_replica_n1 c:collection1 s:shard2) [n:127.0.0.1:62616_ c:collection1 s:shard2  x:collection1_shard2_replica_n1] o.a.s.c.SolrCore [collection1_shard2_replica_n1] Registered new searcher Searcher@4f651587[collection1_shard2_replica_n1] main{ExitableDirectoryReader(UninvertingDirectoryReader())}
   [junit4]   2> 1508726 INFO  (qtp619413055-25021) [n:127.0.0.1:62601_ c:collection1 s:shard1  x:collection1_shard1_replica_n2] o.a.s.r.ManagedResourceStorage Configured ZooKeeperStorageIO with znodeBase: /configs/conf1
   [junit4]   2> 1508726 INFO  (qtp619413055-25021) [n:127.0.0.1:62601_ c:collection1 s:shard1  x:collection1_shard1_replica_n2] o.a.s.r.ManagedResourceStorage Loaded null at path _rest_managed.json using ZooKeeperStorageIO:path=/configs/conf1
   [junit4]   2> 1508726 INFO  (qtp619413055-25021) [n:127.0.0.1:62601_ c:collection1 s:shard1  x:collection1_shard1_replica_n2] o.a.s.u.UpdateLog Could not find max version in index or recent updates, using new clock 1622161966954971136
   [junit4]   2> 1508742 INFO  (qtp1417504475-25054) [n:127.0.0.1:62616_ c:collection1 s:shard2  x:collection1_shard2_replica_n1] o.a.s.c.ZkShardTerms Successful update of terms at /collections/collection1/terms/shard2 to Terms{values={core_node4=0}, version=0}
   [junit4]   2> 1508742 INFO  (qtp1417504475-25054) [n:127.0.0.1:62616_ c:collection1 s:shard2  x:collection1_shard2_replica_n1] o.a.s.c.ShardLeaderElectionContextBase make sure parent is created /collections/collection1/leaders/shard2
   [junit4]   2> 1508742 INFO  (searcherExecutor-8770-thread-1-processing-n:127.0.0.1:62601_ x:collection1_shard1_replica_n2 c:collection1 s:shard1) [n:127.0.0.1:62601_ c:collection1 s:shard1  x:collection1_shard1_replica_n2] o.a.s.c.SolrCore [collection1_shard1_replica_n2] Registered new searcher Searcher@7593e024[collection1_shard1_replica_n2] main{ExitableDirectoryReader(UninvertingDirectoryReader())}
   [junit4]   2> 1508742 INFO  (qtp1417504475-25054) [n:127.0.0.1:62616_ c:collection1 s:shard2  x:collection1_shard2_replica_n1] o.a.s.c.ShardLeaderElectionContext Enough replicas found to continue.
   [junit4]   2> 1508742 INFO  (qtp1417504475-25054) [n:127.0.0.1:62616_ c:collection1 s:shard2  x:collection1_shard2_replica_n1] o.a.s.c.ShardLeaderElectionContext I may be the new leader - try and sync
   [junit4]   2> 1508742 INFO  (qtp1417504475-25054) [n:127.0.0.1:62616_ c:collection1 s:shard2  x:collection1_shard2_replica_n1] o.a.s.c.SyncStrategy Sync replicas to http://127.0.0.1:62616/collection1_shard2_replica_n1/
   [junit4]   2> 1508742 INFO  (qtp1417504475-25054) [n:127.0.0.1:62616_ c:collection1 s:shard2  x:collection1_shard2_replica_n1] o.a.s.c.SyncStrategy Sync Success - now sync replicas to me
   [junit4]   2> 1508742 INFO  (qtp1417504475-25054) [n:127.0.0.1:62616_ c:collection1 s:shard2  x:collection1_shard2_replica_n1] o.a.s.c.SyncStrategy http://127.0.0.1:62616/collection1_shard2_replica_n1/ has no replicas
   [junit4]   2> 1508742 INFO  (qtp1417504475-25054) [n:127.0.0.1:62616_ c:collection1 s:shard2  x:collection1_shard2_replica_n1] o.a.s.c.ShardLeaderElectionContext Found all replicas participating in election, clear LIR
   [junit4]   2> 1508742 INFO  (qtp1417504475-25054) [n:127.0.0.1:62616_ c:collection1 s:shard2  x:collection1_shard2_replica_n1] o.a.s.c.ShardLeaderElectionContextBase Creating leader registration node /collections/collection1/leaders/shard2/leader after winning as /collections/collection1/leader_elect/shard2/election/72164565903343634-core_node4-n_0000000000
   [junit4]   2> 1508742 INFO  (qtp619413055-25021) [n:127.0.0.1:62601_ c:collection1 s:shard1  x:collection1_shard1_replica_n2] o.a.s.c.ZkShardTerms Successful update of terms at /collections/collection1/terms/shard1 to Terms{values={core_node3=0}, version=0}
   [junit4]   2> 1508742 INFO  (qtp619413055-25021) [n:127.0.0.1:62601_ c:collection1 s:shard1  x:collection1_shard1_replica_n2] o.a.s.c.ShardLeaderElectionContextBase make sure parent is created /collections/collection1/leaders/shard1
   [junit4]   2> 1508742 INFO  (qtp1417504475-25054) [n:127.0.0.1:62616_ c:collection1 s:shard2  x:collection1_shard2_replica_n1] o.a.s.c.ShardLeaderElectionContext I am the new leader: http://127.0.0.1:62616/collection1_shard2_replica_n1/ shard2
   [junit4]   2> 1508742 INFO  (qtp619413055-25021) [n:127.0.0.1:62601_ c:collection1 s:shard1  x:collection1_shard1_replica_n2] o.a.s.c.ShardLeaderElectionContext Enough replicas found to continue.
   [junit4]   2> 1508742 INFO  (qtp619413055-25021) [n:127.0.0.1:62601_ c:collection1 s:shard1  x:collection1_shard1_replica_n2] o.a.s.c.ShardLeaderElectionContext I may be the new leader - try and sync
   [junit4]   2> 1508742 INFO  (qtp619413055-25021) [n:127.0.0.1:62601_ c:collection1 s:shard1  x:collection1_shard1_replica_n2] o.a.s.c.SyncStrategy Sync replicas to http://127.0.0.1:62601/collection1_shard1_replica_n2/
   [junit4]   2> 1508742 INFO  (qtp619413055-25021) [n:127.0.0.1:62601_ c:collection1 s:shard1  x:collection1_shard1_replica_n2] o.a.s.c.SyncStrategy Sync Success - now sync replicas to me
   [junit4]   2> 1508742 INFO  (qtp619413055-25021) [n:127.0.0.1:62601_ c:collection1 s:shard1  x:collection1_shard1_replica_n2] o.a.s.c.SyncStrategy http://127.0.0.1:62601/collection1_shard1_replica_n2/ has no replicas
   [junit4]   2> 1508742 INFO  (qtp619413055-25021) [n:127.0.0.1:62601_ c:collection1 s:shard1  x:collection1_shard1_replica_n2] o.a.s.c.ShardLeaderElectionContext Found all replicas participating in election, clear LIR
   [junit4]   2> 1508742 INFO  (qtp619413055-25021) [n:127.0.0.1:62601_ c:collection1 s:shard1  x:collection1_shard1_replica_n2] o.a.s.c.ShardLeaderElectionContextBase Creating leader registration node /collections/collection1/leaders/shard1/leader after winning as /collections/collection1/leader_elect/shard1/election/72164565903343630-core_node3-n_0000000000
   [junit4]   2> 1508757 INFO  (qtp619413055-25021) [n:127.0.0.1:62601_ c:collection1 s:shard1  x:collection1_shard1_replica_n2] o.a.s.c.ShardLeaderElectionContext I am the new leader: http://127.0.0.1:62601/collection1_shard1_replica_n2/ shard1
   [junit4]   2> 1508866 INFO  (zkCallback-7760-thread-1) [    ] o.a.s.c.c.ZkStateReader A cluster state change: [WatchedEvent state:SyncConnected type:NodeDataChanged path:/collections/collection1/state.json] for collection [collection1] has occurred - updating... (live nodes size: [5])
   [junit4]   2> 1508866 INFO  (zkCallback-7776-thread-1) [    ] o.a.s.c.c.ZkStateReader A cluster state change: [WatchedEvent state:SyncConnected type:NodeDataChanged path:/collections/collection1/state.json] for collection [collection1] has occurred - updating... (live nodes

[...truncated too long message...]

merDistrib, DirectSolrConnectionTest, TestPayloadCheckQParserPlugin, HdfsChaosMonkeySafeLeaderTest, SpatialHeatmapFacetsTest, TokenizerChainTest, CloneFieldUpdateProcessorFactoryTest, StressHdfsTest, TestRawResponseWriter, SparseHLLTest, ChaosMonkeySafeLeaderWithPullReplicasTest, TestStressReorder, TemplateUpdateProcessorTest, TestCloudInspectUtil, TestNumericRangeQuery32, CdcrReplicationHandlerTest, TestNestedUpdateProcessor, TestSearchPerf, DistributedMLTComponentTest, DateRangeFieldTest, TestSchemaSimilarityResource, ZkNodePropsTest, SchemaApiFailureTest, SyncSliceTest, RestartWhileUpdatingTest, HdfsCollectionsAPIDistributedZkTest, TestReRankQParserPlugin, TestZkAclsWithHadoopAuth, NumberUtilsTest, JSONWriterTest, ForceLeaderTest, DirectoryFactoryTest, MoreLikeThisHandlerTest, UUIDUpdateProcessorFallbackTest, TestSolrConfigHandlerCloud, TestHdfsUpdateLog, SubstringBytesRefFilterTest, ZkStateReaderTest, TestCloudNestedDocsSort, TestBulkSchemaConcurrent, TestXmlQParser, TestSerializedLuceneMatchVersion, LukeRequestHandlerTest, TestSort, ConnectionReuseTest, SolrXmlInZkTest, AddSchemaFieldsUpdateProcessorFactoryTest, DistributedFacetPivotSmallTest, TestSchemaNameResource, TestGraphMLResponseWriter, SegmentsInfoRequestHandlerTest, DistributedUpdateProcessorTest, BasicFunctionalityTest, MultiSolrCloudTestCaseTest, JvmMetricsTest, DistanceUnitsTest, TestFuzzyAnalyzedSuggestions, LeaderVoteWaitTimeoutTest, AtomicUpdatesTest, SortSpecParsingTest, DirectSolrSpellCheckerTest, DistributedFacetSimpleRefinementLongTailTest, SuggesterTSTTest, TestRetrieveFieldsOptimizer, TestRandomFlRTGCloud, TestLockTree, SimpleCollectionCreateDeleteTest, IndexSchemaRuntimeFieldTest, TestCSVLoader, TestCollectionsAPIViaSolrCloudCluster, NodeLostTriggerTest, OverseerModifyCollectionTest, RemoteQueryErrorTest, CdcrVersionReplicationTest, DeleteShardTest, ComputePlanActionTest, SolrCLIZkUtilsTest, BlockJoinFacetSimpleTest, TestUnifiedSolrHighlighter, SuggestComponentTest, TestSolrDeletionPolicy1, TestCloudConsistency, ZkSolrClientTest, MinimalSchemaTest, TestCloudSchemaless, TestSkipOverseerOperations, TestDocSet, TestSQLHandler]
   [junit4] Completed [379/835 (1!)] on J1 in 21.97s, 1 test, 1 failure <<< FAILURES!

[...truncated 47475 lines...]
-ecj-javadoc-lint-src:
    [mkdir] Created dir: C:\Users\jenkins\AppData\Local\Temp\ecj181203665
 [ecj-lint] Compiling 1235 source files to C:\Users\jenkins\AppData\Local\Temp\ecj181203665
 [ecj-lint] Processing annotations
 [ecj-lint] Annotations processed
 [ecj-lint] Processing annotations
 [ecj-lint] No elements to process
 [ecj-lint] invalid Class-Path header in manifest of jar file: C:\Users\jenkins\workspace\Lucene-Solr-7.x-Windows\solr\core\lib\org.restlet-2.3.0.jar
 [ecj-lint] invalid Class-Path header in manifest of jar file: C:\Users\jenkins\workspace\Lucene-Solr-7.x-Windows\solr\core\lib\org.restlet.ext.servlet-2.3.0.jar
 [ecj-lint] ----------
 [ecj-lint] 1. WARNING in C:\Users\jenkins\workspace\Lucene-Solr-7.x-Windows\solr\core\src\java\org\apache\solr\client\solrj\embedded\EmbeddedSolrServer.java (at line 219)
 [ecj-lint] 	return (NamedList<Object>) new JavaBinCodec(resolver).unmarshal(in);
 [ecj-lint] 	                           ^^^^^^^^^^^^^^^^^^^^^^^^^^
 [ecj-lint] Resource leak: '<unassigned Closeable value>' is never closed
 [ecj-lint] ----------
 [ecj-lint] ----------
 [ecj-lint] 2. WARNING in C:\Users\jenkins\workspace\Lucene-Solr-7.x-Windows\solr\core\src\java\org\apache\solr\cloud\api\collections\RestoreCmd.java (at line 257)
 [ecj-lint] 	throw new SolrException(ErrorCode.BAD_REQUEST, "Unexpected number of replicas, replicationFactor, " +
 [ecj-lint]               Replica.Type.NRT + " or " + Replica.Type.TLOG + " must be greater than 0");
 [ecj-lint] 	^^^^^^^^^^^^^^^^^^^^^^^^^^^^^^^^^^^^^^^^^^^^^^^^^^^^^^^^^^^^^^^^^^^^^^^^^^^^^^^^^^^^^^^^^^^^^^^^^^^^^^^^^^^^^^^^^^^^^^^^^^^^^^^^^^^^^^^^^^^^^^^^^^^^^^^^^^^^^^^^^^^^^^^^^^^^^^^^^^^^^^^^^^^^^^^
 [ecj-lint] Resource leak: 'repository' is not closed at this location
 [ecj-lint] ----------
 [ecj-lint] ----------
 [ecj-lint] 3. WARNING in C:\Users\jenkins\workspace\Lucene-Solr-7.x-Windows\solr\core\src\java\org\apache\solr\handler\loader\JavabinLoader.java (at line 137)
 [ecj-lint] 	new JavaBinCodec() {
 [ecj-lint]       SolrParams params;
 [ecj-lint]       AddUpdateCommand addCmd = null;
 [ecj-lint] 
 [ecj-lint]       @Override
 [ecj-lint]       public List<Object> readIterator(DataInputInputStream fis) throws IOException {
 [ecj-lint]         while (true) {
 [ecj-lint]           Object o = readVal(fis);
 [ecj-lint]           if (o == END_OBJ) break;
 [ecj-lint]           if (o instanceof NamedList) {
 [ecj-lint]             params = ((NamedList) o).toSolrParams();
 [ecj-lint]           } else {
 [ecj-lint]             try {
 [ecj-lint]               if (o instanceof byte[]) {
 [ecj-lint]                 if (params != null) req.setParams(params);
 [ecj-lint]                 byte[] buf = (byte[]) o;
 [ecj-lint]                 contentStreamLoader.load(req, rsp, new ContentStreamBase.ByteArrayStream(buf, null), processor);
 [ecj-lint]               } else {
 [ecj-lint]                 throw new RuntimeException("unsupported type ");
 [ecj-lint]               }
 [ecj-lint]             } catch (Exception e) {
 [ecj-lint]               throw new RuntimeException(e);
 [ecj-lint]             } finally {
 [ecj-lint]               params = null;
 [ecj-lint]               req.setParams(old);
 [ecj-lint]             }
 [ecj-lint]           }
 [ecj-lint]         }
 [ecj-lint]         return Collections.emptyList();
 [ecj-lint]       }
 [ecj-lint] 
 [ecj-lint]     }.unmarshal(in);
 [ecj-lint] 	^^^^^^^^^^^^^^^^^^^^^^^^^^^^^^^^^^^^^^^^^^^^^^^^^^^^^^^^^^^^^^^^^^^^^^^^^^^^^^^^^^^^^^^^^^^^^^^^^^^^^^^^^^^^^^^^^^^^^^^^^^^^^^^^^^^^^^^^^^^^^^^^^^^^^^^^^^^^^^^^^^^^^^^^^^^^^^^^^^^^^^^^^^^^^^^^^^^^^^^^^^^^^^^^^^^^^^^^^^^^^^^^^^^^^^^^^^^^^^^^^^^^^^^^^^^^^^^^^^^^^^^^^^^^^^^^^^^^^^^^^^^^^^^^^^^^^^^^^^^^^^^^^^^^^^^^^^^^^^^^^^^^^^^^^^^^^^^^^^^^^^^^^^^^^^^^^^^^^^^^^^^^^^^^^^^^^^^^^^^^^^^^^^^^^^^^^^^^^^^^^^^^^^^^^^^^^^^^^^^^^^^^^^^^^^^^^^^^^^^^^^^^^^^^^^^^^^^^^^^^^^^^^^^^^^^^^^^^^^^^^^^^^^^^^^^^^^^^^^^^^^^^^^^^^^^^^^^^^^^^^^^^^^^^^^^^^^^^^^^^^^^^^^^^^^^^^^^^^^^^^^^^^^^^^^^^^^^^^^^^^^^^^^^^^^^^^^^^^^^^^^^^^^^^^^^^^^^^^^^^^^^^^^^^^^^^^^^^^^^^^^^^^^^^^^^^^^^^^^^^^^^^^^^^^^^^^^^^^^^^^^^^^^^^^^^^^^^^^^^^^^^^^^^^^^^^^^^^^^^^^^^^^^^^^^^^^^^^^^^^^^^^^^^^^^^^^^^^^^^^^^^^^^^^^^^^^^^^^^^^^^^^^^^^^^^^^^^^^^^^^^^^^^^^^^^^^^^^^^^^^^^^^^^^^^^^^^^^^^^^^^^^^^^^^^^^^^^^^^^^^^^^^^^^^^^^^^^^^^^^^^^^^^^^^^^^^^^^^^^^^^^^^^^^^^^^^^^^^^^^^^^^^^^^^^^^^^^^^^^^^^^^^^^^^^^^^^^^^^^^^^^^^^^^^^^^^^^^^^^^^^^^^^^^^^^^^^^^^^^^^^^^^^^^^^^^^^^^^^^^^^^^^^
 [ecj-lint] Resource leak: '<unassigned Closeable value>' is never closed
 [ecj-lint] ----------
 [ecj-lint] ----------
 [ecj-lint] 4. ERROR in C:\Users\jenkins\workspace\Lucene-Solr-7.x-Windows\solr\core\src\java\org\apache\solr\update\DocumentBuilder.java (at line 32)
 [ecj-lint] 	import org.apache.solr.common.util.ByteArrayUtf8CharSequence;
 [ecj-lint] 	       ^^^^^^^^^^^^^^^^^^^^^^^^^^^^^^^^^^^^^^^^^^^^^^^^^^^^^
 [ecj-lint] The import org.apache.solr.common.util.ByteArrayUtf8CharSequence is never used
 [ecj-lint] ----------
 [ecj-lint] ----------
 [ecj-lint] 5. WARNING in C:\Users\jenkins\workspace\Lucene-Solr-7.x-Windows\solr\core\src\java\org\apache\solr\update\UpdateLog.java (at line 1867)
 [ecj-lint] 	if (exceptionOnExecuteUpdate.get() != null) throw exceptionOnExecuteUpdate.get();
 [ecj-lint] 	                                            ^^^^^^^^^^^^^^^^^^^^^^^^^^^^^^^^^^^^^
 [ecj-lint] Resource leak: 'proc' is not closed at this location
 [ecj-lint] ----------
 [ecj-lint] ----------
 [ecj-lint] 6. WARNING in C:\Users\jenkins\workspace\Lucene-Solr-7.x-Windows\solr\core\src\java\org\apache\solr\util\FileUtils.java (at line 50)
 [ecj-lint] 	in = new FileInputStream(src).getChannel();
 [ecj-lint] 	     ^^^^^^^^^^^^^^^^^^^^^^^^
 [ecj-lint] Resource leak: '<unassigned Closeable value>' is never closed
 [ecj-lint] ----------
 [ecj-lint] 7. WARNING in C:\Users\jenkins\workspace\Lucene-Solr-7.x-Windows\solr\core\src\java\org\apache\solr\util\FileUtils.java (at line 51)
 [ecj-lint] 	out = new FileOutputStream(destination).getChannel();
 [ecj-lint] 	      ^^^^^^^^^^^^^^^^^^^^^^^^^^^^^^^^^
 [ecj-lint] Resource leak: '<unassigned Closeable value>' is never closed
 [ecj-lint] ----------
 [ecj-lint] 7 problems (1 error, 6 warnings)

BUILD FAILED
C:\Users\jenkins\workspace\Lucene-Solr-7.x-Windows\build.xml:633: The following error occurred while executing this line:
C:\Users\jenkins\workspace\Lucene-Solr-7.x-Windows\build.xml:101: The following error occurred while executing this line:
C:\Users\jenkins\workspace\Lucene-Solr-7.x-Windows\solr\build.xml:680: The following error occurred while executing this line:
C:\Users\jenkins\workspace\Lucene-Solr-7.x-Windows\lucene\common-build.xml:2093: The following error occurred while executing this line:
C:\Users\jenkins\workspace\Lucene-Solr-7.x-Windows\lucene\common-build.xml:2132: Compile failed; see the compiler error output for details.

Total time: 108 minutes 45 seconds
Build step 'Invoke Ant' marked build as failure
Archiving artifacts
Setting ANT_1_8_2_HOME=C:\Users\jenkins\tools\hudson.tasks.Ant_AntInstallation\ANT_1.8.2
[WARNINGS] Skipping publisher since build result is FAILURE
Recording test results
Setting ANT_1_8_2_HOME=C:\Users\jenkins\tools\hudson.tasks.Ant_AntInstallation\ANT_1.8.2
Email was triggered for: Failure - Any
Sending email for trigger: Failure - Any
Setting ANT_1_8_2_HOME=C:\Users\jenkins\tools\hudson.tasks.Ant_AntInstallation\ANT_1.8.2
Setting ANT_1_8_2_HOME=C:\Users\jenkins\tools\hudson.tasks.Ant_AntInstallation\ANT_1.8.2
Setting ANT_1_8_2_HOME=C:\Users\jenkins\tools\hudson.tasks.Ant_AntInstallation\ANT_1.8.2
Setting ANT_1_8_2_HOME=C:\Users\jenkins\tools\hudson.tasks.Ant_AntInstallation\ANT_1.8.2

Mime
View raw message