lucene-dev mailing list archives

Site index · List index
Message view « Date » · « Thread »
Top « Date » · « Thread »
From Apache Jenkins Server <jenk...@builds.apache.org>
Subject [JENKINS] Lucene-Solr-Tests-master - Build # 3138 - Still Failing
Date Thu, 10 Jan 2019 18:34:18 GMT
Build: https://builds.apache.org/job/Lucene-Solr-Tests-master/3138/

1 tests failed.
FAILED:  org.apache.solr.cloud.autoscaling.sim.TestSimTriggerIntegration.testSearchRate

Error Message:


Stack Trace:
java.util.ConcurrentModificationException
	at __randomizedtesting.SeedInfo.seed([C3DD81FF93432DE3:9E959F765C858BAC]:0)
	at java.util.ArrayList$Itr.checkForComodification(ArrayList.java:909)
	at java.util.ArrayList$Itr.next(ArrayList.java:859)
	at java.util.AbstractCollection.toString(AbstractCollection.java:461)
	at java.lang.String.valueOf(String.java:2994)
	at java.lang.StringBuilder.append(StringBuilder.java:131)
	at java.util.concurrent.ConcurrentHashMap.toString(ConcurrentHashMap.java:1321)
	at org.apache.solr.cloud.autoscaling.sim.TestSimTriggerIntegration.testSearchRate(TestSimTriggerIntegration.java:1327)
	at sun.reflect.NativeMethodAccessorImpl.invoke0(Native Method)
	at sun.reflect.NativeMethodAccessorImpl.invoke(NativeMethodAccessorImpl.java:62)
	at sun.reflect.DelegatingMethodAccessorImpl.invoke(DelegatingMethodAccessorImpl.java:43)
	at java.lang.reflect.Method.invoke(Method.java:498)
	at com.carrotsearch.randomizedtesting.RandomizedRunner.invoke(RandomizedRunner.java:1750)
	at com.carrotsearch.randomizedtesting.RandomizedRunner$8.evaluate(RandomizedRunner.java:938)
	at com.carrotsearch.randomizedtesting.RandomizedRunner$9.evaluate(RandomizedRunner.java:974)
	at com.carrotsearch.randomizedtesting.RandomizedRunner$10.evaluate(RandomizedRunner.java:988)
	at com.carrotsearch.randomizedtesting.rules.SystemPropertiesRestoreRule$1.evaluate(SystemPropertiesRestoreRule.java:57)
	at org.apache.lucene.util.TestRuleSetupTeardownChained$1.evaluate(TestRuleSetupTeardownChained.java:49)
	at org.apache.lucene.util.AbstractBeforeAfterRule$1.evaluate(AbstractBeforeAfterRule.java:45)
	at org.apache.lucene.util.TestRuleThreadAndTestName$1.evaluate(TestRuleThreadAndTestName.java:48)
	at org.apache.lucene.util.TestRuleIgnoreAfterMaxFailures$1.evaluate(TestRuleIgnoreAfterMaxFailures.java:64)
	at org.apache.lucene.util.TestRuleMarkFailure$1.evaluate(TestRuleMarkFailure.java:47)
	at com.carrotsearch.randomizedtesting.rules.StatementAdapter.evaluate(StatementAdapter.java:36)
	at com.carrotsearch.randomizedtesting.ThreadLeakControl$StatementRunner.run(ThreadLeakControl.java:368)
	at com.carrotsearch.randomizedtesting.ThreadLeakControl.forkTimeoutingTask(ThreadLeakControl.java:817)
	at com.carrotsearch.randomizedtesting.ThreadLeakControl$3.evaluate(ThreadLeakControl.java:468)
	at com.carrotsearch.randomizedtesting.RandomizedRunner.runSingleTest(RandomizedRunner.java:947)
	at com.carrotsearch.randomizedtesting.RandomizedRunner$5.evaluate(RandomizedRunner.java:832)
	at com.carrotsearch.randomizedtesting.RandomizedRunner$6.evaluate(RandomizedRunner.java:883)
	at com.carrotsearch.randomizedtesting.RandomizedRunner$7.evaluate(RandomizedRunner.java:894)
	at com.carrotsearch.randomizedtesting.rules.StatementAdapter.evaluate(StatementAdapter.java:36)
	at com.carrotsearch.randomizedtesting.rules.SystemPropertiesRestoreRule$1.evaluate(SystemPropertiesRestoreRule.java:57)
	at org.apache.lucene.util.AbstractBeforeAfterRule$1.evaluate(AbstractBeforeAfterRule.java:45)
	at com.carrotsearch.randomizedtesting.rules.StatementAdapter.evaluate(StatementAdapter.java:36)
	at org.apache.lucene.util.TestRuleStoreClassName$1.evaluate(TestRuleStoreClassName.java:41)
	at com.carrotsearch.randomizedtesting.rules.NoShadowingOrOverridesOnMethodsRule$1.evaluate(NoShadowingOrOverridesOnMethodsRule.java:40)
	at com.carrotsearch.randomizedtesting.rules.NoShadowingOrOverridesOnMethodsRule$1.evaluate(NoShadowingOrOverridesOnMethodsRule.java:40)
	at com.carrotsearch.randomizedtesting.rules.StatementAdapter.evaluate(StatementAdapter.java:36)
	at com.carrotsearch.randomizedtesting.rules.StatementAdapter.evaluate(StatementAdapter.java:36)
	at com.carrotsearch.randomizedtesting.rules.StatementAdapter.evaluate(StatementAdapter.java:36)
	at org.apache.lucene.util.TestRuleAssertionsRequired$1.evaluate(TestRuleAssertionsRequired.java:53)
	at org.apache.lucene.util.TestRuleMarkFailure$1.evaluate(TestRuleMarkFailure.java:47)
	at org.apache.lucene.util.TestRuleIgnoreAfterMaxFailures$1.evaluate(TestRuleIgnoreAfterMaxFailures.java:64)
	at org.apache.lucene.util.TestRuleIgnoreTestSuites$1.evaluate(TestRuleIgnoreTestSuites.java:54)
	at com.carrotsearch.randomizedtesting.rules.StatementAdapter.evaluate(StatementAdapter.java:36)
	at com.carrotsearch.randomizedtesting.ThreadLeakControl$StatementRunner.run(ThreadLeakControl.java:368)
	at java.lang.Thread.run(Thread.java:748)




Build Log:
[...truncated 13201 lines...]
   [junit4] Suite: org.apache.solr.cloud.autoscaling.sim.TestSimTriggerIntegration
   [junit4]   2> 1182613 INFO  (SUITE-TestSimTriggerIntegration-seed#[C3DD81FF93432DE3]-worker) [    ] o.a.s.SolrTestCaseJ4 SecureRandom sanity checks: test.solr.allowed.securerandom=null & java.security.egd=file:/dev/./urandom
   [junit4]   2> Creating dataDir: /home/jenkins/jenkins-slave/workspace/Lucene-Solr-Tests-master/solr/build/solr-core/test/J2/temp/solr.cloud.autoscaling.sim.TestSimTriggerIntegration_C3DD81FF93432DE3-001/init-core-data-001
   [junit4]   2> 1182614 WARN  (SUITE-TestSimTriggerIntegration-seed#[C3DD81FF93432DE3]-worker) [    ] o.a.s.SolrTestCaseJ4 startTrackingSearchers: numOpens=13 numCloses=13
   [junit4]   2> 1182614 INFO  (SUITE-TestSimTriggerIntegration-seed#[C3DD81FF93432DE3]-worker) [    ] o.a.s.SolrTestCaseJ4 Using TrieFields (NUMERIC_POINTS_SYSPROP=false) w/NUMERIC_DOCVALUES_SYSPROP=true
   [junit4]   2> 1182616 INFO  (SUITE-TestSimTriggerIntegration-seed#[C3DD81FF93432DE3]-worker) [    ] o.a.s.SolrTestCaseJ4 Randomized ssl (false) and clientAuth (false) via: @org.apache.solr.util.RandomizeSSL(reason=, ssl=NaN, value=NaN, clientAuth=NaN)
   [junit4]   2> 1182776 INFO  (TEST-TestSimTriggerIntegration.testNodeAddedTrigger-seed#[C3DD81FF93432DE3]) [    ] o.a.s.SolrTestCaseJ4 ###Starting testNodeAddedTrigger
   [junit4]   2> 1182946 DEBUG (Simulated OverseerAutoScalingTriggerThread) [    ] o.a.s.c.a.OverseerTriggerThread Adding .auto_add_replicas and .scheduled_maintenance triggers
   [junit4]   2> 1182946 DEBUG (Simulated OverseerAutoScalingTriggerThread) [    ] o.a.s.c.a.OverseerTriggerThread Refreshing /autoscaling.json with znode version 1
   [junit4]   2> 1182947 DEBUG (Simulated OverseerAutoScalingTriggerThread) [    ] o.a.s.c.a.OverseerTriggerThread Current znodeVersion 1, lastZnodeVersion 0
   [junit4]   2> 1182947 DEBUG (Simulated OverseerAutoScalingTriggerThread) [    ] o.a.s.c.a.OverseerTriggerThread Processed trigger updates upto znodeVersion 1
   [junit4]   2> 1182949 DEBUG (TEST-TestSimTriggerIntegration.testNodeAddedTrigger-seed#[C3DD81FF93432DE3]) [    ] o.a.s.c.a.s.SimClusterStateProvider --- new Overseer leader: 127.0.0.1:10000_solr
   [junit4]   2> 1182967 DEBUG (TEST-TestSimTriggerIntegration.testNodeAddedTrigger-seed#[C3DD81FF93432DE3]) [    ] o.a.s.c.a.s.SimClusterStateProvider ** creating new collection states, currentVersion=0
   [junit4]   2> 1182968 DEBUG (TEST-TestSimTriggerIntegration.testNodeAddedTrigger-seed#[C3DD81FF93432DE3]) [    ] o.a.s.c.a.s.SimClusterStateProvider ** saved cluster state version 0
   [junit4]   2> 1182968 INFO  (TEST-TestSimTriggerIntegration.testNodeAddedTrigger-seed#[C3DD81FF93432DE3]) [    ] o.a.s.h.a.MetricsHistoryHandler No .system collection, keeping metrics history in memory.
   [junit4]   2> 1182983 DEBUG (Simulated OverseerAutoScalingTriggerThread) [    ] o.a.s.c.a.NodeLostTrigger NodeLostTrigger .auto_add_replicas - Initial livenodes: [127.0.0.1:10001_solr, 127.0.0.1:10000_solr]
   [junit4]   2> 1182986 DEBUG (ScheduledTrigger-2241-thread-2) [    ] o.a.s.c.a.NodeLostTrigger Running NodeLostTrigger: .auto_add_replicas with currently live nodes: 2 and last live nodes: 2
   [junit4]   2> 1183003 DEBUG (Simulated OverseerAutoScalingTriggerThread) [    ] o.a.s.c.a.OverseerTriggerThread -- cleaning old nodeLost / nodeAdded markers
   [junit4]   2> 1183003 DEBUG (Simulated OverseerAutoScalingTriggerThread) [    ] o.a.s.c.a.OverseerTriggerThread Current znodeVersion 1, lastZnodeVersion 1
   [junit4]   2> 1183071 DEBUG (ScheduledTrigger-2241-thread-1) [    ] o.a.s.c.a.NodeLostTrigger Running NodeLostTrigger: .auto_add_replicas with currently live nodes: 2 and last live nodes: 2
   [junit4]   2> 1183074 DEBUG (simCloudManagerPool-2240-thread-2) [    ] o.a.s.c.a.AutoScalingHandler Verified autoscaling configuration
   [junit4]   2> 1183075 DEBUG (simCloudManagerPool-2240-thread-2) [    ] o.a.s.c.a.OverseerTriggerThread Refreshing /autoscaling.json with znode version 2
   [junit4]   2> 1183092 DEBUG (ScheduledTrigger-2241-thread-1) [    ] o.a.s.c.a.NodeLostTrigger Running NodeLostTrigger: .auto_add_replicas with currently live nodes: 2 and last live nodes: 2
   [junit4]   2> 1183096 DEBUG (Simulated OverseerAutoScalingTriggerThread) [    ] o.a.s.c.a.OverseerTriggerThread Processed trigger updates upto znodeVersion 2
   [junit4]   2> 1183096 DEBUG (Simulated OverseerAutoScalingTriggerThread) [    ] o.a.s.c.a.OverseerTriggerThread -- cleaning old nodeLost / nodeAdded markers
   [junit4]   2> 1183096 DEBUG (Simulated OverseerAutoScalingTriggerThread) [    ] o.a.s.c.a.OverseerTriggerThread Current znodeVersion 2, lastZnodeVersion 2
   [junit4]   2> 1183116 DEBUG (simCloudManagerPool-2240-thread-3) [    ] o.a.s.c.a.AutoScalingHandler Verified autoscaling configuration
   [junit4]   2> 1183117 DEBUG (simCloudManagerPool-2240-thread-3) [    ] o.a.s.c.a.OverseerTriggerThread Refreshing /autoscaling.json with znode version 3
   [junit4]   2> 1183118 DEBUG (Simulated OverseerAutoScalingTriggerThread) [    ] o.a.s.c.a.OverseerTriggerThread Processed trigger updates upto znodeVersion 3
   [junit4]   2> 1183118 INFO  (Simulated OverseerAutoScalingTriggerThread) [    ] o.a.s.c.a.s.TestSimTriggerIntegration TestTriggerAction init
   [junit4]   2> 1183118 DEBUG (Simulated OverseerAutoScalingTriggerThread) [    ] o.a.s.c.a.NodeAddedTrigger NodeAddedTrigger node_added_trigger - Initial livenodes: [127.0.0.1:10001_solr, 127.0.0.1:10000_solr]
   [junit4]   2> 1183118 DEBUG (Simulated OverseerAutoScalingTriggerThread) [    ] o.a.s.c.a.NodeAddedTrigger NodeAddedTrigger node_added_trigger instantiated with properties: {event=nodeAdded, waitFor=1, actions=[{name=test, class=org.apache.solr.cloud.autoscaling.sim.TestSimTriggerIntegration$TestTriggerAction}], enabled=true}
   [junit4]   2> 1183118 DEBUG (Simulated OverseerAutoScalingTriggerThread) [    ] o.a.s.c.a.OverseerTriggerThread -- cleaning old nodeLost / nodeAdded markers
   [junit4]   2> 1183119 DEBUG (Simulated OverseerAutoScalingTriggerThread) [    ] o.a.s.c.a.OverseerTriggerThread Current znodeVersion 3, lastZnodeVersion 3
   [junit4]   2> 1183119 DEBUG (TEST-TestSimTriggerIntegration.testNodeAddedTrigger-seed#[C3DD81FF93432DE3]) [    ] o.a.s.c.a.s.SimClusterStateProvider -- creating marker: /autoscaling/nodeAdded/127.0.0.1:10002_solr
   [junit4]   2> 1183136 DEBUG (ScheduledTrigger-2241-thread-2) [    ] o.a.s.c.a.NodeLostTrigger Running NodeLostTrigger: .auto_add_replicas with currently live nodes: 3 and last live nodes: 2
   [junit4]   2> 1183136 DEBUG (ScheduledTrigger-2241-thread-2) [    ] o.a.s.c.a.NodeAddedTrigger Running NodeAddedTrigger node_added_trigger
   [junit4]   2> 1183136 DEBUG (ScheduledTrigger-2241-thread-2) [    ] o.a.s.c.a.NodeAddedTrigger Found livenodes: 3
   [junit4]   2> 1183137 DEBUG (ScheduledTrigger-2241-thread-2) [    ] o.a.s.c.a.NodeAddedTrigger Tracking new node: 127.0.0.1:10002_solr at time 29476500482609762
   [junit4]   2> 1183156 DEBUG (ScheduledTrigger-2241-thread-1) [    ] o.a.s.c.a.NodeLostTrigger Running NodeLostTrigger: .auto_add_replicas with currently live nodes: 3 and last live nodes: 3
   [junit4]   2> 1183157 DEBUG (ScheduledTrigger-2241-thread-2) [    ] o.a.s.c.a.NodeAddedTrigger Running NodeAddedTrigger node_added_trigger
   [junit4]   2> 1183157 DEBUG (ScheduledTrigger-2241-thread-2) [    ] o.a.s.c.a.NodeAddedTrigger Found livenodes: 3
   [junit4]   2> 1183157 DEBUG (ScheduledTrigger-2241-thread-2) [    ] o.a.s.c.a.NodeAddedTrigger NodeAddedTrigger node_added_trigger firing registered processor for nodes: [127.0.0.1:10002_solr] added at times [29476500482609762], now=29476501505890362
   [junit4]   2> 1183157 DEBUG (ScheduledTrigger-2241-thread-2) [    ] o.a.s.c.a.ScheduledTriggers ++++++++ Cooldown inactive - processing event: {
   [junit4]   2>   "id":"68b8b8947cd262Tk7zsiemv4plci8guohwn90c0",
   [junit4]   2>   "source":"node_added_trigger",
   [junit4]   2>   "eventTime":29476500482609762,
   [junit4]   2>   "eventType":"NODEADDED",
   [junit4]   2>   "properties":{
   [junit4]   2>     "eventTimes":[29476500482609762],
   [junit4]   2>     "preferredOperation":"movereplica",
   [junit4]   2>     "nodeNames":["127.0.0.1:10002_solr"]}}
   [junit4]   2> 1183158 DEBUG (ScheduledTrigger-2241-thread-2) [    ] o.a.s.c.a.ScheduledTriggers Pausing all triggers: [.auto_add_replicas, node_added_trigger]
   [junit4]   2> 1183158 DEBUG (ScheduledTrigger-2241-thread-2) [    ] o.a.s.c.a.SystemLogListener Collection .system missing, skip sending event {
   [junit4]   2>   "id":"68b8b8947cd262Tk7zsiemv4plci8guohwn90c0",
   [junit4]   2>   "source":"node_added_trigger",
   [junit4]   2>   "eventTime":29476500482609762,
   [junit4]   2>   "eventType":"NODEADDED",
   [junit4]   2>   "properties":{
   [junit4]   2>     "eventTimes":[29476500482609762],
   [junit4]   2>     "preferredOperation":"movereplica",
   [junit4]   2>     "_enqueue_time_":29476501541004762,
   [junit4]   2>     "nodeNames":["127.0.0.1:10002_solr"]}}
   [junit4]   2> 1183173 DEBUG (ScheduledTrigger-2241-thread-2) [    ] o.a.s.c.a.NodeAddedTrigger Removing new node from tracking: 127.0.0.1:10002_solr
   [junit4]   2> 1183181 DEBUG (AutoscalingActionExecutor-2242-thread-1) [    ] o.a.s.c.a.ScheduledTriggers -- processing actions for {
   [junit4]   2>   "id":"68b8b8947cd262Tk7zsiemv4plci8guohwn90c0",
   [junit4]   2>   "source":"node_added_trigger",
   [junit4]   2>   "eventTime":29476500482609762,
   [junit4]   2>   "eventType":"NODEADDED",
   [junit4]   2>   "properties":{
   [junit4]   2>     "eventTimes":[29476500482609762],
   [junit4]   2>     "preferredOperation":"movereplica",
   [junit4]   2>     "_enqueue_time_":29476501541004762,
   [junit4]   2>     "nodeNames":["127.0.0.1:10002_solr"]}}
   [junit4]   2> 1183181 DEBUG (AutoscalingActionExecutor-2242-thread-1) [    ] o.a.s.c.a.SystemLogListener Collection .system missing, skip sending event {
   [junit4]   2>   "id":"68b8b8947cd262Tk7zsiemv4plci8guohwn90c0",
   [junit4]   2>   "source":"node_added_trigger",
   [junit4]   2>   "eventTime":29476500482609762,
   [junit4]   2>   "eventType":"NODEADDED",
   [junit4]   2>   "properties":{
   [junit4]   2>     "eventTimes":[29476500482609762],
   [junit4]   2>     "preferredOperation":"movereplica",
   [junit4]   2>     "_enqueue_time_":29476501541004762,
   [junit4]   2>     "nodeNames":["127.0.0.1:10002_solr"]}}
   [junit4]   2> 1183181 DEBUG (AutoscalingActionExecutor-2242-thread-1) [    ] o.a.s.c.a.ScheduledTriggers Resuming trigger: .auto_add_replicas after 100ms
   [junit4]   2> 1183181 DEBUG (AutoscalingActionExecutor-2242-thread-1) [    ] o.a.s.c.a.ScheduledTriggers Resuming trigger: node_added_trigger after 100ms
   [junit4]   2> 1183181 DEBUG (AutoscalingActionExecutor-2242-thread-1) [    ] o.a.s.c.a.ScheduledTriggers -- processing took 31 ms for event id=68b8b8947cd262Tk7zsiemv4plci8guohwn90c0
   [junit4]   2> 1183238 DEBUG (simCloudManagerPool-2240-thread-4) [    ] o.a.s.c.a.AutoScalingHandler Verified autoscaling configuration
   [junit4]   2> 1183238 DEBUG (simCloudManagerPool-2240-thread-4) [    ] o.a.s.c.a.OverseerTriggerThread Refreshing /autoscaling.json with znode version 4
   [junit4]   2> 1183239 DEBUG (Simulated OverseerAutoScalingTriggerThread) [    ] o.a.s.c.a.OverseerTriggerThread Processed trigger updates upto znodeVersion 4
   [junit4]   2> 1183239 DEBUG (Simulated OverseerAutoScalingTriggerThread) [    ] o.a.s.c.a.OverseerTriggerThread -- cleaning old nodeLost / nodeAdded markers
   [junit4]   2> 1183239 DEBUG (Simulated OverseerAutoScalingTriggerThread) [    ] o.a.s.c.a.OverseerTriggerThread Current znodeVersion 4, lastZnodeVersion 4
   [junit4]   2> 1183281 DEBUG (ScheduledTrigger-2241-thread-3) [    ] o.a.s.c.a.NodeLostTrigger Running NodeLostTrigger: .auto_add_replicas with currently live nodes: 3 and last live nodes: 3
   [junit4]   2> 1183316 DEBUG (ScheduledTrigger-2241-thread-4) [    ] o.a.s.c.a.NodeLostTrigger Running NodeLostTrigger: .auto_add_replicas with currently live nodes: 3 and last live nodes: 3
   [junit4]   2> 1183351 DEBUG (ScheduledTrigger-2241-thread-3) [    ] o.a.s.c.a.NodeAddedTrigger Running NodeAddedTrigger node_added_trigger
   [junit4]   2> 1183351 DEBUG (ScheduledTrigger-2241-thread-3) [    ] o.a.s.c.a.NodeAddedTrigger Found livenodes: 3
   [junit4]   2> 1183351 DEBUG (ScheduledTrigger-2241-thread-3) [    ] o.a.s.c.a.NodeLostTrigger Running NodeLostTrigger: .auto_add_replicas with currently live nodes: 3 and last live nodes: 3
   [junit4]   2> 1183367 DEBUG (TEST-TestSimTriggerIntegration.testNodeAddedTrigger-seed#[C3DD81FF93432DE3]) [    ] o.a.s.c.a.ScheduledTriggers Shutting down scheduled thread pool executor now
   [junit4]   2> 1183367 DEBUG (TEST-TestSimTriggerIntegration.testNodeAddedTrigger-seed#[C3DD81FF93432DE3]) [    ] o.a.s.c.a.ScheduledTriggers Shutting down action executor now
   [junit4]   2> 1183367 DEBUG (TEST-TestSimTriggerIntegration.testNodeAddedTrigger-seed#[C3DD81FF93432DE3]) [    ] o.a.s.c.a.ScheduledTriggers Awaiting termination for action executor
   [junit4]   2> 1183383 INFO  (Simulated OverseerAutoScalingTriggerThread) [    ] o.a.s.c.a.OverseerTriggerThread OverseerTriggerThread woken up but we are closed, exiting.
   [junit4]   2> 1183383 DEBUG (TEST-TestSimTriggerIntegration.testNodeAddedTrigger-seed#[C3DD81FF93432DE3]) [    ] o.a.s.c.a.ScheduledTriggers Awaiting termination for scheduled thread pool executor
   [junit4]   2> 1183383 DEBUG (TEST-TestSimTriggerIntegration.testNodeAddedTrigger-seed#[C3DD81FF93432DE3]) [    ] o.a.s.c.a.ScheduledTriggers ScheduledTriggers closed completely
   [junit4]   2> 1183383 DEBUG (TEST-TestSimTriggerIntegration.testNodeAddedTrigger-seed#[C3DD81FF93432DE3]) [    ] o.a.s.c.a.OverseerTriggerThread OverseerTriggerThread has been closed explicitly
   [junit4]   2> 1183420 INFO  (TEST-TestSimTriggerIntegration.testNodeAddedTrigger-seed#[C3DD81FF93432DE3]) [    ] o.a.s.SolrTestCaseJ4 ###Ending testNodeAddedTrigger
   [junit4]   2> 1183424 INFO  (TEST-TestSimTriggerIntegration.testNodeMarkersRegistration-seed#[C3DD81FF93432DE3]) [    ] o.a.s.SolrTestCaseJ4 ###Starting testNodeMarkersRegistration
   [junit4]   2> 1183480 DEBUG (TEST-TestSimTriggerIntegration.testNodeMarkersRegistration-seed#[C3DD81FF93432DE3]) [    ] o.a.s.c.a.s.SimClusterStateProvider --- new Overseer leader: 127.0.0.1:10003_solr
   [junit4]   2> 1183493 DEBUG (Simulated OverseerAutoScalingTriggerThread) [    ] o.a.s.c.a.OverseerTriggerThread Adding .auto_add_replicas and .scheduled_maintenance triggers
   [junit4]   2> 1183493 DEBUG (Simulated OverseerAutoScalingTriggerThread) [    ] o.a.s.c.a.OverseerTriggerThread Refreshing /autoscaling.json with znode version 1
   [junit4]   2> 1183494 DEBUG (Simulated OverseerAutoScalingTriggerThread) [    ] o.a.s.c.a.OverseerTriggerThread Current znodeVersion 1, lastZnodeVersion 0
   [junit4]   2> 1183494 DEBUG (Simulated OverseerAutoScalingTriggerThread) [    ] o.a.s.c.a.OverseerTriggerThread Processed trigger updates upto znodeVersion 1
   [junit4]   2> 1183517 DEBUG (TEST-TestSimTriggerIntegration.testNodeMarkersRegistration-seed#[C3DD81FF93432DE3]) [    ] o.a.s.c.a.s.SimClusterStateProvider ** creating new collection states, currentVersion=0
   [junit4]   2> 1183517 DEBUG (TEST-TestSimTriggerIntegration.testNodeMarkersRegistration-seed#[C3DD81FF93432DE3]) [    ] o.a.s.c.a.s.SimClusterStateProvider ** saved cluster state version 0
   [junit4]   2> 1183517 INFO  (TEST-TestSimTriggerIntegration.testNodeMarkersRegistration-seed#[C3DD81FF93432DE3]) [    ] o.a.s.h.a.MetricsHistoryHandler No .system collection, keeping metrics history in memory.
   [junit4]   2> 1183570 DEBUG (simCloudManagerPool-2246-thread-2) [    ] o.a.s.c.a.AutoScalingHandler Verified autoscaling configuration
   [junit4]   2> 1183570 DEBUG (simCloudManagerPool-2246-thread-2) [    ] o.a.s.c.a.OverseerTriggerThread Refreshing /autoscaling.json with znode version 2
   [junit4]   2> 1183573 DEBUG (Simulated OverseerAutoScalingTriggerThread) [    ] o.a.s.c.a.NodeLostTrigger NodeLostTrigger .auto_add_replicas - Initial livenodes: [127.0.0.1:10004_solr, 127.0.0.1:10003_solr]
   [junit4]   2> 1183575 DEBUG (Simulated OverseerAutoScalingTriggerThread) [    ] o.a.s.c.a.OverseerTriggerThread -- cleaning old nodeLost / nodeAdded markers
   [junit4]   2> 1183590 DEBUG (ScheduledTrigger-2247-thread-2) [    ] o.a.s.c.a.NodeLostTrigger Running NodeLostTrigger: .auto_add_replicas with currently live nodes: 2 and last live nodes: 2
   [junit4]   2> 1183639 DEBUG (ScheduledTrigger-2247-thread-2) [    ] o.a.s.c.a.NodeLostTrigger Running NodeLostTrigger: .auto_add_replicas with currently live nodes: 2 and last live nodes: 2
   [junit4]   2> 1183732 DEBUG (ScheduledTrigger-2247-thread-4) [    ] o.a.s.c.a.NodeLostTrigger Running NodeLostTrigger: .auto_add_replicas with currently live nodes: 2 and last live nodes: 2
   [junit4]   2> 1183764 DEBUG (ScheduledTrigger-2247-thread-2) [    ] o.a.s.c.a.NodeLostTrigger Running NodeLostTrigger: .auto_add_replicas with currently live nodes: 2 and last live nodes: 2
   [junit4]   2> 1183777 INFO  (TEST-TestSimTriggerIntegration.testNodeMarkersRegistration-seed#[C3DD81FF93432DE3]) [    ] o.a.s.c.a.s.TestSimTriggerIntegration ====== KILL OVERSEER 1
   [junit4]   2> 1183777 INFO  (TEST-TestSimTriggerIntegration.testNodeMarkersRegistration-seed#[C3DD81FF93432DE3]) [    ] o.a.s.c.a.s.SimCloudManager === Restarting OverseerTriggerThread and clearing object cache...
   [junit4]   2> 1183784 DEBUG (ScheduledTrigger-2247-thread-1) [    ] o.a.s.c.a.NodeLostTrigger Running NodeLostTrigger: .auto_add_replicas with currently live nodes: 3 and last live nodes: 2
   [junit4]   2> 1183821 DEBUG (ScheduledTrigger-2247-thread-1) [    ] o.a.s.c.a.NodeLostTrigger Running NodeLostTrigger: .auto_add_replicas with currently live nodes: 3 and last live nodes: 3
   [junit4]   2> 1183829 DEBUG (TEST-TestSimTriggerIntegration.testNodeMarkersRegistration-seed#[C3DD81FF93432DE3]) [    ] o.a.s.c.a.ScheduledTriggers Shutting down scheduled thread pool executor now
   [junit4]   2> 1183829 DEBUG (TEST-TestSimTriggerIntegration.testNodeMarkersRegistration-seed#[C3DD81FF93432DE3]) [    ] o.a.s.c.a.ScheduledTriggers Shutting down action executor now
   [junit4]   2> 1183829 DEBUG (TEST-TestSimTriggerIntegration.testNodeMarkersRegistration-seed#[C3DD81FF93432DE3]) [    ] o.a.s.c.a.ScheduledTriggers Awaiting termination for action executor
   [junit4]   2> 1183829 DEBUG (TEST-TestSimTriggerIntegration.testNodeMarkersRegistration-seed#[C3DD81FF93432DE3]) [    ] o.a.s.c.a.ScheduledTriggers Awaiting termination for scheduled thread pool executor
   [junit4]   2> 1183837 DEBUG (TEST-TestSimTriggerIntegration.testNodeMarkersRegistration-seed#[C3DD81FF93432DE3]) [    ] o.a.s.c.a.ScheduledTriggers ScheduledTriggers closed completely
   [junit4]   2> 1183837 DEBUG (TEST-TestSimTriggerIntegration.testNodeMarkersRegistration-seed#[C3DD81FF93432DE3]) [    ] o.a.s.c.a.OverseerTriggerThread OverseerTriggerThread has been closed explicitly
   [junit4]   2> 1183837 INFO  (TEST-TestSimTriggerIntegration.testNodeMarkersRegistration-seed#[C3DD81FF93432DE3]) [    ] o.a.s.c.a.s.SimCloudManager   = killing node 127.0.0.1:10003_solr
   [junit4]   2> 1183838 DEBUG (TEST-TestSimTriggerIntegration.testNodeMarkersRegistration-seed#[C3DD81FF93432DE3]) [    ] o.a.s.c.a.s.SimClusterStateProvider  -- created marker: /autoscaling/nodeLost/127.0.0.1:10003_solr
   [junit4]   2> 1183838 DEBUG (TEST-TestSimTriggerIntegration.testNodeMarkersRegistration-seed#[C3DD81FF93432DE3]) [    ] o.a.s.c.a.s.SimClusterStateProvider --- new Overseer leader: 127.0.0.1:10004_solr
   [junit4]   2> 1183839 DEBUG (Simulated OverseerAutoScalingTriggerThread) [    ] o.a.s.c.a.OverseerTriggerThread Refreshing /autoscaling.json with znode version 2
   [junit4]   2> 1183839 DEBUG (Simulated OverseerAutoScalingTriggerThread) [    ] o.a.s.c.a.OverseerTriggerThread Current znodeVersion 2, lastZnodeVersion 0
   [junit4]   2> 1183839 DEBUG (Simulated OverseerAutoScalingTriggerThread) [    ] o.a.s.c.a.OverseerTriggerThread Processed trigger updates upto znodeVersion 2
   [junit4]   2> 1183839 DEBUG (Simulated OverseerAutoScalingTriggerThread) [    ] o.a.s.c.a.NodeLostTrigger NodeLostTrigger .auto_add_replicas - Initial livenodes: [127.0.0.1:10004_solr, 127.0.0.1:10005_solr]
   [junit4]   2> 1183839 DEBUG (Simulated OverseerAutoScalingTriggerThread) [    ] o.a.s.c.a.NodeLostTrigger Adding lost node from marker path: 127.0.0.1:10003_solr
   [junit4]   2> 1183857 DEBUG (Simulated OverseerAutoScalingTriggerThread) [    ] o.a.s.c.a.OverseerTriggerThread -- cleaning old nodeLost / nodeAdded markers
   [junit4]   2> 1183857 DEBUG (Simulated OverseerAutoScalingTriggerThread) [    ] o.a.s.c.a.OverseerTriggerThread Current znodeVersion 2, lastZnodeVersion 2
   [junit4]   2> 1183857 DEBUG (ScheduledTrigger-2252-thread-1) [    ] o.a.s.c.a.NodeLostTrigger Running NodeLostTrigger: .auto_add_replicas with currently live nodes: 2 and last live nodes: 3
   [junit4]   2> 1183857 DEBUG (ScheduledTrigger-2252-thread-1) [    ] o.a.s.c.a.NodeLostTrigger Tracking lost node: 127.0.0.1:10003_solr
   [junit4]   2> 1183894 DEBUG (ScheduledTrigger-2252-thread-1) [    ] o.a.s.c.a.NodeLostTrigger Running NodeLostTrigger: .auto_add_replicas with currently live nodes: 2 and last live nodes: 2
   [junit4]   2> 1183922 DEBUG (ScheduledTrigger-2252-thread-2) [    ] o.a.s.c.a.NodeLostTrigger Running NodeLostTrigger: .auto_add_replicas with currently live nodes: 2 and last live nodes: 2
   [junit4]   2> 1183967 DEBUG (ScheduledTrigger-2252-thread-1) [    ] o.a.s.c.a.NodeLostTrigger Running NodeLostTrigger: .auto_add_replicas with currently live nodes: 2 and last live nodes: 2
   [junit4]   2> 1183967 INFO  (TEST-TestSimTriggerIntegration.testNodeMarkersRegistration-seed#[C3DD81FF93432DE3]) [    ] o.a.s.c.a.s.TestSimTriggerIntegration ====== ADD TRIGGERS
   [junit4]   2> 1183987 DEBUG (ScheduledTrigger-2252-thread-1) [    ] o.a.s.c.a.NodeLostTrigger Running NodeLostTrigger: .auto_add_replicas with currently live nodes: 2 and last live nodes: 2
   [junit4]   2> 1184023 DEBUG (ScheduledTrigger-2252-thread-1) [    ] o.a.s.c.a.NodeLostTrigger Running NodeLostTrigger: .auto_add_replicas with currently live nodes: 2 and last live nodes: 2
   [junit4]   2> 1184044 DEBUG (ScheduledTrigger-2252-thread-1) [    ] o.a.s.c.a.NodeLostTrigger Running NodeLostTrigger: .auto_add_replicas with currently live nodes: 2 and last live nodes: 2
   [junit4]   2> 1184044 INFO  (simCloudManagerPool-2251-thread-1) [    ] o.a.s.c.a.s.TestSimTriggerIntegration TestEventMarkerAction init
   [junit4]   2> 1184044 DEBUG (simCloudManagerPool-2251-thread-1) [    ] o.a.s.c.a.AutoScalingHandler Verified autoscaling configuration
   [junit4]   2> 1184044 DEBUG (simCloudManagerPool-2251-thread-1) [    ] o.a.s.c.a.OverseerTriggerThread Refreshing /autoscaling.json with znode version 3
   [junit4]   2> 1184045 INFO  (simCloudManagerPool-2251-thread-1) [    ] o.a.s.c.a.s.TestSimTriggerIntegration TestEventMarkerAction init
   [junit4]   2> 1184048 DEBUG (Simulated OverseerAutoScalingTriggerThread) [    ] o.a.s.c.a.OverseerTriggerThread Processed trigger updates upto znodeVersion 3
   [junit4]   2> 1184048 DEBUG (Simulated OverseerAutoScalingTriggerThread) [    ] o.a.s.c.a.NodeAddedTrigger NodeAddedTrigger node_added_trigger - Initial livenodes: [127.0.0.1:10004_solr, 127.0.0.1:10005_solr]
   [junit4]   2> 1184048 DEBUG (Simulated OverseerAutoScalingTriggerThread) [    ] o.a.s.c.a.NodeAddedTrigger NodeAddedTrigger node_added_trigger instantiated with properties: {event=nodeAdded, waitFor=1, actions=[{name=test, class=org.apache.solr.cloud.autoscaling.sim.TestSimTriggerIntegration$TestEventMarkerAction}], enabled=true}
   [junit4]   2> 1184048 DEBUG (Simulated OverseerAutoScalingTriggerThread) [    ] o.a.s.c.a.OverseerTriggerThread -- cleaning old nodeLost / nodeAdded markers
   [junit4]   2> 1184048 DEBUG (Simulated OverseerAutoScalingTriggerThread) [    ] o.a.s.c.a.OverseerTriggerThread Current znodeVersion 3, lastZnodeVersion 3
   [junit4]   2> 1184048 DEBUG (ScheduledTrigger-2252-thread-2) [    ] o.a.s.c.a.NodeAddedTrigger Running NodeAddedTrigger node_added_trigger
   [junit4]   2> 1184048 DEBUG (ScheduledTrigger-2252-thread-2) [    ] o.a.s.c.a.NodeAddedTrigger Found livenodes: 2
   [junit4]   2> 1184085 DEBUG (ScheduledTrigger-2252-thread-2) [    ] o.a.s.c.a.NodeLostTrigger Running NodeLostTrigger: .auto_add_replicas with currently live nodes: 2 and last live nodes: 2
   [junit4]   2> 1184085 INFO  (simCloudManagerPool-2251-thread-2) [    ] o.a.s.c.a.s.TestSimTriggerIntegration TestEventMarkerAction init
   [junit4]   2> 1184085 DEBUG (ScheduledTrigger-2252-thread-1) [    ] o.a.s.c.a.NodeAddedTrigger Running NodeAddedTrigger node_added_trigger
   [junit4]   2> 1184085 DEBUG (ScheduledTrigger-2252-thread-1) [    ] o.a.s.c.a.NodeAddedTrigger Found livenodes: 2
   [junit4]   2> 1184085 DEBUG (simCloudManagerPool-2251-thread-2) [    ] o.a.s.c.a.AutoScalingHandler Verified autoscaling configuration
   [junit4]   2> 1184086 DEBUG (simCloudManagerPool-2251-thread-2) [    ] o.a.s.c.a.OverseerTriggerThread Refreshing /autoscaling.json with znode version 4
   [junit4]   2> 1184086 INFO  (simCloudManagerPool-2251-thread-2) [    ] o.a.s.c.a.s.TestSimTriggerIntegration TestEventMarkerAction init
   [junit4]   2> 1184086 INFO  (simCloudManagerPool-2251-thread-2) [    ] o.a.s.c.a.s.TestSimTriggerIntegration TestEventMarkerAction init
   [junit4]   2> 1184086 DEBUG (Simulated OverseerAutoScalingTriggerThread) [    ] o.a.s.c.a.OverseerTriggerThread Processed trigger updates upto znodeVersion 4
   [junit4]   2> 1184087 DEBUG (Simulated OverseerAutoScalingTriggerThread) [    ] o.a.s.c.a.NodeLostTrigger NodeLostTrigger node_lost_trigger - Initial livenodes: [127.0.0.1:10004_solr, 127.0.0.1:10005_solr]
   [junit4]   2> 1184087 DEBUG (Simulated OverseerAutoScalingTriggerThread) [    ] o.a.s.c.a.OverseerTriggerThread -- cleaning old nodeLost / nodeAdded markers
   [junit4]   2> 1184087 DEBUG (Simulated OverseerAutoScalingTriggerThread) [    ] o.a.s.c.a.OverseerTriggerThread Current znodeVersion 4, lastZnodeVersion 4
   [junit4]   2> 1184087 DEBUG (ScheduledTrigger-2252-thread-4) [    ] o.a.s.c.a.NodeLostTrigger Running NodeLostTrigger: node_lost_trigger with currently live nodes: 2 and last live nodes: 2
   [junit4]   2> 1184104 INFO  (TEST-TestSimTriggerIntegration.testNodeMarkersRegistration-seed#[C3DD81FF93432DE3]) [    ] o.a.s.c.a.s.TestSimTriggerIntegration ====== ADD NODE 1
   [junit4]   2> 1184104 DEBUG (TEST-TestSimTriggerIntegration.testNodeMarkersRegistration-seed#[C3DD81FF93432DE3]) [    ] o.a.s.c.a.s.SimClusterStateProvider -- creating marker: /autoscaling/nodeAdded/127.0.0.1:10006_solr
   [junit4]   2> 1184105 INFO  (TEST-TestSimTriggerIntegration.testNodeMarkersRegistration-seed#[C3DD81FF93432DE3]) [    ] o.a.s.c.a.s.TestSimTriggerIntegration ====== KILL OVERSEER 2
   [junit4]   2> 1184105 INFO  (TEST-TestSimTriggerIntegration.testNodeMarkersRegistration-seed#[C3DD81FF93432DE3]) [    ] o.a.s.c.a.s.SimCloudManager === Restarting OverseerTriggerThread and clearing object cache...
   [junit4]   2> 1184105 INFO  (Simulated OverseerAutoScalingTriggerThread) [    ] o.a.s.c.a.OverseerTriggerThread OverseerTriggerThread woken up but we are closed, exiting.
   [junit4]   2> 1184105 DEBUG (ScheduledTrigger-2252-thread-4) [    ] o.a.s.c.a.NodeLostTrigger Running NodeLostTrigger: .auto_add_replicas with currently live nodes: 3 and last live nodes: 2
   [junit4]   2> 1184106 DEBUG (ScheduledTrigger-2252-thread-4) [    ] o.a.s.c.a.NodeAddedTrigger Running NodeAddedTrigger node_added_trigger
   [junit4]   2> 1184106 DEBUG (ScheduledTrigger-2252-thread-4) [    ] o.a.s.c.a.NodeAddedTrigger Found livenodes: 3
   [junit4]   2> 1184106 DEBUG (ScheduledTrigger-2252-thread-4) [    ] o.a.s.c.a.NodeAddedTrigger Tracking new node: 127.0.0.1:10006_solr at time 29476548928163162
   [junit4]   2> 1184178 DEBUG (ScheduledTrigger-2252-thread-1) [    ] o.a.s.c.a.NodeAddedTrigger Running NodeAddedTrigger node_added_trigger
   [junit4]   2> 1184178 DEBUG (ScheduledTrigger-2252-thread-1) [    ] o.a.s.c.a.NodeAddedTrigger Found livenodes: 3
   [junit4]   2> 1184178 DEBUG (ScheduledTrigger-2252-thread-1) [    ] o.a.s.c.a.NodeAddedTrigger NodeAddedTrigger node_added_trigger firing registered processor for nodes: [127.0.0.1:10006_solr] added at times [29476548928163162], now=29476552540767112
   [junit4]   2> 1184178 DEBUG (ScheduledTrigger-2252-thread-1) [    ] o.a.s.c.a.ScheduledTriggers ++++++++ Cooldown inactive - processing event: {
   [junit4]   2>   "id":"68b8c3dc114d5aTk7zsiemv4plci8guohwn90c2",
   [junit4]   2>   "source":"node_added_trigger",
   [junit4]   2>   "eventTime":29476548928163162,
   [junit4]   2>   "eventType":"NODEADDED",
   [junit4]   2>   "properties":{
   [junit4]   2>     "eventTimes":[29476548928163162],
   [junit4]   2>     "preferredOperation":"movereplica",
   [junit4]   2>     "nodeNames":["127.0.0.1:10006_solr"]}}
   [junit4]   2> 1184178 DEBUG (TEST-TestSimTriggerIntegration.testNodeMarkersRegistration-seed#[C3DD81FF93432DE3]) [    ] o.a.s.c.a.ScheduledTriggers Shutting down scheduled thread pool executor now
   [junit4]   2> 1184178 DEBUG (TEST-TestSimTriggerIntegration.testNodeMarkersRegistration-seed#[C3DD81FF93432DE3]) [    ] o.a.s.c.a.ScheduledTriggers Shutting down action executor now
   [junit4]   2> 1184178 DEBUG (TEST-TestSimTriggerIntegration.testNodeMarkersRegistration-seed#[C3DD81FF93432DE3]) [    ] o.a.s.c.a.ScheduledTriggers Awaiting termination for action executor
   [junit4]   2> 1184178 DEBUG (TEST-TestSimTriggerIntegration.testNodeMarkersRegistration-seed#[C3DD81FF93432DE3]) [    ] o.a.s.c.a.ScheduledTriggers Awaiting termination for scheduled thread pool executor
   [junit4]   2> 1184178 DEBUG (ScheduledTrigger-2252-thread-1) [    ] o.a.s.c.a.ScheduledTriggers Pausing all triggers: []
   [junit4]   2> 1184179 ERROR (ScheduledTrigger-2252-thread-1) [    ] o.a.s.c.a.NodeAddedTrigger Unexpected exception in NodeAddedTrigger
   [junit4]   2> org.apache.solr.common.AlreadyClosedException: ScheduledTrigger node_added_trigger has been closed.
   [junit4]   2> 	at org.apache.solr.cloud.autoscaling.ScheduledTriggers$TriggerWrapper.enqueue(ScheduledTriggers.java:576) ~[java/:?]
   [junit4]   2> 	at org.apache.solr.cloud.autoscaling.ScheduledTriggers.lambda$add$4(ScheduledTriggers.java:294) ~[java/:?]
   [junit4]   2> 	at org.apache.solr.cloud.autoscaling.NodeAddedTrigger.run(NodeAddedTrigger.java:186) [java/:?]
   [junit4]   2> 	at org.apache.solr.cloud.autoscaling.ScheduledTriggers$TriggerWrapper.run(ScheduledTriggers.java:633) [java/:?]
   [junit4]   2> 	at java.util.concurrent.Executors$RunnableAdapter.call(Executors.java:511) [?:1.8.0_191]
   [junit4]   2> 	at java.util.concurrent.FutureTask.runAndReset(FutureTask.java:308) [?:1.8.0_191]
   [junit4]   2> 	at java.util.concurrent.ScheduledThreadPoolExecutor$ScheduledFutureTask.access$301(ScheduledThreadPoolExecutor.java:180) [?:1.8.0_191]
   [junit4]   2> 	at java.util.concurrent.ScheduledThreadPoolExecutor$ScheduledFutureTask.run(ScheduledThreadPoolExecutor.java:294) [?:1.8.0_191]
   [junit4]   2> 	at java.util.concurrent.ThreadPoolExecutor.runWorker(ThreadPoolExecutor.java:1149) [?:1.8.0_191]
   [junit4]   2> 	at java.util.concurrent.ThreadPoolExecutor$Worker.run(ThreadPoolExecutor.java:624) [?:1.8.0_191]
   [junit4]   2> 	at java.lang.Thread.run(Thread.java:748) [?:1.8.0_191]
   [junit4]   2> 1184193 DEBUG (TEST-TestSimTriggerIntegration.testNodeMarkersRegistration-seed#[C3DD81FF93432DE3]) [    ] o.a.s.c.a.ScheduledTriggers ScheduledTriggers closed completely
   [junit4]   2> 1184193 DEBUG (TEST-TestSimTriggerIntegration.testNodeMarkersRegistration-seed#[C3DD81FF93432DE3]) [    ] o.a.s.c.a.OverseerTriggerThread OverseerTriggerThread has been closed explicitly
   [junit4]   2> 1184194 INFO  (TEST-TestSimTriggerIntegration.testNodeMarkersRegistration-seed#[C3DD81FF93432DE3]) [    ] o.a.s.c.a.s.SimCloudManager   = killing node 127.0.0.1:10004_solr
   [junit4]   2> 1184194 DEBUG (TEST-TestSimTriggerIntegration.testNodeMarkersRegistration-seed#[C3DD81FF93432DE3]) [    ] o.a.s.c.a.s.SimClusterStateProvider  -- created marker: /autoscaling/nodeLost/127.0.0.1:10004_solr
   [junit4]   2> 1184194 DEBUG (TEST-TestSimTriggerIntegration.testNodeMarkersRegistration-seed#[C3DD81FF93432DE3]) [    ] o.a.s.c.a.s.SimClusterStateProvider --- new Overseer leader: 127.0.0.1:10006_solr
   [junit4]   2> 1184194 DEBUG (Simulated OverseerAutoScalingTriggerThread) [    ] o.a.s.c.a.OverseerTriggerThread Refreshing /autoscaling.json with znode version 4
   [junit4]   2> 1184195 INFO  (Simulated OverseerAutoScalingTriggerThread) [    ] o.a.s.c.a.s.TestSimTriggerIntegration TestEventMarkerAction init
   [junit4]   2> 1184195 INFO  (Simulated OverseerAutoScalingTriggerThread) [    ] o.a.s.c.a.s.TestSimTriggerIntegration TestEventMarkerAction init
   [junit4]   2> 1184195 DEBUG (Simulated OverseerAutoScalingTriggerThread) [    ] o.a.s.c.a.OverseerTriggerThread Current znodeVersion 4, lastZnodeVersion 0
   [junit4]   2> 1184195 DEBUG (Simulated OverseerAutoScalingTriggerThread) [    ] o.a.s.c.a.OverseerTriggerThread Processed trigger updates upto znodeVersion 4
   [junit4]   2> 1184195 DEBUG (Simulated OverseerAutoScalingTriggerThread) [    ] o.a.s.c.a.NodeLostTrigger NodeLostTrigger node_lost_trigger - Initial livenodes: [127.0.0.1:10006_solr, 127.0.0.1:10005_solr]
   [junit4]   2> 1184195 DEBUG (Simulated OverseerAutoScalingTriggerThread) [    ] o.a.s.c.a.NodeLostTrigger Adding lost node from marker path: 127.0.0.1:10004_solr
   [junit4]   2> 1184230 DEBUG (Simulated OverseerAutoScalingTriggerThread) [    ] o.a.s.c.a.NodeAddedTrigger NodeAddedTrigger node_added_trigger - Initial livenodes: [127.0.0.1:10006_solr, 127.0.0.1:10005_solr]
   [junit4]   2> 1184230 DEBUG (Simulated OverseerAutoScalingTriggerThread) [    ] o.a.s.c.a.NodeAddedTrigger NodeAddedTrigger node_added_trigger instantiated with properties: {event=nodeAdded, waitFor=1, actions=[{name=test, class=org.apache.solr.cloud.autoscaling.sim.TestSimTriggerIntegration$TestEventMarkerAction}], enabled=true}
   [junit4]   2> 1184230 DEBUG (ScheduledTrigger-2255-thread-1) [    ] o.a.s.c.a.NodeLostTrigger Running NodeLostTrigger: node_lost_trigger with currently live nodes: 2 and last live nodes: 2
   [junit4]   2> 1184230 DEBUG (ScheduledTrigger-2255-thread-1) [    ] o.a.s.c.a.NodeLostTrigger Tracking lost node: 127.0.0.1:10004_solr
   [junit4]   2> 1184230 DEBUG (Simulated OverseerAutoScalingTriggerThread) [    ] o.a.s.c.a.NodeAddedTrigger Adding node from marker path: 127.0.0.1:10006_solr
   [junit4]   2> 1184269 DEBUG (Simulated OverseerAutoScalingTriggerThread) [    ] o.a.s.c.a.NodeLostTrigger NodeLostTrigger .auto_add_replicas - Initial livenodes: [127.0.0.1:10006_solr, 127.0.0.1:10005_solr]
   [junit4]   2> 1184269 DEBUG (Simulated OverseerAutoScalingTriggerThread) [    ] o.a.s.c.a.NodeLostTrigger Adding lost node from marker path: 127.0.0.1:10004_solr
   [junit4]   2> 1184283 DEBUG (Simulated OverseerAutoScalingTriggerThread) [    ] o.a.s.c.a.OverseerTriggerThread -- cleaning old nodeLost / nodeAdded markers
   [junit4]   2> 1184283 DEBUG (Simulated OverseerAutoScalingTriggerThread) [    ] o.a.s.c.a.OverseerTriggerThread Current znodeVersion 4, lastZnodeVersion 4
   [junit4]   2> 1184283 DEBUG (ScheduledTrigger-2255-thread-4) [    ] o.a.s.c.a.NodeAddedTrigger Running NodeAddedTrigger node_added_trigger
   [junit4]   2> 1184283 DEBUG (ScheduledTrigger-2255-thread-4) [    ] o.a.s.c.a.NodeAddedTrigger Found livenodes: 2
   [junit4]   2> 1184283 DEBUG (ScheduledTrigger-2255-thread-4) [    ] o.a.s.c.a.NodeAddedTrigger NodeAddedTrigger node_added_trigger firing registered processor for nodes: [127.0.0.1:10006_solr] added at times [29476548928163162], now=29476557815835212
   [junit4]   2> 1184283 DEBUG (ScheduledTrigger-2255-thread-4) [    ] o.a.s.c.a.ScheduledTriggers ++++++++ Cooldown inactive - processing event: {
   [junit4]   2>   "id":"68b8c3dc114d5aTk7zsiemv4plci8guohwn90c3",
   [junit4]   2>   "source":"node_added_trigger",
   [junit4]   2>   "eventTime":29476548928163162,
   [junit4]   2>   "eventType":"NODEADDED",
   [junit4]   2>   "properties":{
   [junit4]   2>     "eventTimes":[29476548928163162],
   [junit4]   2>     "preferredOperation":"movereplica",
   [junit4]   2>     "nodeNames":["127.0.0.1:10006_solr"]}}
   [junit4]   2> 1184322 DEBUG (ScheduledTrigger-2255-thread-4) [    ] o.a.s.c.a.ScheduledTriggers Pausing all triggers: [.auto_add_replicas, node_lost_trigger, node_added_trigger]
   [junit4]   2> 1184323 DEBUG (ScheduledTrigger-2255-thread-4) [    ] o.a.s.c.a.SystemLogListener Collection .system missing, skip sending event {
   [junit4]   2>   "id":"68b8c3dc114d5aTk7zsiemv4plci8guohwn90c3",
   [junit4]   2>   "source":"node_added_trigger",
   [junit4]   2>   "eventTime":29476548928163162,
   [junit4]   2>   "eventType":"NODEADDED",
   [junit4]   2>   "properties":{
   [junit4]   2>     "eventTimes":[29476548928163162],
   [junit4]   2>     "preferredOperation":"movereplica",
   [junit4]   2>     "_enqueue_time_":29476559777839362,
   [junit4]   2>     "nodeNames":["127.0.0.1:10006_solr"]}}
   [junit4]   2> 1184323 DEBUG (ScheduledTrigger-2255-thread-4) [    ] o.a.s.c.a.NodeAddedTrigger Removing new node from tracking: 127.0.0.1:10006_solr
   [junit4]   2> 1184323 DEBUG (AutoscalingActionExecutor-2256-thread-1) [    ] o.a.s.c.a.ScheduledTriggers -- processing actions for {
   [junit4]   2>   "id":"68b8c3dc114d5aTk7zsiemv4plci8guohwn90c3",
   [junit4]   2>   "source":"node_added_trigger",
   [junit4]   2>   "eventTime":29476548928163162,
   [junit4]   2>   "eventType":"NODEADDED",
   [junit4]   2>   "properties":{
   [junit4]   2>     "eventTimes":[29476548928163162],
   [junit4]   2>     "preferredOperation":"movereplica",
   [junit4]   2>     "_enqueue_time_":29476559777839362,
   [junit4]   2>     "nodeNames":["127.0.0.1:10006_solr"]}}
   [junit4]   2> 1184324 DEBUG (AutoscalingActionExecutor-2256-thread-1) [    ] o.a.s.c.a.SystemLogListener Collection .system missing, skip sending event {
   [junit4]   2>   "id":"68b8c3dc114d5aTk7zsiemv4plci8guohwn90c3",
   [junit4]   2>   "source":"node_added_trigger",
   [junit4]   2>   "eventTime":29476548928163162,
   [junit4]   2>   "eventType":"NODEADDED",
   [junit4]   2>   "properties":{
   [junit4]   2>     "eventTimes":[29476548928163162],
   [junit4]   2>     "preferredOperation":"movereplica",
   [junit4]   2>     "_enqueue_time_":29476559777839362,
   [junit4]   2>     "nodeNames":["127.0.0.1:10006_solr"]}}
   [junit4]   2> 1184324 DEBUG (AutoscalingActionExecutor-2256-thread-1) [    ] o.a.s.c.a.ScheduledTriggers Resuming trigger: node_added_trigger after 100ms
   [junit4]   2> 1184324 DEBUG (AutoscalingActionExecutor-2256-thread-1) [    ] o.a.s.c.a.ScheduledTriggers Resuming trigger: .auto_add_replicas after 100ms
   [junit4]   2> 1184324 DEBUG (AutoscalingActionExecutor-2256-thread-1) [    ] o.a.s.c.a.ScheduledTriggers Resuming trigger: node_lost_trigger after 100ms
   [junit4]   2> 1184340 DEBUG (AutoscalingActionExecutor-2256-thread-1) [    ] o.a.s.c.a.ScheduledTriggers -- processing took 805 ms for event id=68b8c3dc114d5aTk7zsiemv4plci8guohwn90c3
   [junit4]   2> 1184425 DEBUG (ScheduledTrigger-2255-thread-3) [    ] o.a.s.c.a.NodeLostTrigger Running NodeLostTrigger: .auto_add_replicas with currently live nodes: 2 and last live nodes: 3
   [junit4]   2> 1184425 DEBUG (ScheduledTrigger-2255-thread-3) [    ] o.a.s.c.a.NodeLostTrigger Tracking lost node: 127.0.0.1:10004_solr
   [junit4]   2> 1184425 DEBUG (ScheduledTrigger-2255-thread-1) [    ] o.a.s.c.a.NodeAddedTrigger Running NodeAddedTrigger node_added_trigger
   [junit4]   2> 1184425 DEBUG (ScheduledTrigger-2255-thread-1) [    ] o.a.s.c.a.NodeAddedTrigger Found livenodes: 2
   [junit4]   2> 1184441 DEBUG (ScheduledTrigger-2255-thread-4) [    ] o.a.s.c.a.NodeLostTrigger Running NodeLostTrigger: node_lost_trigger with currently live nodes: 2 and last live nodes: 2
   [junit4]   2> 1184441 DEBUG (ScheduledTrigger-2255-thread-4) [    ] o.a.s.c.a.NodeLostTrigger NodeLostTrigger firing registered processor for lost nodes: [127.0.0.1:10004_solr]
   [junit4]   2> 1184441 DEBUG (ScheduledTrigger-2255-thread-4) [    ] o.a.s.c.a.ScheduledTriggers ++++++++ Cooldown inactive - processing event: {
   [junit4]   2>   "id":"68b8c54fc3d96aTk7zsiemv4plci8guohwn90c4",
   [junit4]   2>   "source":"node_lost_trigger",
   [junit4]   2>   "eventTime":29476555164211562,
   [junit4]   2>   "eventType":"NODELOST",
   [junit4]   2>   "properties":{
   [junit4]   2>     "eventTimes":[29476555164211562],
   [junit4]   2>     "preferredOperation":"movereplica",
   [junit4]   2>     "nodeNames":["127.0.0.1:10004_solr"]}}
   [junit4]   2> 1184441 DEBUG (ScheduledTrigger-2255-thread-4) [    ] o.a.s.c.a.ScheduledTriggers Pausing all triggers: [.auto_add_replicas, node_lost_trigger, node_added_trigger]
   [junit4]   2> 1184441 DEBUG (ScheduledTrigger-2255-thread-4) [    ] o.a.s.c.a.SystemLogListener Collection .system missing, skip sending event {
   [junit4]   2>   "id":"68b8c54fc3d96aTk7zsiemv4plci8guohwn90c4",
   [junit4]   2>   "source":"node_lost_trigger",
   [junit4]   2>   "eventTime":29476555164211562,
   [junit4]   2>   "eventType":"NODELOST",
   [junit4]   2>   "properties":{
   [junit4]   2>     "eventTimes":[29476555164211562],
   [junit4]   2>     "preferredOperation":"movereplica",
   [junit4]   2>     "_enqueue_time_":29476565715598762,
   [junit4]   2>     "nodeNames":["127.0.0.1:10004_solr"]}}
   [junit4]   2> 1184442 DEBUG (AutoscalingActionExecutor-2256-thread-1) [    ] o.a.s.c.a.ScheduledTriggers -- processing actions for {
   [junit4]   2>   "id":"68b8c54fc3d96aTk7zsiemv4plci8guohwn90c4",
   [junit4]   2>   "source":"node_lost_trigger",
   [junit4]   2>   "eventTime":29476555164211562,
   [junit4]   2>   "eventType":"NODELOST",
   [junit4]   2>   "properties":{
   [junit4]   2>     "eventTimes":[29476555164211562],
   [junit4]   2>     "preferredOperation":"movereplica",
   [junit4]   2>     "_enqueue_time_":29476565715598762,
   [junit4]   2>     "nodeNames":["127.0.0.1:10004_solr"]}}
   [junit4]   2> 1184442 DEBUG (AutoscalingActionExecutor-2256-thread-1) [    ] o.a.s.c.a.SystemLogListener Collection .system missing, skip sending event {
   [junit4]   2>   "id":"68b8c54fc3d96aTk7zsiemv4plci8guohwn90c4",
   [junit4]   2>   "source":"node_lost_trigger",
   [junit4]   2>   "eventTime":29476555164211562,
   [junit4]   2>   "eventType":"NODELOST",
   [junit4]   2>   "properties":{
   [junit4]   2>     "eventTimes":[29476555164211562],
   [junit4]   2>     "preferredOperation":"movereplica",
   [junit4]   2>     "_enqueue_time_":29476565715598762,
   [junit4]   2>     "nodeNames":["127.0.0.1:10004_solr"]}}
   [junit4]   2> 1184442 DEBUG (AutoscalingActionExecutor-2256-thread-1) [    ] o.a.s.c.a.ScheduledTriggers Resuming trigger: .auto_add_replicas after 100ms
   [junit4]   2> 1184442 DEBUG (AutoscalingActionExecutor-2256-thread-1) [    ] o.a.s.c.a.ScheduledTriggers Resuming trigger: node_added_trigger after 100ms
   [junit4]   2> 1184442 DEBUG (AutoscalingActionExecutor-2256-thread-1) [    ] o.a.s.c.a.ScheduledTriggers Resuming trigger: node_lost_trigger after 100ms
   [junit4]   2> 1184442 DEBUG (AutoscalingActionExecutor-2256-thread-1) [    ] o.a.s.c.a.ScheduledTriggers -- processing took 18 ms for event id=68b8c54fc3d96aTk7zsiemv4plci8guohwn90c4
   [junit4]   2> 1184485 INFO  (Simulated OverseerAutoScalingTriggerThread) [    ] o.a.s.c.a.OverseerTriggerThread OverseerTriggerThread woken up but we are closed, exiting.
   [junit4]   2> 1184486 DEBUG (TEST-TestSimTriggerIntegration.testNodeMarkersRegistration-seed#[C3DD81FF93432DE3]) [    ] o.a.s.c.a.ScheduledTriggers Shutting down scheduled thread pool executor now
   [junit4]   2> 1184486 DEBUG (TEST-TestSimTriggerIntegration.testNodeMarkersRegistration-seed#[C3DD81FF93432DE3]) [    ] o.a.s.c.a.ScheduledTriggers Shutting down action executor now
   [junit4]   2> 1184486 DEBUG (TEST-TestSimTriggerIntegration.testNodeMarkersRegistration-seed#[C3DD81FF93432DE3]) [    ] o.a.s.c.a.ScheduledTriggers Awaiting termination for action executor
   [junit4]   2> 1184486 DEBUG (TEST-TestSimTriggerIntegration.testNodeMarkersRegistration-seed#[C3DD81FF93432DE3]) [    ] o.a.s.c.a.ScheduledTriggers Awaiting termination for scheduled thread pool executor
   [junit4]   2> 1184486 DEBUG (TEST-TestSimTriggerIntegration.testNodeMarkersRegistration-seed#[C3DD81FF93432DE3]) [    ] o.a.s.c.a.ScheduledTriggers ScheduledTriggers closed completely
   [junit4]   2> 1184486 DEBUG (TEST-TestSimTriggerIntegration.testNodeMarkersRegistration-seed#[C3DD81FF93432DE3]) [    ] o.a.s.c.a.OverseerTriggerThread OverseerTriggerThread has been closed explicitly
   [junit4]   2> 1184487 INFO  (TEST-TestSimTriggerIntegration.testNodeMarkersRegistration-seed#[C3DD81FF93432DE3]) [    ] o.a.s.SolrTestCaseJ4 ###Ending testNodeMarkersRegistration
   [junit4]   2> 1184502 INFO  (TEST-TestSimTriggerIntegration.testListeners-seed#[C3DD81FF93432DE3]) [    ] o.a.s.SolrTestCaseJ4 ###Starting testListeners
   [junit4]   2> 1184522 DEBUG (TEST-TestSimTriggerIntegration.testListeners-seed#[C3DD81FF93432DE3]) [    ] o.a.s.c.a.s.SimClusterStateProvider --- new Overseer leader: 127.0.0.1:10007_solr
   [junit4]   2> 1184524 DEBUG (Simulated OverseerAutoScalingTriggerThread) [    ] o.a.s.c.a.OverseerTriggerThread Adding .auto_add_replicas and .scheduled_maintenance triggers
   [junit4]   2> 1184524 DEBUG (Simulated OverseerAutoScalingTriggerThread) [    ] o.a.s.c.a.OverseerTriggerThread Refreshing /autoscaling.json with znode version 1
   [junit4]   2> 1184525 DEBUG (Simulated OverseerAutoScalingTriggerThread) [    ] o.a.s.c.a.OverseerTriggerThread Current znodeVersion 1, lastZnodeVersion 0
   [junit4]   2> 1184525 DEBUG (Simulated OverseerAutoScalingTriggerThread) [    ] o.a.s.c.a.OverseerTriggerThread Processed trigger updates upto znodeVersion 1
   [junit4]   2> 1184525 DEBUG (TEST-TestSimTriggerIntegration.testListeners-seed#[C3DD81FF93432DE3]) [    ] o.a.s.c.a.s.SimClusterStateProvider ** creating new collection states, currentVersion=0
   [junit4]   2> 1184525 DEBUG (TEST-TestSimTriggerIntegration.testListeners-seed#[C3DD81FF93432DE3]) [    ] o.a.s.c.a.s.SimClusterStateProvider ** saved cluster state version 0
   [junit4]   2> 1184525 INFO  (TEST-TestSimTriggerIntegration.testListeners-seed#[C3DD81FF93432DE3]) [    ] o.a.s.h.a.MetricsHistoryHandler No .system collection, keeping metrics history in memory.
   [junit4]   2> 1184538 DEBUG (Simulated OverseerAutoScalingTriggerThread) [    ] o.a.s.c.a.NodeLostTrigger NodeLostTrigger .auto_add_replicas - Initial livenodes: [127.0.0.1:10008_solr, 127.0.0.1:10007_solr]
   [junit4]   2> 1184542 DEBUG (Simulated OverseerAutoScalingTriggerThread) [    ] o.a.s.c.a.OverseerTriggerThread -- cleaning old nodeLost / nodeAdded markers
   [junit4]   2> 1184542 DEBUG (Simulated OverseerAutoScalingTriggerThread) [    ] o.a.s.c.a.OverseerTriggerThread Current znodeVersion 1, lastZnodeVersion 1
   [junit4]   2> 1184542 DEBUG (ScheduledTrigger-2259-thread-2) [    ] o.a.s.c.a.NodeLostTrigger Running NodeLostTrigger: .auto_add_replicas with currently live nodes: 2 and last live nodes: 2
   [junit4]   2> 1184563 DEBUG (ScheduledTrigger-2259-thread-2) [    ] o.a.s.c.a.NodeLostTrigger Running NodeLostTrigger: .auto_add_replicas with currently live nodes: 2 and last live nodes: 2
   [junit4]   2> 1184595 DEBUG (simCloudManagerPool-2258-thread-2) [    ] o.a.s.c.a.AutoScalingHandler Verified autoscaling configuration
   [junit4]   2> 1184596 DEBUG (simCloudManagerPool-2258-thread-2) [    ] o.a.s.c.a.OverseerTriggerThread Refreshing /autoscaling.json with znode version 2
   [junit4]   2> 1184596 DEBUG (Simulated OverseerAutoScalingTriggerThread) [    ] o.a.s.c.a.OverseerTriggerThread Processed trigger updates upto znodeVersion 2
   [junit4]   2> 1184611 DEBUG (ScheduledTrigger-2259-thread-2) [    ] o.a.s.c.a.NodeLostTrigger Running NodeLostTrigger: .auto_add_replicas with currently live nodes: 2 and last live nodes: 2
   [junit4]   2> 1184611 DEBUG (Simulated OverseerAutoScalingTriggerThread) [    ] o.a.s.c.a.OverseerTriggerThread -- cleaning old nodeLost / nodeAdded markers
   [junit4]   2> 1184611 DEBUG (Simulated OverseerAutoScalingTriggerThread) [    ] o.a.s.c.a.OverseerTriggerThread Current znodeVersion 2, lastZnodeVersion 2
   [junit4]   2> 1184612 DEBUG (simCloudManagerPool-2258-thread-3) [    ] o.a.s.c.a.AutoScalingHandler Verified autoscaling configuration
   [junit4]   2> 1184612 DEBUG (simCloudManagerPool-2258-thread-3) [    ] o.a.s.c.a.OverseerTriggerThread Refreshing /autoscaling.json with znode version 3
   [junit4]   2> 1184613 DEBUG (Simulated OverseerAutoScalingTriggerThread) [    ] o.a.s.c.a.OverseerTriggerThread Processed trigger updates upto znodeVersion 3
   [junit4]   2> 1184613 INFO  (Simulated OverseerAutoScalingTriggerThread) [    ] o.a.s.c.a.s.TestSimTriggerIntegration TestTriggerAction init
   [junit4]   2> 1184613 DEBUG (Simulated OverseerAutoScalingTriggerThread) [    ] o.a.s.c.a.NodeAddedTrigger NodeAddedTrigger node_added_trigger - Initial livenodes: [127.0.0.1:10008_solr, 127.0.0.1:10007_solr]
   [junit4]   2> 1184613 DEBUG (Simulated OverseerAutoScalingTriggerThread) [    ] o.a.s.c.a.NodeAddedTrigger NodeAddedTrigger node_added_trigger instantiated with properties: {event=nodeAdded, waitFor=1, actions=[{name=test, class=org.apache.solr.cloud.autoscaling.sim.TestSimTriggerIntegration$TestTriggerAction}, {name=test1, class=org.apache.solr.cloud.autoscaling.sim.TestSimTriggerIntegration$TestDummyAction}], enabled=true}
   [junit4]   2> 1184613 DEBUG (Simulated OverseerAutoScalingTriggerThread) [    ] o.a.s.c.a.OverseerTriggerThread -- cleaning old nodeLost / nodeAdded markers
   [junit4]   2> 1184613 DEBUG (Simulated OverseerAutoScalingTriggerThread) [    ] o.a.s.c.a.OverseerTriggerThread Current znodeVersion 3, lastZnodeVersion 3
   [junit4]   2> 1184613 DEBUG (ScheduledTrigger-2259-thread-4) [    ] o.a.s.c.a.NodeAddedTrigger Running NodeAddedTrigger node_added_trigger
   [junit4]   2> 1184613 DEBUG (ScheduledTrigger-2259-thread-4) [    ] o.a.s.c.a.NodeAddedTrigger Found livenodes: 2
   [junit4]   2> 1184661 DEBUG (ScheduledTrigger-2259-thread-4) [    ] o.a.s.c.a.NodeLostTrigger Running NodeLostTrigger: .auto_add_replicas with currently live nodes: 2 and last live nodes: 2
   [junit4]   2> 1184661 DEBUG (ScheduledTrigger-2259-thread-2) [    ] o.a.s.c.a.NodeAddedTrigger Running NodeAddedTrigger node_added_trigger
   [junit4]   2> 1184661 DEBUG (ScheduledTrigger-2259-thread-2) [    ] o.a.s.c.a.NodeAddedTrigger Found livenodes: 2
   [junit4]   2> 1184662 DEBUG (simCloudManagerPool-2258-thread-4) [    ] o.a.s.c.a.AutoScalingHandler Verified autoscaling configuration
   [junit4]   2> 1184662 DEBUG (simCloudManagerPool-2258-thread-4) [    ] o.a.s.c.a.OverseerTriggerThread Refreshing /autoscaling.json with znode version 4
   [junit4]   2> 1184676 DEBUG (Simulated OverseerAutoScalingTriggerThread) [    ] o.a.s.c.a.OverseerTriggerThread Processed trigger updates upto znodeVersion 4
   [junit4]   2> 1184676 DEBUG (Simulated OverseerAutoScalingTriggerThread) [    ] o.a.s.c.a.OverseerTriggerThread -- cleaning old nodeLost / nodeAdded markers
   [junit4]   2> 1184676 DEBUG (Simulated OverseerAutoScalingTriggerThread) [    ] o.a.s.c.a.OverseerTriggerThread Current znodeVersion 4, lastZnodeVersion 4
   [junit4]   2> 1184696 DEBUG (ScheduledTrigger-2259-thread-1) [    ] o.a.s.c.a.NodeAddedTrigger Running NodeAddedTrigger node_added_trigger
   [junit4]   2> 1184696 DEBUG (ScheduledTrigger-2259-thread-1) [    ] o.a.s.c.a.NodeAddedTrigger Found livenodes: 2
   [junit4]   2> 1184696 DEBUG (ScheduledTrigger-2259-thread-4) [    ] o.a.s.c.a.NodeLostTrigger Running NodeLostTrigger: .auto_add_replicas with currently live nodes: 2 and last live nodes: 2
   [junit4]   2> 1184737 DEBUG (ScheduledTrigger-2259-thread-1) [    ] o.a.s.c.a.NodeAddedTrigger Running NodeAddedTrigger node_added_trigger
   [junit4]   2> 1184737 DEBUG (ScheduledTrigger-2259-thread-1) [    ] o.a.s.c.a.NodeAddedTrigger Found livenodes: 2
   [junit4]   2> 1184757 DEBUG (simCloudManagerPool-2258-thread-5) [    ] o.a.s.c.a.AutoScalingHandler Verified autoscaling configuration
   [junit4]   2> 1184758 DEBUG (simCloudManagerPool-2258-thread-5) [    ] o.a.s.c.a.OverseerTriggerThread Refreshing /autoscaling.json with znode version 5
   [junit4]   2> 1184769 DEBUG (Simulated OverseerAutoScalingTriggerThread) [    ] o.a.s.c.a.OverseerTriggerThread Processed trigger updates upto znodeVersion 5
   [junit4]   2> 1184769 DEBUG (Simulated OverseerAutoScalingTriggerThread) [    ] o.a.s.c.a.OverseerTriggerThread -- cleaning old nodeLost / nodeAdded markers
   [junit4]   2> 1184769 DEBUG (Simulated OverseerAutoScalingTriggerThread) [    ] o.a.s.c.a.OverseerTriggerThread Current znodeVersion 5, lastZnodeVersion 5
   [junit4]   2> 1184769 DEBUG (ScheduledTrigger-2259-thread-2) [    ] o.a.s.c.a.NodeAddedTrigger Running NodeAddedTrigger node_added_trigger
   [junit4]   2> 1184769 DEBUG (ScheduledTrigger-2259-thread-2) [    ] o.a.s.c.a.NodeAddedTrigger Found livenodes: 2
   [junit4]   2> 1184773 DEBUG (ScheduledTrigger-2259-thread-1) [    ] o.a.s.c.a.NodeLostTrigger Running NodeLostTrigger: .auto_add_replicas with currently live nodes: 2 and last live nodes: 2
   [junit4]   2> 1184789 DEBUG (TEST-TestSimTriggerIntegration.testListeners-seed#[C3DD81FF93432DE3]) [    ] o.a.s.c.a.s.SimClusterStateProvider -- creating marker: /autoscaling/nodeAdded/127.0.0.1:10009_solr
   [junit4]   2> 1184805 DEBUG (ScheduledTrigger-2259-thread-2) [    ] o.a.s.c.a.NodeAddedTrigger Running NodeAddedTrigger node_added_trigger
   [junit4]   2> 1184805 DEBUG (ScheduledTrigger-2259-thread-2) [    ] o.a.s.c.a.NodeAddedTrigger Found livenodes: 3
   [junit4]   2> 1184805 DEBUG (ScheduledTrigger-2259-thread-2) [    ] o.a.s.c.a.NodeAddedTrigger Tracking new node: 127.0.0.1:10009_solr at time 29476583921714562
   [junit4]   2> 1184806 DEBUG (ScheduledTrigger-2259-thread-2) [    ] o.a.s.c.a.NodeLostTrigger Running NodeLostTrigger: .auto_add_replicas with currently live nodes: 3 and last live nodes: 2
   [junit4]   2> 1184826 DEBUG (ScheduledTrigger-2259-thread-2) [    ] o.a.s.c.a.NodeAddedTrigger Running NodeAddedTrigger node_added_trigger
   [junit4]   2> 1184826 DEBUG (ScheduledTrigger-2259-thread-2) [    ] o.a.s.c.a.NodeAddedTrigger Found livenodes: 3
   [junit4]   2> 1184826 DEBUG (ScheduledTrigger-2259-thread-2) [    ] o.a.s.c.a.NodeAddedTrigger NodeAddedTrigger node_added_trigger firing registered processor for nodes: [127.0.0.1:10009_solr] added at times [29476583921714562], now=29476584941653912
   [junit4]   2> 1184826 DEBUG (ScheduledTrigger-2259-thread-2) [    ] o.a.s.c.a.ScheduledTriggers ++++++++ Cooldown inactive - processing event: {
   [junit4]   2>   "id":"68b8cc01d88582Tk7zsiemv4plci8guohwn90c6",
   [junit4]   2>   "source":"node_added_trigger",
   [junit4]   2>   "eventTime":29476583921714562,
   [junit4]   2>   "eventType":"NODEADDED",
   [junit4]   2>   "properties":{
   [junit4]   2>     "eventTimes":[29476583921714562],
   [junit4]   2>     "preferredOperation":"movereplica",
   [junit4]   2>     "nodeNames":["127.0.0.1:10009_solr"]}}
   [junit4]   2> 1184826 DEBUG (ScheduledTrigger-2259-thread-2) [    ] o.a.s.c.a.ScheduledTriggers Pausing all triggers: [.auto_add_replicas, node_added_trigger]
   [junit4]   2> 1184827 DEBUG (ScheduledTrigger-2259-thread-2) [    ] o.a.s.c.a.SystemLogListener Collection .system missing, skip sending event {
   [junit4]   2>   "id":"68b8cc01d88582Tk7zsiemv4plci8guohwn90c6",
   [junit4]   2>   "source":"node_added_trigger",
   [junit4]   2>   "eventTime":29476583921714562,
   [junit4]   2>   "eventType":"NODEADDED",
   [junit4]   2>   "properties":{
   [junit4]   2>     "eventTimes":[29476583921714562],
   [junit4]   2>     "preferredOperation":"movereplica",
   [junit4]   2>     "_enqueue_time_":29476584968224662,
   [junit4]   2>     "nodeNames":["127.0.0.1:10009_solr"]}}
   [junit4]   2> 1184878 DEBUG (ScheduledTrigger-2259-thread-2) [    ] o.a.s.c.a.NodeAddedTrigger Removing new node from tracking: 127.0.0.1:10009_solr
   [junit4]   2> 1184879 DEBUG (AutoscalingActionExecutor-2260-thread-1) [    ] o.a.s.c.a.ScheduledTriggers -- processing actions for {
   [junit4]   2>   "id":"68b8cc01d88582Tk7zsiemv4plci8guohwn90c6",
   [junit4]   2>   "source":"node_added_trigger",
   [junit4]   2>   "eventTime":29476583921714562,
   [junit4]   2>   "eventType":"NODEADDED",
   [junit4]   2>   "properties":{
   [junit4]   2>     "eventTimes":[29476583921714562],
   [junit4]   2>     "preferredOperation":"movereplica",
   [junit4]   2>     "_enqueue_time_":29476584968224662,
   [junit4]   2>     "nodeNames":["127.0.0.1:10009_solr"]}}
   [junit4]   2> 1184881 DEBUG (AutoscalingActionExecutor-2260-thread-1) [    ] o.a.s.c.a.SystemLogListener Collection .system missing, skip sending event {
   [junit4]   2>   "id":"68b8cc01d88582Tk7zsiemv4plci8guohwn90c6",
   [junit4]   2>   "source":"node_added_trigger",
   [junit4]   2>   "eventTime":29476583921714562,
   [junit4]   2>   "eventType":"NODEADDED",
   [junit4]   2>   "properties":{
   [junit4]   2>     "eventTimes":[29476583921714562],
   [junit4]   2>     "preferredOperation":"movereplica",
   [junit4]   2>     "_enqueue_time_":29476584968224662,
   [junit4]   2>     "nodeNames":["127.0.0.1:10009_solr"]}}
   [junit4]   2> 1184881 DEBUG (AutoscalingActionExecutor-2260-thread-1) [    ] o.a.s.c.a.ScheduledTriggers Resuming trigger: node_added_trigger after 100ms
   [junit4]   2> 1184881 DEBUG (AutoscalingActionExecutor-2260-thread-1) [    ] o.a.s.c.a.ScheduledTriggers Resuming trigger: .auto_add_replicas after 100ms
   [junit4]   2> 1184881 DEBUG (AutoscalingActionExecutor-2260-thread-1) [    ] o.a.s.c.a.ScheduledTriggers -- processing took 128 ms for event id=68b8cc01d88582Tk7zsiemv4plci8guohwn90c6
   [junit4]   2> 1184952 DEBUG (TEST-TestSimTriggerIntegration.testListeners-seed#[C3DD81FF93432DE3]) [    ] o.a.s.c.a.s.SimClusterStateProvider -- creating marker: /autoscaling/nodeAdded/127.0.0.1:10010_solr
   [junit4]   2> 1184988 DEBUG (ScheduledTrigger-2259-thread-1) [    ] o.a.s.c.a.NodeLostTrigger Running NodeLostTrigger: .auto_add_replicas with currently live nodes: 4 and last live nodes: 3
   [junit4]   2> 1184988 DEBUG (ScheduledTrigger-2259-thread-3) [    ] o.a.s.c.a.NodeAddedTrigger Running NodeAddedTrigger node_added_trigger
   [junit4]   2> 1184988 DEBUG (ScheduledTrigger-2259-thread-3) [    ] o.a.s.c.a.NodeAddedTrigger Found livenodes: 4
   [junit4]   2> 1184988 DEBUG (ScheduledTrigger-2259-thread-3) [    ] o.a.s.c.a.NodeAddedTrigger Tracking new node: 127.0.0.1:10010_solr at time 29476593049161712
   [junit4]   2> 1185024 DEBUG (ScheduledTrigger-2259-thread-1) [    ] o.a.s.c.a.NodeLostTrigger Running NodeLostTrigger: .auto_add_replicas with currently live nodes: 4 and last live nodes: 4
   [junit4]   2> 1185024 DEBUG (ScheduledTrigger-2259-thread-1) [    ] o.a.s.c.a.NodeAddedTrigger Running NodeAddedTrigger node_added_trigger
   [junit4]   2> 1185024 DEBUG (ScheduledTrigger-2259-thread-1) [    ] o.a.s.c.a.NodeAddedTrigger Found livenodes: 4
   [junit4]   2> 1185024 DEBUG (ScheduledTrigger-2259-thread-1) [    ] o.a.s.c.a.NodeAddedTrigger NodeAddedTrigger node_added_trigger firing registered processor for nodes: [127.0.0.1:10010_solr] added at times [29476593049161712], now=29476594858538012
   [junit4]   2> 1185024 DEBUG (ScheduledTrigger-2259-thread-1) [    ] o.a.s.c.a.ScheduledTriggers ++++++++ Cooldown inactive - processing event: {
   [junit4]   2>   "id":"68b8ce21e24ff0Tk7zsiemv4plci8guohwn90c7",
   [junit4]   2>   "source":"node_added_trigger",
   [junit4]   2>   "eventTime":29476593049161712,
   [junit4]   2>   "eventType":"NODEADDED",
   [junit4]   2>   "properties":{
   [junit4]   2>     "eventTimes":[29476593049161712],
   [junit4]   2>     "preferredOperation":"movereplica",
   [junit4]   2>     "nodeNames":["127.0.0.1:10010_solr"]}}
   [junit4]   2> 1185024 DEBUG (ScheduledTrigger-2259-thread-1) [    ] o.a.s.c.a.ScheduledTriggers Pausing all triggers: [.auto_add_replicas, node_added_trigger]
   [junit4]   2> 1185025 DEBUG (ScheduledTrigger-2259-thread-1) [    ] o.a.s.c.a.SystemLogListener Collection .system missing, skip sending event {
   [junit4]   2>   "id":"68b8ce21e24ff0Tk7zsiemv4plci8guohwn90c7",
   [junit4]   2>   "source":"node_added_trigger",
   [junit4]   2>   "eventTime":29476593049161712,
   [junit4]   2>   "eventType":"NODEADDED",
   [junit4]   2>   "properties":{
   [junit4]   2>     "eventTimes":[29476593049161712],
   [junit4]   2>     "preferredOperation":"movereplica",
   [junit4]   2>     "_enqueue_time_":29476594873897312,
   [junit4]   2>     "nodeNames":["127.0.0.1:10010_solr"]}}
   [junit4]   2> 1185025 DEBUG (ScheduledTrigger-2259-thread-1) [    ] o.a.s.c.a.NodeAddedTrigger Removing new node from tracking: 127.0.0.1:10010_solr
   [junit4]   2> 1185025 DEBUG (AutoscalingActionExecutor-2260-thread-1) [    ] o.a.s.c.a.ScheduledTriggers -- processing actions for {
   [junit4]   2>   "id":"68b8ce21e24ff0Tk7zsiemv4plci8guohwn90c7",
   [junit4]   2>   "source":"node_added_trigger",
   [junit4]   2>   "eventTime":29476593049161712,
   [junit4]   2>   "eventType":"NODEADDED",
   [junit4]   2>   "properties":{
   [junit4]   2>     "eventTimes":[29476593049161712],
   [junit4]   2>     "preferredOperation":"movereplica",
   [junit4]   2>     "_enqueue_time_":29476594873897312,
   [junit4]   2>     "nodeNames":["127.0.0.1:10010_solr"]}}
   [junit4]   2> 1185025 DEBUG (AutoscalingActionExecutor-2260-thread-1) [    ] o.a.s.c.a.SystemLogListener Collection .system missing, skip sending event {
   [junit4]   2>   "id":"68b8ce21e24ff0Tk7zsiemv4plci8guohwn90c7",
   [junit4]   2>   "source":"node_added_trigger",
   [junit4]   2>   "eventTime":29476593049161712,
   [junit4]   2>   "eventType":"NODEADDED",
   [junit4]   2>   "properties":{
   [junit4]   2>     "eventTimes":[29476593049161712],
   [junit4]   2>     "preferredOperation":"movereplica",
   [junit4]   2>     "_enqueue_time_":29476594873897312,
   [junit4]   2>     "nodeNames":["127.0.0.1:10010_solr"]}}
   [junit4]   2> 1185025 WARN  (AutoscalingActionExecutor-2260-thread-1) [    ] o.a.s.c.a.ScheduledTriggers Exception executing actions
   [junit4]   2> org.apache.solr.cloud.autoscaling.TriggerActionException: Error processing action for trigger event: {
   [junit4]   2>   "id":"68b8ce21e24ff0Tk7zsiemv4plci8guohwn90c7",
   [junit4]   2>   "source":"node_added_trigger",
   [junit4]   2>   "eventTime":29476593049161712,
   [junit4]   2>   "eventType":"NODEADDED",
   [junit4]   2>   "properties":{
   [junit4]   2>     "eventTimes":[29476593049161712],
   [junit4]   2>     "preferredOperation":"movereplica",
   [junit4]   2>     "_enqueue_time_":29476594873897312,
   [junit4]   2>     "nodeNames":["127.0.0.1:10010_solr"]}}
   [junit4]   2> 	at org.apache.solr.cloud.autoscaling.ScheduledTriggers.lambda$null$3(ScheduledTriggers.java:327) ~[java/:?]
   [junit4]   2> 	at java.util.concurrent.Executors$RunnableAdapter.call(Executors.java:511) ~[?:1.8.0_191]
   [junit4]   2> 	at java.util.concurrent.FutureTask.run(FutureTask.java:266) ~[?:1.8.0_191]
   [junit4]   2> 	at org.apache.solr.common.util.ExecutorUtil$MDCAwareThreadPoolExecutor.lambda$execute$0(ExecutorUtil.java:209) ~[java/:?]
   [junit4]   2> 	at java.util.concurrent.ThreadPoolExecutor.runWorker(ThreadPoolExecutor.java:1149) [?:1.8.0_191]
   [junit4]   2> 	at java.util.concurrent.ThreadPoolExecutor$Worker.run(ThreadPoolExecutor.java:624) [?:1.8.0_191]
   [junit4]   2> 	at java.lang.Thread.run(Thread.java:748) [?:1.8.0_191]
   [junit4]   2> Caused by: java.lang.RuntimeException: failure
   [junit4]   2> 	at org.apache.solr.cloud.autoscaling.sim.TestSimTriggerIntegration$TestDummyAction.process(TestSimTriggerIntegration.java:999) ~[test/:?]
   [junit4]   2> 	at org.apache.solr.cloud.autoscaling.ScheduledTriggers.lambda$null$3(ScheduledTriggers.java:324) ~[java/:?]
   [junit4]   2> 	... 6 more
   [junit4]   2> 1185026 DEBUG (AutoscalingActionExecutor-2260-thread-1) [    ] o.a.s.c.a.ScheduledTriggers Resuming trigger: .auto_add_replicas after 100ms
   [junit4]   2> 1185026 DEBUG (AutoscalingActionExecutor-2260-thread-1) [    ] o.a.s.c.a.ScheduledTriggers Resuming trigger: node_added_trigger after 100ms
   [junit4]   2> 1185026 DEBUG (AutoscalingActionExecutor-2260-thread-1) [    ] o.a.s.c.a.ScheduledTriggers -- processing took 59 ms for event id=68b8ce21e24ff0Tk7zsiemv4plci8guohwn90c7
   [junit4]   2> 1185098 DEBUG (TEST-TestSimTriggerIntegration.testListeners-seed#[C3DD81FF93432DE3]) [    ] o.a.s.c.a.ScheduledTriggers Shutting down scheduled thread pool executor now
   [junit4]   2> 1185098 DEBUG (TEST-TestSimTriggerIntegration.testListeners-seed#[C3DD81FF93432DE3]) [    ] o.a.s.c.a.ScheduledTriggers Shutting down action executor now
   [junit4]   2> 1185098 DEBUG (TEST-TestSimTriggerIntegration.testListeners-seed#[C3DD81FF93432DE3]) [    ] o.a.s.c.a.ScheduledTriggers Awaiting termination for action executor
   [junit4]   2> 1185098 INFO  (Simulated OverseerAutoScalingTriggerThread) [    ] o.a.s.c.a.OverseerTriggerThread OverseerTriggerThread woken up but we are closed, exiting.
   [junit4]   2> 1185098 DEBUG (TEST-TestSimTriggerIntegration.testListeners-seed#[C3DD81FF93432DE3]) [    ] o.a.s.c.a.ScheduledTriggers Awaiting termination for scheduled thread pool executor
   [junit4]   2> 1185099 DEBUG (TEST-TestSimTriggerIntegration.testListeners-seed#[C3DD81FF93432DE3]) [    ] o.a.s.c.a.ScheduledTriggers ScheduledTriggers closed completely
   [junit4]   2> 1185099 DEBUG (TEST-TestSimTriggerIntegration.testListeners-seed#[C3DD81FF93432DE3]) [    ] o.a.s.c.a.OverseerTriggerThread OverseerTriggerThread has been closed explicitly
   [junit4]   2> 1185099 INFO  (TEST-TestSimTriggerIntegration.testListeners-seed#[C3DD81FF93432DE3]) [    ] o.a.s.SolrTestCaseJ4 ###Ending testListeners
   [junit4]   2> 1185134 INFO  (TEST-TestSimTriggerIntegration.testNodeLostTrigger-seed#[C3DD81FF93432DE3]) [    ] o.a.s.SolrTestCaseJ4 ###Starting testNodeLostTrigger
   [junit4]   2> 1185170 DEBUG (TEST-TestSimTriggerIntegration.testNodeLostTrigger-seed#[C3DD81FF93432DE3]) [    ] o.a.s.c.a.s.SimClusterStateProvider --- new Overseer leader: 127.0.0.1:10011_solr
   [junit4]   2> 1185174 DEBUG (Simulated OverseerAutoScalingTriggerThread) [    ] o.a.s.c.a.OverseerTriggerThread Adding .auto_add_replicas and .scheduled_maintenance triggers
   [junit4]   2> 1185174 DEBUG (Simulated OverseerAutoScalingTriggerThread) [    ] o.a.s.c.a.OverseerTriggerThread Refreshing /autoscaling.json with znode version 1
   [junit4]   2> 1185175 DEBUG (Simulated OverseerAutoScalingTriggerThread) [    ] o.a.s.c.a.OverseerTriggerThread Current znodeVersion 1, lastZnodeVersion 0
   [junit4]   2> 1185175 DEBUG (Simulated OverseerAutoScalingTriggerThread) [    ] o.a.s.c.a.OverseerTriggerThread Processed trigger updates upto znodeVersion 1
   [junit4]   2> 1185190 DEBUG (TEST-TestSimTriggerIntegration.testNodeLostTrigger-seed#[C3DD81FF93432DE3]) [    ] o.a.s.c.a.s.SimClusterStateProvider ** creating new collection states, currentVersion=0
   [junit4]   2> 1185190 DEBUG (TEST-TestSimTriggerIntegration.testNodeLostTrigger-seed#[C3DD81FF93432DE3]) [    ] o.a.s.c.a.s.SimClusterStateProvider ** saved cluster state version 0
   [junit4]   2> 1185190 INFO  (TEST-TestSimTriggerIntegration.testNodeLostTrigger-seed#[C3DD81FF93432DE3]) [    ] o.a.s.h.a.MetricsHistoryHandler No .system collection, keeping metrics history in memory.
   [junit4]   2> 1185207 DEBUG (simCloudManagerPool-2264-thread-2) [    ] o.a.s.c.a.AutoScalingHandler Verified autoscaling configuration
   [junit4]   2> 1185207 DEBUG (simCloudManagerPool-2264-thread-2) [    ] o.a.s.c.a.OverseerTriggerThread Refreshing /autoscaling.json with znode version 2
   [junit4]   2> 1185231 DEBUG (Simulated OverseerAutoScalingTriggerThread) [    ] o.a.s.c.a.NodeLostTrigger NodeLostTrigger .auto_add_replicas - Initial livenodes: [127.0.0.1:10012_solr, 127.0.0.1:10011_solr]
   [junit4]   2> 1185248 DEBUG (Simulated OverseerAutoScalingTriggerThread) [    ] o.a.s.c.a.OverseerTriggerThread -- cleaning old nodeLost / nodeAdded markers
   [junit4]   2> 1185248 DEBUG (Simulated OverseerAutoScalingTriggerThread) [    ] o.a.s.c.a.OverseerTriggerThread Current znodeVersion 2, lastZnodeVersion 1
   [junit4]   2> 1185248 DEBUG (Simulated OverseerAutoScalingTriggerThread) [    ] o.a.s.c.a.OverseerTriggerThread Processed trigger updates upto znodeVersion 2
   [junit4]   2> 1185280 DEBUG (ScheduledTrigger-2265-thread-2) [    ] o.a.s.c.a.NodeLostTrigger Running NodeLostTrigger: .auto_add_replicas with currently live nodes: 2 and last live nodes: 2
   [junit4]   2> 1185283 DEBUG (Simulated OverseerAutoScalingTriggerThread) [    ] o.a.s.c.a.OverseerTriggerThread -- cleaning old nodeLost / nodeAdded markers
   [junit4]   2> 1185284 DEBUG (Simulated OverseerAutoScalingTriggerThread) [    ] o.a.s.c.a.OverseerTriggerThread Current znodeVersion 2, lastZnodeVersion 2
   [junit4]   2> 1185296 DEBUG (simCloudManagerPool-2264-thread-3) [    ] o.a.s.c.a.AutoScalingHandler Verified autoscaling configuration
   [junit4]   2> 1185296 DEBUG (simCloudManagerPool-2264-thread-3) [    ] o.a.s.c.a.OverseerTriggerThread Refreshing /autoscaling.json with znode version 3
   [junit4]   2> 1185300 DEBUG (ScheduledTrigger-2265-thread-2) [    ] o.a.s.c.a.NodeLostTrigger Running NodeLostTrigger: .auto_add_replicas with currently live nodes: 2 and last live nodes: 2
   [junit4]   2> 1185312 DEBUG (Simulated OverseerAutoScalingTriggerThread) [    ] o.a.s.c.a.OverseerTriggerThread Processed trigger updates upto znodeVersion 3
   [junit4]   2> 1185312 INFO  (Simulated OverseerAutoScalingTriggerThread) [    ] o.a.s.c.a.s.TestSimTriggerIntegration TestTriggerAction init
   [junit4]   2> 1185312 DEBUG (Simulated OverseerAutoScalingTriggerThread) [    ] o.a.s.c.a.NodeLostTrigger NodeLostTrigger node_lost_trigger - Initial livenodes: [127.0.0.1:10012_solr, 127.0.0.1:10011_solr]
   [junit4]   2> 1185312 DEBUG (Simulated OverseerAutoScalingTriggerThread) [    ] o.a.s.c.a.OverseerTriggerThread -- cleaning old nodeLost / nodeAdded markers
   [junit4]   2> 1185312 DEBUG (Simulated OverseerAutoScalingTriggerThread) [    ] o.a.s.c.a.OverseerTriggerThread Current znodeVersion 3, lastZnodeVersion 3
   [junit4]   2> 1185312 DEBUG (ScheduledTrigger-2265-thread-1) [    ] o.a.s.c.a.NodeLostTrigger Running NodeLostTrigger: node_lost_trigger with currently live nodes: 2 and last live nodes: 2
   [junit4]   2> 1185328 DEBUG (TEST-TestSimTriggerIntegration.testNodeLostTrigger-seed#[C3DD81FF93432DE3]) [    ] o.a.s.c.a.s.SimClusterStateProvider  -- created marker: /autoscaling/nodeLost/127.0.0.1:10011_solr
   [junit4]   2> 1185328 DEBUG (TEST-TestSimTriggerIntegration.testNodeLostTrigger-seed#[C3DD81FF93432DE3]) [    ] o.a.s.c.a.s.SimClusterStateProvider --- new Overseer leader: 127.0.0.1:10012_solr
   [junit4]   2> 1185328 DEBUG (ScheduledTrigger-2265-thread-1) [    ] o.a.s.c.a.NodeLostTrigger Running NodeLostTrigger: .auto_add_replicas with currently live nodes: 1 and last live nodes: 2
   [junit4]   2> 1185328 DEBUG (ScheduledTrigger-2265-thread-1) [    ] o.a.s.c.a.NodeLostTrigger Tracking lost node: 127.0.0.1:10011_solr
   [junit4]   2> 1185336 DEBUG (ScheduledTrigger-2265-thread-2) [    ] o.a.s.c.a.NodeLostTrigger Running NodeLostTrigger: node_lost_trigger with currently live nodes: 1 and last live nodes: 2
   [junit4]   2> 1185336 DEBUG (ScheduledTrigger-2265-thread-2) [    ] o.a.s.c.a.NodeLostTrigger Tracking lost node: 127.0.0.1:10011_solr
   [junit4]   2> 1185349 DEBUG (ScheduledTrigger-2265-thread-1) [    ] o.a.s.c.a.NodeLostTrigger Running NodeLostTrigger: .auto_add_replicas with currently live nodes: 1 and last live nodes: 1
   [junit4]   2> 1185364 DEBUG (ScheduledTrigger-2265-thread-1) [    ] o.a.s.c.a.NodeLostTrigger Running NodeLostTrigger: node_lost_trigger with currently live nodes: 1 and last live nodes: 1
   [junit4]   2> 1185385 DEBUG (ScheduledTrigger-2265-thread-1) [    ] o.a.s.c.a.NodeLostTrigger Running NodeLostTrigger: .auto_add_replicas with currently live nodes: 1 and last live nodes: 1
   [junit4]   2> 1185385 DEBUG (ScheduledTrigger-2265-thread-1) [    ] o.a.s.c.a.NodeLostTrigger Running NodeLostTrigger: node_lost_trigger with currently live nodes: 1 and last live nodes: 1
   [junit4]   2> 1185421 DEBUG (ScheduledTrigger-2265-thread-1) [    ] o.a.s.c.a.NodeLostTrigger Running NodeLostTrigger: .auto_add_replicas with currently live nodes: 1 and last live nodes: 1
   [junit4]   2> 1185421 DEBUG (ScheduledTrigger-2265-thread-1) [    ] o.a.s.c.a.NodeLostTrigger Running NodeLostTrigger: node_lost_trigger with currently live nodes: 1 and last live nodes: 1
   [junit4]   2> 1185421 DEBUG (ScheduledTrigger-2265-thread-1) [    ] o.a.s.c.a.NodeLostTrigger NodeLostTrigger firing registered processor for lost nodes: [127.0.0.1:10011_solr]
   [junit4]   2> 1185421 DEBUG (ScheduledTrigger-2265-thread-1) [    ] o.a.s.c.a.ScheduledTriggers ++++++++ Cooldown inactive - processing event: {
   [junit4]   2>   "id":"68b8d22fab25a4Tk7zsiemv4plci8guohwn90c9",
   [junit4]   2>   "source":"node_lost_trigger",
   [junit4]   2>   "eventTime":29476610460296612,
   [junit4]   2>   "eventType":"NODELOST",
   [junit4]   2>   "properties":{
   [junit4]   2>     "eventTimes":[29476610460296612],
   [junit4]   2>     "preferredOperation":"movereplica",
   [junit4]   2>     "nodeNames":["127.0.0.1:10011_solr"]}}
   [junit4]   2> 1185422 DEBUG (ScheduledTrigger-2265-thread-1) [    ] o.a.s.c.a.ScheduledTriggers Pausing all triggers: [.auto_add_replicas, node_lost_trigger]
   [junit4]   2> 1185422 DEBUG (ScheduledTrigger-2265-thread-1) [    ] o.a.s.c.a.SystemLogListener Collection .system missing, skip sending event {
   [junit4]   2>   "id":"68b8d22fab25a4Tk7zsiemv4plci8guohwn90c9",
   [junit4]   2>   "source":"node_lost_trigger",
   [junit4]   2>   "eventTime":29476610460296612,
   [junit4]   2>   "eventType":"NODELOST",
   [junit4]   2>   "properties":{
   [junit4]   2>     "eventTimes":[29476610460296612],
   [junit4]   2>     "preferredOperation":"movereplica",
   [junit4]   2>     "_enqueue_time_":29476614743352562,
   [junit4]   2>     "nodeNames":["127.0.0.1:10011_solr"]}}
   [junit4]   2> 1185422 DEBUG (AutoscalingActionExecutor-2266-thread-1) [    ] o.a.s.c.a.ScheduledTriggers -- processing actions for {
   [junit4]   2>   "id":"68b8d22fab25a4Tk7zsiemv4plci8guohwn90c9",
   [junit4]   2>   "source":"node_lost_trigger",
   [junit4]   2>   "eventTime":29476610460296612,
   [junit4]   2>   "eventType":"NODELOST",
   [junit4]   2>   "properties":{
   [junit4]   2>     "eventTimes":[29476610460296612],
   [junit4]   2>     "preferredOperation":"movereplica",
   [junit4]   2>     "_enqueue_time_":29476614743352562,
   [junit4]   2>     "nodeNames":["127.0.0.1:10011_solr"]}}
   [junit4]   2> 1185423 DEBUG (AutoscalingActionExecutor-2266-thread-1) [    ] o.a.s.c.a.SystemLogListener Collection .system missing, skip sending event {
   [junit4]   2>   "id":"68b8d22fab25a4Tk7zsiemv4plci8guohwn90c9",
   [junit4]   2>   "source":"node_lost_trigger",
   [junit4]   2>   "eventTime":29476610460296612,
   [junit4]   2>   "eventType":"NODELOST",
   [junit4]   2>   "properties":{
   [junit4]   2>     "eventTimes":[29476610460296612],
   [junit4]   2>     "preferredOperation":"movereplica",
   [junit4]   2>     "_enqueue_time_":29476614743352562,
   [junit4]   2>     "nodeNames":["127.0.0.1:10011_solr"]}}
   [junit4]   2> 1185423 DEBUG (AutoscalingActionExecutor-2266-thread-1) [    ] o.a.s.c.a.ScheduledTriggers Resuming trigger: node_lost_trigger after 100ms
   [junit4]   2> 1185423 DEBUG (AutoscalingActionExecutor-2266-thread-1) [    ] o.a.s.c.a.ScheduledTriggers Resuming trigger: .auto_add_replicas after 100ms
   [junit4]   2> 1185423 DEBUG (AutoscalingActionExecutor-2266-thread-1) [    ] o.a.s.c.a.ScheduledTriggers -- processing took 28 ms for event id=68b8d22fab25a4Tk7zsiemv4plci8guohwn90c9
   [junit4]   2> 1185424 DEBUG (simCloudManagerPool-2264-thread-4) [    ] o.a.s.c.a.AutoScalingHandler Verified autoscaling configuration
   [junit4]   2> 1185424 DEBUG (simCloudManagerPool-2264-thread-4) [    ] o.a.s.c.a.OverseerTriggerThread Refreshing /autoscaling.json with znode version 4
   [junit4]   2> 1185424 DEBUG (Simulated OverseerAutoScalingTriggerThread) [    ] o.a.s.c.a.OverseerTriggerThread Processed trigger updates upto znodeVersion 4
   [junit4]   2> 1185424 DEBUG (Simulated OverseerAutoScalingTriggerThread) [    ] o.a.s.c.a.OverseerTriggerThread -- cleaning old nodeLost / nodeAdded markers
   [junit4]   2> 1185424 DEBUG (Simulated OverseerAutoScalingTriggerThread) [    ] o.a.s.c.a.OverseerTriggerThread Current znodeVersion 4, lastZnodeVersion 4
   [junit4]   2> 1185502 DEBUG (TEST-TestSimTriggerIntegration.testNodeLostTrigger-seed#[C3DD81FF93432DE3]) [    ] o.a.s.c.a.ScheduledTriggers Shutting down scheduled thread pool executor now
   [junit4]   2> 1185502 DEBUG (TEST-TestSimTriggerIntegration.testNodeLostTrigger-seed#[C3DD81FF93432DE3]) [    ] o.a.s.c.a.ScheduledTriggers Shutting down action executor now
   [junit4]   2> 1185502 DEBUG (TEST-TestSimTriggerIntegration.testNodeLostTrigger-seed#[C3DD81FF93432DE3]) [    ] o.a.s.c.a.ScheduledTriggers Awaiting termination for action executor
   [junit4]   2> 1185503 INFO  (Simulated OverseerAutoScalingTriggerThread) [    ] o.a.s.c.a.OverseerTriggerThread OverseerTriggerThread woken up but we are closed, exiting.
   [junit4]   2> 1185505 DEBUG (TEST-TestSimTriggerIntegration.testNodeLostTrigger-seed#[C3DD81FF93432DE3]) [    ] o.a.s.c.a.ScheduledTriggers Awaiting termination for scheduled thread pool executor
   [junit4]   2> 1185505 DEBUG (TEST-TestSimTriggerIntegration.testNodeLostTrigger-seed#[C3DD81FF93432DE3]) [    ] o.a.s.c.a.ScheduledTriggers ScheduledTriggers closed completely
   [junit4]   2> 1185505 DEBUG (TEST-TestSimTriggerIntegration.testNodeLostTrigger-seed#[C3DD81FF93432DE3]) [    ] o.a.s.c.a.OverseerTriggerThread OverseerTriggerThread has been closed explicitly
   [junit4]   2> 1185506 INFO  (TEST-TestSimTriggerIntegration.testNodeLostTrigger-seed#[C3DD81FF93432DE3]) [    ] o.a.s.SolrTestCaseJ4 ###Ending testNodeLostTrigger
   [junit4]   2> 1185541 INFO  (TEST-TestSimTriggerIntegration.testNodeAddedTriggerRestoreState-seed#[C3DD81FF93432DE3]) [    ] o.a.s.SolrTestCaseJ4 ###Starting testNodeAddedTriggerRestoreState
   [junit4]   2> 1185632 DEBUG (TEST-TestSimTriggerIntegration.testNodeAddedTriggerRestoreState-seed#[C3DD81FF93432DE3]) [    ] o.a.s.c.a.s.SimClusterStateProvider --- new Overseer leader: 127.0.0.1:10013_solr
   [junit4]   2> 1185632 DEBUG (Simulated OverseerAutoScalingTriggerThread) [    ] o.a.s.c.a.OverseerTriggerThread Adding .auto_add_replicas and .scheduled_maintenance triggers
   [junit4]   2> 1185633 DEBUG (Simulated OverseerAutoScalingTriggerThread) [    ] o.a.s.c.a.OverseerTriggerThread Refreshing /autoscaling.json with znode version 1
   [junit4]   2> 1185633 DEBUG (Simulated OverseerAutoScalingTriggerThread) [    ] o.a.s.c.a.OverseerTriggerThread Current znodeVersion 1, lastZnodeVersion 0
   [junit4]   2> 1185633 DEBUG (Simulated OverseerAutoScalingTriggerThread) [    ] o.a.s.c.a.OverseerTriggerThread Processed trigger updates upto znodeVersion 1
   [junit4]   2> 1185648 DEBUG (Simulated OverseerAutoScalingTriggerThread) [    ] o.a.s.c.a.NodeLostTrigger NodeLostTrigger .auto_add_replicas - Initial livenodes: [127.0.0.1:10013_solr]
   [junit4]   2> 1185668 DEBUG (TEST-TestSimTriggerIntegration.testNodeAddedTriggerRestoreState-seed#[C3DD81FF93432DE3]) [    ] o.a.s.c.a.s.SimClusterStateProvider ** creating new collection states, currentVersion=0
   [junit4]   2> 1185668 DEBUG (TEST-TestSimTriggerIntegration.testNodeAddedTriggerRestoreState-seed#[C3DD81FF93432DE3]) [    ] o.a.s.c.a.s.SimClusterStateProvider ** saved cluster state version 0
   [junit4]   2> 1185668 INFO  (TEST-TestSimTriggerIntegration.testNodeAddedTriggerRestoreState-seed#[C3DD81FF93432DE3]) [    ] o.a.s.h.a.MetricsHistoryHandler No .system collection, keeping metrics history in memory.
   [junit4]   2> 1185686 DEBUG (ScheduledTrigger-2271-thread-1) [    ] o.a.s.c.a.NodeLostTrigger Running NodeLostTrigger: .auto_add_replicas with currently live nodes: 2 and last live nodes: 1
   [junit4]   2> 1185686 DEBUG (Simulated OverseerAutoScalingTriggerThread) [    ] o.a.s.c.a.OverseerTriggerThread -- cleaning old nodeLost / nodeAdded markers
   [junit4]   2> 1185686 DEBUG (Simulated OverseerAutoScalingTriggerThread) [    ] o.a.s.c.a.OverseerTriggerThread Current znodeVersion 1, lastZnodeVersion 1
   [junit4]   2> 1185717 DEBUG (ScheduledTrigger-2271-thread-1) [    ] o.a.s.c.a.NodeLostTrigger Running NodeLostTrigger: .auto_add_replicas with currently live nodes: 2 and last live nodes: 2
   [junit4]   2> 1185814 DEBUG (ScheduledTrigger-2271-thread-1) [    ] o.a.s.c.a.NodeLostTrigger Running NodeLostTrigger: .auto_add_replicas with currently live nodes: 2 and last live nodes: 2
   [junit4]   2> 1185831 DEBUG (simCloudManagerPool-2270-thread-2) [    ] o.a.s.c.a.AutoScalingHandler Verified autoscaling configuration
   [junit4]   2> 1185831 DEBUG (simCloudManagerPool-2270-thread-2) [    ] o.a.s.c.a.OverseerTriggerThread Refreshing /autoscaling.json with znode version 2
   [junit4]   2> 1185896 DEBUG (Simulated OverseerAutoScalingTriggerThread) [    ] o.a.s.c.a.OverseerTriggerThread Processed trigger updates upto znodeVersion 2
   [junit4]   2> 1185896 DEBUG (Simulated OverseerAutoScalingTriggerThread) [    ] o.a.s.c.a.OverseerTriggerThread -- cleaning old nodeLost / nodeAdded markers
   [junit4]   2> 1185896 DEBUG (Simulated OverseerAutoScalingTriggerThread) [    ] o.a.s.c.a.OverseerTriggerThread Current znodeVersion 2, lastZnodeVersion 2
   [junit4]   2> 1185896 DEBUG (ScheduledTrigger-2271-thread-1) [    ] o.a.s.c.a.NodeLostTrigger Running NodeLostTrigger: .auto_add_replicas with currently live nodes: 2 and last live nodes: 2
   [junit4]   2> 1185916 DEBUG (simCloudManagerPool-2270-thread-3) [    ] o.a.s.c.a.AutoScalingHandler Verified autoscaling configuration
   [junit4]   2> 1185916 DEBUG (simCloudManagerPool-2270-thread-3) [    ] o.a.s.c.a.OverseerTriggerThread Refreshing /autoscaling.json with znode version 3
   [junit4]   2> 1185917 DEBUG (ScheduledTrigger-2271-thread-1) [    ] o.a.s.c.a.NodeLostTrigger Running NodeLostTrigger: .auto_add_replicas with currently live nodes: 2 and last live nodes: 2
   [junit4]   2> 1185931 DEBUG (Simulated OverseerAutoScalingTriggerThread) [    ] o.a.s.c.a.OverseerTriggerThread Processed trigger updates upto znodeVersion 3
   [junit4]   2> 1185932 INFO  (Simulated OverseerAutoScalingTriggerThread) [    ] o.a.s.c.a.s.TestSimTriggerIntegration TestTriggerAction init
   [junit4]   2> 1185932 DEBUG (Simulated OverseerAutoScalingTriggerThread) [    ] o.a.s.c.a.NodeAddedTrigger NodeAddedTrigger node_added_restore_trigger - Initial livenodes: [127.0.0.1:10013_solr, 127.0.0.1:10014_solr]
   [junit4]   2> 1185932 DEBUG (Simulated OverseerAutoScalingTriggerThread) [    ] o.a.s.c.a.NodeAddedTrigger NodeAddedTrigger node_added_restore_trigger instantiated with properties: {event=nodeAdded, waitFor=500000, actions=[{name=test, class=org.apache.solr.cloud.autoscaling.sim.TestSimTriggerIntegration$TestTriggerAction}], enabled=true}
   [junit4]   2> 1185932 DEBUG (Simulated OverseerAutoScalingTriggerThread) [    ] o.a.s.c.a.OverseerTriggerThread -- cleaning old nodeLost / nodeAdded markers
   [junit4]   2> 1185932 DEBUG (Simulated OverseerAutoScalingTriggerThread) [    ] o.a.s.c.a.OverseerTriggerThread Current znodeVersion 3, lastZnodeVersion 3
   [junit4]   2> 1185932 DEBUG (ScheduledTrigger-2271-thread-3) [    ] o.a.s.c.a.NodeAddedTrigger Running NodeAddedTrigger node_added_restore_trigger
   [junit4]   2> 1185932 DEBUG (ScheduledTrigger-2271-thread-3) [    ] o.a.s.c.a.NodeAddedTrigger Found livenodes: 2
   [junit4]   2> 1185936 DEBUG (TEST-TestSimTriggerIntegration.testNodeAddedTriggerRestoreState-seed#[C3DD81FF93432DE3]) [    ] o.a.s.c.a.s.SimClusterStateProvider -- creating marker: /autoscaling/nodeAdded/127.0.0.1:10015_solr
   [junit4]   2> 1185937 DEBUG (ScheduledTrigger-2271-thread-1) [    ] o.a.s.c.a.NodeLostTrigger Running NodeLostTrigger: .auto_add_replicas with currently live nodes: 3 and last live nodes: 2
   [junit4]   2> 1186013 DEBUG (ScheduledTrigger-2271-thread-3) [    ] o.a.s.c.a.NodeAddedTrigger Running NodeAddedTrigger node_added_restore_trigger
   [junit4]   2> 1186013 DEBUG (ScheduledTrigger-2271-thread-3) [    ] o.a.s.c.a.NodeAddedTrigger Found livenodes: 3
   [junit4]   2> 1186013 DEBUG (ScheduledTrigger-2271-thread-3) [    ] o.a.s.c.a.NodeAddedTrigger Tracking new node: 127.0.0.1:10015_solr at time 29476644281499412
   [junit4]   2> 1186114 DEBUG (ScheduledTrigger-2271-thread-3) [    ] o.a.s.c.a.NodeLostTrigger Running NodeLostTrigger: .auto_add_replicas with currently live nodes: 3 and last live nodes: 3
   [junit4]   2> 1186114 DEBUG (ScheduledTri

[...truncated too long message...]

ScalingTriggerThread) [    ] o.a.s.c.a.OverseerTriggerThread OverseerTriggerThread woken up but we are closed, exiting.
   [junit4]   2> 1190229 DEBUG (TEST-TestSimTriggerIntegration.testCooldown-seed#[C3DD81FF93432DE3]) [    ] o.a.s.c.a.ScheduledTriggers Shutting down scheduled thread pool executor now
   [junit4]   2> 1190230 DEBUG (TEST-TestSimTriggerIntegration.testCooldown-seed#[C3DD81FF93432DE3]) [    ] o.a.s.c.a.ScheduledTriggers Shutting down action executor now
   [junit4]   2> 1190230 DEBUG (TEST-TestSimTriggerIntegration.testCooldown-seed#[C3DD81FF93432DE3]) [    ] o.a.s.c.a.ScheduledTriggers Awaiting termination for action executor
   [junit4]   2> 1190230 DEBUG (TEST-TestSimTriggerIntegration.testCooldown-seed#[C3DD81FF93432DE3]) [    ] o.a.s.c.a.ScheduledTriggers Awaiting termination for scheduled thread pool executor
   [junit4]   2> 1190230 DEBUG (TEST-TestSimTriggerIntegration.testCooldown-seed#[C3DD81FF93432DE3]) [    ] o.a.s.c.a.ScheduledTriggers ScheduledTriggers closed completely
   [junit4]   2> 1190230 DEBUG (TEST-TestSimTriggerIntegration.testCooldown-seed#[C3DD81FF93432DE3]) [    ] o.a.s.c.a.OverseerTriggerThread OverseerTriggerThread has been closed explicitly
   [junit4]   2> 1190230 INFO  (TEST-TestSimTriggerIntegration.testCooldown-seed#[C3DD81FF93432DE3]) [    ] o.a.s.SolrTestCaseJ4 ###Ending testCooldown
   [junit4]   2> NOTE: leaving temporary files on disk at: /home/jenkins/jenkins-slave/workspace/Lucene-Solr-Tests-master/solr/build/solr-core/test/J2/temp/solr.cloud.autoscaling.sim.TestSimTriggerIntegration_C3DD81FF93432DE3-001
   [junit4]   2> NOTE: test params are: codec=Asserting(Lucene80): {}, docValues:{}, maxPointsInLeafNode=1721, maxMBSortInHeap=7.5272786097052435, sim=Asserting(org.apache.lucene.search.similarities.AssertingSimilarity@7f486285), locale=vi-VN, timezone=SystemV/AST4ADT
   [junit4]   2> NOTE: Linux 4.4.0-112-generic amd64/Oracle Corporation 1.8.0_191 (64-bit)/cpus=4,threads=1,free=114889008,total=515899392
   [junit4]   2> NOTE: All tests run in this JVM: [ZookeeperStatusHandlerTest, ClusterStateTest, ChaosMonkeyNothingIsSafeWithPullReplicasTest, TestCollectionAPIs, TestRestoreCore, SoftAutoCommitTest, HdfsRecoverLeaseTest, TestNumericRangeQuery32, TestCloudInspectUtil, DOMUtilTest, TestJsonFacets, TestConfigReload, UniqFieldsUpdateProcessorFactoryTest, TestLeaderElectionWithEmptyReplica, TaggingAttributeTest, TestPushWriter, TestClusterStateMutator, TestRTimerTree, SpellingQueryConverterTest, IgnoreLargeDocumentProcessorFactoryTest, MigrateRouteKeyTest, HdfsAutoAddReplicasIntegrationTest, RecoveryZkTest, SolrIndexMetricsTest, BlockCacheTest, TestReload, AssignBackwardCompatibilityTest, TestCloudSearcherWarming, TestSimTriggerIntegration]
   [junit4] Completed [163/837 (1!)] on J2 in 7.91s, 11 tests, 1 error <<< FAILURES!

[...truncated 48184 lines...]
-ecj-javadoc-lint-src:
    [mkdir] Created dir: /tmp/ecj1304171580
 [ecj-lint] Compiling 1241 source files to /tmp/ecj1304171580
 [ecj-lint] Processing annotations
 [ecj-lint] Annotations processed
 [ecj-lint] Processing annotations
 [ecj-lint] No elements to process
 [ecj-lint] invalid Class-Path header in manifest of jar file: /home/jenkins/.ivy2/cache/org.restlet.jee/org.restlet/jars/org.restlet-2.3.0.jar
 [ecj-lint] invalid Class-Path header in manifest of jar file: /home/jenkins/.ivy2/cache/org.restlet.jee/org.restlet.ext.servlet/jars/org.restlet.ext.servlet-2.3.0.jar
 [ecj-lint] ----------
 [ecj-lint] 1. WARNING in /home/jenkins/jenkins-slave/workspace/Lucene-Solr-Tests-master/solr/core/src/java/org/apache/solr/client/solrj/embedded/EmbeddedSolrServer.java (at line 219)
 [ecj-lint] 	return (NamedList<Object>) new JavaBinCodec(resolver).unmarshal(in);
 [ecj-lint] 	                           ^^^^^^^^^^^^^^^^^^^^^^^^^^
 [ecj-lint] Resource leak: '<unassigned Closeable value>' is never closed
 [ecj-lint] ----------
 [ecj-lint] ----------
 [ecj-lint] 2. WARNING in /home/jenkins/jenkins-slave/workspace/Lucene-Solr-Tests-master/solr/core/src/java/org/apache/solr/cloud/api/collections/RestoreCmd.java (at line 257)
 [ecj-lint] 	throw new SolrException(ErrorCode.BAD_REQUEST, "Unexpected number of replicas, replicationFactor, " +
 [ecj-lint]               Replica.Type.NRT + " or " + Replica.Type.TLOG + " must be greater than 0");
 [ecj-lint] 	^^^^^^^^^^^^^^^^^^^^^^^^^^^^^^^^^^^^^^^^^^^^^^^^^^^^^^^^^^^^^^^^^^^^^^^^^^^^^^^^^^^^^^^^^^^^^^^^^^^^^^^^^^^^^^^^^^^^^^^^^^^^^^^^^^^^^^^^^^^^^^^^^^^^^^^^^^^^^^^^^^^^^^^^^^^^^^^^^^^^^^^^^^^^^^^
 [ecj-lint] Resource leak: 'repository' is not closed at this location
 [ecj-lint] ----------
 [ecj-lint] ----------
 [ecj-lint] 3. WARNING in /home/jenkins/jenkins-slave/workspace/Lucene-Solr-Tests-master/solr/core/src/java/org/apache/solr/handler/loader/JavabinLoader.java (at line 137)
 [ecj-lint] 	new JavaBinCodec() {
 [ecj-lint]       SolrParams params;
 [ecj-lint]       AddUpdateCommand addCmd = null;
 [ecj-lint] 
 [ecj-lint]       @Override
 [ecj-lint]       public List<Object> readIterator(DataInputInputStream fis) throws IOException {
 [ecj-lint]         while (true) {
 [ecj-lint]           Object o = readVal(fis);
 [ecj-lint]           if (o == END_OBJ) break;
 [ecj-lint]           if (o instanceof NamedList) {
 [ecj-lint]             params = ((NamedList) o).toSolrParams();
 [ecj-lint]           } else {
 [ecj-lint]             try {
 [ecj-lint]               if (o instanceof byte[]) {
 [ecj-lint]                 if (params != null) req.setParams(params);
 [ecj-lint]                 byte[] buf = (byte[]) o;
 [ecj-lint]                 contentStreamLoader.load(req, rsp, new ContentStreamBase.ByteArrayStream(buf, null), processor);
 [ecj-lint]               } else {
 [ecj-lint]                 throw new RuntimeException("unsupported type ");
 [ecj-lint]               }
 [ecj-lint]             } catch (Exception e) {
 [ecj-lint]               throw new RuntimeException(e);
 [ecj-lint]             } finally {
 [ecj-lint]               params = null;
 [ecj-lint]               req.setParams(old);
 [ecj-lint]             }
 [ecj-lint]           }
 [ecj-lint]         }
 [ecj-lint]         return Collections.emptyList();
 [ecj-lint]       }
 [ecj-lint] 
 [ecj-lint]     }.unmarshal(in);
 [ecj-lint] 	^^^^^^^^^^^^^^^^^^^^^^^^^^^^^^^^^^^^^^^^^^^^^^^^^^^^^^^^^^^^^^^^^^^^^^^^^^^^^^^^^^^^^^^^^^^^^^^^^^^^^^^^^^^^^^^^^^^^^^^^^^^^^^^^^^^^^^^^^^^^^^^^^^^^^^^^^^^^^^^^^^^^^^^^^^^^^^^^^^^^^^^^^^^^^^^^^^^^^^^^^^^^^^^^^^^^^^^^^^^^^^^^^^^^^^^^^^^^^^^^^^^^^^^^^^^^^^^^^^^^^^^^^^^^^^^^^^^^^^^^^^^^^^^^^^^^^^^^^^^^^^^^^^^^^^^^^^^^^^^^^^^^^^^^^^^^^^^^^^^^^^^^^^^^^^^^^^^^^^^^^^^^^^^^^^^^^^^^^^^^^^^^^^^^^^^^^^^^^^^^^^^^^^^^^^^^^^^^^^^^^^^^^^^^^^^^^^^^^^^^^^^^^^^^^^^^^^^^^^^^^^^^^^^^^^^^^^^^^^^^^^^^^^^^^^^^^^^^^^^^^^^^^^^^^^^^^^^^^^^^^^^^^^^^^^^^^^^^^^^^^^^^^^^^^^^^^^^^^^^^^^^^^^^^^^^^^^^^^^^^^^^^^^^^^^^^^^^^^^^^^^^^^^^^^^^^^^^^^^^^^^^^^^^^^^^^^^^^^^^^^^^^^^^^^^^^^^^^^^^^^^^^^^^^^^^^^^^^^^^^^^^^^^^^^^^^^^^^^^^^^^^^^^^^^^^^^^^^^^^^^^^^^^^^^^^^^^^^^^^^^^^^^^^^^^^^^^^^^^^^^^^^^^^^^^^^^^^^^^^^^^^^^^^^^^^^^^^^^^^^^^^^^^^^^^^^^^^^^^^^^^^^^^^^^^^^^^^^^^^^^^^^^^^^^^^^^^^^^^^^^^^^^^^^^^^^^^^^^^^^^^^^^^^^^^^^^^^^^^^^^^^^^^^^^^^^^^^^^^^^^^^^^^^^^^^^^^^^^^^^^^^^^^^^^^^^^^^^^^^^^^^^^^^^^^^^^^^^^^^^^^^^^^^^^^^^^^^^^^^^^^^^^^^^^^^^^^^^^^^^^^^^^^
 [ecj-lint] Resource leak: '<unassigned Closeable value>' is never closed
 [ecj-lint] ----------
 [ecj-lint] ----------
 [ecj-lint] 4. ERROR in /home/jenkins/jenkins-slave/workspace/Lucene-Solr-Tests-master/solr/core/src/java/org/apache/solr/update/DocumentBuilder.java (at line 32)
 [ecj-lint] 	import org.apache.solr.common.util.ByteArrayUtf8CharSequence;
 [ecj-lint] 	       ^^^^^^^^^^^^^^^^^^^^^^^^^^^^^^^^^^^^^^^^^^^^^^^^^^^^^
 [ecj-lint] The import org.apache.solr.common.util.ByteArrayUtf8CharSequence is never used
 [ecj-lint] ----------
 [ecj-lint] ----------
 [ecj-lint] 5. WARNING in /home/jenkins/jenkins-slave/workspace/Lucene-Solr-Tests-master/solr/core/src/java/org/apache/solr/update/UpdateLog.java (at line 1867)
 [ecj-lint] 	if (exceptionOnExecuteUpdate.get() != null) throw exceptionOnExecuteUpdate.get();
 [ecj-lint] 	                                            ^^^^^^^^^^^^^^^^^^^^^^^^^^^^^^^^^^^^^
 [ecj-lint] Resource leak: 'proc' is not closed at this location
 [ecj-lint] ----------
 [ecj-lint] ----------
 [ecj-lint] 6. WARNING in /home/jenkins/jenkins-slave/workspace/Lucene-Solr-Tests-master/solr/core/src/java/org/apache/solr/util/FileUtils.java (at line 50)
 [ecj-lint] 	in = new FileInputStream(src).getChannel();
 [ecj-lint] 	     ^^^^^^^^^^^^^^^^^^^^^^^^
 [ecj-lint] Resource leak: '<unassigned Closeable value>' is never closed
 [ecj-lint] ----------
 [ecj-lint] 7. WARNING in /home/jenkins/jenkins-slave/workspace/Lucene-Solr-Tests-master/solr/core/src/java/org/apache/solr/util/FileUtils.java (at line 51)
 [ecj-lint] 	out = new FileOutputStream(destination).getChannel();
 [ecj-lint] 	      ^^^^^^^^^^^^^^^^^^^^^^^^^^^^^^^^^
 [ecj-lint] Resource leak: '<unassigned Closeable value>' is never closed
 [ecj-lint] ----------
 [ecj-lint] 7 problems (1 error, 6 warnings)

BUILD FAILED
/home/jenkins/jenkins-slave/workspace/Lucene-Solr-Tests-master/build.xml:633: The following error occurred while executing this line:
/home/jenkins/jenkins-slave/workspace/Lucene-Solr-Tests-master/build.xml:101: The following error occurred while executing this line:
/home/jenkins/jenkins-slave/workspace/Lucene-Solr-Tests-master/solr/build.xml:680: The following error occurred while executing this line:
/home/jenkins/jenkins-slave/workspace/Lucene-Solr-Tests-master/lucene/common-build.xml:2093: The following error occurred while executing this line:
/home/jenkins/jenkins-slave/workspace/Lucene-Solr-Tests-master/lucene/common-build.xml:2132: Compile failed; see the compiler error output for details.

Total time: 203 minutes 30 seconds
Build step 'Invoke Ant' marked build as failure
Archiving artifacts
Recording test results
Email was triggered for: Failure - Any
Sending email for trigger: Failure - Any

Mime
View raw message