lucene-dev mailing list archives

Site index · List index
Message view « Date » · « Thread »
Top « Date » · « Thread »
From Policeman Jenkins Server <jenk...@thetaphi.de>
Subject [JENKINS] Lucene-Solr-master-Linux (64bit/jdk-10.0.1) - Build # 23490 - Unstable!
Date Tue, 08 Jan 2019 17:46:17 GMT
Build: https://jenkins.thetaphi.de/job/Lucene-Solr-master-Linux/23490/
Java: 64bit/jdk-10.0.1 -XX:-UseCompressedOops -XX:+UseParallelGC

3 tests failed.
FAILED:  junit.framework.TestSuite.org.apache.solr.cloud.TestCloudSearcherWarming

Error Message:
5 threads leaked from SUITE scope at org.apache.solr.cloud.TestCloudSearcherWarming:     1) Thread[id=24114, name=ProcessThread(sid:0 cport:46829):, state=WAITING, group=TGRP-TestCloudSearcherWarming]         at java.base@10.0.1/jdk.internal.misc.Unsafe.park(Native Method)         at java.base@10.0.1/java.util.concurrent.locks.LockSupport.park(LockSupport.java:194)         at java.base@10.0.1/java.util.concurrent.locks.AbstractQueuedSynchronizer$ConditionObject.await(AbstractQueuedSynchronizer.java:2075)         at java.base@10.0.1/java.util.concurrent.LinkedBlockingQueue.take(LinkedBlockingQueue.java:435)         at app//org.apache.zookeeper.server.PrepRequestProcessor.run(PrepRequestProcessor.java:123)    2) Thread[id=24111, name=NIOServerCxn.Factory:0.0.0.0/0.0.0.0:0, state=RUNNABLE, group=TGRP-TestCloudSearcherWarming]         at java.base@10.0.1/sun.nio.ch.EPollArrayWrapper.epollWait(Native Method)         at java.base@10.0.1/sun.nio.ch.EPollArrayWrapper.poll(EPollArrayWrapper.java:265)         at java.base@10.0.1/sun.nio.ch.EPollSelectorImpl.doSelect(EPollSelectorImpl.java:92)         at java.base@10.0.1/sun.nio.ch.SelectorImpl.lockAndDoSelect(SelectorImpl.java:89)         at java.base@10.0.1/sun.nio.ch.SelectorImpl.select(SelectorImpl.java:100)         at app//org.apache.zookeeper.server.NIOServerCnxnFactory.run(NIOServerCnxnFactory.java:196)         at java.base@10.0.1/java.lang.Thread.run(Thread.java:844)    3) Thread[id=24112, name=SessionTracker, state=TIMED_WAITING, group=TGRP-TestCloudSearcherWarming]         at java.base@10.0.1/java.lang.Object.wait(Native Method)         at app//org.apache.zookeeper.server.SessionTrackerImpl.run(SessionTrackerImpl.java:147)    4) Thread[id=24113, name=SyncThread:0, state=WAITING, group=TGRP-TestCloudSearcherWarming]         at java.base@10.0.1/jdk.internal.misc.Unsafe.park(Native Method)         at java.base@10.0.1/java.util.concurrent.locks.LockSupport.park(LockSupport.java:194)         at java.base@10.0.1/java.util.concurrent.locks.AbstractQueuedSynchronizer$ConditionObject.await(AbstractQueuedSynchronizer.java:2075)         at java.base@10.0.1/java.util.concurrent.LinkedBlockingQueue.take(LinkedBlockingQueue.java:435)         at app//org.apache.zookeeper.server.SyncRequestProcessor.run(SyncRequestProcessor.java:127)    5) Thread[id=24110, name=ZkTestServer Run Thread, state=WAITING, group=TGRP-TestCloudSearcherWarming]         at java.base@10.0.1/java.lang.Object.wait(Native Method)         at java.base@10.0.1/java.lang.Thread.join(Thread.java:1353)         at java.base@10.0.1/java.lang.Thread.join(Thread.java:1427)         at app//org.apache.zookeeper.server.NIOServerCnxnFactory.join(NIOServerCnxnFactory.java:313)         at app//org.apache.solr.cloud.ZkTestServer$ZKServerMain.runFromConfig(ZkTestServer.java:343)         at app//org.apache.solr.cloud.ZkTestServer$2.run(ZkTestServer.java:564)

Stack Trace:
com.carrotsearch.randomizedtesting.ThreadLeakError: 5 threads leaked from SUITE scope at org.apache.solr.cloud.TestCloudSearcherWarming: 
   1) Thread[id=24114, name=ProcessThread(sid:0 cport:46829):, state=WAITING, group=TGRP-TestCloudSearcherWarming]
        at java.base@10.0.1/jdk.internal.misc.Unsafe.park(Native Method)
        at java.base@10.0.1/java.util.concurrent.locks.LockSupport.park(LockSupport.java:194)
        at java.base@10.0.1/java.util.concurrent.locks.AbstractQueuedSynchronizer$ConditionObject.await(AbstractQueuedSynchronizer.java:2075)
        at java.base@10.0.1/java.util.concurrent.LinkedBlockingQueue.take(LinkedBlockingQueue.java:435)
        at app//org.apache.zookeeper.server.PrepRequestProcessor.run(PrepRequestProcessor.java:123)
   2) Thread[id=24111, name=NIOServerCxn.Factory:0.0.0.0/0.0.0.0:0, state=RUNNABLE, group=TGRP-TestCloudSearcherWarming]
        at java.base@10.0.1/sun.nio.ch.EPollArrayWrapper.epollWait(Native Method)
        at java.base@10.0.1/sun.nio.ch.EPollArrayWrapper.poll(EPollArrayWrapper.java:265)
        at java.base@10.0.1/sun.nio.ch.EPollSelectorImpl.doSelect(EPollSelectorImpl.java:92)
        at java.base@10.0.1/sun.nio.ch.SelectorImpl.lockAndDoSelect(SelectorImpl.java:89)
        at java.base@10.0.1/sun.nio.ch.SelectorImpl.select(SelectorImpl.java:100)
        at app//org.apache.zookeeper.server.NIOServerCnxnFactory.run(NIOServerCnxnFactory.java:196)
        at java.base@10.0.1/java.lang.Thread.run(Thread.java:844)
   3) Thread[id=24112, name=SessionTracker, state=TIMED_WAITING, group=TGRP-TestCloudSearcherWarming]
        at java.base@10.0.1/java.lang.Object.wait(Native Method)
        at app//org.apache.zookeeper.server.SessionTrackerImpl.run(SessionTrackerImpl.java:147)
   4) Thread[id=24113, name=SyncThread:0, state=WAITING, group=TGRP-TestCloudSearcherWarming]
        at java.base@10.0.1/jdk.internal.misc.Unsafe.park(Native Method)
        at java.base@10.0.1/java.util.concurrent.locks.LockSupport.park(LockSupport.java:194)
        at java.base@10.0.1/java.util.concurrent.locks.AbstractQueuedSynchronizer$ConditionObject.await(AbstractQueuedSynchronizer.java:2075)
        at java.base@10.0.1/java.util.concurrent.LinkedBlockingQueue.take(LinkedBlockingQueue.java:435)
        at app//org.apache.zookeeper.server.SyncRequestProcessor.run(SyncRequestProcessor.java:127)
   5) Thread[id=24110, name=ZkTestServer Run Thread, state=WAITING, group=TGRP-TestCloudSearcherWarming]
        at java.base@10.0.1/java.lang.Object.wait(Native Method)
        at java.base@10.0.1/java.lang.Thread.join(Thread.java:1353)
        at java.base@10.0.1/java.lang.Thread.join(Thread.java:1427)
        at app//org.apache.zookeeper.server.NIOServerCnxnFactory.join(NIOServerCnxnFactory.java:313)
        at app//org.apache.solr.cloud.ZkTestServer$ZKServerMain.runFromConfig(ZkTestServer.java:343)
        at app//org.apache.solr.cloud.ZkTestServer$2.run(ZkTestServer.java:564)
	at __randomizedtesting.SeedInfo.seed([7D7602E4034B9072]:0)


FAILED:  junit.framework.TestSuite.org.apache.solr.cloud.TestCloudSearcherWarming

Error Message:
There are still zombie threads that couldn't be terminated:    1) Thread[id=24111, name=NIOServerCxn.Factory:0.0.0.0/0.0.0.0:0, state=RUNNABLE, group=TGRP-TestCloudSearcherWarming]         at java.base@10.0.1/sun.nio.ch.EPollArrayWrapper.interrupt(Native Method)         at java.base@10.0.1/sun.nio.ch.EPollArrayWrapper.interrupt(EPollArrayWrapper.java:313)         at java.base@10.0.1/sun.nio.ch.EPollSelectorImpl.wakeup(EPollSelectorImpl.java:206)         at java.base@10.0.1/java.nio.channels.spi.AbstractSelector$1.interrupt(AbstractSelector.java:213)         at java.base@10.0.1/java.nio.channels.spi.AbstractSelector.begin(AbstractSelector.java:219)         at java.base@10.0.1/sun.nio.ch.EPollSelectorImpl.doSelect(EPollSelectorImpl.java:91)         at java.base@10.0.1/sun.nio.ch.SelectorImpl.lockAndDoSelect(SelectorImpl.java:89)         at java.base@10.0.1/sun.nio.ch.SelectorImpl.select(SelectorImpl.java:100)         at app//org.apache.zookeeper.server.NIOServerCnxnFactory.run(NIOServerCnxnFactory.java:196)         at java.base@10.0.1/java.lang.Thread.run(Thread.java:844)

Stack Trace:
com.carrotsearch.randomizedtesting.ThreadLeakError: There are still zombie threads that couldn't be terminated:
   1) Thread[id=24111, name=NIOServerCxn.Factory:0.0.0.0/0.0.0.0:0, state=RUNNABLE, group=TGRP-TestCloudSearcherWarming]
        at java.base@10.0.1/sun.nio.ch.EPollArrayWrapper.interrupt(Native Method)
        at java.base@10.0.1/sun.nio.ch.EPollArrayWrapper.interrupt(EPollArrayWrapper.java:313)
        at java.base@10.0.1/sun.nio.ch.EPollSelectorImpl.wakeup(EPollSelectorImpl.java:206)
        at java.base@10.0.1/java.nio.channels.spi.AbstractSelector$1.interrupt(AbstractSelector.java:213)
        at java.base@10.0.1/java.nio.channels.spi.AbstractSelector.begin(AbstractSelector.java:219)
        at java.base@10.0.1/sun.nio.ch.EPollSelectorImpl.doSelect(EPollSelectorImpl.java:91)
        at java.base@10.0.1/sun.nio.ch.SelectorImpl.lockAndDoSelect(SelectorImpl.java:89)
        at java.base@10.0.1/sun.nio.ch.SelectorImpl.select(SelectorImpl.java:100)
        at app//org.apache.zookeeper.server.NIOServerCnxnFactory.run(NIOServerCnxnFactory.java:196)
        at java.base@10.0.1/java.lang.Thread.run(Thread.java:844)
	at __randomizedtesting.SeedInfo.seed([7D7602E4034B9072]:0)


FAILED:  org.apache.solr.cloud.TestCloudSearcherWarming.testRepFactor1LeaderStartup

Error Message:
No live SolrServers available to handle this request

Stack Trace:
org.apache.solr.client.solrj.SolrServerException: No live SolrServers available to handle this request
	at org.apache.solr.client.solrj.impl.LBSolrClient.request(LBSolrClient.java:343)
	at org.apache.solr.client.solrj.impl.LBHttpSolrClient.request(LBHttpSolrClient.java:213)
	at org.apache.solr.client.solrj.impl.CloudSolrClient.sendRequest(CloudSolrClient.java:1110)
	at org.apache.solr.client.solrj.impl.CloudSolrClient.requestWithRetryOnStaleState(CloudSolrClient.java:884)
	at org.apache.solr.client.solrj.impl.CloudSolrClient.request(CloudSolrClient.java:817)
	at org.apache.solr.client.solrj.SolrRequest.process(SolrRequest.java:207)
	at org.apache.solr.client.solrj.SolrRequest.process(SolrRequest.java:224)
	at org.apache.solr.cloud.MiniSolrCloudCluster.deleteAllCollections(MiniSolrCloudCluster.java:514)
	at org.apache.solr.cloud.TestCloudSearcherWarming.tearDown(TestCloudSearcherWarming.java:78)
	at java.base/jdk.internal.reflect.NativeMethodAccessorImpl.invoke0(Native Method)
	at java.base/jdk.internal.reflect.NativeMethodAccessorImpl.invoke(NativeMethodAccessorImpl.java:62)
	at java.base/jdk.internal.reflect.DelegatingMethodAccessorImpl.invoke(DelegatingMethodAccessorImpl.java:43)
	at java.base/java.lang.reflect.Method.invoke(Method.java:564)
	at com.carrotsearch.randomizedtesting.RandomizedRunner.invoke(RandomizedRunner.java:1750)
	at com.carrotsearch.randomizedtesting.RandomizedRunner$10.evaluate(RandomizedRunner.java:996)
	at com.carrotsearch.randomizedtesting.rules.SystemPropertiesRestoreRule$1.evaluate(SystemPropertiesRestoreRule.java:57)
	at org.apache.lucene.util.TestRuleSetupTeardownChained$1.evaluate(TestRuleSetupTeardownChained.java:49)
	at org.apache.lucene.util.AbstractBeforeAfterRule$1.evaluate(AbstractBeforeAfterRule.java:45)
	at org.apache.lucene.util.TestRuleThreadAndTestName$1.evaluate(TestRuleThreadAndTestName.java:48)
	at org.apache.lucene.util.TestRuleIgnoreAfterMaxFailures$1.evaluate(TestRuleIgnoreAfterMaxFailures.java:64)
	at org.apache.lucene.util.TestRuleMarkFailure$1.evaluate(TestRuleMarkFailure.java:47)
	at com.carrotsearch.randomizedtesting.rules.StatementAdapter.evaluate(StatementAdapter.java:36)
	at com.carrotsearch.randomizedtesting.ThreadLeakControl$StatementRunner.run(ThreadLeakControl.java:368)
	at com.carrotsearch.randomizedtesting.ThreadLeakControl.forkTimeoutingTask(ThreadLeakControl.java:817)
	at com.carrotsearch.randomizedtesting.ThreadLeakControl$3.evaluate(ThreadLeakControl.java:468)
	at com.carrotsearch.randomizedtesting.RandomizedRunner.runSingleTest(RandomizedRunner.java:947)
	at com.carrotsearch.randomizedtesting.RandomizedRunner$5.evaluate(RandomizedRunner.java:832)
	at com.carrotsearch.randomizedtesting.RandomizedRunner$6.evaluate(RandomizedRunner.java:883)
	at com.carrotsearch.randomizedtesting.RandomizedRunner$7.evaluate(RandomizedRunner.java:894)
	at com.carrotsearch.randomizedtesting.rules.StatementAdapter.evaluate(StatementAdapter.java:36)
	at com.carrotsearch.randomizedtesting.rules.SystemPropertiesRestoreRule$1.evaluate(SystemPropertiesRestoreRule.java:57)
	at org.apache.lucene.util.AbstractBeforeAfterRule$1.evaluate(AbstractBeforeAfterRule.java:45)
	at com.carrotsearch.randomizedtesting.rules.StatementAdapter.evaluate(StatementAdapter.java:36)
	at org.apache.lucene.util.TestRuleStoreClassName$1.evaluate(TestRuleStoreClassName.java:41)
	at com.carrotsearch.randomizedtesting.rules.NoShadowingOrOverridesOnMethodsRule$1.evaluate(NoShadowingOrOverridesOnMethodsRule.java:40)
	at com.carrotsearch.randomizedtesting.rules.NoShadowingOrOverridesOnMethodsRule$1.evaluate(NoShadowingOrOverridesOnMethodsRule.java:40)
	at com.carrotsearch.randomizedtesting.rules.StatementAdapter.evaluate(StatementAdapter.java:36)
	at com.carrotsearch.randomizedtesting.rules.StatementAdapter.evaluate(StatementAdapter.java:36)
	at org.apache.lucene.util.TestRuleAssertionsRequired$1.evaluate(TestRuleAssertionsRequired.java:53)
	at org.apache.lucene.util.TestRuleMarkFailure$1.evaluate(TestRuleMarkFailure.java:47)
	at org.apache.lucene.util.TestRuleIgnoreAfterMaxFailures$1.evaluate(TestRuleIgnoreAfterMaxFailures.java:64)
	at org.apache.lucene.util.TestRuleIgnoreTestSuites$1.evaluate(TestRuleIgnoreTestSuites.java:54)
	at com.carrotsearch.randomizedtesting.rules.StatementAdapter.evaluate(StatementAdapter.java:36)
	at com.carrotsearch.randomizedtesting.ThreadLeakControl$StatementRunner.run(ThreadLeakControl.java:368)
	at java.base/java.lang.Thread.run(Thread.java:844)




Build Log:
[...truncated 14515 lines...]
   [junit4] Suite: org.apache.solr.cloud.TestCloudSearcherWarming
   [junit4]   2> 1170675 INFO  (SUITE-TestCloudSearcherWarming-seed#[7D7602E4034B9072]-worker) [    ] o.a.s.SolrTestCaseJ4 SecureRandom sanity checks: test.solr.allowed.securerandom=null & java.security.egd=file:/dev/./urandom
   [junit4]   2> Creating dataDir: /home/jenkins/workspace/Lucene-Solr-master-Linux/solr/build/solr-core/test/J1/temp/solr.cloud.TestCloudSearcherWarming_7D7602E4034B9072-001/init-core-data-001
   [junit4]   2> 1170675 WARN  (SUITE-TestCloudSearcherWarming-seed#[7D7602E4034B9072]-worker) [    ] o.a.s.SolrTestCaseJ4 startTrackingSearchers: numOpens=12 numCloses=12
   [junit4]   2> 1170676 INFO  (SUITE-TestCloudSearcherWarming-seed#[7D7602E4034B9072]-worker) [    ] o.a.s.SolrTestCaseJ4 Using PointFields (NUMERIC_POINTS_SYSPROP=true) w/NUMERIC_DOCVALUES_SYSPROP=false
   [junit4]   2> 1170676 INFO  (SUITE-TestCloudSearcherWarming-seed#[7D7602E4034B9072]-worker) [    ] o.a.s.SolrTestCaseJ4 Randomized ssl (false) and clientAuth (true) via: @org.apache.solr.util.RandomizeSSL(reason="", ssl=0.0/0.0, value=0.0/0.0, clientAuth=0.0/0.0)
   [junit4]   2> 1170678 INFO  (TEST-TestCloudSearcherWarming.testRepFactor1LeaderStartup-seed#[7D7602E4034B9072]) [    ] o.a.s.SolrTestCaseJ4 ###Starting testRepFactor1LeaderStartup
   [junit4]   2> 1170678 INFO  (TEST-TestCloudSearcherWarming.testRepFactor1LeaderStartup-seed#[7D7602E4034B9072]) [    ] o.a.s.c.MiniSolrCloudCluster Starting cluster of 1 servers in /home/jenkins/workspace/Lucene-Solr-master-Linux/solr/build/solr-core/test/J1/temp/solr.cloud.TestCloudSearcherWarming_7D7602E4034B9072-001/tempDir-001
   [junit4]   2> 1170678 INFO  (TEST-TestCloudSearcherWarming.testRepFactor1LeaderStartup-seed#[7D7602E4034B9072]) [    ] o.a.s.c.ZkTestServer STARTING ZK TEST SERVER
   [junit4]   2> 1170679 INFO  (ZkTestServer Run Thread) [    ] o.a.s.c.ZkTestServer client port:0.0.0.0/0.0.0.0:0
   [junit4]   2> 1170679 INFO  (ZkTestServer Run Thread) [    ] o.a.s.c.ZkTestServer Starting server
   [junit4]   2> 1170779 INFO  (TEST-TestCloudSearcherWarming.testRepFactor1LeaderStartup-seed#[7D7602E4034B9072]) [    ] o.a.s.c.ZkTestServer start zk server on port:46829
   [junit4]   2> 1170779 INFO  (TEST-TestCloudSearcherWarming.testRepFactor1LeaderStartup-seed#[7D7602E4034B9072]) [    ] o.a.s.c.ZkTestServer parse host and port list: 127.0.0.1:46829
   [junit4]   2> 1170779 INFO  (TEST-TestCloudSearcherWarming.testRepFactor1LeaderStartup-seed#[7D7602E4034B9072]) [    ] o.a.s.c.ZkTestServer connecting to 127.0.0.1 46829
   [junit4]   2> 1170782 INFO  (zkConnectionManagerCallback-8170-thread-1) [    ] o.a.s.c.c.ConnectionManager zkClient has connected
   [junit4]   2> 1170783 INFO  (zkConnectionManagerCallback-8172-thread-1) [    ] o.a.s.c.c.ConnectionManager zkClient has connected
   [junit4]   2> 1170784 INFO  (zkConnectionManagerCallback-8174-thread-1) [    ] o.a.s.c.c.ConnectionManager zkClient has connected
   [junit4]   2> 1170785 WARN  (jetty-launcher-8175-thread-1) [    ] o.e.j.s.AbstractConnector Ignoring deprecated socket close linger time
   [junit4]   2> 1170785 INFO  (jetty-launcher-8175-thread-1) [    ] o.a.s.c.s.e.JettySolrRunner Start Jetty (original configured port=0)
   [junit4]   2> 1170785 INFO  (jetty-launcher-8175-thread-1) [    ] o.a.s.c.s.e.JettySolrRunner Trying to start Jetty on port 0 try number 1 ...
   [junit4]   2> 1170786 INFO  (jetty-launcher-8175-thread-1) [    ] o.e.j.s.Server jetty-9.4.14.v20181114; built: 2018-11-14T21:20:31.478Z; git: c4550056e785fb5665914545889f21dc136ad9e6; jvm 10.0.1+10
   [junit4]   2> 1170786 INFO  (jetty-launcher-8175-thread-1) [    ] o.e.j.s.session DefaultSessionIdManager workerName=node0
   [junit4]   2> 1170786 INFO  (jetty-launcher-8175-thread-1) [    ] o.e.j.s.session No SessionScavenger set, using defaults
   [junit4]   2> 1170786 INFO  (jetty-launcher-8175-thread-1) [    ] o.e.j.s.session node0 Scavenging every 600000ms
   [junit4]   2> 1170786 INFO  (jetty-launcher-8175-thread-1) [    ] o.e.j.s.h.ContextHandler Started o.e.j.s.ServletContextHandler@5167ab4{/solr,null,AVAILABLE}
   [junit4]   2> 1170787 INFO  (jetty-launcher-8175-thread-1) [    ] o.e.j.s.AbstractConnector Started ServerConnector@1457c966{HTTP/1.1,[http/1.1, h2c]}{127.0.0.1:٣٨٩٢٥}
   [junit4]   2> 1170787 INFO  (jetty-launcher-8175-thread-1) [    ] o.e.j.s.Server Started @١١٧٠٨١٧ms
   [junit4]   2> 1170787 INFO  (jetty-launcher-8175-thread-1) [    ] o.a.s.c.s.e.JettySolrRunner Jetty properties: {hostContext=/solr, hostPort=38925}
   [junit4]   2> 1170787 ERROR (jetty-launcher-8175-thread-1) [    ] o.a.s.u.StartupLoggingUtils Missing Java Option solr.log.dir. Logging may be missing or incomplete.
   [junit4]   2> 1170787 INFO  (jetty-launcher-8175-thread-1) [    ] o.a.s.s.SolrDispatchFilter Using logger factory org.apache.logging.slf4j.Log4jLoggerFactory
   [junit4]   2> 1170787 INFO  (jetty-launcher-8175-thread-1) [    ] o.a.s.s.SolrDispatchFilter  ___      _       Welcome to Apache Solr™ version 9.0.0
   [junit4]   2> 1170787 INFO  (jetty-launcher-8175-thread-1) [    ] o.a.s.s.SolrDispatchFilter / __| ___| |_ _   Starting in cloud mode on port null
   [junit4]   2> 1170787 INFO  (jetty-launcher-8175-thread-1) [    ] o.a.s.s.SolrDispatchFilter \__ \/ _ \ | '_|  Install dir: null
   [junit4]   2> 1170787 INFO  (jetty-launcher-8175-thread-1) [    ] o.a.s.s.SolrDispatchFilter |___/\___/_|_|    Start time: 2019-01-08T17:20:48.224544Z
   [junit4]   2> 1170788 INFO  (zkConnectionManagerCallback-8177-thread-1) [    ] o.a.s.c.c.ConnectionManager zkClient has connected
   [junit4]   2> 1170788 INFO  (jetty-launcher-8175-thread-1) [    ] o.a.s.s.SolrDispatchFilter solr.xml found in ZooKeeper. Loading...
   [junit4]   2> 1170872 WARN  (jetty-launcher-8175-thread-1) [    ] o.e.j.u.s.S.config No Client EndPointIdentificationAlgorithm configured for SslContextFactory@29072c19[provider=null,keyStore=null,trustStore=null]
   [junit4]   2> 1170874 WARN  (jetty-launcher-8175-thread-1) [    ] o.e.j.u.s.S.config No Client EndPointIdentificationAlgorithm configured for SslContextFactory@18d55fd6[provider=null,keyStore=null,trustStore=null]
   [junit4]   2> 1170875 INFO  (jetty-launcher-8175-thread-1) [    ] o.a.s.c.ZkContainer Zookeeper client=127.0.0.1:46829/solr
   [junit4]   2> 1170876 INFO  (zkConnectionManagerCallback-8183-thread-1) [    ] o.a.s.c.c.ConnectionManager zkClient has connected
   [junit4]   2> 1170877 INFO  (zkConnectionManagerCallback-8185-thread-1) [    ] o.a.s.c.c.ConnectionManager zkClient has connected
   [junit4]   2> 1171242 INFO  (jetty-launcher-8175-thread-1) [n:127.0.0.1:38925_solr    ] o.a.s.c.OverseerElectionContext I am going to be the leader 127.0.0.1:38925_solr
   [junit4]   2> 1171242 INFO  (jetty-launcher-8175-thread-1) [n:127.0.0.1:38925_solr    ] o.a.s.c.Overseer Overseer (id=72182461512941573-127.0.0.1:38925_solr-n_0000000000) starting
   [junit4]   2> 1171245 INFO  (zkConnectionManagerCallback-8192-thread-1) [    ] o.a.s.c.c.ConnectionManager zkClient has connected
   [junit4]   2> 1171246 INFO  (jetty-launcher-8175-thread-1) [n:127.0.0.1:38925_solr    ] o.a.s.c.s.i.ZkClientClusterStateProvider Cluster at 127.0.0.1:46829/solr ready
   [junit4]   2> 1171246 INFO  (OverseerStateUpdate-72182461512941573-127.0.0.1:38925_solr-n_0000000000) [n:127.0.0.1:38925_solr    ] o.a.s.c.Overseer Starting to work on the main queue : 127.0.0.1:38925_solr
   [junit4]   2> 1171246 INFO  (jetty-launcher-8175-thread-1) [n:127.0.0.1:38925_solr    ] o.a.s.c.ZkController Register node as live in ZooKeeper:/live_nodes/127.0.0.1:38925_solr
   [junit4]   2> 1171247 INFO  (zkCallback-8191-thread-1) [    ] o.a.s.c.c.ZkStateReader Updated live nodes from ZooKeeper... (0) -> (1)
   [junit4]   2> 1171247 INFO  (zkCallback-8184-thread-1) [    ] o.a.s.c.c.ZkStateReader Updated live nodes from ZooKeeper... (0) -> (1)
   [junit4]   2> 1171256 INFO  (jetty-launcher-8175-thread-1) [n:127.0.0.1:38925_solr    ] o.a.s.h.a.MetricsHistoryHandler No .system collection, keeping metrics history in memory.
   [junit4]   2> 1171266 INFO  (jetty-launcher-8175-thread-1) [n:127.0.0.1:38925_solr    ] o.a.s.m.r.SolrJmxReporter JMX monitoring for 'solr_38925.solr.node' (registry 'solr.node') enabled at server: com.sun.jmx.mbeanserver.JmxMBeanServer@40df98c5
   [junit4]   2> 1171271 INFO  (jetty-launcher-8175-thread-1) [n:127.0.0.1:38925_solr    ] o.a.s.m.r.SolrJmxReporter JMX monitoring for 'solr_38925.solr.jvm' (registry 'solr.jvm') enabled at server: com.sun.jmx.mbeanserver.JmxMBeanServer@40df98c5
   [junit4]   2> 1171271 INFO  (jetty-launcher-8175-thread-1) [n:127.0.0.1:38925_solr    ] o.a.s.m.r.SolrJmxReporter JMX monitoring for 'solr_38925.solr.jetty' (registry 'solr.jetty') enabled at server: com.sun.jmx.mbeanserver.JmxMBeanServer@40df98c5
   [junit4]   2> 1171272 INFO  (jetty-launcher-8175-thread-1) [n:127.0.0.1:38925_solr    ] o.a.s.c.CorePropertiesLocator Found 0 core definitions underneath /home/jenkins/workspace/Lucene-Solr-master-Linux/solr/build/solr-core/test/J1/temp/solr.cloud.TestCloudSearcherWarming_7D7602E4034B9072-001/tempDir-001/node1/.
   [junit4]   2> 1171281 INFO  (zkConnectionManagerCallback-8198-thread-1) [    ] o.a.s.c.c.ConnectionManager zkClient has connected
   [junit4]   2> 1171282 INFO  (TEST-TestCloudSearcherWarming.testRepFactor1LeaderStartup-seed#[7D7602E4034B9072]) [    ] o.a.s.c.c.ZkStateReader Updated live nodes from ZooKeeper... (0) -> (1)
   [junit4]   2> 1171282 INFO  (TEST-TestCloudSearcherWarming.testRepFactor1LeaderStartup-seed#[7D7602E4034B9072]) [    ] o.a.s.c.s.i.ZkClientClusterStateProvider Cluster at 127.0.0.1:46829/solr ready
   [junit4]   2> 1171284 INFO  (qtp1327395195-24132) [n:127.0.0.1:38925_solr    ] o.a.s.h.a.CollectionsHandler Invoked Collection Action :create with params pullReplicas=0&name=testRepFactor1LeaderStartup&nrtReplicas=1&action=CREATE&numShards=1&tlogReplicas=0&createNodeSet=127.0.0.1:38925_solr&wt=javabin&version=2 and sendToOCPQueue=true
   [junit4]   2> 1171285 INFO  (OverseerThreadFactory-7512-thread-1-processing-n:127.0.0.1:38925_solr) [n:127.0.0.1:38925_solr    ] o.a.s.c.a.c.CreateCollectionCmd Create collection testRepFactor1LeaderStartup
   [junit4]   2> 1171286 INFO  (OverseerThreadFactory-7512-thread-1-processing-n:127.0.0.1:38925_solr) [n:127.0.0.1:38925_solr    ] o.a.s.c.c.ZkConfigManager Copying zk node /configs/_default/protwords.txt to /configs/testRepFactor1LeaderStartup.AUTOCREATED/protwords.txt
   [junit4]   2> 1171286 INFO  (OverseerThreadFactory-7512-thread-1-processing-n:127.0.0.1:38925_solr) [n:127.0.0.1:38925_solr    ] o.a.s.c.c.ZkConfigManager Copying zk node /configs/_default/managed-schema to /configs/testRepFactor1LeaderStartup.AUTOCREATED/managed-schema
   [junit4]   2> 1171287 INFO  (OverseerThreadFactory-7512-thread-1-processing-n:127.0.0.1:38925_solr) [n:127.0.0.1:38925_solr    ] o.a.s.c.c.ZkConfigManager Copying zk node /configs/_default/solrconfig.xml to /configs/testRepFactor1LeaderStartup.AUTOCREATED/solrconfig.xml
   [junit4]   2> 1171287 INFO  (OverseerThreadFactory-7512-thread-1-processing-n:127.0.0.1:38925_solr) [n:127.0.0.1:38925_solr    ] o.a.s.c.c.ZkConfigManager Copying zk node /configs/_default/synonyms.txt to /configs/testRepFactor1LeaderStartup.AUTOCREATED/synonyms.txt
   [junit4]   2> 1171288 INFO  (OverseerThreadFactory-7512-thread-1-processing-n:127.0.0.1:38925_solr) [n:127.0.0.1:38925_solr    ] o.a.s.c.c.ZkConfigManager Copying zk node /configs/_default/stopwords.txt to /configs/testRepFactor1LeaderStartup.AUTOCREATED/stopwords.txt
   [junit4]   2> 1171288 INFO  (OverseerThreadFactory-7512-thread-1-processing-n:127.0.0.1:38925_solr) [n:127.0.0.1:38925_solr    ] o.a.s.c.c.ZkConfigManager Copying zk node /configs/_default/lang/contractions_it.txt to /configs/testRepFactor1LeaderStartup.AUTOCREATED/lang/contractions_it.txt
   [junit4]   2> 1171289 INFO  (OverseerThreadFactory-7512-thread-1-processing-n:127.0.0.1:38925_solr) [n:127.0.0.1:38925_solr    ] o.a.s.c.c.ZkConfigManager Copying zk node /configs/_default/lang/stemdict_nl.txt to /configs/testRepFactor1LeaderStartup.AUTOCREATED/lang/stemdict_nl.txt
   [junit4]   2> 1171289 INFO  (OverseerThreadFactory-7512-thread-1-processing-n:127.0.0.1:38925_solr) [n:127.0.0.1:38925_solr    ] o.a.s.c.c.ZkConfigManager Copying zk node /configs/_default/lang/stopwords_hy.txt to /configs/testRepFactor1LeaderStartup.AUTOCREATED/lang/stopwords_hy.txt
   [junit4]   2> 1171289 INFO  (OverseerThreadFactory-7512-thread-1-processing-n:127.0.0.1:38925_solr) [n:127.0.0.1:38925_solr    ] o.a.s.c.c.ZkConfigManager Copying zk node /configs/_default/lang/stopwords_no.txt to /configs/testRepFactor1LeaderStartup.AUTOCREATED/lang/stopwords_no.txt
   [junit4]   2> 1171290 INFO  (OverseerThreadFactory-7512-thread-1-processing-n:127.0.0.1:38925_solr) [n:127.0.0.1:38925_solr    ] o.a.s.c.c.ZkConfigManager Copying zk node /configs/_default/lang/contractions_ca.txt to /configs/testRepFactor1LeaderStartup.AUTOCREATED/lang/contractions_ca.txt
   [junit4]   2> 1171290 INFO  (OverseerThreadFactory-7512-thread-1-processing-n:127.0.0.1:38925_solr) [n:127.0.0.1:38925_solr    ] o.a.s.c.c.ZkConfigManager Copying zk node /configs/_default/lang/stopwords_id.txt to /configs/testRepFactor1LeaderStartup.AUTOCREATED/lang/stopwords_id.txt
   [junit4]   2> 1171291 INFO  (OverseerThreadFactory-7512-thread-1-processing-n:127.0.0.1:38925_solr) [n:127.0.0.1:38925_solr    ] o.a.s.c.c.ZkConfigManager Copying zk node /configs/_default/lang/stopwords_ga.txt to /configs/testRepFactor1LeaderStartup.AUTOCREATED/lang/stopwords_ga.txt
   [junit4]   2> 1171291 INFO  (OverseerThreadFactory-7512-thread-1-processing-n:127.0.0.1:38925_solr) [n:127.0.0.1:38925_solr    ] o.a.s.c.c.ZkConfigManager Copying zk node /configs/_default/lang/stopwords_hi.txt to /configs/testRepFactor1LeaderStartup.AUTOCREATED/lang/stopwords_hi.txt
   [junit4]   2> 1171292 INFO  (OverseerThreadFactory-7512-thread-1-processing-n:127.0.0.1:38925_solr) [n:127.0.0.1:38925_solr    ] o.a.s.c.c.ZkConfigManager Copying zk node /configs/_default/lang/stopwords_da.txt to /configs/testRepFactor1LeaderStartup.AUTOCREATED/lang/stopwords_da.txt
   [junit4]   2> 1171292 INFO  (OverseerThreadFactory-7512-thread-1-processing-n:127.0.0.1:38925_solr) [n:127.0.0.1:38925_solr    ] o.a.s.c.c.ZkConfigManager Copying zk node /configs/_default/lang/stopwords_ja.txt to /configs/testRepFactor1LeaderStartup.AUTOCREATED/lang/stopwords_ja.txt
   [junit4]   2> 1171293 INFO  (OverseerThreadFactory-7512-thread-1-processing-n:127.0.0.1:38925_solr) [n:127.0.0.1:38925_solr    ] o.a.s.c.c.ZkConfigManager Copying zk node /configs/_default/lang/stopwords_pt.txt to /configs/testRepFactor1LeaderStartup.AUTOCREATED/lang/stopwords_pt.txt
   [junit4]   2> 1171293 INFO  (OverseerThreadFactory-7512-thread-1-processing-n:127.0.0.1:38925_solr) [n:127.0.0.1:38925_solr    ] o.a.s.c.c.ZkConfigManager Copying zk node /configs/_default/lang/stopwords_hu.txt to /configs/testRepFactor1LeaderStartup.AUTOCREATED/lang/stopwords_hu.txt
   [junit4]   2> 1171294 INFO  (OverseerThreadFactory-7512-thread-1-processing-n:127.0.0.1:38925_solr) [n:127.0.0.1:38925_solr    ] o.a.s.c.c.ZkConfigManager Copying zk node /configs/_default/lang/stopwords_el.txt to /configs/testRepFactor1LeaderStartup.AUTOCREATED/lang/stopwords_el.txt
   [junit4]   2> 1171294 INFO  (OverseerThreadFactory-7512-thread-1-processing-n:127.0.0.1:38925_solr) [n:127.0.0.1:38925_solr    ] o.a.s.c.c.ZkConfigManager Copying zk node /configs/_default/lang/stopwords_ru.txt to /configs/testRepFactor1LeaderStartup.AUTOCREATED/lang/stopwords_ru.txt
   [junit4]   2> 1171295 INFO  (OverseerThreadFactory-7512-thread-1-processing-n:127.0.0.1:38925_solr) [n:127.0.0.1:38925_solr    ] o.a.s.c.c.ZkConfigManager Copying zk node /configs/_default/lang/stopwords_tr.txt to /configs/testRepFactor1LeaderStartup.AUTOCREATED/lang/stopwords_tr.txt
   [junit4]   2> 1171295 INFO  (OverseerThreadFactory-7512-thread-1-processing-n:127.0.0.1:38925_solr) [n:127.0.0.1:38925_solr    ] o.a.s.c.c.ZkConfigManager Copying zk node /configs/_default/lang/stopwords_ar.txt to /configs/testRepFactor1LeaderStartup.AUTOCREATED/lang/stopwords_ar.txt
   [junit4]   2> 1171296 INFO  (OverseerThreadFactory-7512-thread-1-processing-n:127.0.0.1:38925_solr) [n:127.0.0.1:38925_solr    ] o.a.s.c.c.ZkConfigManager Copying zk node /configs/_default/lang/userdict_ja.txt to /configs/testRepFactor1LeaderStartup.AUTOCREATED/lang/userdict_ja.txt
   [junit4]   2> 1171296 INFO  (OverseerThreadFactory-7512-thread-1-processing-n:127.0.0.1:38925_solr) [n:127.0.0.1:38925_solr    ] o.a.s.c.c.ZkConfigManager Copying zk node /configs/_default/lang/stopwords_eu.txt to /configs/testRepFactor1LeaderStartup.AUTOCREATED/lang/stopwords_eu.txt
   [junit4]   2> 1171296 INFO  (OverseerThreadFactory-7512-thread-1-processing-n:127.0.0.1:38925_solr) [n:127.0.0.1:38925_solr    ] o.a.s.c.c.ZkConfigManager Copying zk node /configs/_default/lang/stopwords_it.txt to /configs/testRepFactor1LeaderStartup.AUTOCREATED/lang/stopwords_it.txt
   [junit4]   2> 1171297 INFO  (OverseerThreadFactory-7512-thread-1-processing-n:127.0.0.1:38925_solr) [n:127.0.0.1:38925_solr    ] o.a.s.c.c.ZkConfigManager Copying zk node /configs/_default/lang/stopwords_cz.txt to /configs/testRepFactor1LeaderStartup.AUTOCREATED/lang/stopwords_cz.txt
   [junit4]   2> 1171297 INFO  (OverseerThreadFactory-7512-thread-1-processing-n:127.0.0.1:38925_solr) [n:127.0.0.1:38925_solr    ] o.a.s.c.c.ZkConfigManager Copying zk node /configs/_default/lang/stoptags_ja.txt to /configs/testRepFactor1LeaderStartup.AUTOCREATED/lang/stoptags_ja.txt
   [junit4]   2> 1171298 INFO  (OverseerThreadFactory-7512-thread-1-processing-n:127.0.0.1:38925_solr) [n:127.0.0.1:38925_solr    ] o.a.s.c.c.ZkConfigManager Copying zk node /configs/_default/lang/contractions_fr.txt to /configs/testRepFactor1LeaderStartup.AUTOCREATED/lang/contractions_fr.txt
   [junit4]   2> 1171298 INFO  (OverseerThreadFactory-7512-thread-1-processing-n:127.0.0.1:38925_solr) [n:127.0.0.1:38925_solr    ] o.a.s.c.c.ZkConfigManager Copying zk node /configs/_default/lang/stopwords_de.txt to /configs/testRepFactor1LeaderStartup.AUTOCREATED/lang/stopwords_de.txt
   [junit4]   2> 1171298 INFO  (OverseerThreadFactory-7512-thread-1-processing-n:127.0.0.1:38925_solr) [n:127.0.0.1:38925_solr    ] o.a.s.c.c.ZkConfigManager Copying zk node /configs/_default/lang/stopwords_fa.txt to /configs/testRepFactor1LeaderStartup.AUTOCREATED/lang/stopwords_fa.txt
   [junit4]   2> 1171299 INFO  (OverseerThreadFactory-7512-thread-1-processing-n:127.0.0.1:38925_solr) [n:127.0.0.1:38925_solr    ] o.a.s.c.c.ZkConfigManager Copying zk node /configs/_default/lang/contractions_ga.txt to /configs/testRepFactor1LeaderStartup.AUTOCREATED/lang/contractions_ga.txt
   [junit4]   2> 1171299 INFO  (OverseerThreadFactory-7512-thread-1-processing-n:127.0.0.1:38925_solr) [n:127.0.0.1:38925_solr    ] o.a.s.c.c.ZkConfigManager Copying zk node /configs/_default/lang/stopwords_ca.txt to /configs/testRepFactor1LeaderStartup.AUTOCREATED/lang/stopwords_ca.txt
   [junit4]   2> 1171300 INFO  (OverseerThreadFactory-7512-thread-1-processing-n:127.0.0.1:38925_solr) [n:127.0.0.1:38925_solr    ] o.a.s.c.c.ZkConfigManager Copying zk node /configs/_default/lang/stopwords_nl.txt to /configs/testRepFactor1LeaderStartup.AUTOCREATED/lang/stopwords_nl.txt
   [junit4]   2> 1171300 INFO  (OverseerThreadFactory-7512-thread-1-processing-n:127.0.0.1:38925_solr) [n:127.0.0.1:38925_solr    ] o.a.s.c.c.ZkConfigManager Copying zk node /configs/_default/lang/stopwords_bg.txt to /configs/testRepFactor1LeaderStartup.AUTOCREATED/lang/stopwords_bg.txt
   [junit4]   2> 1171301 INFO  (OverseerThreadFactory-7512-thread-1-processing-n:127.0.0.1:38925_solr) [n:127.0.0.1:38925_solr    ] o.a.s.c.c.ZkConfigManager Copying zk node /configs/_default/lang/stopwords_lv.txt to /configs/testRepFactor1LeaderStartup.AUTOCREATED/lang/stopwords_lv.txt
   [junit4]   2> 1171301 INFO  (OverseerThreadFactory-7512-thread-1-processing-n:127.0.0.1:38925_solr) [n:127.0.0.1:38925_solr    ] o.a.s.c.c.ZkConfigManager Copying zk node /configs/_default/lang/stopwords_en.txt to /configs/testRepFactor1LeaderStartup.AUTOCREATED/lang/stopwords_en.txt
   [junit4]   2> 1171302 INFO  (OverseerThreadFactory-7512-thread-1-processing-n:127.0.0.1:38925_solr) [n:127.0.0.1:38925_solr    ] o.a.s.c.c.ZkConfigManager Copying zk node /configs/_default/lang/stopwords_es.txt to /configs/testRepFactor1LeaderStartup.AUTOCREATED/lang/stopwords_es.txt
   [junit4]   2> 1171302 INFO  (OverseerThreadFactory-7512-thread-1-processing-n:127.0.0.1:38925_solr) [n:127.0.0.1:38925_solr    ] o.a.s.c.c.ZkConfigManager Copying zk node /configs/_default/lang/stopwords_th.txt to /configs/testRepFactor1LeaderStartup.AUTOCREATED/lang/stopwords_th.txt
   [junit4]   2> 1171303 INFO  (OverseerThreadFactory-7512-thread-1-processing-n:127.0.0.1:38925_solr) [n:127.0.0.1:38925_solr    ] o.a.s.c.c.ZkConfigManager Copying zk node /configs/_default/lang/stopwords_ro.txt to /configs/testRepFactor1LeaderStartup.AUTOCREATED/lang/stopwords_ro.txt
   [junit4]   2> 1171303 INFO  (OverseerThreadFactory-7512-thread-1-processing-n:127.0.0.1:38925_solr) [n:127.0.0.1:38925_solr    ] o.a.s.c.c.ZkConfigManager Copying zk node /configs/_default/lang/stopwords_fr.txt to /configs/testRepFactor1LeaderStartup.AUTOCREATED/lang/stopwords_fr.txt
   [junit4]   2> 1171304 INFO  (OverseerThreadFactory-7512-thread-1-processing-n:127.0.0.1:38925_solr) [n:127.0.0.1:38925_solr    ] o.a.s.c.c.ZkConfigManager Copying zk node /configs/_default/lang/stopwords_sv.txt to /configs/testRepFactor1LeaderStartup.AUTOCREATED/lang/stopwords_sv.txt
   [junit4]   2> 1171304 INFO  (OverseerThreadFactory-7512-thread-1-processing-n:127.0.0.1:38925_solr) [n:127.0.0.1:38925_solr    ] o.a.s.c.c.ZkConfigManager Copying zk node /configs/_default/lang/stopwords_fi.txt to /configs/testRepFactor1LeaderStartup.AUTOCREATED/lang/stopwords_fi.txt
   [junit4]   2> 1171305 INFO  (OverseerThreadFactory-7512-thread-1-processing-n:127.0.0.1:38925_solr) [n:127.0.0.1:38925_solr    ] o.a.s.c.c.ZkConfigManager Copying zk node /configs/_default/lang/hyphenations_ga.txt to /configs/testRepFactor1LeaderStartup.AUTOCREATED/lang/hyphenations_ga.txt
   [junit4]   2> 1171305 INFO  (OverseerThreadFactory-7512-thread-1-processing-n:127.0.0.1:38925_solr) [n:127.0.0.1:38925_solr    ] o.a.s.c.c.ZkConfigManager Copying zk node /configs/_default/lang/stopwords_gl.txt to /configs/testRepFactor1LeaderStartup.AUTOCREATED/lang/stopwords_gl.txt
   [junit4]   2> 1171305 INFO  (OverseerThreadFactory-7512-thread-1-processing-n:127.0.0.1:38925_solr) [n:127.0.0.1:38925_solr    ] o.a.s.c.c.ZkConfigManager Copying zk node /configs/_default/params.json to /configs/testRepFactor1LeaderStartup.AUTOCREATED/params.json
   [junit4]   2> 1171410 INFO  (qtp1327395195-24131) [n:127.0.0.1:38925_solr    ] o.a.s.s.HttpSolrCall [admin] webapp=null path=/admin/metrics params={prefix=CONTAINER.fs.usableSpace,CONTAINER.fs.totalSpace,CORE.coreName&wt=javabin&version=2&group=solr.node,solr.core} status=0 QTime=0
   [junit4]   2> 1171410 INFO  (qtp1327395195-24133) [n:127.0.0.1:38925_solr    ] o.a.s.s.HttpSolrCall [admin] webapp=null path=/admin/metrics params={prefix=CONTAINER.fs.usableSpace,CONTAINER.fs.totalSpace,CORE.coreName&wt=javabin&version=2&group=solr.node,solr.core} status=0 QTime=0
   [junit4]   2> 1171411 INFO  (qtp1327395195-24131) [n:127.0.0.1:38925_solr    ] o.a.s.s.HttpSolrCall [admin] webapp=null path=/admin/metrics params={prefix=CONTAINER.fs.usableSpace,CONTAINER.fs.totalSpace,CORE.coreName&wt=javabin&version=2&group=solr.node,solr.core} status=0 QTime=0
   [junit4]   2> 1171411 INFO  (qtp1327395195-24133) [n:127.0.0.1:38925_solr    ] o.a.s.s.HttpSolrCall [admin] webapp=null path=/admin/metrics params={prefix=CONTAINER.fs.usableSpace,CONTAINER.fs.totalSpace,CORE.coreName&wt=javabin&version=2&group=solr.node,solr.core} status=0 QTime=0
   [junit4]   2> 1171412 INFO  (qtp1327395195-24131) [n:127.0.0.1:38925_solr    ] o.a.s.s.HttpSolrCall [admin] webapp=null path=/admin/metrics params={prefix=CONTAINER.fs.usableSpace,CONTAINER.fs.totalSpace,CORE.coreName&wt=javabin&version=2&group=solr.node,solr.core} status=0 QTime=0
   [junit4]   2> 1171414 INFO  (OverseerStateUpdate-72182461512941573-127.0.0.1:38925_solr-n_0000000000) [n:127.0.0.1:38925_solr    ] o.a.s.c.o.SliceMutator createReplica() {
   [junit4]   2>   "operation":"ADDREPLICA",
   [junit4]   2>   "collection":"testRepFactor1LeaderStartup",
   [junit4]   2>   "shard":"shard1",
   [junit4]   2>   "core":"testRepFactor1LeaderStartup_shard1_replica_n1",
   [junit4]   2>   "state":"down",
   [junit4]   2>   "base_url":"http://127.0.0.1:38925/solr",
   [junit4]   2>   "type":"NRT",
   [junit4]   2>   "waitForFinalState":"false"} 
   [junit4]   2> 1171616 INFO  (qtp1327395195-24133) [n:127.0.0.1:38925_solr    x:testRepFactor1LeaderStartup_shard1_replica_n1] o.a.s.h.a.CoreAdminOperation core create command qt=/admin/cores&coreNodeName=core_node2&collection.configName=testRepFactor1LeaderStartup.AUTOCREATED&newCollection=true&name=testRepFactor1LeaderStartup_shard1_replica_n1&action=CREATE&numShards=1&collection=testRepFactor1LeaderStartup&shard=shard1&wt=javabin&version=2&replicaType=NRT
   [junit4]   2> 1171616 INFO  (qtp1327395195-24133) [n:127.0.0.1:38925_solr    x:testRepFactor1LeaderStartup_shard1_replica_n1] o.a.s.c.TransientSolrCoreCacheDefault Allocating transient cache for 2147483647 transient cores
   [junit4]   2> 1172622 INFO  (qtp1327395195-24133) [n:127.0.0.1:38925_solr c:testRepFactor1LeaderStartup s:shard1 r:core_node2 x:testRepFactor1LeaderStartup_shard1_replica_n1] o.a.s.c.RequestParams conf resource params.json loaded . version : 0 
   [junit4]   2> 1172622 INFO  (qtp1327395195-24133) [n:127.0.0.1:38925_solr c:testRepFactor1LeaderStartup s:shard1 r:core_node2 x:testRepFactor1LeaderStartup_shard1_replica_n1] o.a.s.c.RequestParams request params refreshed to version 0
   [junit4]   2> 1172622 WARN  (qtp1327395195-24133) [n:127.0.0.1:38925_solr c:testRepFactor1LeaderStartup s:shard1 r:core_node2 x:testRepFactor1LeaderStartup_shard1_replica_n1] o.a.s.c.SolrConfig Couldn't add files from /home/jenkins/workspace/Lucene-Solr-master-Linux/solr/build/solr-core/test/J1/temp/solr.cloud.TestCloudSearcherWarming_7D7602E4034B9072-001/tempDir-001/node1/testRepFactor1LeaderStartup_shard1_replica_n1/../../../../contrib/extraction/lib filtered by .*\.jar to classpath: /home/jenkins/workspace/Lucene-Solr-master-Linux/solr/build/solr-core/test/J1/temp/solr.cloud.TestCloudSearcherWarming_7D7602E4034B9072-001/tempDir-001/node1/testRepFactor1LeaderStartup_shard1_replica_n1/../../../../contrib/extraction/lib
   [junit4]   2> 1172622 WARN  (qtp1327395195-24133) [n:127.0.0.1:38925_solr c:testRepFactor1LeaderStartup s:shard1 r:core_node2 x:testRepFactor1LeaderStartup_shard1_replica_n1] o.a.s.c.SolrConfig Couldn't add files from /home/jenkins/workspace/Lucene-Solr-master-Linux/solr/build/solr-core/test/J1/temp/solr.cloud.TestCloudSearcherWarming_7D7602E4034B9072-001/tempDir-001/node1/testRepFactor1LeaderStartup_shard1_replica_n1/../../../../dist filtered by solr-cell-\d.*\.jar to classpath: /home/jenkins/workspace/Lucene-Solr-master-Linux/solr/build/solr-core/test/J1/temp/solr.cloud.TestCloudSearcherWarming_7D7602E4034B9072-001/tempDir-001/node1/testRepFactor1LeaderStartup_shard1_replica_n1/../../../../dist
   [junit4]   2> 1172622 WARN  (qtp1327395195-24133) [n:127.0.0.1:38925_solr c:testRepFactor1LeaderStartup s:shard1 r:core_node2 x:testRepFactor1LeaderStartup_shard1_replica_n1] o.a.s.c.SolrConfig Couldn't add files from /home/jenkins/workspace/Lucene-Solr-master-Linux/solr/build/solr-core/test/J1/temp/solr.cloud.TestCloudSearcherWarming_7D7602E4034B9072-001/tempDir-001/node1/testRepFactor1LeaderStartup_shard1_replica_n1/../../../../contrib/clustering/lib filtered by .*\.jar to classpath: /home/jenkins/workspace/Lucene-Solr-master-Linux/solr/build/solr-core/test/J1/temp/solr.cloud.TestCloudSearcherWarming_7D7602E4034B9072-001/tempDir-001/node1/testRepFactor1LeaderStartup_shard1_replica_n1/../../../../contrib/clustering/lib
   [junit4]   2> 1172623 WARN  (qtp1327395195-24133) [n:127.0.0.1:38925_solr c:testRepFactor1LeaderStartup s:shard1 r:core_node2 x:testRepFactor1LeaderStartup_shard1_replica_n1] o.a.s.c.SolrConfig Couldn't add files from /home/jenkins/workspace/Lucene-Solr-master-Linux/solr/build/solr-core/test/J1/temp/solr.cloud.TestCloudSearcherWarming_7D7602E4034B9072-001/tempDir-001/node1/testRepFactor1LeaderStartup_shard1_replica_n1/../../../../dist filtered by solr-clustering-\d.*\.jar to classpath: /home/jenkins/workspace/Lucene-Solr-master-Linux/solr/build/solr-core/test/J1/temp/solr.cloud.TestCloudSearcherWarming_7D7602E4034B9072-001/tempDir-001/node1/testRepFactor1LeaderStartup_shard1_replica_n1/../../../../dist
   [junit4]   2> 1172623 WARN  (qtp1327395195-24133) [n:127.0.0.1:38925_solr c:testRepFactor1LeaderStartup s:shard1 r:core_node2 x:testRepFactor1LeaderStartup_shard1_replica_n1] o.a.s.c.SolrConfig Couldn't add files from /home/jenkins/workspace/Lucene-Solr-master-Linux/solr/build/solr-core/test/J1/temp/solr.cloud.TestCloudSearcherWarming_7D7602E4034B9072-001/tempDir-001/node1/testRepFactor1LeaderStartup_shard1_replica_n1/../../../../contrib/langid/lib filtered by .*\.jar to classpath: /home/jenkins/workspace/Lucene-Solr-master-Linux/solr/build/solr-core/test/J1/temp/solr.cloud.TestCloudSearcherWarming_7D7602E4034B9072-001/tempDir-001/node1/testRepFactor1LeaderStartup_shard1_replica_n1/../../../../contrib/langid/lib
   [junit4]   2> 1172623 WARN  (qtp1327395195-24133) [n:127.0.0.1:38925_solr c:testRepFactor1LeaderStartup s:shard1 r:core_node2 x:testRepFactor1LeaderStartup_shard1_replica_n1] o.a.s.c.SolrConfig Couldn't add files from /home/jenkins/workspace/Lucene-Solr-master-Linux/solr/build/solr-core/test/J1/temp/solr.cloud.TestCloudSearcherWarming_7D7602E4034B9072-001/tempDir-001/node1/testRepFactor1LeaderStartup_shard1_replica_n1/../../../../dist filtered by solr-langid-\d.*\.jar to classpath: /home/jenkins/workspace/Lucene-Solr-master-Linux/solr/build/solr-core/test/J1/temp/solr.cloud.TestCloudSearcherWarming_7D7602E4034B9072-001/tempDir-001/node1/testRepFactor1LeaderStartup_shard1_replica_n1/../../../../dist
   [junit4]   2> 1172623 WARN  (qtp1327395195-24133) [n:127.0.0.1:38925_solr c:testRepFactor1LeaderStartup s:shard1 r:core_node2 x:testRepFactor1LeaderStartup_shard1_replica_n1] o.a.s.c.SolrConfig Couldn't add files from /home/jenkins/workspace/Lucene-Solr-master-Linux/solr/build/solr-core/test/J1/temp/solr.cloud.TestCloudSearcherWarming_7D7602E4034B9072-001/tempDir-001/node1/testRepFactor1LeaderStartup_shard1_replica_n1/../../../../contrib/velocity/lib filtered by .*\.jar to classpath: /home/jenkins/workspace/Lucene-Solr-master-Linux/solr/build/solr-core/test/J1/temp/solr.cloud.TestCloudSearcherWarming_7D7602E4034B9072-001/tempDir-001/node1/testRepFactor1LeaderStartup_shard1_replica_n1/../../../../contrib/velocity/lib
   [junit4]   2> 1172623 WARN  (qtp1327395195-24133) [n:127.0.0.1:38925_solr c:testRepFactor1LeaderStartup s:shard1 r:core_node2 x:testRepFactor1LeaderStartup_shard1_replica_n1] o.a.s.c.SolrConfig Couldn't add files from /home/jenkins/workspace/Lucene-Solr-master-Linux/solr/build/solr-core/test/J1/temp/solr.cloud.TestCloudSearcherWarming_7D7602E4034B9072-001/tempDir-001/node1/testRepFactor1LeaderStartup_shard1_replica_n1/../../../../dist filtered by solr-velocity-\d.*\.jar to classpath: /home/jenkins/workspace/Lucene-Solr-master-Linux/solr/build/solr-core/test/J1/temp/solr.cloud.TestCloudSearcherWarming_7D7602E4034B9072-001/tempDir-001/node1/testRepFactor1LeaderStartup_shard1_replica_n1/../../../../dist
   [junit4]   2> 1172623 WARN  (qtp1327395195-24133) [n:127.0.0.1:38925_solr c:testRepFactor1LeaderStartup s:shard1 r:core_node2 x:testRepFactor1LeaderStartup_shard1_replica_n1] o.a.s.c.SolrConfig Couldn't add files from /home/jenkins/workspace/Lucene-Solr-master-Linux/solr/build/solr-core/test/J1/temp/solr.cloud.TestCloudSearcherWarming_7D7602E4034B9072-001/tempDir-001/node1/testRepFactor1LeaderStartup_shard1_replica_n1/../../../../dist filtered by solr-ltr-\d.*\.jar to classpath: /home/jenkins/workspace/Lucene-Solr-master-Linux/solr/build/solr-core/test/J1/temp/solr.cloud.TestCloudSearcherWarming_7D7602E4034B9072-001/tempDir-001/node1/testRepFactor1LeaderStartup_shard1_replica_n1/../../../../dist
   [junit4]   2> 1172627 INFO  (qtp1327395195-24133) [n:127.0.0.1:38925_solr c:testRepFactor1LeaderStartup s:shard1 r:core_node2 x:testRepFactor1LeaderStartup_shard1_replica_n1] o.a.s.c.SolrConfig Using Lucene MatchVersion: 9.0.0
   [junit4]   2> 1172644 INFO  (qtp1327395195-24133) [n:127.0.0.1:38925_solr c:testRepFactor1LeaderStartup s:shard1 r:core_node2 x:testRepFactor1LeaderStartup_shard1_replica_n1] o.a.s.s.IndexSchema [testRepFactor1LeaderStartup_shard1_replica_n1] Schema name=default-config
   [junit4]   2> 1172734 INFO  (qtp1327395195-24133) [n:127.0.0.1:38925_solr c:testRepFactor1LeaderStartup s:shard1 r:core_node2 x:testRepFactor1LeaderStartup_shard1_replica_n1] o.a.s.s.IndexSchema Loaded schema default-config/1.6 with uniqueid field id
   [junit4]   2> 1172744 INFO  (qtp1327395195-24133) [n:127.0.0.1:38925_solr c:testRepFactor1LeaderStartup s:shard1 r:core_node2 x:testRepFactor1LeaderStartup_shard1_replica_n1] o.a.s.c.CoreContainer Creating SolrCore 'testRepFactor1LeaderStartup_shard1_replica_n1' using configuration from collection testRepFactor1LeaderStartup, trusted=true
   [junit4]   2> 1172745 INFO  (qtp1327395195-24133) [n:127.0.0.1:38925_solr c:testRepFactor1LeaderStartup s:shard1 r:core_node2 x:testRepFactor1LeaderStartup_shard1_replica_n1] o.a.s.m.r.SolrJmxReporter JMX monitoring for 'solr_38925.solr.core.testRepFactor1LeaderStartup.shard1.replica_n1' (registry 'solr.core.testRepFactor1LeaderStartup.shard1.replica_n1') enabled at server: com.sun.jmx.mbeanserver.JmxMBeanServer@40df98c5
   [junit4]   2> 1172745 INFO  (qtp1327395195-24133) [n:127.0.0.1:38925_solr c:testRepFactor1LeaderStartup s:shard1 r:core_node2 x:testRepFactor1LeaderStartup_shard1_replica_n1] o.a.s.c.SolrCore [[testRepFactor1LeaderStartup_shard1_replica_n1] ] Opening new SolrCore at [/home/jenkins/workspace/Lucene-Solr-master-Linux/solr/build/solr-core/test/J1/temp/solr.cloud.TestCloudSearcherWarming_7D7602E4034B9072-001/tempDir-001/node1/testRepFactor1LeaderStartup_shard1_replica_n1], dataDir=[/home/jenkins/workspace/Lucene-Solr-master-Linux/solr/build/solr-core/test/J1/temp/solr.cloud.TestCloudSearcherWarming_7D7602E4034B9072-001/tempDir-001/node1/./testRepFactor1LeaderStartup_shard1_replica_n1/data/]
   [junit4]   2> 1173100 INFO  (qtp1327395195-24133) [n:127.0.0.1:38925_solr c:testRepFactor1LeaderStartup s:shard1 r:core_node2 x:testRepFactor1LeaderStartup_shard1_replica_n1] o.a.s.r.XSLTResponseWriter xsltCacheLifetimeSeconds=5
   [junit4]   2> 1173140 INFO  (qtp1327395195-24133) [n:127.0.0.1:38925_solr c:testRepFactor1LeaderStartup s:shard1 r:core_node2 x:testRepFactor1LeaderStartup_shard1_replica_n1] o.a.s.u.UpdateHandler Using UpdateLog implementation: org.apache.solr.update.UpdateLog
   [junit4]   2> 1173140 INFO  (qtp1327395195-24133) [n:127.0.0.1:38925_solr c:testRepFactor1LeaderStartup s:shard1 r:core_node2 x:testRepFactor1LeaderStartup_shard1_replica_n1] o.a.s.u.UpdateLog Initializing UpdateLog: dataDir= defaultSyncLevel=FLUSH numRecordsToKeep=100 maxNumLogsToKeep=10 numVersionBuckets=65536
   [junit4]   2> 1173142 INFO  (qtp1327395195-24133) [n:127.0.0.1:38925_solr c:testRepFactor1LeaderStartup s:shard1 r:core_node2 x:testRepFactor1LeaderStartup_shard1_replica_n1] o.a.s.u.CommitTracker Hard AutoCommit: if uncommitted for 15000ms; 
   [junit4]   2> 1173142 INFO  (qtp1327395195-24133) [n:127.0.0.1:38925_solr c:testRepFactor1LeaderStartup s:shard1 r:core_node2 x:testRepFactor1LeaderStartup_shard1_replica_n1] o.a.s.u.CommitTracker Soft AutoCommit: disabled
   [junit4]   2> 1173143 INFO  (qtp1327395195-24133) [n:127.0.0.1:38925_solr c:testRepFactor1LeaderStartup s:shard1 r:core_node2 x:testRepFactor1LeaderStartup_shard1_replica_n1] o.a.s.s.SolrIndexSearcher Opening [Searcher@70415d7e[testRepFactor1LeaderStartup_shard1_replica_n1] main]
   [junit4]   2> 1173144 INFO  (qtp1327395195-24133) [n:127.0.0.1:38925_solr c:testRepFactor1LeaderStartup s:shard1 r:core_node2 x:testRepFactor1LeaderStartup_shard1_replica_n1] o.a.s.r.ManagedResourceStorage Configured ZooKeeperStorageIO with znodeBase: /configs/testRepFactor1LeaderStartup.AUTOCREATED
   [junit4]   2> 1173144 INFO  (qtp1327395195-24133) [n:127.0.0.1:38925_solr c:testRepFactor1LeaderStartup s:shard1 r:core_node2 x:testRepFactor1LeaderStartup_shard1_replica_n1] o.a.s.r.ManagedResourceStorage Loaded null at path _rest_managed.json using ZooKeeperStorageIO:path=/configs/testRepFactor1LeaderStartup.AUTOCREATED
   [junit4]   2> 1173144 INFO  (qtp1327395195-24133) [n:127.0.0.1:38925_solr c:testRepFactor1LeaderStartup s:shard1 r:core_node2 x:testRepFactor1LeaderStartup_shard1_replica_n1] o.a.s.s.ZkIndexSchemaReader Creating ZooKeeper watch for the managed schema at /configs/testRepFactor1LeaderStartup.AUTOCREATED/managed-schema
   [junit4]   2> 1173144 INFO  (qtp1327395195-24133) [n:127.0.0.1:38925_solr c:testRepFactor1LeaderStartup s:shard1 r:core_node2 x:testRepFactor1LeaderStartup_shard1_replica_n1] o.a.s.s.ZkIndexSchemaReader Current schema version 0 is already the latest
   [junit4]   2> 1173144 INFO  (qtp1327395195-24133) [n:127.0.0.1:38925_solr c:testRepFactor1LeaderStartup s:shard1 r:core_node2 x:testRepFactor1LeaderStartup_shard1_replica_n1] o.a.s.h.c.SpellCheckComponent Initializing spell checkers
   [junit4]   2> 1173144 INFO  (qtp1327395195-24133) [n:127.0.0.1:38925_solr c:testRepFactor1LeaderStartup s:shard1 r:core_node2 x:testRepFactor1LeaderStartup_shard1_replica_n1] o.a.s.s.DirectSolrSpellChecker init: {name=default,field=_text_,classname=solr.DirectSolrSpellChecker,distanceMeasure=internal,accuracy=0.5,maxEdits=2,minPrefix=1,maxInspections=5,minQueryLength=4,maxQueryFrequency=0.01}
   [junit4]   2> 1173145 INFO  (qtp1327395195-24133) [n:127.0.0.1:38925_solr c:testRepFactor1LeaderStartup s:shard1 r:core_node2 x:testRepFactor1LeaderStartup_shard1_replica_n1] o.a.s.h.ReplicationHandler Commits will be reserved for 10000ms.
   [junit4]   2> 1173145 INFO  (qtp1327395195-24133) [n:127.0.0.1:38925_solr c:testRepFactor1LeaderStartup s:shard1 r:core_node2 x:testRepFactor1LeaderStartup_shard1_replica_n1] o.a.s.u.UpdateLog Could not find max version in index or recent updates, using new clock 1622113570607071232
   [junit4]   2> 1173147 INFO  (searcherExecutor-7517-thread-1-processing-n:127.0.0.1:38925_solr x:testRepFactor1LeaderStartup_shard1_replica_n1 c:testRepFactor1LeaderStartup s:shard1 r:core_node2) [n:127.0.0.1:38925_solr c:testRepFactor1LeaderStartup s:shard1 r:core_node2 x:testRepFactor1LeaderStartup_shard1_replica_n1] o.a.s.c.QuerySenderListener QuerySenderListener sending requests to Searcher@70415d7e[testRepFactor1LeaderStartup_shard1_replica_n1] main{ExitableDirectoryReader(UninvertingDirectoryReader())}
   [junit4]   2> 1173147 INFO  (searcherExecutor-7517-thread-1-processing-n:127.0.0.1:38925_solr x:testRepFactor1LeaderStartup_shard1_replica_n1 c:testRepFactor1LeaderStartup s:shard1 r:core_node2) [n:127.0.0.1:38925_solr c:testRepFactor1LeaderStartup s:shard1 r:core_node2 x:testRepFactor1LeaderStartup_shard1_replica_n1] o.a.s.c.QuerySenderListener QuerySenderListener done.
   [junit4]   2> 1173147 INFO  (searcherExecutor-7517-thread-1-processing-n:127.0.0.1:38925_solr x:testRepFactor1LeaderStartup_shard1_replica_n1 c:testRepFactor1LeaderStartup s:shard1 r:core_node2) [n:127.0.0.1:38925_solr c:testRepFactor1LeaderStartup s:shard1 r:core_node2 x:testRepFactor1LeaderStartup_shard1_replica_n1] o.a.s.h.c.SpellCheckComponent Loading spell index for spellchecker: default
   [junit4]   2> 1173147 INFO  (searcherExecutor-7517-thread-1-processing-n:127.0.0.1:38925_solr x:testRepFactor1LeaderStartup_shard1_replica_n1 c:testRepFactor1LeaderStartup s:shard1 r:core_node2) [n:127.0.0.1:38925_solr c:testRepFactor1LeaderStartup s:shard1 r:core_node2 x:testRepFactor1LeaderStartup_shard1_replica_n1] o.a.s.c.SolrCore [testRepFactor1LeaderStartup_shard1_replica_n1] Registered new searcher Searcher@70415d7e[testRepFactor1LeaderStartup_shard1_replica_n1] main{ExitableDirectoryReader(UninvertingDirectoryReader())}
   [junit4]   2> 1173148 INFO  (qtp1327395195-24133) [n:127.0.0.1:38925_solr c:testRepFactor1LeaderStartup s:shard1 r:core_node2 x:testRepFactor1LeaderStartup_shard1_replica_n1] o.a.s.c.ZkShardTerms Successful update of terms at /collections/testRepFactor1LeaderStartup/terms/shard1 to Terms{values={core_node2=0}, version=0}
   [junit4]   2> 1173148 INFO  (qtp1327395195-24133) [n:127.0.0.1:38925_solr c:testRepFactor1LeaderStartup s:shard1 r:core_node2 x:testRepFactor1LeaderStartup_shard1_replica_n1] o.a.s.c.ShardLeaderElectionContextBase make sure parent is created /collections/testRepFactor1LeaderStartup/leaders/shard1
   [junit4]   2> 1173149 INFO  (qtp1327395195-24133) [n:127.0.0.1:38925_solr c:testRepFactor1LeaderStartup s:shard1 r:core_node2 x:testRepFactor1LeaderStartup_shard1_replica_n1] o.a.s.c.ShardLeaderElectionContext Enough replicas found to continue.
   [junit4]   2> 1173149 INFO  (qtp1327395195-24133) [n:127.0.0.1:38925_solr c:testRepFactor1LeaderStartup s:shard1 r:core_node2 x:testRepFactor1LeaderStartup_shard1_replica_n1] o.a.s.c.ShardLeaderElectionContext I may be the new leader - try and sync
   [junit4]   2> 1173149 INFO  (qtp1327395195-24133) [n:127.0.0.1:38925_solr c:testRepFactor1LeaderStartup s:shard1 r:core_node2 x:testRepFactor1LeaderStartup_shard1_replica_n1] o.a.s.c.SyncStrategy Sync replicas to http://127.0.0.1:38925/solr/testRepFactor1LeaderStartup_shard1_replica_n1/
   [junit4]   2> 1173149 INFO  (qtp1327395195-24133) [n:127.0.0.1:38925_solr c:testRepFactor1LeaderStartup s:shard1 r:core_node2 x:testRepFactor1LeaderStartup_shard1_replica_n1] o.a.s.c.SyncStrategy Sync Success - now sync replicas to me
   [junit4]   2> 1173149 INFO  (qtp1327395195-24133) [n:127.0.0.1:38925_solr c:testRepFactor1LeaderStartup s:shard1 r:core_node2 x:testRepFactor1LeaderStartup_shard1_replica_n1] o.a.s.c.SyncStrategy http://127.0.0.1:38925/solr/testRepFactor1LeaderStartup_shard1_replica_n1/ has no replicas
   [junit4]   2> 1173149 INFO  (qtp1327395195-24133) [n:127.0.0.1:38925_solr c:testRepFactor1LeaderStartup s:shard1 r:core_node2 x:testRepFactor1LeaderStartup_shard1_replica_n1] o.a.s.c.ShardLeaderElectionContextBase Creating leader registration node /collections/testRepFactor1LeaderStartup/leaders/shard1/leader after winning as /collections/testRepFactor1LeaderStartup/leader_elect/shard1/election/72182461512941573-core_node2-n_0000000000
   [junit4]   2> 1173150 INFO  (qtp1327395195-24133) [n:127.0.0.1:38925_solr c:testRepFactor1LeaderStartup s:shard1 r:core_node2 x:testRepFactor1LeaderStartup_shard1_replica_n1] o.a.s.c.ShardLeaderElectionContext I am the new leader: http://127.0.0.1:38925/solr/testRepFactor1LeaderStartup_shard1_replica_n1/ shard1
   [junit4]   2> 1173251 INFO  (zkCallback-8184-thread-1) [    ] o.a.s.c.c.ZkStateReader A cluster state change: [WatchedEvent state:SyncConnected type:NodeDataChanged path:/collections/testRepFactor1LeaderStartup/state.json] for collection [testRepFactor1LeaderStartup] has occurred - updating... (live nodes size: [1])
   [junit4]   2> 1173251 INFO  (zkCallback-8184-thread-2) [    ] o.a.s.c.c.ZkStateReader A cluster state change: [WatchedEvent state:SyncConnected type:NodeDataChanged path:/collections/testRepFactor1LeaderStartup/state.json] for collection [testRepFactor1LeaderStartup] has occurred - updating... (live nodes size: [1])
   [junit4]   2> 1173251 INFO  (qtp1327395195-24133) [n:127.0.0.1:38925_solr c:testRepFactor1LeaderStartup s:shard1 r:core_node2 x:testRepFactor1LeaderStartup_shard1_replica_n1] o.a.s.c.ZkController I am the leader, no recovery necessary
   [junit4]   2> 1173252 INFO  (qtp1327395195-24133) [n:127.0.0.1:38925_solr c:testRepFactor1LeaderStartup s:shard1 r:core_node2 x:testRepFactor1LeaderStartup_shard1_replica_n1] o.a.s.s.HttpSolrCall [admin] webapp=null path=/admin/cores params={qt=/admin/cores&coreNodeName=core_node2&collection.configName=testRepFactor1LeaderStartup.AUTOCREATED&newCollection=true&name=testRepFactor1LeaderStartup_shard1_replica_n1&action=CREATE&numShards=1&collection=testRepFactor1LeaderStartup&shard=shard1&wt=javabin&version=2&replicaType=NRT} status=0 QTime=1636
   [junit4]   2> 1173254 INFO  (qtp1327395195-24132) [n:127.0.0.1:38925_solr    ] o.a.s.h.a.CollectionsHandler Wait for new collection to be active for at most 45 seconds. Check all shard replicas
   [junit4]   2> 1173287 INFO  (OverseerCollectionConfigSetProcessor-72182461512941573-127.0.0.1:38925_solr-n_0000000000) [n:127.0.0.1:38925_solr    ] o.a.s.c.OverseerTaskQueue Response ZK path: /overseer/collection-queue-work/qnr-0000000000 doesn't exist.  Requestor may have disconnected from ZooKeeper
   [junit4]   2> 1173352 INFO  (zkCallback-8184-thread-1) [    ] o.a.s.c.c.ZkStateReader A cluster state change: [WatchedEvent state:SyncConnected type:NodeDataChanged path:/collections/testRepFactor1LeaderStartup/state.json] for collection [testRepFactor1LeaderStartup] has occurred - updating... (live nodes size: [1])
   [junit4]   2> 1173352 INFO  (zkCallback-8184-thread-3) [    ] o.a.s.c.c.ZkStateReader A cluster state change: [WatchedEvent state:SyncConnected type:NodeDataChanged path:/collections/testRepFactor1LeaderStartup/state.json] for collection [testRepFactor1LeaderStartup] has occurred - updating... (live nodes size: [1])
   [junit4]   2> 1173352 INFO  (zkCallback-8184-thread-2) [    ] o.a.s.c.c.ZkStateReader A cluster state change: [WatchedEvent state:SyncConnected type:NodeDataChanged path:/collections/testRepFactor1LeaderStartup/state.json] for collection [testRepFactor1LeaderStartup] has occurred - updating... (live nodes size: [1])
   [junit4]   2> 1173353 INFO  (qtp1327395195-24132) [n:127.0.0.1:38925_solr    ] o.a.s.s.HttpSolrCall [admin] webapp=null path=/admin/collections params={pullReplicas=0&name=testRepFactor1LeaderStartup&nrtReplicas=1&action=CREATE&numShards=1&tlogReplicas=0&createNodeSet=127.0.0.1:38925_solr&wt=javabin&version=2} status=0 QTime=2068
   [junit4]   2> java.lang.RuntimeException
   [junit4]   2> 	at org.apache.solr.cloud.TestCloudSearcherWarming$SleepingSolrEventListener.init(TestCloudSearcherWarming.java:305)
   [junit4]   2> 	at org.apache.solr.core.SolrCore.createInitInstance(SolrCore.java:857)
   [junit4]   2> 	at org.apache.solr.handler.SolrConfigHandler$Command.verifyClass(SolrConfigHandler.java:558)
   [junit4]   2> 	at org.apache.solr.handler.SolrConfigHandler$Command.updateNamedPlugin(SolrConfigHandler.java:529)
   [junit4]   2> 	at org.apache.solr.handler.SolrConfigHandler$Command.handleCommands(SolrConfigHandler.java:480)
   [junit4]   2> 	at org.apache.solr.handler.SolrConfigHandler$Command.handlePOST(SolrConfigHandler.java:345)
   [junit4]   2> 	at org.apache.solr.handler.SolrConfigHandler$Command.access$100(SolrConfigHandler.java:158)
   [junit4]   2> 	at org.apache.solr.handler.SolrConfigHandler.handleRequestBody(SolrConfigHandler.java:136)
   [junit4]   2> 	at org.apache.solr.handler.RequestHandlerBase.handleRequest(RequestHandlerBase.java:199)
   [junit4]   2> 	at org.apache.solr.core.SolrCore.execute(SolrCore.java:2551)
   [junit4]   2> 	at org.apache.solr.servlet.HttpSolrCall.execute(HttpSolrCall.java:711)
   [junit4]   2> 	at org.apache.solr.servlet.HttpSolrCall.call(HttpSolrCall.java:516)
   [junit4]   2> 	at org.apache.solr.servlet.SolrDispatchFilter.doFilter(SolrDispatchFilter.java:394)
   [junit4]   2> 	at org.apache.solr.servlet.SolrDispatchFilter.doFilter(SolrDispatchFilter.java:340)
   [junit4]   2> 	at org.eclipse.jetty.servlet.ServletHandler$CachedChain.doFilter(ServletHandler.java:1610)
   [junit4]   2> 	at org.apache.solr.client.solrj.embedded.JettySolrRunner$DebugFilter.doFilter(JettySolrRunner.java:164)
   [junit4]   2> 	at org.eclipse.jetty.servlet.ServletHandler$CachedChain.doFilter(ServletHandler.java:1610)
   [junit4]   2> 	at org.eclipse.jetty.servlet.ServletHandler.doHandle(ServletHandler.java:540)
   [junit4]   2> 	at org.eclipse.jetty.server.handler.ScopedHandler.nextHandle(ScopedHandler.java:255)
   [junit4]   2> 	at org.eclipse.jetty.server.session.SessionHandler.doHandle(SessionHandler.java:1588)
   [junit4]   2> 	at org.eclipse.jetty.server.handler.ScopedHandler.nextHandle(ScopedHandler.java:255)
   [junit4]   2> 	at org.eclipse.jetty.server.handler.ContextHandler.doHandle(ContextHandler.java:1345)
   [junit4]   2> 	at org.eclipse.jetty.server.handler.ScopedHandler.nextScope(ScopedHandler.java:203)
   [junit4]   2> 	at org.eclipse.jetty.servlet.ServletHandler.doScope(ServletHandler.java:480)
   [junit4]   2> 	at org.eclipse.jetty.server.session.SessionHandler.doScope(SessionHandler.java:1557)
   [junit4]   2> 	at org.eclipse.jetty.server.handler.ScopedHandler.nextScope(ScopedHandler.java:201)
   [junit4]   2> 	at org.eclipse.jetty.server.handler.ContextHandler.doScope(ContextHandler.java:1247)
   [junit4]   2> 	at org.eclipse.jetty.server.handler.ScopedHandler.handle(ScopedHandler.java:144)
   [junit4]   2> 	at org.eclipse.jetty.server.handler.gzip.GzipHandler.handle(GzipHandler.java:703)
   [junit4]   2> 	at org.eclipse.jetty.server.handler.HandlerWrapper.handle(HandlerWrapper.java:132)
   [junit4]   2> 	at org.eclipse.jetty.server.Server.handle(Server.java:502)
   [junit4]   2> 	at org.eclipse.jetty.server.HttpChannel.handle(HttpChannel.java:364)
   [junit4]   2> 	at org.eclipse.jetty.server.HttpConnection.onFillable(HttpConnection.java:260)
   [junit4]   2> 	at org.eclipse.jetty.io.AbstractConnection$ReadCallback.succeeded(AbstractConnection.java:305)
   [junit4]   2> 	at org.eclipse.jetty.io.FillInterest.fillable(FillInterest.java:103)
   [junit4]   2> 	at org.eclipse.jetty.io.ChannelEndPoint$2.run(ChannelEndPoint.java:118)
   [junit4]   2> 	at org.eclipse.jetty.util.thread.QueuedThreadPool.runJob(QueuedThreadPool.java:765)
   [junit4]   2> 	at org.eclipse.jetty.util.thread.QueuedThreadPool$2.run(QueuedThreadPool.java:683)
   [junit4]   2> 	at java.base/java.lang.Thread.run(Thread.java:844)
   [junit4]   1> {event=newSearcher}
   [junit4]   2> java.lang.RuntimeException
   [junit4]   2> 	at org.apache.solr.cloud.TestCloudSearcherWarming$SleepingSolrEventListener.init(TestCloudSearcherWarming.java:305)
   [junit4]   2> 	at org.apache.solr.core.SolrCore.createInitInstance(SolrCore.java:857)
   [junit4]   2> 	at org.apache.solr.handler.SolrConfigHandler$Command.verifyClass(SolrConfigHandler.java:558)
   [junit4]   2> 	at org.apache.solr.handler.SolrConfigHandler$Command.updateNamedPlugin(SolrConfigHandler.java:529)
   [junit4]   2> 	at org.apache.solr.handler.SolrConfigHandler$Command.handleCommands(SolrConfigHandler.java:480)
   [junit4]   2> 	at org.apache.solr.handler.SolrConfigHandler$Command.handlePOST(SolrConfigHandler.java:345)
   [junit4]   2> 	at org.apache.solr.handler.SolrConfigHandler$Command.access$100(SolrConfigHandler.java:158)
   [junit4]   2> 	at org.apache.solr.handler.SolrConfigHandler.handleRequestBody(SolrConfigHandler.java:136)
   [junit4]   2> 	at org.apache.solr.handler.RequestHandlerBase.handleRequest(RequestHandlerBase.java:199)
   [junit4]   2> 	at org.apache.solr.core.SolrCore.execute(SolrCore.java:2551)
   [junit4]   2> 	at org.apache.solr.servlet.HttpSolrCall.execute(HttpSolrCall.java:711)
   [junit4]   2> 	at org.apache.solr.servlet.HttpSolrCall.call(HttpSolrCall.java:516)
   [junit4]   2> 	at org.apache.solr.servlet.SolrDispatchFilter.doFilter(SolrDispatchFilter.java:394)
   [junit4]   2> 	at org.apache.solr.servlet.SolrDispatchFilter.doFilter(SolrDispatchFilter.java:340)
   [junit4]   2> 	at org.eclipse.jetty.servlet.ServletHandler$CachedChain.doFilter(ServletHandler.java:1610)
   [junit4]   2> 	at org.apache.solr.client.solrj.embedded.JettySolrRunner$DebugFilter.doFilter(JettySolrRunner.java:164)
   [junit4]   2> 	at org.eclipse.jetty.servlet.ServletHandler$CachedChain.doFilter(ServletHandler.java:1610)
   [junit4]   2> 	at org.eclipse.jetty.servlet.ServletHandler.doHandle(ServletHandler.java:540)
   [junit4]   2> 	at org.eclipse.jetty.server.handler.ScopedHandler.nextHandle(ScopedHandler.java:255)
   [junit4]   2> 	at org.eclipse.jetty.server.session.SessionHandler.doHandle(SessionHandler.java:1588)
   [junit4]   2> 	at org.eclipse.jetty.server.handler.ScopedHandler.nextHandle(ScopedHandler.java:255)
   [junit4]   2> 	at org.eclipse.jetty.server.handler.ContextHandler.doHandle(ContextHandler.java:1345)
   [junit4]   2> 	at org.eclipse.jetty.server.handler.ScopedHandler.nextScope(ScopedHandler.java:203)
   [junit4]   2> 	at org.eclipse.jetty.servlet.ServletHandler.doScope(ServletHandler.java:480)
   [junit4]   2> 	at org.eclipse.jetty.server.session.SessionHandler.doScope(SessionHandler.java:1557)
   [junit4]   2> 	at org.eclipse.jetty.server.handler.ScopedHandler.nextScope(ScopedHandler.java:201)
   [junit4]   2> 	at org.eclipse.jetty.server.handler.ContextHandler.doScope(ContextHandler.java:1247)
   [junit4]   2> 	at org.eclipse.jetty.server.handler.ScopedHandler.handle(ScopedHandler.java:144)
   [junit4]   2> 	at org.eclipse.jetty.server.handler.gzip.GzipHandler.handle(GzipHandler.java:703)
   [junit4]   2> 	at org.eclipse.jetty.server.handler.HandlerWrapper.handle(HandlerWrapper.java:132)
   [junit4]   2> 	at org.eclipse.jetty.server.Server.handle(Server.java:502)
   [junit4]   2> 	at org.eclipse.jetty.server.HttpChannel.handle(HttpChannel.java:364)
   [junit4]   2> 	at org.eclipse.jetty.server.HttpConnection.onFillable(HttpConnection.java:260)
   [junit4]   2> 	at org.eclipse.jetty.io.AbstractConnection$ReadCallback.succeeded(AbstractConnection.java:305)
   [junit4]   2> 	at org.eclipse.jetty.io.FillInterest.fillable(FillInterest.java:103)
   [junit4]   2> 	at org.eclipse.jetty.io.ChannelEndPoint$2.run(ChannelEndPoint.java:118)
   [junit4]   2> 	at org.eclipse.jetty.util.thread.QueuedThreadPool.runJob(QueuedThreadPool.java:765)
   [junit4]   2> 	at org.eclipse.jetty.util.thread.QueuedThreadPool$2.run(QueuedThreadPool.java:683)
   [junit4]   2> 	at java.base/java.lang.Thread.run(Thread.java:844)
   [junit4]   1> {event=firstSearcher}
   [junit4]   2> 1173357 INFO  (qtp1327395195-24131) [n:127.0.0.1:38925_solr c:testRepFactor1LeaderStartup s:shard1 r:core_node2 x:testRepFactor1LeaderStartup_shard1_replica_n1] o.a.s.h.SolrConfigHandler Executed config commands successfully and persisted to ZK [{"add-listener":{
   [junit4]   2>     "name":"newSearcherListener",
   [junit4]   2>     "event":"newSearcher",
   [junit4]   2>     "class":"org.apache.solr.cloud.TestCloudSearcherWarming$SleepingSolrEventListener"}}, {"add-listener":{
   [junit4]   2>     "name":"firstSearcherListener",
   [junit4]   2>     "event":"firstSearcher",
   [junit4]   2>     "class":"org.apache.solr.cloud.TestCloudSearcherWarming$SleepingSolrEventListener"}}]
   [junit4]   2> 1173357 INFO  (qtp1327395195-24131) [n:127.0.0.1:38925_solr c:testRepFactor1LeaderStartup s:shard1 r:core_node2 x:testRepFactor1LeaderStartup_shard1_replica_n1] o.a.s.h.SolrConfigHandler Waiting up to 30 secs for 1 replicas to set the property overlay to be of version 0 for collection testRepFactor1LeaderStartup
   [junit4]   2> 1173357 INFO  (Thread-3798) [    ] o.a.s.c.SolrCore config update listener called for core testRepFactor1LeaderStartup_shard1_replica_n1
   [junit4]   2> 1173357 INFO  (Thread-3798) [    ] o.a.s.c.SolrCore core reload testRepFactor1LeaderStartup_shard1_replica_n1
   [junit4]   2> 1173357 INFO  (solrHandlerExecutor-7522-thread-1-processing-n:127.0.0.1:38925_solr x:testRepFactor1LeaderStartup_shard1_replica_n1 c:testRepFactor1LeaderStartup s:shard1 r:core_node2) [n:127.0.0.1:38925_solr c:testRepFactor1LeaderStartup s:shard1 r:core_node2 x:testRepFactor1LeaderStartup_shard1_replica_n1] o.a.s.h.SolrConfigHandler Time elapsed : 0 secs, maxWait 30
   [junit4]   2> 1173360 INFO  (Thread-3798) [    ] o.a.s.c.RequestParams conf resource params.json loaded . version : 0 
   [junit4]   2> 1173360 INFO  (Thread-3798) [    ] o.a.s.c.RequestParams request params refreshed to version 0
   [junit4]   2> 1173361 WARN  (Thread-3798) [    ] o.a.s.c.SolrConfig Couldn't add files from /home/jenkins/workspace/Lucene-Solr-master-Linux/solr/build/solr-core/test/J1/temp/solr.cloud.TestCloudSearcherWarming_7D7602E4034B9072-001/tempDir-001/node1/testRepFactor1LeaderStartup_shard1_replica_n1/../../../../contrib/extraction/lib filtered by .*\.jar to classpath: /home/jenkins/workspace/Lucene-Solr-master-Linux/solr/build/solr-core/test/J1/temp/solr.cloud.TestCloudSearcherWarming_7D7602E4034B9072-001/tempDir-001/node1/testRepFactor1LeaderStartup_shard1_replica_n1/../../../../contrib/extraction/lib
   [junit4]   2> 1173361 WARN  (Thread-3798) [    ] o.a.s.c.SolrConfig Couldn't add files from /home/jenkins/workspace/Lucene-Solr-master-Linux/solr/build/solr-core/test/J1/temp/solr.cloud.TestCloudSearcherWarming_7D7602E4034B9072-001/tempDir-001/node1/testRepFactor1LeaderStartup_shard1_replica_n1/../../../../dist filtered by solr-cell-\d.*\.jar to classpath: /home/jenkins/workspace/Lucene-Solr-master-Linux/solr/build/solr-core/test/J1/temp/solr.cloud.TestCloudSearcherWarming_7D7602E4034B9072-001/tempDir-001/node1/testRepFactor1LeaderStartup_shard1_replica_n1/../../../../dist
   [junit4]   2> 1173361 WARN  (Thread-3798) [    ] o.a.s.c.SolrConfig Couldn't add files from /home/jenkins/workspace/Lucene-Solr-master-Linux/solr/build/solr-core/test/J1/temp/solr.cloud.TestCloudSearcherWarming_7D7602E4034B9072-001/tempDir-001/node1/testRepFactor1LeaderStartup_shard1_replica_n1/../../../../contrib/clustering/lib filtered by .*\.jar to classpath: /home/jenkins/workspace/Lucene-Solr-master-Linux/solr/build/solr-core/test/J1/temp/solr.cloud.TestCloudSearcherWarming_7D7602E4034B9072-001/tempDir-001/node1/testRepFactor1LeaderStartup_shard1_replica_n1/../../../../contrib/clustering/lib
   [junit4]   2> 1173361 WARN  (Thread-3798) [    ] o.a.s.c.SolrConfig Couldn't add files from /home/jenkins/workspace/Lucene-Solr-master-Linux/solr/build/solr-core/test/J1/temp/solr.cloud.TestCloudSearcherWarming_7D7602E4034B9072-001/tempDir-001/node1/testRepFactor1LeaderStartup_shard1_replica_n1/../../../../dist filtered by solr-clustering-\d.*\.jar to classpath: /home/jenkins/workspace/Lucene-Solr-master-Linux/solr/build/solr-core/test/J1/temp/solr.cloud.TestCloudSearcherWarming_7D7602E4034B9072-001/tempDir-001/node1/testRepFactor1LeaderStartup_shard1_replica_n1/../../../../dist
   [junit4]   2> 1173361 WARN  (Thread-3798) [    ] o.a.s.c.SolrConfig Couldn't add files from /home/jenkins/workspace/Lucene-Solr-master-Linux/solr/build/solr-core/test/J1/temp/solr.cloud.TestCloudSearcherWarming_7D7602E4034B9072-001/tempDir-001/node1/testRepFactor1LeaderStartup_shard1_replica_n1/../../../../contrib/langid/lib filtered by .*\.jar to classpath: /home/jenkins/workspace/Lucene-Solr-master-Linux/solr/build/solr-core/test/J1/temp/solr.cloud.TestCloudSearcherWarming_7D7602E4034B9072-001/tempDir-001/node1/testRepFactor1LeaderStartup_shard1_replica_n1/../../../../contrib/langid/lib
   [junit4]   2> 1173361 WARN  (Thread-3798) [    ] o.a.s.c.SolrConfig Couldn't add files from /home/jenkins/workspace/Lucene-Solr-master-Linux/solr/build/solr-core/test/J1/temp/solr.cloud.TestCloudSearcherWarming_7D7602E4034B9072-001/tempDir-001/node1/testRepFactor1LeaderStartup_shard1_replica_n1/../../../../dist filtered by solr-langid-\d.*\.jar to classpath: /home/jenkins/workspace/Lucene-Solr-master-Linux/solr/build/solr-core/test/J1/temp/solr.cloud.TestCloudSearcherWarming_7D7602E4034B9072-001/tempDir-001/node1/testRepFactor1LeaderStartup_shard1_replica_n1/../../../../dist
   [junit4]   2> 1173361 WARN  (Thread-3798) [    ] o.a.s.c.SolrConfig Couldn't add files from /home/jenkins/workspace/Lucene-Solr-master-Linux/solr/build/solr-core/test/J1/temp/solr.cloud.TestCloudSearcherWarming_7D7602E4034B9072-001/tempDir-001/node1/testRepFactor1LeaderStartup_shard1_replica_n1/../../../../contrib/velocity/lib filtered by .*\.jar to classpath: /home/jenkins/workspace/Lucene-Solr-master-Linux/solr/build/solr-core/test/J1/temp/solr.cloud.TestCloudSearcherWarming_7D7602E4034B9072-001/tempDir-001/node1/testRepFactor1LeaderStartup_shard1_replica_n1/../../../../contrib/velocity/lib
   [junit4]   2> 1173361 WARN  (Thread-3798) [    ] o.a.s.c.SolrConfig Couldn't add files from /home/jenkins/workspace/Lucene-Solr-master-Linux/solr/build/solr-core/test/J1/temp/solr.cloud.TestCloudSearcherWarming_7D7602E4034B9072-001/tempDir-001/node1/testRepFactor1LeaderStartup_shard1_replica_n1/../../../../dist filtered by solr-velocity-\d.*\.jar to classpath: /home/jenkins/workspace/Lucene-Solr-master-Linux/solr/build/solr-core/test/J1/temp/solr.cloud.TestCloudSearcherWarming_7D7602E4034B9072-001/tempDir-001/node1/testRepFactor1LeaderStartup_shard1_replica_n1/../../../../dist
   [junit4]   2> 1173361 WARN  (Thread-3798) [    ] o.a.s.c.SolrConfig Couldn't add files from /home/jenkins/workspace/Lucene-Solr-master-Linux/solr/build/solr-core/test/J1/temp/solr.cloud.TestCloudSearcherWarming_7D7602E4034B9072-001/tempDir-001/node1/testRepFactor1LeaderStartup_shard1_replica_n1/../../../../dist filtered by solr-ltr-\d.*\.jar to classpath: /home/jenkins/workspace/Lucene-Solr-master-Linux/solr/build/solr-core/test/J1/temp/solr.cloud.TestCloudSearcherWarming_7D7602E4034B9072-001/tempDir-001/node1/testRepFactor1LeaderStartup_shard1_replica_n1/../../../../dist
   [junit4]   2> 1173371 INFO  (Thread-3798) [    ] o.a.s.c.SolrConfig Using Lucene MatchVersion: 9.0.0
   [junit4]   2> 1173383 INFO  (Thread-3798) [    ] o.a.s.s.IndexSchema [testRepFactor1LeaderStartup_shard1_replica_n1] Schema name=default-config
   [junit4]   2> 1173458 INFO  (qtp1327395195-24132) [n:127.0.0.1:38925_solr c:testRepFactor1LeaderStartup s:shard1 r:core_node2 x:testRepFactor1LeaderStartup_shard1_replica_n1] o.a.s.h.SolrConfigHandler expecting overlay version 0 but my version is -1
   [junit4]   2> 1173458 INFO  (qtp1327395195-24132) [n:127.0.0.1:38925_solr c:testRepFactor1LeaderStartup s:shard1 r:core_node2 x:testRepFactor1LeaderStartup_shard1_replica_n1] o.a.s.c.S.Request [testRepFactor1LeaderStartup_shard1_replica_n1]  webapp=/solr path=/config/znodeVersion params={overlay=0&wt=javabin&version=2} status=0 QTime=0
   [junit4]   2> 1173458 INFO  (SolrConfigHandler-refreshconf) [    ] o.a.s.h.SolrConfigHandler Another reload is in progress . Not doing anything
   [junit4]   2> 1173459 INFO  (solrHandlerExecutor-7522-thread-1-processing-n:127.0.0.1:38925_solr x:testRepFactor1LeaderStartup_shard1_replica_n1 c:testRepFactor1LeaderStartup s:shard1 r:core_node2) [n:127.0.0.1:38925_solr c:testRepFactor1LeaderStartup s:shard1 r:core_node2 x:testRepFactor1LeaderStartup_shard1_replica_n1] o.a.s.h.SolrConfigHandler Could not get expectedVersion 0 from http://127.0.0.1:38925/solr/testRepFactor1LeaderStartup_shard1_replica_n1/ for prop overlay   after 1 attempts
   [junit4]   2> 1173459 INFO  (solrHandlerExecutor-7522-thread-1-processing-n:127.0.0.1:38925_solr x:testRepFactor1LeaderStartup_shard1_replica_n1 c:testRepFactor1LeaderStartup s:shard1 r:core_node2) [n:127.0.0.1:38925_solr c:testRepFactor1LeaderStartup s:shard1 r:core_node2 x:testRepFactor1LeaderStartup_shard1_replica_n1] o.a.s.h.SolrConfigHandler Time elapsed : 0 secs, maxWait 30
   [junit4]   2> 1173495 INFO  (Thread-3798) [    ] o.a.s.s.IndexSchema Loaded schema default-config/1.6 with uniqueid field id
   [junit4]   2> 1173507 INFO  (Thread-3798) [    ] o.a.s.c.CoreContainer Reloading SolrCore 'testRepFactor1LeaderStartup_shard1_replica_n1' using configuration from collection testRepFactor1LeaderStartup
   [junit4]   2> 1173522 INFO  (Thread-3798) [n:127.0.0.1:38925_solr c:testRepFactor1LeaderStartup s:shard1 r:core_node2 x:testRepFactor1LeaderStartup_shard1_replica_n1] o.a.s.m.r.SolrJmxReporter JMX monitoring for 'solr_38925.solr.core.testRepFactor1LeaderStartup.shard1.replica_n1' (registry 'solr.core.testRepFactor1LeaderStartup.shard1.replica_n1') enabled at server: com.sun.jmx.mbeanserver.JmxMBeanServer@40df98c5
   [junit4]   2> 1173522 INFO  (Thread-3798) [n:127.0.0.1:38925_solr c:testRepFactor1LeaderStartup s:shard1 r:core_node2 x:testRepFactor1LeaderStartup_shard1_replica_n1] o.a.s.c.SolrCore [[testRepFactor1LeaderStartup_shard1_replica_n1] ] Opening new SolrCore at [/home/jenkins/workspace/Lucene-Solr-master-Linux/solr/build/solr-core/test/J1/temp/solr.cloud.TestCloudSearcherWarming_7D7602E4034B9072-001/tempDir-001/node1/testRepFactor1LeaderStartup_shard1_replica_n1], dataDir=[/home/jenkins/workspace/Lucene-Solr-master-Linux/solr/build/solr-core/test/J1/temp/solr.cloud.TestCloudSearcherWarming_7D7602E4034B9072-001/tempDir-001/node1/./testRepFactor1LeaderStartup_shard1_replica_n1/data/]
   [junit4]   2> java.lang.RuntimeException
   [junit4]   2> 	at org.apache.solr.cloud.TestCloudSearcherWarming$SleepingSolrEventListener.init(TestCloudSearcherWarming.java:305)
   [junit4]   2> 	at org.apache.solr.core.SolrCore.createInitInstance(SolrCore.java:857)
   [junit4]   2> 	at org.apache.solr.core.SolrCore.initListeners(SolrCore.java:603)
   [junit4]   2> 	at org.apache.solr.core.SolrCore.<init>(SolrCore.java:957)
   [junit4]   2> 	at org.apache.solr.core.SolrCore.reload(SolrCore.java:666)
   [junit4]   2> 	at org.apache.solr.core.CoreContainer.reload(CoreContainer.java:1450)
   [junit4]   2> 	at org.apache.solr.core.SolrCore.lambda$getConfListener$20(SolrCore.java:3041)
   [junit4]   2> 	at org.apache.solr.cloud.ZkController.lambda$fireEventListeners$21(ZkController.java:2468)
   [junit4]   2> 	at java.base/java.lang.Thread.run(Thread.java:844)
   [junit4]   1> {event=newSearcher}
   [junit4]   2> java.lang.RuntimeException
   [junit4]   2> 	at org.apache.solr.cloud.TestCloudSearcherWarming$SleepingSolrEventListener.init(TestCloudSearcherWarming.java:305)
   [junit4]   2> 	at org.apache.solr.core.SolrCore.createInitInstance(SolrCore.java:857)
   [junit4]   2> 	at org.apache.solr.core.SolrCore.initListeners(SolrCore.java:599)
   [junit4]   2> 	at org.apache.solr.core.SolrCore.<init>(SolrCore.java:957)
   [junit4]   2> 	at org.apache.solr.core.SolrCore.reload(SolrCore.java:666)
   [junit4]   2> 	at org.apache.solr.core.CoreContainer.reload(CoreContainer.java:1450)
   [junit4]   2> 	at org.apache.solr.core.SolrCore.lambda$getConfListener$20(SolrCore.java:3041)
   [junit4]   2> 	at org.apache.solr.cloud.ZkController.lambda$fireEventListeners$21(ZkController.java:2468)
   [junit4]   2> 	at java.base/java.lang.Thread.run(Thread.java:844)
   [junit4]   1> {event=firstSearcher}
   [junit4]   2> 1173525 INFO  (Thread-3798) [n:127.0.0.1:38925_solr c:testRepFactor1LeaderStartup s:shard1 r:core_node2 x:testRepFactor1LeaderStartup_shard1_replica_n1] o.a.s.r.XSLTResponseWriter xsltCacheLifetimeSeconds=5
   [junit4]   2> 1173550 INFO  (Thread-3798) [n:127.0.0.1:38925_solr c:testRepFactor1LeaderStartup s:shard1 r:core_node2 x:testRepFactor1LeaderStartup_shard1_replica_n1] o.a.s.u.CommitTracker Hard AutoCommit: if uncommitted for 15000ms; 
   [junit4]   2> 1173550 INFO  (Thread-3798) [n:127.0.0.1:38925_solr c:testRepFactor1LeaderStartup s:shard1 r:core_node2 x:testRepFactor1LeaderStartup_shard1_replica_n1] o.a.s.u.CommitTracker Soft AutoCommit: disabled
   [junit4]   2> 1173551 INFO  (Thread-3798) [n:127.0.0.1:38925_solr c:testRepFactor1LeaderStartup s:shard1 r:core_node2 x:testRepFactor1LeaderStartup_shard1_replica_n1] o.a.s.s.SolrIndexSearcher Opening [Searcher@1dafc2c9[testRepFactor1LeaderStartup_shard1_replica_n1] main]
   [junit4]   2> 1173552 INFO  (Thread-3798) [n:127.0.0.1:38925_solr c:testRepFactor1LeaderStartup s:shard1 r:core_node2 x:testRepFactor1LeaderStartup_shard1_replica_n1] o.a.s.r.ManagedResourceStorage Configured ZooKeeperStorageIO with znodeBase: /configs/testRepFactor1LeaderStartup.AUTOCREATED
   [junit4]   2> 1173552 INFO  (Thread-3798) [n:127.0.0.1:38925_solr c:testRepFactor1LeaderStartup s:shard1 r:core_node2 x:testRepFactor1LeaderStartup_shard1_replica_n1] o.a.s.r.ManagedResourceStorage Loaded null at path _rest_managed.json using ZooKeeperStorageIO:path=/configs/testRepFactor1LeaderStartup.AUTOCREATED
   [junit4]   2> 1173552 INFO  (Thread-3798) [n:127.0.0.1:38925_solr c:testRepFactor1LeaderStartup s:shard1 r:core_node2 x:testRepFactor1LeaderStartup_shard1_replica_n1] o.a.s.s.ZkIndexSchemaReader Creating ZooKeeper watch for the managed schema at /configs/testRepFactor1LeaderStartup.AUTOCREATED/managed-schema
   [junit4]   2> 1173552 INFO  (Thread-3798) [n:127.0.0.1:38925_solr c:testRepFactor1LeaderStartup s:shard1 r:core_node2 x:testRepFactor1LeaderStartup_shard1_replica_n1] o.a.s.s.ZkIndexSchemaReader Current schema version 0 is already the latest
   [junit4]   2> 1173552 INFO  (Thread-3798) [n:127.0.0.1:38925_solr c:testRepFactor1LeaderStartup s:shard1 r:core_node2 x:testRepFactor1LeaderStartup_shard1_replica_n1] o.a.s.h.c.SpellCheckComponent Initializing spell checkers
   [junit4]   2> 1173552 INFO  (Thread-3798) [n:127.0.0.1:38925_solr c:testRepFactor1LeaderStartup s:shard1 r:core_node2 x:testRepFactor1LeaderStartup_shard1_replica_n1] o.a.s.s.DirectSolrSpellChecker init: {name=default,field=_text_,classname=solr.DirectSolrSpellChecker,distanceMeasure=internal,accuracy=0.5,maxEdits=2,minPrefix=1,maxInspections=5,minQueryLength=4,maxQueryFrequency=0.01}
   [junit4]   2> 1173552 INFO  (Thread-3798) [n:127.0.0.1:38925_solr c:testRepFactor1LeaderStartup s:shard1 r:core_node2 x:testRepFactor1LeaderStartup_shard1_replica_n1] o.a.s.h.ReplicationHandler Commits will be reserved for 10000ms.
   [junit4]   2> 1173553 INFO  (Thread-3798) [n:127.0.0.1:38925_solr c:testRepFactor1LeaderStartup s:shard1 r:core_node2 x:testRepFactor1LeaderStartup_shard1_replica_n1] o.a.s.u.UpdateLog Could not find max version in index or recent updates, using new clock 1622113571034890240
   [junit4]   2> 1173554 INFO  (searcherExecutor-7523-thread-1-processing-n:127.0.0.1:38925_solr x:testRepFactor1LeaderStartup_shard1_replica_n1 c:testRepFactor1LeaderStartup s:shard1 r:core_node2) [n:127.0.0.1:38925_solr c:testRepFactor1LeaderStartup s:shard1 r:core_node2 x:testRepFactor1LeaderStartup_shard1_replica_n1] o.a.s.c.QuerySenderListener QuerySenderListener sending requests to Searcher@1dafc2c9[testRepFactor1LeaderStartup_shard1_replica_n1] main{ExitableDirectoryReader(UninvertingDirectoryReader())}
   [junit4]   2> 1173554 INFO  (searcherExecutor-7523-thread-1-processing-n:127.0.0.1:38925_solr x:testRepFactor1LeaderStartup_shard1_replica_n1 c:testRepFactor1LeaderStartup s:shard1 r:core_node2) [n:127.0.0.1:38925_solr c:testRepFactor1LeaderStartup s:shard1 r:core_node2 x:testRepFactor1LeaderStartup_shard1_replica_n1] o.a.s.c.QuerySenderListener QuerySenderListener done.
   [junit4]   2> 1173554 INFO  (searcherExecutor-7523-thread-1-processing-n:127.0.0.1:38925_solr x:testRepFactor1LeaderStartup_shard1_replica_n1 c:testRepFactor1LeaderStartup s:shard1 r:core_node2) [n:127.0.0.1:38925_solr c:testRepFactor1LeaderStartup s:shard1 r:core_node2 x:testRepFactor1LeaderStartup_shard1_replica_n1] o.a.s.h.c.SpellCheckComponent Loading spell index for spellchecker: default
   [junit4]   2> 1173565 INFO  (Thread-3798) [n:127.0.0.1:38925_solr c:testRepFactor1LeaderStartup s:shard1 r:core_node2 x:testRepFactor1LeaderStartup_shard1_replica_n1] o.a.s.u.DefaultSolrCoreState New IndexWriter is ready to be used.
   [junit4]   2> 1173565 INFO  (qtp1327395195-24133) [n:127.0.0.1:38925_solr c:testRepFactor1LeaderStartup s:shard1 r:core_node2 x:testRepFactor1LeaderStartup_shard1_replica_n1] o.a.s.h.SolrConfigHandler expecting overlay version 0 but my version is -1
   [junit4]   2> 1173565 INFO  (qtp1327395195-24133) [n:127.0.0.1:38925_solr c:testRepFactor1LeaderStartup s:shard1 r:core_node2 x:testRepFactor1LeaderStartup_shard1_replica_n1] o.a.s.c.S.Request [testRepFactor1LeaderStartup_shard1_replica_n1]  webapp=/solr path=/config/znodeVersion params={overlay=0&wt=javabin&version=2} status=0 QTime=0
   [junit4]   2> 1173565 INFO  (SolrConfigHandler-refreshconf) [    ] o.a.s.h.SolrConfigHandler Another reload is in progress . Not doing anything
   [junit4]   2> 1173565 INFO  (searcherExecutor-7523-thread-1-processing-n:127.0.0.1:38925_solr x:testRepFactor1LeaderStartup_shard1_replica_n1 c:testRepFactor1LeaderStartup s:shard1 r:core_node2) [n:127.0.0.1:38925_solr c:testRepFactor1LeaderStartup s:shard1 r:core_node2 x:testRepFactor1LeaderStartup_shard1_replica_n1] o.a.s.c.SolrCore [testRepFactor1LeaderStartup_shard1_replica_n1] Registered new searcher Searcher@1dafc2c9[testRepFactor1LeaderStartup_shard1_replica_n1] main{ExitableDirectoryReader(UninvertingDirectoryReader())}
   [junit4]   2> 1173565 INFO  (solrHandlerExecutor-7522-thread-1-processing-n:127.0.0.1:38925_solr x:testRepFactor1LeaderStartup_shard1_replica_n1 c:testRepFactor1LeaderStartup s:shard1 r:core_node2) [n:127.0.0.1:38925_solr c:testRepFactor1LeaderStartup s:shard1 r:core_node2 x:testRepFactor1LeaderStartup_shard1_replica_n1] o.a.s.h.SolrConfigHandler Could not get expectedVersion 0 from http://127.0.0.1:38925/solr/testRepFactor1LeaderStartup_shard1_replica_n1/ for prop overlay   after 2 attempts
   [junit4]   2> 1173565 INFO  (solrHandlerExecutor-7522-thread-1-processing-n:127.0.0.1:38925_solr x:testRepFactor1LeaderStartup_shard1_replica_n1 c:testRepFactor1LeaderStartup s:shard1 r:core_node2) [n:127.0.0.1:38925_solr c:testRepFactor1LeaderStartup s:shard1 r:core_node2 x:testRepFactor1LeaderStartup_shard1_replica_n1] o.a.s.h.SolrConfigHandler Time elapsed : 0 secs, maxWait 30
   [junit4]   2> 1173565 INFO  (Thread-3798) [n:127.0.0.1:38925_solr c:testRepFactor1LeaderStartup s:shard1 r:core_node2 x:testRepFactor1LeaderStartup_shard1_replica_n1] o.a.s.s.SolrIndexSearcher Opening [Searcher@1e9ae13a[testRepFactor1LeaderStartup_shard1_replica_n1] main]
   [junit4]   2> 1173565 INFO  (searcherExecutor-7523-thread-1-processing-n:127.0.0.1:38925_solr x:testRepFactor1LeaderStartup_shard1_replica_n1 c:testRepFactor1LeaderStartup s:shard1 r:core_node2) [n:127.0.0.1:38925_solr c:testRepFactor1LeaderStartup s:shard1 r:core_node2 x:testRepFactor1LeaderStartup_shard1_replica_n1] o.a.s.c.QuerySenderListener QuerySenderListener sending requests to Searcher@1e9ae13a[testRepFactor1LeaderStartup_shard1_replica_n1] main{ExitableDirectoryReader(UninvertingDirectoryReader())}
   [junit4]   2> 1173565 INFO  (searcherExecutor-7523-thread-1-processing-n:127.0.0.1:38925_solr x:testRepFactor1LeaderStartup_shard1_replica_n1 c:testRepFactor1LeaderStartup s:shard1 r:core_node2) [n:127.0.0.1:38925_solr c:testRepFactor1LeaderStartup s:shard1 r:core_node2 x:testRepFactor1LeaderStartup_shard1_replica_n1] o.a.s.c.QuerySenderListener QuerySenderListener done.
   [junit4]   2> 1173568 INFO  (searcherExecutor-7523-thread-1-processing-n:127.0.0.1:38925_solr x:testRepFactor1LeaderStartup_shard1_replica_n1 c:testRepFactor1LeaderStartup s:shard1 r:core_node2) [n:127.0.0.1:38925_solr c:testRepFactor1LeaderStartup s:shard1 r:core_node2 x:testRepFactor1LeaderStartup_shard1_replica_n1] o.a.s.c.SolrCore [testRepFactor1LeaderStartup_shard1_replica_n1] Registered new searcher Searcher@1e9ae13a[testRepFactor1LeaderStartup_shard1_replica_n1] main{ExitableDirectoryReader(UninvertingDirectoryReader())}
   [junit4]   2> 1173665 INFO  (qtp1327395195-24132) [n:127.0.0.1:38925_solr c:testRepFactor1LeaderStartup s:shard1 r:core_node2 x:testRepFactor1LeaderStartup_shard1_replica_n1] o.a.s.h.SolrConfigHandler I already have the expected version 0 of config
   [junit4]   2> 1173665 INFO  (qtp1327395195-24132) [n:127.0.0.1:38925_solr c:testRepFactor1LeaderStartup s:shard1 r:core_node2 x:testRepFactor1LeaderStartup_shard1_replica_n1] o.a.s.h.SolrConfigHandler isStale false , resourceloader org.apache.solr.cloud.ZkSolrResourceLoader
   [junit4]   2> 1173665 INFO  (qtp1327395195-24132) [n:127.0.0.1:38925_solr c:testRepFactor1LeaderStartup s:shard1 r:core_node2 x:testRepFactor1LeaderStartup_shard1_replica_n1] o.a.s.c.S.Request [testRepFactor1LeaderStartup_shard1_replica_n1]  webapp=/solr path=/config/znodeVersion params={overlay=0&wt=javabin&version=2} status=0 QTime=0
   [junit4]   2> 1173666 INFO  (qtp1327395195-24131) [n:127.0.0.1:38925_solr c:testRepFactor1LeaderStartup s:shard1 r:core_node2 x:testRepFactor1LeaderStartup_shard1_replica_n1] o.a.s.h.SolrConfigHandler Took 309.0ms to set the property overlay to be of version 0 for collection testRepFactor1LeaderStartup
   [junit4]   2> 1173666 INFO  (qtp1327395195-24131) [n:127.0.0.

[...truncated too long message...]

AdminApis, AddBlockUpdateTest, TestMacros, ExitableDirectoryReaderTest, ZkSolrClientTest, BlockJoinFacetRandomTest, HighlighterTest, CdcrBidirectionalTest, DocValuesMissingTest, TestSubQueryTransformerCrossCore, TestGeoJSONResponseWriter, TestUtilizeNode, TestStressCloudBlindAtomicUpdates, TestLMDirichletSimilarityFactory, SparseHLLTest, TestLegacyNumericRangeQueryBuilder, SpatialHeatmapFacetsTest, MinimalSchemaTest, TestJsonFacetRefinement, HdfsBasicDistributedZkTest, TestTrieFacet, TestSweetSpotSimilarityFactory, AutoscalingHistoryHandlerTest, MetricsHistoryIntegrationTest, PKIAuthenticationIntegrationTest, ChaosMonkeyNothingIsSafeTest, ResponseBuilderTest, ExecutePlanActionTest, TestBinaryResponseWriter, TestPhraseSuggestions, OrderedExecutorTest, TestDocTermOrds, DistributedQueryComponentOptimizationTest, TestReplicaProperties, IgnoreCommitOptimizeUpdateProcessorFactoryTest, TestSolrCoreSnapshots, CurrencyFieldTypeTest, TestSearchPerf, ShufflingReplicaListTransformerTest, TransactionLogTest, PreAnalyzedFieldManagedSchemaCloudTest, TestUseDocValuesAsStored, TestSolrCLIRunExample, FullSolrCloudDistribCmdsTest, TestAtomicUpdateErrorCases, ScheduledMaintenanceTriggerTest, TestQuerySenderListener, DistanceUnitsTest, TestSolrCoreParser, SpellPossibilityIteratorTest, TestHighlightDedupGrouping, TestMissingGroups, TimeRoutedAliasUpdateProcessorTest, TestCollectionsAPIViaSolrCloudCluster, TestInitQParser, RootFieldTest, NodeLostTriggerTest, TestReqParamsAPI, SolrGraphiteReporterTest, SolrPluginUtilsTest, BooleanFieldTest, SubstringBytesRefFilterTest, ShardSplitTest, CloudExitableDirectoryReaderTest, AutoAddReplicasPlanActionTest, RulesTest, NodeAddedTriggerIntegrationTest, IndexSizeTriggerTest, TestConfigSets, TestSimExecutePlanAction, HttpPartitionTest, CacheHeaderTest, InfoHandlerTest, TestStressLucene, TestSolrDeletionPolicy1, DistributedUpdateProcessorTest, VMParamsZkACLAndCredentialsProvidersTest, LeaderElectionTest, TestBadConfig, TaggerTest, TestAnalyzedSuggestions, QueryEqualityTest, RestartWhileUpdatingTest, TestSchemaManager, ChaosMonkeySafeLeaderWithPullReplicasTest, TestPseudoReturnFields, TestSimComputePlanAction, MoreLikeThisHandlerTest, ReplicaListTransformerTest, IndexSchemaTest, DeleteShardTest, UUIDUpdateProcessorFallbackTest, DistanceFunctionTest, FullHLLTest, SaslZkACLProviderTest, TestEmbeddedSolrServerConstructors, TermVectorComponentTest, TestOverriddenPrefixQueryForCustomFieldType, TestUniqueKeyFieldResource, TestXmlQParserPlugin, TestSimPolicyCloud, TestSimpleTrackingShardHandler, TestCharFilters, TestLuceneMatchVersion, TokenizerChainTest, AddReplicaTest, AsyncCallRequestStatusResponseTest, BasicDistributedZk2Test, ConcurrentCreateRoutedAliasTest, ConfigSetsAPITest, ConnectionManagerTest, DeleteInactiveReplicaTest, DistribCursorPagingTest, DistribJoinFromCollectionTest, DistributedVersionInfoTest, LeaderVoteWaitTimeoutTest, OverseerTaskQueueTest, RecoveryZkTest, RemoteQueryErrorTest, ReplaceNodeNoTargetTest, ReplaceNodeTest, SharedFSAutoReplicaFailoverTest, SliceStateTest, TestCloudRecovery, TestCloudSearcherWarming]
   [junit4]   2> NOTE: reproduce with: ant test  -Dtestcase=TestCloudSearcherWarming -Dtests.seed=7D7602E4034B9072 -Dtests.multiplier=3 -Dtests.slow=true -Dtests.locale=ar-IL -Dtests.timezone=Africa/Nouakchott -Dtests.asserts=true -Dtests.file.encoding=UTF-8
   [junit4] ERROR   0.00s J1 | TestCloudSearcherWarming (suite) <<<
   [junit4]    > Throwable #1: com.carrotsearch.randomizedtesting.ThreadLeakError: 5 threads leaked from SUITE scope at org.apache.solr.cloud.TestCloudSearcherWarming: 
   [junit4]    >    1) Thread[id=24114, name=ProcessThread(sid:0 cport:46829):, state=WAITING, group=TGRP-TestCloudSearcherWarming]
   [junit4]    >         at java.base@10.0.1/jdk.internal.misc.Unsafe.park(Native Method)
   [junit4]    >         at java.base@10.0.1/java.util.concurrent.locks.LockSupport.park(LockSupport.java:194)
   [junit4]    >         at java.base@10.0.1/java.util.concurrent.locks.AbstractQueuedSynchronizer$ConditionObject.await(AbstractQueuedSynchronizer.java:2075)
   [junit4]    >         at java.base@10.0.1/java.util.concurrent.LinkedBlockingQueue.take(LinkedBlockingQueue.java:435)
   [junit4]    >         at app//org.apache.zookeeper.server.PrepRequestProcessor.run(PrepRequestProcessor.java:123)
   [junit4]    >    2) Thread[id=24111, name=NIOServerCxn.Factory:0.0.0.0/0.0.0.0:0, state=RUNNABLE, group=TGRP-TestCloudSearcherWarming]
   [junit4]    >         at java.base@10.0.1/sun.nio.ch.EPollArrayWrapper.epollWait(Native Method)
   [junit4]    >         at java.base@10.0.1/sun.nio.ch.EPollArrayWrapper.poll(EPollArrayWrapper.java:265)
   [junit4]    >         at java.base@10.0.1/sun.nio.ch.EPollSelectorImpl.doSelect(EPollSelectorImpl.java:92)
   [junit4]    >         at java.base@10.0.1/sun.nio.ch.SelectorImpl.lockAndDoSelect(SelectorImpl.java:89)
   [junit4]    >         at java.base@10.0.1/sun.nio.ch.SelectorImpl.select(SelectorImpl.java:100)
   [junit4]    >         at app//org.apache.zookeeper.server.NIOServerCnxnFactory.run(NIOServerCnxnFactory.java:196)
   [junit4]    >         at java.base@10.0.1/java.lang.Thread.run(Thread.java:844)
   [junit4]    >    3) Thread[id=24112, name=SessionTracker, state=TIMED_WAITING, group=TGRP-TestCloudSearcherWarming]
   [junit4]    >         at java.base@10.0.1/java.lang.Object.wait(Native Method)
   [junit4]    >         at app//org.apache.zookeeper.server.SessionTrackerImpl.run(SessionTrackerImpl.java:147)
   [junit4]    >    4) Thread[id=24113, name=SyncThread:0, state=WAITING, group=TGRP-TestCloudSearcherWarming]
   [junit4]    >         at java.base@10.0.1/jdk.internal.misc.Unsafe.park(Native Method)
   [junit4]    >         at java.base@10.0.1/java.util.concurrent.locks.LockSupport.park(LockSupport.java:194)
   [junit4]    >         at java.base@10.0.1/java.util.concurrent.locks.AbstractQueuedSynchronizer$ConditionObject.await(AbstractQueuedSynchronizer.java:2075)
   [junit4]    >         at java.base@10.0.1/java.util.concurrent.LinkedBlockingQueue.take(LinkedBlockingQueue.java:435)
   [junit4]    >         at app//org.apache.zookeeper.server.SyncRequestProcessor.run(SyncRequestProcessor.java:127)
   [junit4]    >    5) Thread[id=24110, name=ZkTestServer Run Thread, state=WAITING, group=TGRP-TestCloudSearcherWarming]
   [junit4]    >         at java.base@10.0.1/java.lang.Object.wait(Native Method)
   [junit4]    >         at java.base@10.0.1/java.lang.Thread.join(Thread.java:1353)
   [junit4]    >         at java.base@10.0.1/java.lang.Thread.join(Thread.java:1427)
   [junit4]    >         at app//org.apache.zookeeper.server.NIOServerCnxnFactory.join(NIOServerCnxnFactory.java:313)
   [junit4]    >         at app//org.apache.solr.cloud.ZkTestServer$ZKServerMain.runFromConfig(ZkTestServer.java:343)
   [junit4]    >         at app//org.apache.solr.cloud.ZkTestServer$2.run(ZkTestServer.java:564)
   [junit4]    > 	at __randomizedtesting.SeedInfo.seed([7D7602E4034B9072]:0)Throwable #2: com.carrotsearch.randomizedtesting.ThreadLeakError: There are still zombie threads that couldn't be terminated:
   [junit4]    >    1) Thread[id=24111, name=NIOServerCxn.Factory:0.0.0.0/0.0.0.0:0, state=RUNNABLE, group=TGRP-TestCloudSearcherWarming]
   [junit4]    >         at java.base@10.0.1/sun.nio.ch.EPollArrayWrapper.interrupt(Native Method)
   [junit4]    >         at java.base@10.0.1/sun.nio.ch.EPollArrayWrapper.interrupt(EPollArrayWrapper.java:313)
   [junit4]    >         at java.base@10.0.1/sun.nio.ch.EPollSelectorImpl.wakeup(EPollSelectorImpl.java:206)
   [junit4]    >         at java.base@10.0.1/java.nio.channels.spi.AbstractSelector$1.interrupt(AbstractSelector.java:213)
   [junit4]    >         at java.base@10.0.1/java.nio.channels.spi.AbstractSelector.begin(AbstractSelector.java:219)
   [junit4]    >         at java.base@10.0.1/sun.nio.ch.EPollSelectorImpl.doSelect(EPollSelectorImpl.java:91)
   [junit4]    >         at java.base@10.0.1/sun.nio.ch.SelectorImpl.lockAndDoSelect(SelectorImpl.java:89)
   [junit4]    >         at java.base@10.0.1/sun.nio.ch.SelectorImpl.select(SelectorImpl.java:100)
   [junit4]    >         at app//org.apache.zookeeper.server.NIOServerCnxnFactory.run(NIOServerCnxnFactory.java:196)
   [junit4]    >         at java.base@10.0.1/java.lang.Thread.run(Thread.java:844)
   [junit4]    > 	at __randomizedtesting.SeedInfo.seed([7D7602E4034B9072]:0)
   [junit4] Completed [512/837 (1!)] on J1 in 98.62s, 2 tests, 3 errors <<< FAILURES!

[...truncated 43444 lines...]
[repro] Jenkins log URL: https://jenkins.thetaphi.de/job/Lucene-Solr-master-Linux/23490/consoleText

[repro] Revision: a37e2c609cb26dfffa5b88f8a6b3afa2711880a5

[repro] Ant options: "-Dargs=-XX:-UseCompressedOops -XX:+UseParallelGC"
[repro] Repro line:  ant test  -Dtestcase=TestCloudSearcherWarming -Dtests.method=testRepFactor1LeaderStartup -Dtests.seed=7D7602E4034B9072 -Dtests.multiplier=3 -Dtests.slow=true -Dtests.locale=ar-IL -Dtests.timezone=Africa/Nouakchott -Dtests.asserts=true -Dtests.file.encoding=UTF-8

[repro] Repro line:  ant test  -Dtestcase=TestCloudSearcherWarming -Dtests.seed=7D7602E4034B9072 -Dtests.multiplier=3 -Dtests.slow=true -Dtests.locale=ar-IL -Dtests.timezone=Africa/Nouakchott -Dtests.asserts=true -Dtests.file.encoding=UTF-8

[repro] ant clean

[...truncated 6 lines...]
[repro] Test suites by module:
[repro]    solr/core
[repro]       TestCloudSearcherWarming
[repro] ant compile-test

[...truncated 3597 lines...]
[repro] ant test-nocompile -Dtests.dups=5 -Dtests.maxfailures=5 -Dtests.class="*.TestCloudSearcherWarming" -Dtests.showOutput=onerror "-Dargs=-XX:-UseCompressedOops -XX:+UseParallelGC" -Dtests.seed=7D7602E4034B9072 -Dtests.multiplier=3 -Dtests.slow=true -Dtests.locale=ar-IL -Dtests.timezone=Africa/Nouakchott -Dtests.asserts=true -Dtests.file.encoding=UTF-8

[...truncated 80 lines...]
[repro] Failures:
[repro]   0/5 failed: org.apache.solr.cloud.TestCloudSearcherWarming
[repro] Exiting with code 0

[...truncated 40 lines...]

Mime
View raw message