lucene-dev mailing list archives

Site index · List index
Message view « Date » · « Thread »
Top « Date » · « Thread »
From Apache Jenkins Server <jenk...@builds.apache.org>
Subject [JENKINS] Lucene-Solr-NightlyTests-7.x - Build # 430 - Still Unstable
Date Sat, 12 Jan 2019 07:27:38 GMT
Build: https://builds.apache.org/job/Lucene-Solr-NightlyTests-7.x/430/

2 tests failed.
FAILED:  org.apache.solr.cloud.ForceLeaderTest.testReplicasInLIRNoLeader

Error Message:
Timeout occured while waiting response from server at: http://127.0.0.1:39788/kiilu/forceleader_test_collection

Stack Trace:
org.apache.solr.client.solrj.SolrServerException: Timeout occured while waiting response from server at: http://127.0.0.1:39788/kiilu/forceleader_test_collection
	at __randomizedtesting.SeedInfo.seed([D7C3616BE0F39CD1:315455ABD97165B0]:0)
	at org.apache.solr.client.solrj.impl.HttpSolrClient.executeMethod(HttpSolrClient.java:654)
	at org.apache.solr.client.solrj.impl.HttpSolrClient.request(HttpSolrClient.java:255)
	at org.apache.solr.client.solrj.impl.HttpSolrClient.request(HttpSolrClient.java:244)
	at org.apache.solr.client.solrj.impl.LBHttpSolrClient.doRequest(LBHttpSolrClient.java:484)
	at org.apache.solr.client.solrj.impl.LBHttpSolrClient.request(LBHttpSolrClient.java:414)
	at org.apache.solr.client.solrj.impl.CloudSolrClient.sendRequest(CloudSolrClient.java:1110)
	at org.apache.solr.client.solrj.impl.CloudSolrClient.requestWithRetryOnStaleState(CloudSolrClient.java:884)
	at org.apache.solr.client.solrj.impl.CloudSolrClient.request(CloudSolrClient.java:817)
	at org.apache.solr.client.solrj.SolrRequest.process(SolrRequest.java:194)
	at org.apache.solr.client.solrj.SolrClient.commit(SolrClient.java:504)
	at org.apache.solr.client.solrj.SolrClient.commit(SolrClient.java:479)
	at org.apache.solr.cloud.ForceLeaderTest.testReplicasInLIRNoLeader(ForceLeaderTest.java:294)
	at sun.reflect.NativeMethodAccessorImpl.invoke0(Native Method)
	at sun.reflect.NativeMethodAccessorImpl.invoke(NativeMethodAccessorImpl.java:62)
	at sun.reflect.DelegatingMethodAccessorImpl.invoke(DelegatingMethodAccessorImpl.java:43)
	at java.lang.reflect.Method.invoke(Method.java:498)
	at com.carrotsearch.randomizedtesting.RandomizedRunner.invoke(RandomizedRunner.java:1750)
	at com.carrotsearch.randomizedtesting.RandomizedRunner$8.evaluate(RandomizedRunner.java:938)
	at com.carrotsearch.randomizedtesting.RandomizedRunner$9.evaluate(RandomizedRunner.java:974)
	at com.carrotsearch.randomizedtesting.RandomizedRunner$10.evaluate(RandomizedRunner.java:988)
	at org.apache.solr.BaseDistributedSearchTestCase$ShardsRepeatRule$ShardsFixedStatement.callStatement(BaseDistributedSearchTestCase.java:1063)
	at org.apache.solr.BaseDistributedSearchTestCase$ShardsRepeatRule$ShardsStatement.evaluate(BaseDistributedSearchTestCase.java:1035)
	at com.carrotsearch.randomizedtesting.rules.SystemPropertiesRestoreRule$1.evaluate(SystemPropertiesRestoreRule.java:57)
	at org.apache.lucene.util.TestRuleSetupTeardownChained$1.evaluate(TestRuleSetupTeardownChained.java:49)
	at org.apache.lucene.util.AbstractBeforeAfterRule$1.evaluate(AbstractBeforeAfterRule.java:45)
	at org.apache.lucene.util.TestRuleThreadAndTestName$1.evaluate(TestRuleThreadAndTestName.java:48)
	at org.apache.lucene.util.TestRuleIgnoreAfterMaxFailures$1.evaluate(TestRuleIgnoreAfterMaxFailures.java:64)
	at org.apache.lucene.util.TestRuleMarkFailure$1.evaluate(TestRuleMarkFailure.java:47)
	at com.carrotsearch.randomizedtesting.rules.StatementAdapter.evaluate(StatementAdapter.java:36)
	at com.carrotsearch.randomizedtesting.ThreadLeakControl$StatementRunner.run(ThreadLeakControl.java:368)
	at com.carrotsearch.randomizedtesting.ThreadLeakControl.forkTimeoutingTask(ThreadLeakControl.java:817)
	at com.carrotsearch.randomizedtesting.ThreadLeakControl$3.evaluate(ThreadLeakControl.java:468)
	at com.carrotsearch.randomizedtesting.RandomizedRunner.runSingleTest(RandomizedRunner.java:947)
	at com.carrotsearch.randomizedtesting.RandomizedRunner$5.evaluate(RandomizedRunner.java:832)
	at com.carrotsearch.randomizedtesting.RandomizedRunner$6.evaluate(RandomizedRunner.java:883)
	at com.carrotsearch.randomizedtesting.RandomizedRunner$7.evaluate(RandomizedRunner.java:894)
	at com.carrotsearch.randomizedtesting.rules.StatementAdapter.evaluate(StatementAdapter.java:36)
	at com.carrotsearch.randomizedtesting.rules.SystemPropertiesRestoreRule$1.evaluate(SystemPropertiesRestoreRule.java:57)
	at org.apache.lucene.util.AbstractBeforeAfterRule$1.evaluate(AbstractBeforeAfterRule.java:45)
	at com.carrotsearch.randomizedtesting.rules.StatementAdapter.evaluate(StatementAdapter.java:36)
	at org.apache.lucene.util.TestRuleStoreClassName$1.evaluate(TestRuleStoreClassName.java:41)
	at com.carrotsearch.randomizedtesting.rules.NoShadowingOrOverridesOnMethodsRule$1.evaluate(NoShadowingOrOverridesOnMethodsRule.java:40)
	at com.carrotsearch.randomizedtesting.rules.NoShadowingOrOverridesOnMethodsRule$1.evaluate(NoShadowingOrOverridesOnMethodsRule.java:40)
	at com.carrotsearch.randomizedtesting.rules.StatementAdapter.evaluate(StatementAdapter.java:36)
	at com.carrotsearch.randomizedtesting.rules.StatementAdapter.evaluate(StatementAdapter.java:36)
	at com.carrotsearch.randomizedtesting.rules.StatementAdapter.evaluate(StatementAdapter.java:36)
	at org.apache.lucene.util.TestRuleAssertionsRequired$1.evaluate(TestRuleAssertionsRequired.java:53)
	at org.apache.lucene.util.TestRuleMarkFailure$1.evaluate(TestRuleMarkFailure.java:47)
	at org.apache.lucene.util.TestRuleIgnoreAfterMaxFailures$1.evaluate(TestRuleIgnoreAfterMaxFailures.java:64)
	at org.apache.lucene.util.TestRuleIgnoreTestSuites$1.evaluate(TestRuleIgnoreTestSuites.java:54)
	at com.carrotsearch.randomizedtesting.rules.StatementAdapter.evaluate(StatementAdapter.java:36)
	at com.carrotsearch.randomizedtesting.ThreadLeakControl$StatementRunner.run(ThreadLeakControl.java:368)
	at java.lang.Thread.run(Thread.java:748)
Caused by: java.net.SocketTimeoutException: Read timed out
	at java.net.SocketInputStream.socketRead0(Native Method)
	at java.net.SocketInputStream.socketRead(SocketInputStream.java:116)
	at java.net.SocketInputStream.read(SocketInputStream.java:171)
	at java.net.SocketInputStream.read(SocketInputStream.java:141)
	at org.apache.http.impl.io.SessionInputBufferImpl.streamRead(SessionInputBufferImpl.java:137)
	at org.apache.http.impl.io.SessionInputBufferImpl.fillBuffer(SessionInputBufferImpl.java:153)
	at org.apache.http.impl.io.SessionInputBufferImpl.readLine(SessionInputBufferImpl.java:282)
	at org.apache.http.impl.conn.DefaultHttpResponseParser.parseHead(DefaultHttpResponseParser.java:138)
	at org.apache.http.impl.conn.DefaultHttpResponseParser.parseHead(DefaultHttpResponseParser.java:56)
	at org.apache.http.impl.io.AbstractMessageParser.parse(AbstractMessageParser.java:259)
	at org.apache.http.impl.DefaultBHttpClientConnection.receiveResponseHeader(DefaultBHttpClientConnection.java:163)
	at org.apache.http.impl.conn.CPoolProxy.receiveResponseHeader(CPoolProxy.java:165)
	at org.apache.http.protocol.HttpRequestExecutor.doReceiveResponse(HttpRequestExecutor.java:273)
	at org.apache.http.protocol.HttpRequestExecutor.execute(HttpRequestExecutor.java:125)
	at org.apache.http.impl.execchain.MainClientExec.execute(MainClientExec.java:272)
	at org.apache.http.impl.execchain.ProtocolExec.execute(ProtocolExec.java:185)
	at org.apache.http.impl.execchain.RetryExec.execute(RetryExec.java:89)
	at org.apache.http.impl.execchain.RedirectExec.execute(RedirectExec.java:110)
	at org.apache.http.impl.client.InternalHttpClient.doExecute(InternalHttpClient.java:185)
	at org.apache.http.impl.client.CloseableHttpClient.execute(CloseableHttpClient.java:83)
	at org.apache.http.impl.client.CloseableHttpClient.execute(CloseableHttpClient.java:56)
	at org.apache.solr.client.solrj.impl.HttpSolrClient.executeMethod(HttpSolrClient.java:542)
	... 52 more


FAILED:  org.apache.solr.cloud.hdfs.StressHdfsTest.test

Error Message:
There are still nodes recoverying - waited for 330 seconds

Stack Trace:
java.lang.AssertionError: There are still nodes recoverying - waited for 330 seconds
	at __randomizedtesting.SeedInfo.seed([D7C3616BE0F39CD1:5F975EB14E0FF129]:0)
	at org.junit.Assert.fail(Assert.java:88)
	at org.apache.solr.cloud.AbstractDistribZkTestBase.waitForRecoveriesToFinish(AbstractDistribZkTestBase.java:195)
	at org.apache.solr.cloud.AbstractDistribZkTestBase.waitForRecoveriesToFinish(AbstractDistribZkTestBase.java:143)
	at org.apache.solr.cloud.AbstractDistribZkTestBase.waitForRecoveriesToFinish(AbstractDistribZkTestBase.java:138)
	at org.apache.solr.cloud.AbstractFullDistribZkTestBase.waitForRecoveriesToFinish(AbstractFullDistribZkTestBase.java:1008)
	at org.apache.solr.cloud.hdfs.StressHdfsTest.createAndDeleteCollection(StressHdfsTest.java:164)
	at org.apache.solr.cloud.hdfs.StressHdfsTest.test(StressHdfsTest.java:108)
	at sun.reflect.NativeMethodAccessorImpl.invoke0(Native Method)
	at sun.reflect.NativeMethodAccessorImpl.invoke(NativeMethodAccessorImpl.java:62)
	at sun.reflect.DelegatingMethodAccessorImpl.invoke(DelegatingMethodAccessorImpl.java:43)
	at java.lang.reflect.Method.invoke(Method.java:498)
	at com.carrotsearch.randomizedtesting.RandomizedRunner.invoke(RandomizedRunner.java:1750)
	at com.carrotsearch.randomizedtesting.RandomizedRunner$8.evaluate(RandomizedRunner.java:938)
	at com.carrotsearch.randomizedtesting.RandomizedRunner$9.evaluate(RandomizedRunner.java:974)
	at com.carrotsearch.randomizedtesting.RandomizedRunner$10.evaluate(RandomizedRunner.java:988)
	at org.apache.solr.BaseDistributedSearchTestCase$ShardsRepeatRule$ShardsFixedStatement.callStatement(BaseDistributedSearchTestCase.java:1063)
	at org.apache.solr.BaseDistributedSearchTestCase$ShardsRepeatRule$ShardsStatement.evaluate(BaseDistributedSearchTestCase.java:1035)
	at com.carrotsearch.randomizedtesting.rules.SystemPropertiesRestoreRule$1.evaluate(SystemPropertiesRestoreRule.java:57)
	at org.apache.lucene.util.TestRuleSetupTeardownChained$1.evaluate(TestRuleSetupTeardownChained.java:49)
	at org.apache.lucene.util.AbstractBeforeAfterRule$1.evaluate(AbstractBeforeAfterRule.java:45)
	at org.apache.lucene.util.TestRuleThreadAndTestName$1.evaluate(TestRuleThreadAndTestName.java:48)
	at org.apache.lucene.util.TestRuleIgnoreAfterMaxFailures$1.evaluate(TestRuleIgnoreAfterMaxFailures.java:64)
	at org.apache.lucene.util.TestRuleMarkFailure$1.evaluate(TestRuleMarkFailure.java:47)
	at com.carrotsearch.randomizedtesting.rules.StatementAdapter.evaluate(StatementAdapter.java:36)
	at com.carrotsearch.randomizedtesting.ThreadLeakControl$StatementRunner.run(ThreadLeakControl.java:368)
	at com.carrotsearch.randomizedtesting.ThreadLeakControl.forkTimeoutingTask(ThreadLeakControl.java:817)
	at com.carrotsearch.randomizedtesting.ThreadLeakControl$3.evaluate(ThreadLeakControl.java:468)
	at com.carrotsearch.randomizedtesting.RandomizedRunner.runSingleTest(RandomizedRunner.java:947)
	at com.carrotsearch.randomizedtesting.RandomizedRunner$5.evaluate(RandomizedRunner.java:832)
	at com.carrotsearch.randomizedtesting.RandomizedRunner$6.evaluate(RandomizedRunner.java:883)
	at com.carrotsearch.randomizedtesting.RandomizedRunner$7.evaluate(RandomizedRunner.java:894)
	at com.carrotsearch.randomizedtesting.rules.StatementAdapter.evaluate(StatementAdapter.java:36)
	at com.carrotsearch.randomizedtesting.rules.SystemPropertiesRestoreRule$1.evaluate(SystemPropertiesRestoreRule.java:57)
	at org.apache.lucene.util.AbstractBeforeAfterRule$1.evaluate(AbstractBeforeAfterRule.java:45)
	at com.carrotsearch.randomizedtesting.rules.StatementAdapter.evaluate(StatementAdapter.java:36)
	at org.apache.lucene.util.TestRuleStoreClassName$1.evaluate(TestRuleStoreClassName.java:41)
	at com.carrotsearch.randomizedtesting.rules.NoShadowingOrOverridesOnMethodsRule$1.evaluate(NoShadowingOrOverridesOnMethodsRule.java:40)
	at com.carrotsearch.randomizedtesting.rules.NoShadowingOrOverridesOnMethodsRule$1.evaluate(NoShadowingOrOverridesOnMethodsRule.java:40)
	at com.carrotsearch.randomizedtesting.rules.StatementAdapter.evaluate(StatementAdapter.java:36)
	at com.carrotsearch.randomizedtesting.rules.StatementAdapter.evaluate(StatementAdapter.java:36)
	at com.carrotsearch.randomizedtesting.rules.StatementAdapter.evaluate(StatementAdapter.java:36)
	at org.apache.lucene.util.TestRuleAssertionsRequired$1.evaluate(TestRuleAssertionsRequired.java:53)
	at org.apache.lucene.util.TestRuleMarkFailure$1.evaluate(TestRuleMarkFailure.java:47)
	at org.apache.lucene.util.TestRuleIgnoreAfterMaxFailures$1.evaluate(TestRuleIgnoreAfterMaxFailures.java:64)
	at org.apache.lucene.util.TestRuleIgnoreTestSuites$1.evaluate(TestRuleIgnoreTestSuites.java:54)
	at com.carrotsearch.randomizedtesting.rules.StatementAdapter.evaluate(StatementAdapter.java:36)
	at com.carrotsearch.randomizedtesting.ThreadLeakControl$StatementRunner.run(ThreadLeakControl.java:368)
	at java.lang.Thread.run(Thread.java:748)




Build Log:
[...truncated 14600 lines...]
   [junit4] Suite: org.apache.solr.cloud.ForceLeaderTest
   [junit4]   2> Creating dataDir: /x1/jenkins/jenkins-slave/workspace/Lucene-Solr-NightlyTests-7.x/checkout/solr/build/solr-core/test/J2/temp/solr.cloud.ForceLeaderTest_D7C3616BE0F39CD1-001/init-core-data-001
   [junit4]   2> 2678654 WARN  (SUITE-ForceLeaderTest-seed#[D7C3616BE0F39CD1]-worker) [    ] o.a.s.SolrTestCaseJ4 startTrackingSearchers: numOpens=38 numCloses=38
   [junit4]   2> 2678654 INFO  (SUITE-ForceLeaderTest-seed#[D7C3616BE0F39CD1]-worker) [    ] o.a.s.SolrTestCaseJ4 Using PointFields (NUMERIC_POINTS_SYSPROP=true) w/NUMERIC_DOCVALUES_SYSPROP=false
   [junit4]   2> 2678657 INFO  (SUITE-ForceLeaderTest-seed#[D7C3616BE0F39CD1]-worker) [    ] o.a.s.SolrTestCaseJ4 Randomized ssl (false) and clientAuth (false) via: @org.apache.solr.SolrTestCaseJ4$SuppressSSL(bugUrl=https://issues.apache.org/jira/browse/SOLR-5776)
   [junit4]   2> 2678657 INFO  (SUITE-ForceLeaderTest-seed#[D7C3616BE0F39CD1]-worker) [    ] o.a.s.SolrTestCaseJ4 SecureRandom sanity checks: test.solr.allowed.securerandom=null & java.security.egd=file:/dev/./urandom
   [junit4]   2> 2678657 INFO  (SUITE-ForceLeaderTest-seed#[D7C3616BE0F39CD1]-worker) [    ] o.a.s.BaseDistributedSearchTestCase Setting hostContext system property: /kiilu/
   [junit4]   2> 2678661 INFO  (TEST-ForceLeaderTest.testReplicasInLIRNoLeader-seed#[D7C3616BE0F39CD1]) [    ] o.a.s.c.ZkTestServer STARTING ZK TEST SERVER
   [junit4]   2> 2678661 INFO  (ZkTestServer Run Thread) [    ] o.a.s.c.ZkTestServer client port:0.0.0.0/0.0.0.0:0
   [junit4]   2> 2678661 INFO  (ZkTestServer Run Thread) [    ] o.a.s.c.ZkTestServer Starting server
   [junit4]   2> 2678762 INFO  (TEST-ForceLeaderTest.testReplicasInLIRNoLeader-seed#[D7C3616BE0F39CD1]) [    ] o.a.s.c.ZkTestServer start zk server on port:36417
   [junit4]   2> 2678762 INFO  (TEST-ForceLeaderTest.testReplicasInLIRNoLeader-seed#[D7C3616BE0F39CD1]) [    ] o.a.s.c.ZkTestServer parse host and port list: 127.0.0.1:36417
   [junit4]   2> 2678762 INFO  (TEST-ForceLeaderTest.testReplicasInLIRNoLeader-seed#[D7C3616BE0F39CD1]) [    ] o.a.s.c.ZkTestServer connecting to 127.0.0.1 36417
   [junit4]   2> 2678769 INFO  (zkConnectionManagerCallback-11404-thread-1) [    ] o.a.s.c.c.ConnectionManager zkClient has connected
   [junit4]   2> 2678772 INFO  (zkConnectionManagerCallback-11406-thread-1) [    ] o.a.s.c.c.ConnectionManager zkClient has connected
   [junit4]   2> 2678773 INFO  (TEST-ForceLeaderTest.testReplicasInLIRNoLeader-seed#[D7C3616BE0F39CD1]) [    ] o.a.s.c.ZkTestServer put /x1/jenkins/jenkins-slave/workspace/Lucene-Solr-NightlyTests-7.x/checkout/solr/core/src/test-files/solr/collection1/conf/solrconfig-tlog.xml to /configs/conf1/solrconfig.xml
   [junit4]   2> 2678775 INFO  (TEST-ForceLeaderTest.testReplicasInLIRNoLeader-seed#[D7C3616BE0F39CD1]) [    ] o.a.s.c.ZkTestServer put /x1/jenkins/jenkins-slave/workspace/Lucene-Solr-NightlyTests-7.x/checkout/solr/core/src/test-files/solr/collection1/conf/schema.xml to /configs/conf1/schema.xml
   [junit4]   2> 2678776 INFO  (TEST-ForceLeaderTest.testReplicasInLIRNoLeader-seed#[D7C3616BE0F39CD1]) [    ] o.a.s.c.ZkTestServer put /x1/jenkins/jenkins-slave/workspace/Lucene-Solr-NightlyTests-7.x/checkout/solr/core/src/test-files/solr/collection1/conf/solrconfig.snippet.randomindexconfig.xml to /configs/conf1/solrconfig.snippet.randomindexconfig.xml
   [junit4]   2> 2678778 INFO  (TEST-ForceLeaderTest.testReplicasInLIRNoLeader-seed#[D7C3616BE0F39CD1]) [    ] o.a.s.c.ZkTestServer put /x1/jenkins/jenkins-slave/workspace/Lucene-Solr-NightlyTests-7.x/checkout/solr/core/src/test-files/solr/collection1/conf/stopwords.txt to /configs/conf1/stopwords.txt
   [junit4]   2> 2678779 INFO  (TEST-ForceLeaderTest.testReplicasInLIRNoLeader-seed#[D7C3616BE0F39CD1]) [    ] o.a.s.c.ZkTestServer put /x1/jenkins/jenkins-slave/workspace/Lucene-Solr-NightlyTests-7.x/checkout/solr/core/src/test-files/solr/collection1/conf/protwords.txt to /configs/conf1/protwords.txt
   [junit4]   2> 2678780 INFO  (TEST-ForceLeaderTest.testReplicasInLIRNoLeader-seed#[D7C3616BE0F39CD1]) [    ] o.a.s.c.ZkTestServer put /x1/jenkins/jenkins-slave/workspace/Lucene-Solr-NightlyTests-7.x/checkout/solr/core/src/test-files/solr/collection1/conf/currency.xml to /configs/conf1/currency.xml
   [junit4]   2> 2678781 INFO  (TEST-ForceLeaderTest.testReplicasInLIRNoLeader-seed#[D7C3616BE0F39CD1]) [    ] o.a.s.c.ZkTestServer put /x1/jenkins/jenkins-slave/workspace/Lucene-Solr-NightlyTests-7.x/checkout/solr/core/src/test-files/solr/collection1/conf/enumsConfig.xml to /configs/conf1/enumsConfig.xml
   [junit4]   2> 2678782 INFO  (TEST-ForceLeaderTest.testReplicasInLIRNoLeader-seed#[D7C3616BE0F39CD1]) [    ] o.a.s.c.ZkTestServer put /x1/jenkins/jenkins-slave/workspace/Lucene-Solr-NightlyTests-7.x/checkout/solr/core/src/test-files/solr/collection1/conf/open-exchange-rates.json to /configs/conf1/open-exchange-rates.json
   [junit4]   2> 2678785 INFO  (TEST-ForceLeaderTest.testReplicasInLIRNoLeader-seed#[D7C3616BE0F39CD1]) [    ] o.a.s.c.ZkTestServer put /x1/jenkins/jenkins-slave/workspace/Lucene-Solr-NightlyTests-7.x/checkout/solr/core/src/test-files/solr/collection1/conf/mapping-ISOLatin1Accent.txt to /configs/conf1/mapping-ISOLatin1Accent.txt
   [junit4]   2> 2678787 INFO  (TEST-ForceLeaderTest.testReplicasInLIRNoLeader-seed#[D7C3616BE0F39CD1]) [    ] o.a.s.c.ZkTestServer put /x1/jenkins/jenkins-slave/workspace/Lucene-Solr-NightlyTests-7.x/checkout/solr/core/src/test-files/solr/collection1/conf/old_synonyms.txt to /configs/conf1/old_synonyms.txt
   [junit4]   2> 2678789 INFO  (TEST-ForceLeaderTest.testReplicasInLIRNoLeader-seed#[D7C3616BE0F39CD1]) [    ] o.a.s.c.ZkTestServer put /x1/jenkins/jenkins-slave/workspace/Lucene-Solr-NightlyTests-7.x/checkout/solr/core/src/test-files/solr/collection1/conf/synonyms.txt to /configs/conf1/synonyms.txt
   [junit4]   2> 2678791 INFO  (TEST-ForceLeaderTest.testReplicasInLIRNoLeader-seed#[D7C3616BE0F39CD1]) [    ] o.a.s.c.AbstractFullDistribZkTestBase Will use NRT replicas unless explicitly asked otherwise
   [junit4]   2> 2678967 WARN  (TEST-ForceLeaderTest.testReplicasInLIRNoLeader-seed#[D7C3616BE0F39CD1]) [    ] o.e.j.s.AbstractConnector Ignoring deprecated socket close linger time
   [junit4]   2> 2678968 INFO  (TEST-ForceLeaderTest.testReplicasInLIRNoLeader-seed#[D7C3616BE0F39CD1]) [    ] o.a.s.c.s.e.JettySolrRunner Start Jetty (original configured port=0)
   [junit4]   2> 2678968 INFO  (TEST-ForceLeaderTest.testReplicasInLIRNoLeader-seed#[D7C3616BE0F39CD1]) [    ] o.a.s.c.s.e.JettySolrRunner Trying to start Jetty on port 0 try number 1 ...
   [junit4]   2> 2678968 INFO  (TEST-ForceLeaderTest.testReplicasInLIRNoLeader-seed#[D7C3616BE0F39CD1]) [    ] o.e.j.s.Server jetty-9.4.14.v20181114; built: 2018-11-14T21:20:31.478Z; git: c4550056e785fb5665914545889f21dc136ad9e6; jvm 1.8.0_191-b12
   [junit4]   2> 2678969 INFO  (TEST-ForceLeaderTest.testReplicasInLIRNoLeader-seed#[D7C3616BE0F39CD1]) [    ] o.e.j.s.session DefaultSessionIdManager workerName=node0
   [junit4]   2> 2678969 INFO  (TEST-ForceLeaderTest.testReplicasInLIRNoLeader-seed#[D7C3616BE0F39CD1]) [    ] o.e.j.s.session No SessionScavenger set, using defaults
   [junit4]   2> 2678969 INFO  (TEST-ForceLeaderTest.testReplicasInLIRNoLeader-seed#[D7C3616BE0F39CD1]) [    ] o.e.j.s.session node0 Scavenging every 660000ms
   [junit4]   2> 2678972 INFO  (TEST-ForceLeaderTest.testReplicasInLIRNoLeader-seed#[D7C3616BE0F39CD1]) [    ] o.e.j.s.h.ContextHandler Started o.e.j.s.ServletContextHandler@10702f8f{/kiilu,null,AVAILABLE}
   [junit4]   2> 2678978 INFO  (TEST-ForceLeaderTest.testReplicasInLIRNoLeader-seed#[D7C3616BE0F39CD1]) [    ] o.e.j.s.AbstractConnector Started ServerConnector@49d0a0c8{HTTP/1.1,[http/1.1]}{127.0.0.1:44891}
   [junit4]   2> 2678978 INFO  (TEST-ForceLeaderTest.testReplicasInLIRNoLeader-seed#[D7C3616BE0F39CD1]) [    ] o.e.j.s.Server Started @2679071ms
   [junit4]   2> 2678978 INFO  (TEST-ForceLeaderTest.testReplicasInLIRNoLeader-seed#[D7C3616BE0F39CD1]) [    ] o.a.s.c.s.e.JettySolrRunner Jetty properties: {solr.data.dir=/x1/jenkins/jenkins-slave/workspace/Lucene-Solr-NightlyTests-7.x/checkout/solr/build/solr-core/test/J2/temp/solr.cloud.ForceLeaderTest_D7C3616BE0F39CD1-001/tempDir-001/control/data, hostContext=/kiilu, hostPort=40702, coreRootDirectory=/x1/jenkins/jenkins-slave/workspace/Lucene-Solr-NightlyTests-7.x/checkout/solr/build/solr-core/test/J2/temp/solr.cloud.ForceLeaderTest_D7C3616BE0F39CD1-001/control-001/cores}
   [junit4]   2> 2678979 ERROR (TEST-ForceLeaderTest.testReplicasInLIRNoLeader-seed#[D7C3616BE0F39CD1]) [    ] o.a.s.u.StartupLoggingUtils Missing Java Option solr.log.dir. Logging may be missing or incomplete.
   [junit4]   2> 2678979 INFO  (TEST-ForceLeaderTest.testReplicasInLIRNoLeader-seed#[D7C3616BE0F39CD1]) [    ] o.a.s.s.SolrDispatchFilter Using logger factory org.apache.logging.slf4j.Log4jLoggerFactory
   [junit4]   2> 2678979 INFO  (TEST-ForceLeaderTest.testReplicasInLIRNoLeader-seed#[D7C3616BE0F39CD1]) [    ] o.a.s.s.SolrDispatchFilter  ___      _       Welcome to Apache Solr™ version 7.7.0
   [junit4]   2> 2678979 INFO  (TEST-ForceLeaderTest.testReplicasInLIRNoLeader-seed#[D7C3616BE0F39CD1]) [    ] o.a.s.s.SolrDispatchFilter / __| ___| |_ _   Starting in cloud mode on port null
   [junit4]   2> 2678979 INFO  (TEST-ForceLeaderTest.testReplicasInLIRNoLeader-seed#[D7C3616BE0F39CD1]) [    ] o.a.s.s.SolrDispatchFilter \__ \/ _ \ | '_|  Install dir: null
   [junit4]   2> 2678979 INFO  (TEST-ForceLeaderTest.testReplicasInLIRNoLeader-seed#[D7C3616BE0F39CD1]) [    ] o.a.s.s.SolrDispatchFilter |___/\___/_|_|    Start time: 2019-01-12T06:27:40.376Z
   [junit4]   2> 2678982 INFO  (zkConnectionManagerCallback-11408-thread-1) [    ] o.a.s.c.c.ConnectionManager zkClient has connected
   [junit4]   2> 2678983 INFO  (TEST-ForceLeaderTest.testReplicasInLIRNoLeader-seed#[D7C3616BE0F39CD1]) [    ] o.a.s.s.SolrDispatchFilter Loading solr.xml from SolrHome (not found in ZooKeeper)
   [junit4]   2> 2678983 INFO  (TEST-ForceLeaderTest.testReplicasInLIRNoLeader-seed#[D7C3616BE0F39CD1]) [    ] o.a.s.c.SolrXmlConfig Loading container configuration from /x1/jenkins/jenkins-slave/workspace/Lucene-Solr-NightlyTests-7.x/checkout/solr/build/solr-core/test/J2/temp/solr.cloud.ForceLeaderTest_D7C3616BE0F39CD1-001/control-001/solr.xml
   [junit4]   2> 2678988 INFO  (TEST-ForceLeaderTest.testReplicasInLIRNoLeader-seed#[D7C3616BE0F39CD1]) [    ] o.a.s.c.SolrXmlConfig Configuration parameter autoReplicaFailoverWorkLoopDelay is ignored
   [junit4]   2> 2678988 INFO  (TEST-ForceLeaderTest.testReplicasInLIRNoLeader-seed#[D7C3616BE0F39CD1]) [    ] o.a.s.c.SolrXmlConfig Configuration parameter autoReplicaFailoverBadNodeExpiration is ignored
   [junit4]   2> 2679002 INFO  (TEST-ForceLeaderTest.testReplicasInLIRNoLeader-seed#[D7C3616BE0F39CD1]) [    ] o.a.s.c.SolrXmlConfig MBean server found: com.sun.jmx.mbeanserver.JmxMBeanServer@1baf2c5a, but no JMX reporters were configured - adding default JMX reporter.
   [junit4]   2> 2679093 INFO  (TEST-ForceLeaderTest.testReplicasInLIRNoLeader-seed#[D7C3616BE0F39CD1]) [    ] o.a.s.c.ZkContainer Zookeeper client=127.0.0.1:36417/solr
   [junit4]   2> 2679096 INFO  (zkConnectionManagerCallback-11412-thread-1) [    ] o.a.s.c.c.ConnectionManager zkClient has connected
   [junit4]   2> 2679100 INFO  (zkConnectionManagerCallback-11414-thread-1) [    ] o.a.s.c.c.ConnectionManager zkClient has connected
   [junit4]   2> 2679215 INFO  (TEST-ForceLeaderTest.testReplicasInLIRNoLeader-seed#[D7C3616BE0F39CD1]) [n:127.0.0.1:40702_kiilu    ] o.a.s.c.OverseerElectionContext I am going to be the leader 127.0.0.1:40702_kiilu
   [junit4]   2> 2679217 INFO  (TEST-ForceLeaderTest.testReplicasInLIRNoLeader-seed#[D7C3616BE0F39CD1]) [n:127.0.0.1:40702_kiilu    ] o.a.s.c.Overseer Overseer (id=72608701520084996-127.0.0.1:40702_kiilu-n_0000000000) starting
   [junit4]   2> 2679224 INFO  (zkConnectionManagerCallback-11421-thread-1) [    ] o.a.s.c.c.ConnectionManager zkClient has connected
   [junit4]   2> 2679227 INFO  (TEST-ForceLeaderTest.testReplicasInLIRNoLeader-seed#[D7C3616BE0F39CD1]) [n:127.0.0.1:40702_kiilu    ] o.a.s.c.s.i.ZkClientClusterStateProvider Cluster at 127.0.0.1:36417/solr ready
   [junit4]   2> 2679228 INFO  (OverseerStateUpdate-72608701520084996-127.0.0.1:40702_kiilu-n_0000000000) [n:127.0.0.1:40702_kiilu    ] o.a.s.c.Overseer Starting to work on the main queue : 127.0.0.1:40702_kiilu
   [junit4]   2> 2679232 INFO  (TEST-ForceLeaderTest.testReplicasInLIRNoLeader-seed#[D7C3616BE0F39CD1]) [n:127.0.0.1:40702_kiilu    ] o.a.s.c.ZkController Register node as live in ZooKeeper:/live_nodes/127.0.0.1:40702_kiilu
   [junit4]   2> 2679251 INFO  (zkCallback-11420-thread-1) [    ] o.a.s.c.c.ZkStateReader Updated live nodes from ZooKeeper... (0) -> (1)
   [junit4]   2> 2679251 INFO  (zkCallback-11413-thread-1) [    ] o.a.s.c.c.ZkStateReader Updated live nodes from ZooKeeper... (0) -> (1)
   [junit4]   2> 2679289 INFO  (TEST-ForceLeaderTest.testReplicasInLIRNoLeader-seed#[D7C3616BE0F39CD1]) [n:127.0.0.1:40702_kiilu    ] o.a.s.h.a.MetricsHistoryHandler No .system collection, keeping metrics history in memory.
   [junit4]   2> 2679319 INFO  (TEST-ForceLeaderTest.testReplicasInLIRNoLeader-seed#[D7C3616BE0F39CD1]) [n:127.0.0.1:40702_kiilu    ] o.a.s.m.r.SolrJmxReporter JMX monitoring for 'solr.node' (registry 'solr.node') enabled at server: com.sun.jmx.mbeanserver.JmxMBeanServer@1baf2c5a
   [junit4]   2> 2679334 INFO  (TEST-ForceLeaderTest.testReplicasInLIRNoLeader-seed#[D7C3616BE0F39CD1]) [n:127.0.0.1:40702_kiilu    ] o.a.s.m.r.SolrJmxReporter JMX monitoring for 'solr.jvm' (registry 'solr.jvm') enabled at server: com.sun.jmx.mbeanserver.JmxMBeanServer@1baf2c5a
   [junit4]   2> 2679335 INFO  (TEST-ForceLeaderTest.testReplicasInLIRNoLeader-seed#[D7C3616BE0F39CD1]) [n:127.0.0.1:40702_kiilu    ] o.a.s.m.r.SolrJmxReporter JMX monitoring for 'solr.jetty' (registry 'solr.jetty') enabled at server: com.sun.jmx.mbeanserver.JmxMBeanServer@1baf2c5a
   [junit4]   2> 2679337 INFO  (TEST-ForceLeaderTest.testReplicasInLIRNoLeader-seed#[D7C3616BE0F39CD1]) [n:127.0.0.1:40702_kiilu    ] o.a.s.c.CorePropertiesLocator Found 0 core definitions underneath /x1/jenkins/jenkins-slave/workspace/Lucene-Solr-NightlyTests-7.x/checkout/solr/build/solr-core/test/J2/temp/solr.cloud.ForceLeaderTest_D7C3616BE0F39CD1-001/control-001/cores
   [junit4]   2> 2679382 INFO  (zkConnectionManagerCallback-11427-thread-1) [    ] o.a.s.c.c.ConnectionManager zkClient has connected
   [junit4]   2> 2679384 INFO  (TEST-ForceLeaderTest.testReplicasInLIRNoLeader-seed#[D7C3616BE0F39CD1]) [    ] o.a.s.c.c.ZkStateReader Updated live nodes from ZooKeeper... (0) -> (1)
   [junit4]   2> 2679385 INFO  (TEST-ForceLeaderTest.testReplicasInLIRNoLeader-seed#[D7C3616BE0F39CD1]) [    ] o.a.s.c.s.i.ZkClientClusterStateProvider Cluster at 127.0.0.1:36417/solr ready
   [junit4]   2> 2679386 INFO  (SocketProxy-Acceptor-40702) [    ] o.a.s.c.s.c.SocketProxy accepted Socket[addr=/127.0.0.1,port=60972,localport=40702], receiveBufferSize:531000
   [junit4]   2> 2679393 INFO  (SocketProxy-Acceptor-40702) [    ] o.a.s.c.s.c.SocketProxy proxy connection Socket[addr=/127.0.0.1,port=44891,localport=38950], receiveBufferSize=530904
   [junit4]   2> 2679394 INFO  (qtp1378305256-46669) [n:127.0.0.1:40702_kiilu    ] o.a.s.h.a.CollectionsHandler Invoked Collection Action :create with params collection.configName=conf1&name=control_collection&nrtReplicas=1&action=CREATE&numShards=1&createNodeSet=127.0.0.1:40702_kiilu&wt=javabin&version=2 and sendToOCPQueue=true
   [junit4]   2> 2679408 INFO  (OverseerThreadFactory-11906-thread-1-processing-n:127.0.0.1:40702_kiilu) [n:127.0.0.1:40702_kiilu    ] o.a.s.c.a.c.CreateCollectionCmd Create collection control_collection
   [junit4]   2> 2679520 INFO  (SocketProxy-Acceptor-40702) [    ] o.a.s.c.s.c.SocketProxy accepted Socket[addr=/127.0.0.1,port=60976,localport=40702], receiveBufferSize:531000
   [junit4]   2> 2679520 INFO  (SocketProxy-Acceptor-40702) [    ] o.a.s.c.s.c.SocketProxy proxy connection Socket[addr=/127.0.0.1,port=44891,localport=38954], receiveBufferSize=530904
   [junit4]   2> 2679521 INFO  (qtp1378305256-46671) [n:127.0.0.1:40702_kiilu    ] o.a.s.s.HttpSolrCall [admin] webapp=null path=/admin/metrics params={prefix=CONTAINER.fs.usableSpace,CONTAINER.fs.totalSpace,CORE.coreName&wt=javabin&version=2&group=solr.node,solr.core} status=0 QTime=0
   [junit4]   2> 2679522 INFO  (qtp1378305256-46672) [n:127.0.0.1:40702_kiilu    ] o.a.s.s.HttpSolrCall [admin] webapp=null path=/admin/metrics params={prefix=CONTAINER.fs.usableSpace,CONTAINER.fs.totalSpace,CORE.coreName&wt=javabin&version=2&group=solr.node,solr.core} status=0 QTime=0
   [junit4]   2> 2679523 INFO  (qtp1378305256-46668) [n:127.0.0.1:40702_kiilu    ] o.a.s.s.HttpSolrCall [admin] webapp=null path=/admin/metrics params={prefix=CONTAINER.fs.usableSpace,CONTAINER.fs.totalSpace,CORE.coreName&wt=javabin&version=2&group=solr.node,solr.core} status=0 QTime=0
   [junit4]   2> 2679524 INFO  (qtp1378305256-46670) [n:127.0.0.1:40702_kiilu    ] o.a.s.s.HttpSolrCall [admin] webapp=null path=/admin/metrics params={prefix=CONTAINER.fs.usableSpace,CONTAINER.fs.totalSpace,CORE.coreName&wt=javabin&version=2&group=solr.node,solr.core} status=0 QTime=0
   [junit4]   2> 2679525 INFO  (qtp1378305256-46671) [n:127.0.0.1:40702_kiilu    ] o.a.s.s.HttpSolrCall [admin] webapp=null path=/admin/metrics params={prefix=CONTAINER.fs.usableSpace,CONTAINER.fs.totalSpace,CORE.coreName&wt=javabin&version=2&group=solr.node,solr.core} status=0 QTime=0
   [junit4]   2> 2679535 INFO  (qtp1378305256-46672) [n:127.0.0.1:40702_kiilu    x:control_collection_shard1_replica_n1] o.a.s.h.a.CoreAdminOperation core create command qt=/admin/cores&collection.configName=conf1&newCollection=true&name=control_collection_shard1_replica_n1&action=CREATE&numShards=1&collection=control_collection&shard=shard1&wt=javabin&version=2&replicaType=NRT
   [junit4]   2> 2679536 INFO  (qtp1378305256-46672) [n:127.0.0.1:40702_kiilu    x:control_collection_shard1_replica_n1] o.a.s.c.TransientSolrCoreCacheDefault Allocating transient cache for 4 transient cores
   [junit4]   2> 2680556 INFO  (qtp1378305256-46672) [n:127.0.0.1:40702_kiilu c:control_collection s:shard1  x:control_collection_shard1_replica_n1] o.a.s.c.SolrConfig Using Lucene MatchVersion: 7.7.0
   [junit4]   2> 2680576 INFO  (qtp1378305256-46672) [n:127.0.0.1:40702_kiilu c:control_collection s:shard1  x:control_collection_shard1_replica_n1] o.a.s.s.IndexSchema [control_collection_shard1_replica_n1] Schema name=test
   [junit4]   2> 2680750 INFO  (qtp1378305256-46672) [n:127.0.0.1:40702_kiilu c:control_collection s:shard1  x:control_collection_shard1_replica_n1] o.a.s.s.IndexSchema Loaded schema test/1.0 with uniqueid field id
   [junit4]   2> 2680774 INFO  (qtp1378305256-46672) [n:127.0.0.1:40702_kiilu c:control_collection s:shard1  x:control_collection_shard1_replica_n1] o.a.s.c.CoreContainer Creating SolrCore 'control_collection_shard1_replica_n1' using configuration from collection control_collection, trusted=true
   [junit4]   2> 2680775 INFO  (qtp1378305256-46672) [n:127.0.0.1:40702_kiilu c:control_collection s:shard1  x:control_collection_shard1_replica_n1] o.a.s.m.r.SolrJmxReporter JMX monitoring for 'solr.core.control_collection.shard1.replica_n1' (registry 'solr.core.control_collection.shard1.replica_n1') enabled at server: com.sun.jmx.mbeanserver.JmxMBeanServer@1baf2c5a
   [junit4]   2> 2680775 INFO  (qtp1378305256-46672) [n:127.0.0.1:40702_kiilu c:control_collection s:shard1  x:control_collection_shard1_replica_n1] o.a.s.c.SolrCore [[control_collection_shard1_replica_n1] ] Opening new SolrCore at [/x1/jenkins/jenkins-slave/workspace/Lucene-Solr-NightlyTests-7.x/checkout/solr/build/solr-core/test/J2/temp/solr.cloud.ForceLeaderTest_D7C3616BE0F39CD1-001/control-001/cores/control_collection_shard1_replica_n1], dataDir=[/x1/jenkins/jenkins-slave/workspace/Lucene-Solr-NightlyTests-7.x/checkout/solr/build/solr-core/test/J2/temp/solr.cloud.ForceLeaderTest_D7C3616BE0F39CD1-001/control-001/cores/control_collection_shard1_replica_n1/data/]
   [junit4]   2> 2680779 INFO  (qtp1378305256-46672) [n:127.0.0.1:40702_kiilu c:control_collection s:shard1  x:control_collection_shard1_replica_n1] o.a.s.u.RandomMergePolicy RandomMergePolicy wrapping class org.apache.lucene.index.AlcoholicMergePolicy: [AlcoholicMergePolicy: minMergeSize=0, mergeFactor=10, maxMergeSize=1785880122, maxMergeSizeForForcedMerge=9223372036854775807, calibrateSizeByDeletes=true, maxMergeDocs=2147483647, maxCFSSegmentSizeMB=8.796093022207999E12, noCFSRatio=0.1]
   [junit4]   2> 2680782 WARN  (qtp1378305256-46672) [n:127.0.0.1:40702_kiilu c:control_collection s:shard1  x:control_collection_shard1_replica_n1] o.a.s.c.RequestHandlers INVALID paramSet a in requestHandler {type = requestHandler,name = /dump,class = DumpRequestHandler,attributes = {initParams=a, name=/dump, class=DumpRequestHandler},args = {defaults={a=A,b=B}}}
   [junit4]   2> 2680856 INFO  (qtp1378305256-46672) [n:127.0.0.1:40702_kiilu c:control_collection s:shard1  x:control_collection_shard1_replica_n1] o.a.s.u.UpdateHandler Using UpdateLog implementation: org.apache.solr.update.UpdateLog
   [junit4]   2> 2680856 INFO  (qtp1378305256-46672) [n:127.0.0.1:40702_kiilu c:control_collection s:shard1  x:control_collection_shard1_replica_n1] o.a.s.u.UpdateLog Initializing UpdateLog: dataDir= defaultSyncLevel=FLUSH numRecordsToKeep=100 maxNumLogsToKeep=10 numVersionBuckets=65536
   [junit4]   2> 2680859 INFO  (qtp1378305256-46672) [n:127.0.0.1:40702_kiilu c:control_collection s:shard1  x:control_collection_shard1_replica_n1] o.a.s.u.CommitTracker Hard AutoCommit: disabled
   [junit4]   2> 2680859 INFO  (qtp1378305256-46672) [n:127.0.0.1:40702_kiilu c:control_collection s:shard1  x:control_collection_shard1_replica_n1] o.a.s.u.CommitTracker Soft AutoCommit: disabled
   [junit4]   2> 2680861 INFO  (qtp1378305256-46672) [n:127.0.0.1:40702_kiilu c:control_collection s:shard1  x:control_collection_shard1_replica_n1] o.a.s.u.RandomMergePolicy RandomMergePolicy wrapping class org.apache.lucene.index.TieredMergePolicy: [TieredMergePolicy: maxMergeAtOnce=20, maxMergeAtOnceExplicit=27, maxMergedSegmentMB=85.259765625, floorSegmentMB=1.9423828125, forceMergeDeletesPctAllowed=11.351351537833635, segmentsPerTier=2.0, maxCFSSegmentSizeMB=8.796093022207999E12, noCFSRatio=0.8803353755890616, deletesPctAllowed=38.96661081862243
   [junit4]   2> 2680862 INFO  (qtp1378305256-46672) [n:127.0.0.1:40702_kiilu c:control_collection s:shard1  x:control_collection_shard1_replica_n1] o.a.s.s.SolrIndexSearcher Opening [Searcher@2b833d92[control_collection_shard1_replica_n1] main]
   [junit4]   2> 2680864 INFO  (qtp1378305256-46672) [n:127.0.0.1:40702_kiilu c:control_collection s:shard1  x:control_collection_shard1_replica_n1] o.a.s.r.ManagedResourceStorage Configured ZooKeeperStorageIO with znodeBase: /configs/conf1
   [junit4]   2> 2680864 INFO  (qtp1378305256-46672) [n:127.0.0.1:40702_kiilu c:control_collection s:shard1  x:control_collection_shard1_replica_n1] o.a.s.r.ManagedResourceStorage Loaded null at path _rest_managed.json using ZooKeeperStorageIO:path=/configs/conf1
   [junit4]   2> 2680865 INFO  (qtp1378305256-46672) [n:127.0.0.1:40702_kiilu c:control_collection s:shard1  x:control_collection_shard1_replica_n1] o.a.s.h.ReplicationHandler Commits will be reserved for 10000ms.
   [junit4]   2> 2680865 INFO  (qtp1378305256-46672) [n:127.0.0.1:40702_kiilu c:control_collection s:shard1  x:control_collection_shard1_replica_n1] o.a.s.u.UpdateLog Could not find max version in index or recent updates, using new clock 1622434866540838912
   [junit4]   2> 2680870 INFO  (searcherExecutor-11911-thread-1-processing-n:127.0.0.1:40702_kiilu x:control_collection_shard1_replica_n1 c:control_collection s:shard1) [n:127.0.0.1:40702_kiilu c:control_collection s:shard1  x:control_collection_shard1_replica_n1] o.a.s.c.SolrCore [control_collection_shard1_replica_n1] Registered new searcher Searcher@2b833d92[control_collection_shard1_replica_n1] main{ExitableDirectoryReader(UninvertingDirectoryReader())}
   [junit4]   2> 2680873 INFO  (qtp1378305256-46672) [n:127.0.0.1:40702_kiilu c:control_collection s:shard1  x:control_collection_shard1_replica_n1] o.a.s.c.ZkShardTerms Successful update of terms at /collections/control_collection/terms/shard1 to Terms{values={core_node2=0}, version=0}
   [junit4]   2> 2680873 INFO  (qtp1378305256-46672) [n:127.0.0.1:40702_kiilu c:control_collection s:shard1  x:control_collection_shard1_replica_n1] o.a.s.c.ShardLeaderElectionContextBase make sure parent is created /collections/control_collection/leaders/shard1
   [junit4]   2> 2680877 INFO  (qtp1378305256-46672) [n:127.0.0.1:40702_kiilu c:control_collection s:shard1  x:control_collection_shard1_replica_n1] o.a.s.c.ShardLeaderElectionContext Enough replicas found to continue.
   [junit4]   2> 2680877 INFO  (qtp1378305256-46672) [n:127.0.0.1:40702_kiilu c:control_collection s:shard1  x:control_collection_shard1_replica_n1] o.a.s.c.ShardLeaderElectionContext I may be the new leader - try and sync
   [junit4]   2> 2680877 INFO  (qtp1378305256-46672) [n:127.0.0.1:40702_kiilu c:control_collection s:shard1  x:control_collection_shard1_replica_n1] o.a.s.c.SyncStrategy Sync replicas to http://127.0.0.1:40702/kiilu/control_collection_shard1_replica_n1/
   [junit4]   2> 2680878 INFO  (qtp1378305256-46672) [n:127.0.0.1:40702_kiilu c:control_collection s:shard1  x:control_collection_shard1_replica_n1] o.a.s.c.SyncStrategy Sync Success - now sync replicas to me
   [junit4]   2> 2680878 INFO  (qtp1378305256-46672) [n:127.0.0.1:40702_kiilu c:control_collection s:shard1  x:control_collection_shard1_replica_n1] o.a.s.c.SyncStrategy http://127.0.0.1:40702/kiilu/control_collection_shard1_replica_n1/ has no replicas
   [junit4]   2> 2680878 INFO  (qtp1378305256-46672) [n:127.0.0.1:40702_kiilu c:control_collection s:shard1  x:control_collection_shard1_replica_n1] o.a.s.c.ShardLeaderElectionContext Found all replicas participating in election, clear LIR
   [junit4]   2> 2680878 INFO  (qtp1378305256-46672) [n:127.0.0.1:40702_kiilu c:control_collection s:shard1  x:control_collection_shard1_replica_n1] o.a.s.c.ShardLeaderElectionContextBase Creating leader registration node /collections/control_collection/leaders/shard1/leader after winning as /collections/control_collection/leader_elect/shard1/election/72608701520084996-core_node2-n_0000000000
   [junit4]   2> 2680881 INFO  (qtp1378305256-46672) [n:127.0.0.1:40702_kiilu c:control_collection s:shard1  x:control_collection_shard1_replica_n1] o.a.s.c.ShardLeaderElectionContext I am the new leader: http://127.0.0.1:40702/kiilu/control_collection_shard1_replica_n1/ shard1
   [junit4]   2> 2680985 INFO  (zkCallback-11413-thread-1) [    ] o.a.s.c.c.ZkStateReader A cluster state change: [WatchedEvent state:SyncConnected type:NodeDataChanged path:/collections/control_collection/state.json] for collection [control_collection] has occurred - updating... (live nodes size: [1])
   [junit4]   2> 2680986 INFO  (zkCallback-11413-thread-2) [    ] o.a.s.c.c.ZkStateReader A cluster state change: [WatchedEvent state:SyncConnected type:NodeDataChanged path:/collections/control_collection/state.json] for collection [control_collection] has occurred - updating... (live nodes size: [1])
   [junit4]   2> 2680989 INFO  (qtp1378305256-46672) [n:127.0.0.1:40702_kiilu c:control_collection s:shard1  x:control_collection_shard1_replica_n1] o.a.s.c.ZkController I am the leader, no recovery necessary
   [junit4]   2> 2680992 INFO  (qtp1378305256-46672) [n:127.0.0.1:40702_kiilu c:control_collection s:shard1  x:control_collection_shard1_replica_n1] o.a.s.s.HttpSolrCall [admin] webapp=null path=/admin/cores params={qt=/admin/cores&collection.configName=conf1&newCollection=true&name=control_collection_shard1_replica_n1&action=CREATE&numShards=1&collection=control_collection&shard=shard1&wt=javabin&version=2&replicaType=NRT} status=0 QTime=1456
   [junit4]   2> 2680995 INFO  (qtp1378305256-46669) [n:127.0.0.1:40702_kiilu    ] o.a.s.h.a.CollectionsHandler Wait for new collection to be active for at most 45 seconds. Check all shard replicas
   [junit4]   2> 2681091 INFO  (zkCallback-11413-thread-1) [    ] o.a.s.c.c.ZkStateReader A cluster state change: [WatchedEvent state:SyncConnected type:NodeDataChanged path:/collections/control_collection/state.json] for collection [control_collection] has occurred - updating... (live nodes size: [1])
   [junit4]   2> 2681091 INFO  (zkCallback-11413-thread-2) [    ] o.a.s.c.c.ZkStateReader A cluster state change: [WatchedEvent state:SyncConnected type:NodeDataChanged path:/collections/control_collection/state.json] for collection [control_collection] has occurred - updating... (live nodes size: [1])
   [junit4]   2> 2681092 INFO  (zkCallback-11413-thread-3) [    ] o.a.s.c.c.ZkStateReader A cluster state change: [WatchedEvent state:SyncConnected type:NodeDataChanged path:/collections/control_collection/state.json] for collection [control_collection] has occurred - updating... (live nodes size: [1])
   [junit4]   2> 2681092 INFO  (qtp1378305256-46669) [n:127.0.0.1:40702_kiilu    ] o.a.s.s.HttpSolrCall [admin] webapp=null path=/admin/collections params={collection.configName=conf1&name=control_collection&nrtReplicas=1&action=CREATE&numShards=1&createNodeSet=127.0.0.1:40702_kiilu&wt=javabin&version=2} status=0 QTime=1698
   [junit4]   2> 2681098 INFO  (zkConnectionManagerCallback-11432-thread-1) [    ] o.a.s.c.c.ConnectionManager zkClient has connected
   [junit4]   2> 2681100 INFO  (TEST-ForceLeaderTest.testReplicasInLIRNoLeader-seed#[D7C3616BE0F39CD1]) [    ] o.a.s.c.c.ZkStateReader Updated live nodes from ZooKeeper... (0) -> (1)
   [junit4]   2> 2681101 INFO  (TEST-ForceLeaderTest.testReplicasInLIRNoLeader-seed#[D7C3616BE0F39CD1]) [    ] o.a.s.c.s.i.ZkClientClusterStateProvider Cluster at 127.0.0.1:36417/solr ready
   [junit4]   2> 2681101 INFO  (TEST-ForceLeaderTest.testReplicasInLIRNoLeader-seed#[D7C3616BE0F39CD1]) [    ] o.a.s.c.ChaosMonkey monkey: init - expire sessions:false cause connection loss:false
   [junit4]   2> 2681102 INFO  (SocketProxy-Acceptor-40702) [    ] o.a.s.c.s.c.SocketProxy accepted Socket[addr=/127.0.0.1,port=60982,localport=40702], receiveBufferSize:531000
   [junit4]   2> 2681102 INFO  (SocketProxy-Acceptor-40702) [    ] o.a.s.c.s.c.SocketProxy proxy connection Socket[addr=/127.0.0.1,port=44891,localport=38960], receiveBufferSize=530904
   [junit4]   2> 2681103 INFO  (qtp1378305256-46672) [n:127.0.0.1:40702_kiilu    ] o.a.s.h.a.CollectionsHandler Invoked Collection Action :create with params collection.configName=conf1&name=collection1&nrtReplicas=1&action=CREATE&numShards=2&createNodeSet=&stateFormat=2&wt=javabin&version=2 and sendToOCPQueue=true
   [junit4]   2> 2681106 INFO  (OverseerThreadFactory-11906-thread-2-processing-n:127.0.0.1:40702_kiilu) [n:127.0.0.1:40702_kiilu    ] o.a.s.c.a.c.CreateCollectionCmd Create collection collection1
   [junit4]   2> 2681106 INFO  (OverseerCollectionConfigSetProcessor-72608701520084996-127.0.0.1:40702_kiilu-n_0000000000) [n:127.0.0.1:40702_kiilu    ] o.a.s.c.OverseerTaskQueue Response ZK path: /overseer/collection-queue-work/qnr-0000000000 doesn't exist.  Requestor may have disconnected from ZooKeeper
   [junit4]   2> 2681311 WARN  (OverseerThreadFactory-11906-thread-2-processing-n:127.0.0.1:40702_kiilu) [n:127.0.0.1:40702_kiilu    ] o.a.s.c.a.c.CreateCollectionCmd It is unusual to create a collection (collection1) without cores.
   [junit4]   2> 2681313 INFO  (qtp1378305256-46672) [n:127.0.0.1:40702_kiilu    ] o.a.s.h.a.CollectionsHandler Wait for new collection to be active for at most 45 seconds. Check all shard replicas
   [junit4]   2> 2681314 INFO  (qtp1378305256-46672) [n:127.0.0.1:40702_kiilu    ] o.a.s.s.HttpSolrCall [admin] webapp=null path=/admin/collections params={collection.configName=conf1&name=collection1&nrtReplicas=1&action=CREATE&numShards=2&createNodeSet=&stateFormat=2&wt=javabin&version=2} status=0 QTime=210
   [junit4]   2> 2681315 INFO  (TEST-ForceLeaderTest.testReplicasInLIRNoLeader-seed#[D7C3616BE0F39CD1]) [    ] o.a.s.c.AbstractFullDistribZkTestBase Creating jetty instances pullReplicaCount=0 numOtherReplicas=3
   [junit4]   2> 2681504 INFO  (TEST-ForceLeaderTest.testReplicasInLIRNoLeader-seed#[D7C3616BE0F39CD1]) [    ] o.a.s.c.AbstractFullDistribZkTestBase create jetty 1 in directory /x1/jenkins/jenkins-slave/workspace/Lucene-Solr-NightlyTests-7.x/checkout/solr/build/solr-core/test/J2/temp/solr.cloud.ForceLeaderTest_D7C3616BE0F39CD1-001/shard-1-001 of type NRT
   [junit4]   2> 2681505 WARN  (closeThreadPool-11433-thread-1) [    ] o.e.j.s.AbstractConnector Ignoring deprecated socket close linger time
   [junit4]   2> 2681506 INFO  (closeThreadPool-11433-thread-1) [    ] o.a.s.c.s.e.JettySolrRunner Start Jetty (original configured port=0)
   [junit4]   2> 2681506 INFO  (closeThreadPool-11433-thread-1) [    ] o.a.s.c.s.e.JettySolrRunner Trying to start Jetty on port 0 try number 1 ...
   [junit4]   2> 2681506 INFO  (closeThreadPool-11433-thread-1) [    ] o.e.j.s.Server jetty-9.4.14.v20181114; built: 2018-11-14T21:20:31.478Z; git: c4550056e785fb5665914545889f21dc136ad9e6; jvm 1.8.0_191-b12
   [junit4]   2> 2681507 INFO  (closeThreadPool-11433-thread-1) [    ] o.e.j.s.session DefaultSessionIdManager workerName=node0
   [junit4]   2> 2681507 INFO  (closeThreadPool-11433-thread-1) [    ] o.e.j.s.session No SessionScavenger set, using defaults
   [junit4]   2> 2681507 INFO  (closeThreadPool-11433-thread-1) [    ] o.e.j.s.session node0 Scavenging every 660000ms
   [junit4]   2> 2681507 INFO  (closeThreadPool-11433-thread-1) [    ] o.e.j.s.h.ContextHandler Started o.e.j.s.ServletContextHandler@6b67f02{/kiilu,null,AVAILABLE}
   [junit4]   2> 2681508 INFO  (closeThreadPool-11433-thread-1) [    ] o.e.j.s.AbstractConnector Started ServerConnector@51ac19a{HTTP/1.1,[http/1.1]}{127.0.0.1:42238}
   [junit4]   2> 2681508 INFO  (closeThreadPool-11433-thread-1) [    ] o.e.j.s.Server Started @2681600ms
   [junit4]   2> 2681508 INFO  (closeThreadPool-11433-thread-1) [    ] o.a.s.c.s.e.JettySolrRunner Jetty properties: {solr.data.dir=/x1/jenkins/jenkins-slave/workspace/Lucene-Solr-NightlyTests-7.x/checkout/solr/build/solr-core/test/J2/temp/solr.cloud.ForceLeaderTest_D7C3616BE0F39CD1-001/tempDir-001/jetty1, solrconfig=solrconfig.xml, hostContext=/kiilu, hostPort=33132, coreRootDirectory=/x1/jenkins/jenkins-slave/workspace/Lucene-Solr-NightlyTests-7.x/checkout/solr/build/solr-core/test/J2/temp/solr.cloud.ForceLeaderTest_D7C3616BE0F39CD1-001/shard-1-001/cores}
   [junit4]   2> 2681508 ERROR (closeThreadPool-11433-thread-1) [    ] o.a.s.u.StartupLoggingUtils Missing Java Option solr.log.dir. Logging may be missing or incomplete.
   [junit4]   2> 2681508 INFO  (closeThreadPool-11433-thread-1) [    ] o.a.s.s.SolrDispatchFilter Using logger factory org.apache.logging.slf4j.Log4jLoggerFactory
   [junit4]   2> 2681508 INFO  (closeThreadPool-11433-thread-1) [    ] o.a.s.s.SolrDispatchFilter  ___      _       Welcome to Apache Solr™ version 7.7.0
   [junit4]   2> 2681508 INFO  (closeThreadPool-11433-thread-1) [    ] o.a.s.s.SolrDispatchFilter / __| ___| |_ _   Starting in cloud mode on port null
   [junit4]   2> 2681508 INFO  (closeThreadPool-11433-thread-1) [    ] o.a.s.s.SolrDispatchFilter \__ \/ _ \ | '_|  Install dir: null
   [junit4]   2> 2681508 INFO  (closeThreadPool-11433-thread-1) [    ] o.a.s.s.SolrDispatchFilter |___/\___/_|_|    Start time: 2019-01-12T06:27:42.905Z
   [junit4]   2> 2681510 INFO  (zkConnectionManagerCallback-11435-thread-1) [    ] o.a.s.c.c.ConnectionManager zkClient has connected
   [junit4]   2> 2681512 INFO  (closeThreadPool-11433-thread-1) [    ] o.a.s.s.SolrDispatchFilter Loading solr.xml from SolrHome (not found in ZooKeeper)
   [junit4]   2> 2681513 INFO  (closeThreadPool-11433-thread-1) [    ] o.a.s.c.SolrXmlConfig Loading container configuration from /x1/jenkins/jenkins-slave/workspace/Lucene-Solr-NightlyTests-7.x/checkout/solr/build/solr-core/test/J2/temp/solr.cloud.ForceLeaderTest_D7C3616BE0F39CD1-001/shard-1-001/solr.xml
   [junit4]   2> 2681517 INFO  (closeThreadPool-11433-thread-1) [    ] o.a.s.c.SolrXmlConfig Configuration parameter autoReplicaFailoverWorkLoopDelay is ignored
   [junit4]   2> 2681517 INFO  (closeThreadPool-11433-thread-1) [    ] o.a.s.c.SolrXmlConfig Configuration parameter autoReplicaFailoverBadNodeExpiration is ignored
   [junit4]   2> 2681519 INFO  (closeThreadPool-11433-thread-1) [    ] o.a.s.c.SolrXmlConfig MBean server found: com.sun.jmx.mbeanserver.JmxMBeanServer@1baf2c5a, but no JMX reporters were configured - adding default JMX reporter.
   [junit4]   2> 2681669 INFO  (closeThreadPool-11433-thread-1) [    ] o.a.s.c.ZkContainer Zookeeper client=127.0.0.1:36417/solr
   [junit4]   2> 2681671 INFO  (zkConnectionManagerCallback-11439-thread-1) [    ] o.a.s.c.c.ConnectionManager zkClient has connected
   [junit4]   2> 2681694 INFO  (zkConnectionManagerCallback-11441-thread-1) [    ] o.a.s.c.c.ConnectionManager zkClient has connected
   [junit4]   2> 2681699 INFO  (closeThreadPool-11433-thread-1) [n:127.0.0.1:33132_kiilu    ] o.a.s.c.c.ZkStateReader Updated live nodes from ZooKeeper... (0) -> (1)
   [junit4]   2> 2681703 INFO  (closeThreadPool-11433-thread-1) [n:127.0.0.1:33132_kiilu    ] o.a.s.c.ZkController Publish node=127.0.0.1:33132_kiilu as DOWN
   [junit4]   2> 2681704 INFO  (closeThreadPool-11433-thread-1) [n:127.0.0.1:33132_kiilu    ] o.a.s.c.TransientSolrCoreCacheDefault Allocating transient cache for 4 transient cores
   [junit4]   2> 2681704 INFO  (closeThreadPool-11433-thread-1) [n:127.0.0.1:33132_kiilu    ] o.a.s.c.ZkController Register node as live in ZooKeeper:/live_nodes/127.0.0.1:33132_kiilu
   [junit4]   2> 2681706 INFO  (zkCallback-11420-thread-1) [    ] o.a.s.c.c.ZkStateReader Updated live nodes from ZooKeeper... (1) -> (2)
   [junit4]   2> 2681706 INFO  (zkCallback-11413-thread-3) [    ] o.a.s.c.c.ZkStateReader Updated live nodes from ZooKeeper... (1) -> (2)
   [junit4]   2> 2681716 INFO  (zkCallback-11440-thread-1) [    ] o.a.s.c.c.ZkStateReader Updated live nodes from ZooKeeper... (1) -> (2)
   [junit4]   2> 2681717 INFO  (zkCallback-11431-thread-1) [    ] o.a.s.c.c.ZkStateReader Updated live nodes from ZooKeeper... (1) -> (2)
   [junit4]   2> 2681740 INFO  (zkConnectionManagerCallback-11448-thread-1) [    ] o.a.s.c.c.ConnectionManager zkClient has connected
   [junit4]   2> 2681742 INFO  (closeThreadPool-11433-thread-1) [n:127.0.0.1:33132_kiilu    ] o.a.s.c.c.ZkStateReader Updated live nodes from ZooKeeper... (0) -> (2)
   [junit4]   2> 2681744 INFO  (closeThreadPool-11433-thread-1) [n:127.0.0.1:33132_kiilu    ] o.a.s.c.s.i.ZkClientClusterStateProvider Cluster at 127.0.0.1:36417/solr ready
   [junit4]   2> 2681746 INFO  (closeThreadPool-11433-thread-1) [n:127.0.0.1:33132_kiilu    ] o.a.s.h.a.MetricsHistoryHandler No .system collection, keeping metrics history in memory.
   [junit4]   2> 2681762 INFO  (TEST-ForceLeaderTest.testReplicasInLIRNoLeader-seed#[D7C3616BE0F39CD1]) [    ] o.a.s.c.AbstractFullDistribZkTestBase create jetty 2 in directory /x1/jenkins/jenkins-slave/workspace/Lucene-Solr-NightlyTests-7.x/checkout/solr/build/solr-core/test/J2/temp/solr.cloud.ForceLeaderTest_D7C3616BE0F39CD1-001/shard-2-001 of type NRT
   [junit4]   2> 2681773 WARN  (closeThreadPool-11433-thread-2) [    ] o.e.j.s.AbstractConnector Ignoring deprecated socket close linger time
   [junit4]   2> 2681773 INFO  (closeThreadPool-11433-thread-2) [    ] o.a.s.c.s.e.JettySolrRunner Start Jetty (original configured port=0)
   [junit4]   2> 2681773 INFO  (closeThreadPool-11433-thread-2) [    ] o.a.s.c.s.e.JettySolrRunner Trying to start Jetty on port 0 try number 1 ...
   [junit4]   2> 2681773 INFO  (closeThreadPool-11433-thread-2) [    ] o.e.j.s.Server jetty-9.4.14.v20181114; built: 2018-11-14T21:20:31.478Z; git: c4550056e785fb5665914545889f21dc136ad9e6; jvm 1.8.0_191-b12
   [junit4]   2> 2681775 INFO  (closeThreadPool-11433-thread-1) [n:127.0.0.1:33132_kiilu    ] o.a.s.m.r.SolrJmxReporter JMX monitoring for 'solr.node' (registry 'solr.node') enabled at server: com.sun.jmx.mbeanserver.JmxMBeanServer@1baf2c5a
   [junit4]   2> 2681793 INFO  (closeThreadPool-11433-thread-1) [n:127.0.0.1:33132_kiilu    ] o.a.s.m.r.SolrJmxReporter JMX monitoring for 'solr.jvm' (registry 'solr.jvm') enabled at server: com.sun.jmx.mbeanserver.JmxMBeanServer@1baf2c5a
   [junit4]   2> 2681793 INFO  (closeThreadPool-11433-thread-1) [n:127.0.0.1:33132_kiilu    ] o.a.s.m.r.SolrJmxReporter JMX monitoring for 'solr.jetty' (registry 'solr.jetty') enabled at server: com.sun.jmx.mbeanserver.JmxMBeanServer@1baf2c5a
   [junit4]   2> 2681795 INFO  (closeThreadPool-11433-thread-1) [n:127.0.0.1:33132_kiilu    ] o.a.s.c.CorePropertiesLocator Found 0 core definitions underneath /x1/jenkins/jenkins-slave/workspace/Lucene-Solr-NightlyTests-7.x/checkout/solr/build/solr-core/test/J2/temp/solr.cloud.ForceLeaderTest_D7C3616BE0F39CD1-001/shard-1-001/cores
   [junit4]   2> 2681799 INFO  (closeThreadPool-11433-thread-2) [    ] o.e.j.s.session DefaultSessionIdManager workerName=node0
   [junit4]   2> 2681799 INFO  (closeThreadPool-11433-thread-2) [    ] o.e.j.s.session No SessionScavenger set, using defaults
   [junit4]   2> 2681799 INFO  (closeThreadPool-11433-thread-2) [    ] o.e.j.s.session node0 Scavenging every 660000ms
   [junit4]   2> 2681799 INFO  (closeThreadPool-11433-thread-2) [    ] o.e.j.s.h.ContextHandler Started o.e.j.s.ServletContextHandler@6ae95616{/kiilu,null,AVAILABLE}
   [junit4]   2> 2681800 INFO  (closeThreadPool-11433-thread-2) [    ] o.e.j.s.AbstractConnector Started ServerConnector@6e6e4ffc{HTTP/1.1,[http/1.1]}{127.0.0.1:44159}
   [junit4]   2> 2681800 INFO  (closeThreadPool-11433-thread-2) [    ] o.e.j.s.Server Started @2681892ms
   [junit4]   2> 2681800 INFO  (closeThreadPool-11433-thread-2) [    ] o.a.s.c.s.e.JettySolrRunner Jetty properties: {solr.data.dir=/x1/jenkins/jenkins-slave/workspace/Lucene-Solr-NightlyTests-7.x/checkout/solr/build/solr-core/test/J2/temp/solr.cloud.ForceLeaderTest_D7C3616BE0F39CD1-001/tempDir-001/jetty2, solrconfig=solrconfig.xml, hostContext=/kiilu, hostPort=39734, coreRootDirectory=/x1/jenkins/jenkins-slave/workspace/Lucene-Solr-NightlyTests-7.x/checkout/solr/build/solr-core/test/J2/temp/solr.cloud.ForceLeaderTest_D7C3616BE0F39CD1-001/shard-2-001/cores}
   [junit4]   2> 2681800 ERROR (closeThreadPool-11433-thread-2) [    ] o.a.s.u.StartupLoggingUtils Missing Java Option solr.log.dir. Logging may be missing or incomplete.
   [junit4]   2> 2681800 INFO  (closeThreadPool-11433-thread-2) [    ] o.a.s.s.SolrDispatchFilter Using logger factory org.apache.logging.slf4j.Log4jLoggerFactory
   [junit4]   2> 2681800 INFO  (closeThreadPool-11433-thread-2) [    ] o.a.s.s.SolrDispatchFilter  ___      _       Welcome to Apache Solr™ version 7.7.0
   [junit4]   2> 2681800 INFO  (closeThreadPool-11433-thread-2) [    ] o.a.s.s.SolrDispatchFilter / __| ___| |_ _   Starting in cloud mode on port null
   [junit4]   2> 2681800 INFO  (closeThreadPool-11433-thread-2) [    ] o.a.s.s.SolrDispatchFilter \__ \/ _ \ | '_|  Install dir: null
   [junit4]   2> 2681801 INFO  (closeThreadPool-11433-thread-2) [    ] o.a.s.s.SolrDispatchFilter |___/\___/_|_|    Start time: 2019-01-12T06:27:43.197Z
   [junit4]   2> 2681821 INFO  (zkConnectionManagerCallback-11451-thread-1) [    ] o.a.s.c.c.ConnectionManager zkClient has connected
   [junit4]   2> 2681823 INFO  (closeThreadPool-11433-thread-2) [    ] o.a.s.s.SolrDispatchFilter Loading solr.xml from SolrHome (not found in ZooKeeper)
   [junit4]   2> 2681823 INFO  (closeThreadPool-11433-thread-2) [    ] o.a.s.c.SolrXmlConfig Loading container configuration from /x1/jenkins/jenkins-slave/workspace/Lucene-Solr-NightlyTests-7.x/checkout/solr/build/solr-core/test/J2/temp/solr.cloud.ForceLeaderTest_D7C3616BE0F39CD1-001/shard-2-001/solr.xml
   [junit4]   2> 2681828 INFO  (closeThreadPool-11433-thread-2) [    ] o.a.s.c.SolrXmlConfig Configuration parameter autoReplicaFailoverWorkLoopDelay is ignored
   [junit4]   2> 2681828 INFO  (closeThreadPool-11433-thread-2) [    ] o.a.s.c.SolrXmlConfig Configuration parameter autoReplicaFailoverBadNodeExpiration is ignored
   [junit4]   2> 2681860 INFO  (closeThreadPool-11433-thread-2) [    ] o.a.s.c.SolrXmlConfig MBean server found: com.sun.jmx.mbeanserver.JmxMBeanServer@1baf2c5a, but no JMX reporters were configured - adding default JMX reporter.
   [junit4]   2> 2681963 INFO  (closeThreadPool-11433-thread-2) [    ] o.a.s.c.ZkContainer Zookeeper client=127.0.0.1:36417/solr
   [junit4]   2> 2681965 INFO  (zkConnectionManagerCallback-11455-thread-1) [    ] o.a.s.c.c.ConnectionManager zkClient has connected
   [junit4]   2> 2681986 INFO  (zkConnectionManagerCallback-11457-thread-1) [    ] o.a.s.c.c.ConnectionManager zkClient has connected
   [junit4]   2> 2681998 INFO  (closeThreadPool-11433-thread-2) [n:127.0.0.1:39734_kiilu    ] o.a.s.c.c.ZkStateReader Updated live nodes from ZooKeeper... (0) -> (2)
   [junit4]   2> 2682008 INFO  (closeThreadPool-11433-thread-2) [n:127.0.0.1:39734_kiilu    ] o.a.s.c.ZkController Publish node=127.0.0.1:39734_kiilu as DOWN
   [junit4]   2> 2682010 INFO  (TEST-ForceLeaderTest.testReplicasInLIRNoLeader-seed#[D7C3616BE0F39CD1]) [    ] o.a.s.c.AbstractFullDistribZkTestBase create jetty 3 in directory /x1/jenkins/jenkins-slave/workspace/Lucene-Solr-NightlyTests-7.x/checkout/solr/build/solr-core/test/J2/temp/solr.cloud.ForceLeaderTest_D7C3616BE0F39CD1-001/shard-3-001 of type NRT
   [junit4]   2> 2682010 WARN  (closeThreadPool-11433-thread-1) [    ] o.e.j.s.AbstractConnector Ignoring deprecated socket close linger time
   [junit4]   2> 2682011 INFO  (closeThreadPool-11433-thread-2) [n:127.0.0.1:39734_kiilu    ] o.a.s.c.TransientSolrCoreCacheDefault Allocating transient cache for 4 transient cores
   [junit4]   2> 2682011 INFO  (closeThreadPool-11433-thread-2) [n:127.0.0.1:39734_kiilu    ] o.a.s.c.ZkController Register node as live in ZooKeeper:/live_nodes/127.0.0.1:39734_kiilu
   [junit4]   2> 2682011 INFO  (closeThreadPool-11433-thread-1) [    ] o.a.s.c.s.e.JettySolrRunner Start Jetty (original configured port=0)
   [junit4]   2> 2682011 INFO  (closeThreadPool-11433-thread-1) [    ] o.a.s.c.s.e.JettySolrRunner Trying to start Jetty on port 0 try number 1 ...
   [junit4]   2> 2682011 INFO  (closeThreadPool-11433-thread-1) [    ] o.e.j.s.Server jetty-9.4.14.v20181114; built: 2018-11-14T21:20:31.478Z; git: c4550056e785fb5665914545889f21dc136ad9e6; jvm 1.8.0_191-b12
   [junit4]   2> 2682012 INFO  (zkCallback-11420-thread-1) [    ] o.a.s.c.c.ZkStateReader Updated live nodes from ZooKeeper... (2) -> (3)
   [junit4]   2> 2682014 INFO  (zkCallback-11440-thread-1) [    ] o.a.s.c.c.ZkStateReader Updated live nodes from ZooKeeper... (2) -> (3)
   [junit4]   2> 2682014 INFO  (zkCallback-11431-thread-1) [    ] o.a.s.c.c.ZkStateReader Updated live nodes from ZooKeeper... (2) -> (3)
   [junit4]   2> 2682015 INFO  (closeThreadPool-11433-thread-1) [    ] o.e.j.s.session DefaultSessionIdManager workerName=node0
   [junit4]   2> 2682015 INFO  (closeThreadPool-11433-thread-1) [    ] o.e.j.s.session No SessionScavenger set, using defaults
   [junit4]   2> 2682015 INFO  (closeThreadPool-11433-thread-1) [    ] o.e.j.s.session node0 Scavenging every 660000ms
   [junit4]   2> 2682015 INFO  (closeThreadPool-11433-thread-1) [    ] o.e.j.s.h.ContextHandler Started o.e.j.s.ServletContextHandler@20cc7b6a{/kiilu,null,AVAILABLE}
   [junit4]   2> 2682016 INFO  (zkCallback-11413-thread-3) [    ] o.a.s.c.c.ZkStateReader Updated live nodes from ZooKeeper... (2) -> (3)
   [junit4]   2> 2682017 INFO  (closeThreadPool-11433-thread-1) [    ] o.e.j.s.AbstractConnector Started ServerConnector@7e908026{HTTP/1.1,[http/1.1]}{127.0.0.1:43579}
   [junit4]   2> 2682017 INFO  (closeThreadPool-11433-thread-1) [    ] o.e.j.s.Server Started @2682109ms
   [junit4]   2> 2682017 INFO  (closeThreadPool-11433-thread-1) [    ] o.a.s.c.s.e.JettySolrRunner Jetty properties: {solr.data.dir=/x1/jenkins/jenkins-slave/workspace/Lucene-Solr-NightlyTests-7.x/checkout/solr/build/solr-core/test/J2/temp/solr.cloud.ForceLeaderTest_D7C3616BE0F39CD1-001/tempDir-001/jetty3, solrconfig=solrconfig.xml, hostContext=/kiilu, hostPort=39788, coreRootDirectory=/x1/jenkins/jenkins-slave/workspace/Lucene-Solr-NightlyTests-7.x/checkout/solr/build/solr-core/test/J2/temp/solr.cloud.ForceLeaderTest_D7C3616BE0F39CD1-001/shard-3-001/cores}
   [junit4]   2> 2682017 ERROR (closeThreadPool-11433-thread-1) [    ] o.a.s.u.StartupLoggingUtils Missing Java Option solr.log.dir. Logging may be missing or incomplete.
   [junit4]   2> 2682017 INFO  (closeThreadPool-11433-thread-1) [    ] o.a.s.s.SolrDispatchFilter Using logger factory org.apache.logging.slf4j.Log4jLoggerFactory
   [junit4]   2> 2682017 INFO  (closeThreadPool-11433-thread-1) [    ] o.a.s.s.SolrDispatchFilter  ___      _       Welcome to Apache Solr™ version 7.7.0
   [junit4]   2> 2682017 INFO  (closeThreadPool-11433-thread-1) [    ] o.a.s.s.SolrDispatchFilter / __| ___| |_ _   Starting in cloud mode on port null
   [junit4]   2> 2682017 INFO  (closeThreadPool-11433-thread-1) [    ] o.a.s.s.SolrDispatchFilter \__ \/ _ \ | '_|  Install dir: null
   [junit4]   2> 2682017 INFO  (closeThreadPool-11433-thread-1) [    ] o.a.s.s.SolrDispatchFilter |___/\___/_|_|    Start time: 2019-01-12T06:27:43.414Z
   [junit4]   2> 2682018 INFO  (zkCallback-11447-thread-1) [    ] o.a.s.c.c.ZkStateReader Updated live nodes from ZooKeeper... (2) -> (3)
   [junit4]   2> 2682019 INFO  (zkCallback-11456-thread-1) [    ] o.a.s.c.c.ZkStateReader Updated live nodes from ZooKeeper... (2) -> (3)
   [junit4]   2> 2682020 INFO  (zkConnectionManagerCallback-11461-thread-1) [    ] o.a.s.c.c.ConnectionManager zkClient has connected
   [junit4]   2> 2682021 INFO  (closeThreadPool-11433-thread-1) [    ] o.a.s.s.SolrDispatchFilter Loading solr.xml from SolrHome (not found in ZooKeeper)
   [junit4]   2> 2682021 INFO  (closeThreadPool-11433-thread-1) [    ] o.a.s.c.SolrXmlConfig Loading container configuration from /x1/jenkins/jenkins-slave/workspace/Lucene-Solr-NightlyTests-7.x/checkout/solr/build/solr-core/test/J2/temp/solr.cloud.ForceLeaderTest_D7C3616BE0F39CD1-001/shard-3-001/solr.xml
   [junit4]   2> 2682026 INFO  (closeThreadPool-11433-thread-1) [    ] o.a.s.c.SolrXmlConfig Configuration parameter autoReplicaFailoverWorkLoopDelay is ignored
   [junit4]   2> 2682026 INFO  (closeThreadPool-11433-thread-1) [    ] o.a.s.c.SolrXmlConfig Configuration parameter autoReplicaFailoverBadNodeExpiration is ignored
   [junit4]   2> 2682027 INFO  (closeThreadPool-11433-thread-1) [    ] o.a.s.c.SolrXmlConfig MBean server found: com.sun.jmx.mbeanserver.JmxMBeanServer@1baf2c5a, but no JMX reporters were configured - adding default JMX reporter.
   [junit4]   2> 2682045 INFO  (zkConnectionManagerCallback-11466-thread-1) [    ] o.a.s.c.c.ConnectionManager zkClient has connected
   [junit4]   2> 2682046 INFO  (closeThreadPool-11433-thread-2) [n:127.0.0.1:39734_kiilu    ] o.a.s.c.c.ZkStateReader Updated live nodes from ZooKeeper... (0) -> (3)
   [junit4]   2> 2682047 INFO  (closeThreadPool-11433-thread-2) [n:127.0.0.1:39734_kiilu    ] o.a.s.c.s.i.ZkClientClusterStateProvider Cluster at 127.0.0.1:36417/solr ready
   [junit4]   2> 2682048 INFO  (closeThreadPool-11433-thread-2) [n:127.0.0.1:39734_kiilu    ] o.a.s.h.a.MetricsHistoryHandler No .system collection, keeping metrics history in memory.
   [junit4]   2> 2682077 INFO  (closeThreadPool-11433-thread-2) [n:127.0.0.1:39734_kiilu    ] o.a.s.m.r.SolrJmxReporter JMX monitoring for 'solr.node' (registry 'solr.node') enabled at server: com.sun.jmx.mbeanserver.JmxMBeanServer@1baf2c5a
   [junit4]   2> 2682095 INFO  (closeThreadPool-11433-thread-2) [n:127.0.0.1:39734_kiilu    ] o.a.s.m.r.SolrJmxReporter JMX monitoring for 'solr.jvm' (registry 'solr.jvm') enabled at server: com.sun.jmx.mbeanserver.JmxMBeanServer@1baf2c5a
   [junit4]   2> 2682095 INFO  (closeThreadPool-11433-thread-2) [n:127.0.0.1:39734_kiilu    ] o.a.s.m.r.SolrJmxReporter JMX monitoring for 'solr.jetty' (registry 'solr.jetty') enabled at server: com.sun.jmx.mbeanserver.JmxMBeanServer@1baf2c5a
   [junit4]   2> 2682097 INFO  (closeThreadPool-11433-thread-2) [n:127.0.0.1:39734_kiilu    ] o.a.s.c.CorePropertiesLocator Found 0 core definitions underneath /x1/jenkins/jenkins-slave/workspace/Lucene-Solr-NightlyTests-7.x/checkout/solr/build/solr-core/test/J2/temp/solr.cloud.ForceLeaderTest_D7C3616BE0F39CD1-001/shard-2-001/cores
   [junit4]   2> 2682156 INFO  (closeThreadPool-11433-thread-1) [    ] o.a.s.c.ZkContainer Zookeeper client=127.0.0.1:36417/solr
   [junit4]   2> 2682157 INFO  (zkConnectionManagerCallback-11471-thread-1) [    ] o.a.s.c.c.ConnectionManager zkClient has connected
   [junit4]   2> 2682159 INFO  (zkConnectionManagerCallback-11473-thread-1) [    ] o.a.s.c.c.ConnectionManager zkClient has connected
   [junit4]   2> 2682166 INFO  (closeThreadPool-11433-thread-1) [    ] o.a.s.c.c.ZkStateReader Updated live nodes from ZooKeeper... (0) -> (3)
   [junit4]   2> 2682172 INFO  (closeThreadPool-11433-thread-1) [    ] o.a.s.c.ZkController Publish node=127.0.0.1:39788_kiilu as DOWN
   [junit4]   2> 2682173 INFO  (closeThreadPool-11433-thread-1) [    ] o.a.s.c.TransientSolrCoreCacheDefault Allocating transient cache for 4 transient cores
   [junit4]   2> 2682173 INFO  (closeThreadPool-11433-thread-1) [    ] o.a.s.c.ZkController Register node as live in ZooKeeper:/live_nodes/127.0.0.1:39788_kiilu
   [junit4]   2> 2682175 INFO  (zkCallback-11456-thread-1) [    ] o.a.s.c.c.ZkStateReader Updated live nodes from ZooKeeper... (3) -> (4)
   [junit4]   2> 2682175 INFO  (zkCallback-11440-thread-1) [    ] o.a.s.c.c.ZkStateReader Updated live nodes from ZooKeeper... (3) -> (4)
   [junit4]   2> 2682175 INFO  (zkCallback-11420-thread-1) [    ] o.a.s.c.c.ZkStateReader Updated live nodes from ZooKeeper... (3) -> (4)
   [junit4]   2> 2682175 INFO  (zkCallback-11431-thread-1) [    ] o.a.s.c.c.ZkStateReader Updated live nodes from ZooKeeper... (3) -> (4)
   [junit4]   2> 2682175 INFO  (zkCallback-11447-thread-1) [    ] o.a.s.c.c.ZkStateReader Updated live nodes from ZooKeeper... (3) -> (4)
   [junit4]   2> 2682175 INFO  (zkCallback-11413-thread-3) [    ] o.a.s.c.c.ZkStateReader Updated live nodes from ZooKeeper... (3) -> (4)
   [junit4]   2> 2682175 INFO  (zkCallback-11465-thread-1) [    ] o.a.s.c.c.ZkStateReader Updated live nodes from ZooKeeper... (3) -> (4)
   [junit4]   2> 2682176 INFO  (zkCallback-11472-thread-1) [    ] o.a.s.c.c.ZkStateReader Updated live nodes from ZooKeeper... (3) -> (4)
   [junit4]   2> 2682206 INFO  (zkConnectionManagerCallback-11480-thread-1) [    ] o.a.s.c.c.ConnectionManager zkClient has connected
   [junit4]   2> 2682207 INFO  (closeThreadPool-11433-thread-1) [    ] o.a.s.c.c.ZkStateReader Updated live nodes from ZooKeeper... (0) -> (4)
   [junit4]   2> 2682208 INFO  (closeThreadPool-11433-thread-1) [    ] o.a.s.c.s.i.ZkClientClusterStateProvider Cluster at 127.0.0.1:36417/solr ready
   [junit4]   2> 2682209 INFO  (closeThreadPool-11433-thread-1) [    ] o.a.s.h.a.MetricsHistoryHandler No .system collection, keeping metrics history in memory.
   [junit4]   2> 2682236 INFO  (closeThreadPool-11433-thread-1) [    ] o.a.s.m.r.SolrJmxReporter JMX monitoring for 'solr.node' (registry 'solr.node') enabled at server: com.sun.jmx.mbeanserver.JmxMBeanServer@1baf2c5a
   [junit4]   2> 2682252 INFO  (closeThreadPool-11433-thread-1) [    ] o.a.s.m.r.SolrJmxReporter JMX monitoring for 'solr.jvm' (registry 'solr.jvm') enabled at server: com.sun.jmx.mbeanserver.JmxMBeanServer@1baf2c5a
   [junit4]   2> 2682253 INFO  (closeThreadPool-11433-thread-1) [    ] o.a.s.m.r.SolrJmxReporter JMX monitoring for 'solr.jetty' (registry 'solr.jetty') enabled at server: com.sun.jmx.mbeanserver.JmxMBeanServer@1baf2c5a
   [junit4]   2> 2682255 INFO  (closeThreadPool-11433-thread-1) [    ] o.a.s.c.CorePropertiesLocator Found 0 core definitions underneath /x1/jenkins/jenkins-slave/workspace/Lucene-Solr-NightlyTests-7.x/checkout/solr/build/solr-core/test/J2/temp/solr.cloud.ForceLeaderTest_D7C3616BE0F39CD1-001/shard-3-001/cores
   [junit4]   2> 2682361 INFO  (SocketProxy-Acceptor-33132) [    ] o.a.s.c.s.c.SocketProxy accepted Socket[addr=/127.0.0.1,port=49442,localport=33132], receiveBufferSize:531000
   [junit4]   2> 2682366 INFO  (SocketProxy-Acceptor-33132) [    ] o.a.s.c.s.c.SocketProxy proxy connection Socket[addr=/127.0.0.1,port=42238,localport=52256], receiveBufferSize=530904
   [junit4]   2> 2682366 INFO  (SocketProxy-Acceptor-33132) [    ] o.a.s.c.s.c.SocketProxy accepted Socket[addr=/127.0.0.1,port=49446,localport=33132], receiveBufferSize:531000
   [junit4]   2> 2682367 INFO  (SocketProxy-Acceptor-33132) [    ] o.a.s.c.s.c.SocketProxy proxy connection Socket[addr=/127.0.0.1,port=42238,localport=52260], receiveBufferSize=530904
   [junit4]   2> 2682367 INFO  (SocketProxy-Acceptor-33132) [    ] o.a.s.c.s.c.SocketProxy accepted Socket[addr=/127.0.0.1,port=49450,localport=33132], receiveBufferSize:531000
   [junit4]   2> 2682367 INFO  (qtp847944717-46736) [n:127.0.0.1:33132_kiilu    ] o.a.s.h.a.CollectionsHandler Invoked Collection Action :addreplica with params node=127.0.0.1:33132_kiilu&action=ADDREPLICA&collection=collection1&shard=shard2&type=NRT&wt=javabin&version=2 and sendToOCPQueue=true
   [junit4]   2> 2682368 INFO  (qtp847944717-46737) [n:127.0.0.1:33132_kiilu    ] o.a.s.h.a.CollectionsHandler Invoked Collection Action :addreplica with params node=127.0.0.1:39788_kiilu&action=ADDREPLICA&collection=collection1&shard=shard2&type=NRT&wt=javabin&version=2 and sendToOCPQueue=true
   [junit4]   2> 2682368 INFO  (SocketProxy-Acceptor-33132) [    ] o.a.s.c.s.c.SocketProxy proxy connection Socket[addr=/127.0.0.1,port=42238,localport=52264], receiveBufferSize=530904
   [junit4]   2> 2682369 INFO  (qtp847944717-46735) [n:127.0.0.1:33132_kiilu    ] o.a.s.h.a.CollectionsHandler Invoked Collection Action :addreplica with params node=127.0.0.1:39734_kiilu&action=ADDREPLICA&collection=collection1&shard=shard1&type=NRT&wt=javabin&version=2 and sendToOCPQueue=true
   [junit4]   2> 2682371 INFO  (OverseerCollectionConfigSetProcessor-72608701520084996-127.0.0.1:40702_kiilu-n_0000000000) [n:127.0.0.1:40702_kiilu    ] o.a.s.c.OverseerTaskQueue Response ZK path: /overseer/collection-queue-work/qnr-0000000002 doesn't exist.  Requestor may have disconnected from ZooKeeper
   [junit4]   2> 2682376 INFO  (SocketProxy-Acceptor-33132) [    ] o.a.s.c.s.c.SocketProxy accepted Socket[addr=/127.0.0.1,port=49454,localport=33132], receiveBufferSize:531000
   [junit4]   2> 2682379 INFO  (qtp847944717-46739) [n:127.0.0.1:33132_kiilu    ] o.a.s.s.HttpSolrCall [admin] webapp=null path=/admin/metrics params={prefix=CONTAINER.fs.usableSpace,CONTAINER.fs.totalSpace,CORE.coreName&wt=javabin&version=2&group=solr.node,solr.core} status=0 QTime=0
   [junit4]   2> 2682379 INFO  (SocketProxy-Acceptor-33132) [    ] o.a.s.c.s.c.SocketProxy proxy connection Socket[addr=/127.0.0.1,port=42238,localport=52268], receiveBufferSize=530904
   [junit4]   2> 2682380 INFO  (qtp847944717-46738) [n:127.0.0.1:33132_kiilu    ] o.a.s.s.HttpSolrCall [admin] webapp=null path=/admin/metrics params={prefix=CONTAINER.fs.usableSpace,CONTAINER.fs.totalSpace,CORE.coreName&wt=javabin&version=2&group=solr.node,solr.core} status=0 QTime=0
   [junit4]   2> 2682381 INFO  (qtp847944717-46739) [n:127.0.0.1:33132_kiilu    ] o.a.s.s.HttpSolrCall [admin] webapp=null path=/admin/metrics params={prefix=CONTAINER.fs.usableSpace,CONTAINER.fs.totalSpace,CORE.coreName&wt=javabin&version=2&group=solr.node,solr.core} status=0 QTime=0
   [junit4]   2> 2682382 INFO  (qtp847944717-46738) [n:127.0.0.1:33132_kiilu    ] o.a.s.s.HttpSolrCall [admin] webapp=null path=/admin/metrics params={prefix=CONTAINER.fs.usableSpace,CONTAINER.fs.totalSpace,CORE.coreName&wt=javabin&version=2&group=solr.node,solr.core} status=0 QTime=0
   [junit4]   2> 2682383 INFO  (qtp847944717-46739) [n:127.0.0.1:33132_kiilu    ] o.a.s.s.HttpSolrCall [admin] webapp=null path=/admin/metrics params={prefix=CONTAINER.fs.usableSpace,CONTAINER.fs.totalSpace,CORE.coreName&wt=javabin&version=2&group=solr.node,solr.core} status=0 QTime=0
   [junit4]   2> 2682384 INFO  (SocketProxy-Acceptor-39734) [    ] o.a.s.c.s.c.SocketProxy accepted Socket[addr=/127.0.0.1,port=47468,localport=39734], receiveBufferSize:531000
   [junit4]   2> 2682385 INFO  (SocketProxy-Acceptor-39734) [    ] o.a.s.c.s.c.SocketProxy proxy connection Socket[addr=/127.0.0.1,port=44159,localport=58304], receiveBufferSize=530904
   [junit4]   2> 2682386 INFO  (qtp962315849-46766) [n:127.0.0.1:39734_kiilu    ] o.a.s.s.HttpSolrCall [admin] webapp=null path=/admin/metrics params={prefix=CONTAINER.fs.usableSpace,CONTAINER.fs.totalSpace,CORE.coreName&wt=javabin&version=2&group=solr.node,solr.core} status=0 QTime=0
   [junit4]   2> 2682390 INFO  (qtp962315849-46767) [n:127.0.0.1:39734_kiilu    ] o.a.s.s.HttpSolrCall [admin] webapp=null path=/admin/metrics params={prefix=CONTAINER.fs.usableSpace,CONTAINER.fs.totalSpace,CORE.coreName&wt=javabin&version=2&group=solr.node,solr.core} status=0 QTime=0
   [junit4]   2> 2682391 INFO  (qtp962315849-46768) [n:127.0.0.1:39734_kiilu    ] o.a.s.s.HttpSolrCall [admin] webapp=null path=/admin/metrics params={prefix=CONTAINER.fs.usableSpace,CONTAINER.fs.totalSpace,CORE.coreName&wt=javabin&version=2&group=solr.node,solr.core} status=0 QTime=0
   [junit4]   2> 2682394 INFO  (qtp962315849-46769) [n:127.0.0.1:39734_kiilu    ] o.a.s.s.HttpSolrCall [admin] webapp=null path=/admin/metrics params={prefix=CONTAINER.fs.usableSpace,CONTAINER.fs.totalSpace,CORE.coreName&wt=javabin&version=2&group=solr.node,solr.core} status=0 QTime=0
   [junit4]   2> 2682395 INFO  (qtp962315849-46765) [n:127.0.0.1:39734_kiilu    ] o.a.s.s.HttpSolrCall [admin] webapp=null path=/admin/metrics params={prefix=CONTAINER.fs.usableSpace,CONTAINER.fs.totalSpace,CORE.coreName&wt=javabin&version=2&group=solr.node,solr.core} status=0 QTime=0
   [junit4]   2> 2682396 INFO  (SocketProxy-Acceptor-39788) [    ] o.a.s.c.s.c.SocketProxy accepted Socket[addr=/127.0.0.1,port=35668,localport=39788], receiveBufferSize:531000
   [junit4]   2> 2682406 INFO  (SocketProxy-Acceptor-39788) [    ] o.a.s.c.s.c.SocketProxy proxy connection Socket[addr=/127.0.0.1,port=43579,localport=43500], receiveBufferSize=530904
   [junit4]   2> 2682407 INFO  (qtp1232006470-46794) [n:127.0.0.1:39788_kiilu    ] o.a.s.s.HttpSolrCall [admin] webapp=null path=/admin/metrics params={prefix=CONTAINER.fs.usableSpace,CONTAINER.fs.totalSpace,CORE.coreName&wt=javabin&version=2&group=solr.node,solr.core} status=0 QTime=0
   [junit4]   2> 2682408 INFO  (qtp1232006470-46793) [n:127.0.0.1:39788_kiilu    ] o.a.s.s.HttpSolrCall [admin] webapp=null path=/admin/metrics params={prefix=CONTAINER.fs.usableSpace,CONTAINER.fs.totalSpace,CORE.coreName&wt=javabin&version=2&group=solr.node,solr.core} status=0 QTime=0
   [junit4]   2> 2682409 INFO  (qtp1232006470-46795) [n:127.0.0.1:39788_kiilu    ] o.a.s.s.HttpSolrCall [admin] webapp=null path=/admin/metrics params={prefix=CONTAINER.fs.usableSpace,CONTAINER.fs.totalSpace,CORE.coreName&wt=javabin&version=2&group=solr.node,solr.core} status=0 QTime=0
   [junit4]   2> 2682410 INFO  (qtp1232006470-46796) [n:127.0.0.1:39788_kiilu    ] o.a.s.s.HttpSolrCall [admin] webapp=null path=/admin/metrics params={prefix=CONTAINER.fs.usableSpace,CONTAINER.fs.totalSpace,CORE.coreName&wt=javabin&version=2&group=solr.node,solr.core} status=0 QTime=0
   [junit4]   2> 2682411 INFO  (qtp1232006470-46792) [n:127.0.0.1:39788_kiilu    ] o.a.s.s.HttpSolrCall [admin] webapp=null path=/admin/metrics params={prefix=CONTAINER.fs.usableSpace,CONTAINER.fs.totalSpace,CORE.coreName&wt=javabin&version=2&group=solr.node,solr.core} status=0 QTime=0
   [junit4]   2> 2682412 INFO  (qtp1378305256-46669) [n:127.0.0.1:40702_kiilu    ] o.a.s.s.HttpSolrCall [admin] webapp=null path=/admin/metrics params={wt=javabin&version=2&key=solr.core.control_collection.shard1.replica_n1:INDEX.sizeInBytes} status=0 QTime=1
   [junit4]   2> 2682413 INFO  (qtp1378305256-46668) [n:127.0.0.1:40702_kiilu    ] o.a.s.s.HttpSolrCall [admin] webapp=null path=/admin/metrics params={wt=javabin&version=2&key=solr.core.control_collection.shard1.replica_n1:INDEX.sizeInBytes} status=0 QTime=0
   [junit4]   2> 2682414 INFO  (qtp1378305256-46670) [n:127.0.0.1:40702_kiilu    ] o.a.s.s.HttpSolrCall [admin] webapp=null path=/admin/metrics params={wt=javabin&version=2&key=solr.core.control_collection.shard1.replica_n1:INDEX.sizeInBytes} status=0 QTime=0
   [junit4]   2> 2682415 INFO  (qtp1378305256-46671) [n:127.0.0.1:40702_kiilu    ] o.a.s.s.HttpSolrCall [admin] webapp=null path=/admin/metrics params={prefix=CONTAINER.fs.usableSpace,CONTAINER.fs.totalSpace,CORE.coreName&wt=javabin&version=2&group=solr.node,solr.core} status=0 QTime=0
   [junit4]   2> 2682416 INFO  (qtp1378305256-46672) [n:127.0.0.1:40702_kiilu    ] o.a.s.s.HttpSolrCall [admin] webapp=null path=/admin/metrics params={prefix=CONTAINER.fs.usableSpace,CONTAINER.fs.totalSpace,CORE.coreName&wt=javabin&version=2&group=solr.node,solr.core} status=0 QTime=0
   [junit4]   2> 2682417 INFO  (qtp1378305256-46669) [n:127.0.0.1:40702_kiilu    ] o.a.s.s.HttpSolrCall [admin] webapp=null path=/admin/metrics params={prefix=CONTAINER.fs.usableSpace,CONTAINER.fs.totalSpace,CORE.coreName&wt=javabin&version=2&group=solr.node,solr.core} status=0 QTime=0
   [junit4]   2> 2682418 INFO  (qtp1378305256-46668) [n:127.0.0.1:40702_kiilu    ] o.a.s.s.HttpSolrCall [admin] webapp=null path=/admin/metrics params={prefix=CONTAINER.fs.usableSpace,CONTAINER.fs.totalSpace,CORE.coreName&wt=javabin&version=2&group=solr.node,solr.core} status=0 QTime=0
   [junit4]   2> 2682419 INFO  (qtp1378305256-46670) [n:127.0.0.1:40702_kiilu    ] o.a.s.s.HttpSolrCall [admin] webapp=null path=/admin/metrics params={prefix=CONTAINER.fs.usableSpace,CONTAINER.fs.totalSpace,CORE.coreName&wt=javabin&version=2&group=solr.node,solr.core} status=0 QTime=0
   [junit4]   2> 2682420 INFO  (OverseerThreadFactory-11906-thread-3-processing-n:127.0.0.1:40702_kiilu) [n:127.0.0.1:40702_kiilu c:collection1 s:shard2  ] o.a.s.c.a.c.AddReplicaCmd Node Identified 127.0.0.1:33132_kiilu for creating new replica of shard shard2 for collection collection1
   [junit4]   2> 2682422 INFO  (OverseerThreadFactory-11906-thread-4-processing-n:127.0.0.1:40702_kiilu) [n:127.0.0.1:40702_kiilu c:collection1 s:shard1  ] o.a.s.c.a.c.AddReplicaCmd Node Identified 127.0.0.1:39734_kiilu for creating new replica of shard shard1 for collection collection1
   [junit4]   2> 2682424 INFO  (OverseerThreadFactory-11906-thread-3-processing-n:127.0.0.1:40702_kiilu) [n:127.0.0.1:40702_kiilu c:collection1 s:shard2  ] o.a.s.c.a.c.AddReplicaCmd Returning CreateReplica command.
   [junit4]   2> 2682424 INFO  (OverseerThreadFactory-11906-thread-4-processing-n:127.0.0.1:40702_kiilu) [n:127.0.0.1:40702_kiilu c:collection1 s:shard1  ] o.a.s.c.a.c.AddReplicaCmd Returning CreateReplica command.
   [junit4]   2> 2682426 INFO  (SocketProxy-Acceptor-33132) [    ] o.a.s.c.s.c.SocketProxy accepted Socket[addr=/127.0.0.1,port=49466,localport=33132], receiveBufferSize:531000
   [junit4]   2> 2682426 INFO  (SocketProxy-Acceptor-39734) [    ] o.a.s.c.s.c.SocketProxy accepted Socket[addr=/127.0.0.1,port=47480,localport=39734], receiveBufferSize:531000
   [junit4]   2> 2682434 INFO  (SocketProxy-Acceptor-33132) [    ] o.a.s.c.s.c.SocketProxy proxy connection Socket[addr=/127.0.0.1,port=42238,localport=52280], receiveBufferSize=530904
   [junit4]   2> 2682434 INFO  (SocketProxy-Acceptor-39734) [    ] o.a.s.c.s.c.SocketProxy proxy connection Socket[addr=/127.0.0.1,port=44159,localport=58316], receiveBufferSize=530904
   [junit4]   2> 2682438 INFO  (qtp847944717-46739) [n:127.0.0.1:33132_kiilu    x:collection1_shard2_replica_n1] o.a.s.h.a.CoreAdminOperation core create command qt=/admin/cores&collection.configName=conf1&name=collection1_shard2_replica_n1&action=CREATE&collection=collection1&shard=shard2&wt=javabin&version=2&replicaType=NRT
   [junit4]   2> 2682438 INFO  (qtp962315849-46767) [n:127.0.0.1:39734_kiilu    x:collection1_shard1_replica_n2] o.a.s.h.a.CoreAdminOperation core create command qt=/admin/cores&collection.configName=conf1&name=collection1_shard1_replica_n2&action=CREATE&collection=collection1&shard=shard1&wt=javabin&version=2&replicaType=NRT
   [junit4]   2> 2683470 INFO  (qtp962315849-46767) [n:127.0.0.1:39734_kiilu c:collection1 s:shard1  x:collection1_shard1_replica_n2] o.a.s.c.SolrConfig Using Lucene MatchVersion: 7.7.0
   [junit4]   2> 2683473 INFO  (qtp847944717-46739) [n:127.0.0.1:33132_kiilu c:collection1 s:shard2  x:collection1_shard2_replica_n1] o.a.s.c.SolrConfig Using Lucene MatchVersion: 7.7.0
   [junit4]   2> 2683489 INFO  (qtp962315849-46767) [n:127.0.0.1:39734_kiilu c:collection1 s:shard1  x:collection1_shard1_replica_n2] o.a.s.s.IndexSchema [collection1_shard1_replica_n2] Schema name=test
   [junit4]   2> 2683490 INFO  (qtp847944717-46739) [n:127.0.0.1:33132_kiilu c:collection1 s:shard2  x:collection1_shard2_replica_n1] o.a.s.s.IndexSchema [collection1_shard2_replica_n1] Schema name=test
   [junit4]   2> 2683674 INFO  (qtp847944717-46739) [n:127.0.0.1:33132_kiilu c:collection1 s:shard2  x:collection1_shard2_replica_n1] o.a.s.s.IndexSchema Loaded schema test/1.0 with uniqueid field id
   [junit4]   2> 2683676 INFO  (qtp962315849-46767) [n:127.0.0.1:39734_kiilu c:collection1 s:shard1  x:collection1_shard1_replica_n2] o.a.s.s.IndexSchema Loaded schema test/1.0 with uniqueid field id
   [junit4]   2> 2683693 INFO  (qtp847944717-46739) [n:127.0.0.1:33132_kiilu c:collection1 s:shard2  x:collection1_shard2_replica_n1] o.a.s.c.CoreContainer Creating SolrCore 'collection1_shard2_replica_n1' using configuration from collection collection1, trusted=true
   [junit4]   2> 2683694 INFO  (qtp847944717-46739) [n:127.0.0.1:33132_kiilu c:collection1 s:shard2  x:collection1_shard2_replica_n1] o.a.s.m.r.SolrJmxReporter JMX monitoring for 'solr.core.collection1.shard2.replica_n1' (registry 'solr.core.collection1.shard2.replica_n1') enabled at server: com.sun.jmx.mbeanserver.JmxMBeanServer@1baf2c5a
   [junit4]   2> 2683694 INFO  (qtp847944717-46739) [n:127.0.0.1:33132_kiilu c:collection1 s:shard2  x:collection1_shard2_replica_n1] o.a.s.c.SolrCore [[collection1_shard2_replica_n1] ] Opening new SolrCore at [/x1/jenkins/jenkins-slave/workspace/Lucene-Solr-NightlyTests-7.x/checkout/solr/build/solr-core/test/J2/temp/solr.cloud.ForceLeaderTest_D7C3616BE0F39CD1-001/shard-1-001/cores/collection1_shard2_replica_n1], dataDir=[/x1/jenkins/jenkins-slave/workspace/Lucene-Solr-NightlyTests-7.x/checkout/solr/build/solr-core/test/J2/temp/solr.cloud.ForceLeaderTest_D7C3616BE0F39CD1-001/shard-1-001/cores/collection1_shard2_replica_n1/data/]
   [junit4]   2> 2683702 INFO  (qtp847944717-46739) [n:127.0.0.1:33132_kiilu c:collection1 s:shard2  x:collection1_shard2_replica_n1] o.a.s.u.RandomMergePolicy RandomMergePolicy wrapping class org.apache.lucene.index.AlcoholicMergePolicy: [AlcoholicMergePolicy: minMergeSize=0, mergeFactor=10, maxMergeSize=1785880122, maxMergeSizeForForcedMerge=9223372036854775807, calibrateSizeByDeletes=true, maxMergeDocs=2147483647, maxCFSSegmentSizeMB=8.796093022207999E12, noCFSRatio=0.1]
   [junit4]   2> 2683704 WARN  (qtp847944717-46739) [n:127.0.0.1:33132_kiilu c:collection1 s:shard2  x:collection1_shard2_replica_n1] o.a.s.c.RequestHandlers INVALID paramSet a in requestHandler {type = requestHandler,name = /dump,class = DumpRequestHandler,attributes = {initParams=a, name=/dump, class=DumpRequestHandler},args = {defaults={a=A,b=B}}}
   [junit4]   2> 2683710 INFO  (qtp962315849-46767) [n:127.0.0.1:39734_kiilu c:collection1 s:shard1  x:collection1_shard1_replica_n2] o.a.s.c.CoreContainer Creating SolrCore 'collection1_shard1_replica_n2' using configuration from collection collection1, trusted=true
   [junit4]   2> 2683710 INFO  (qtp962315849-46767) [n:127.0.0.1:39734_kiilu c:collection1 s:shard1  x:collection1_shard1_replica_n2] o.a.s.m.r.SolrJmxReporter JMX monitoring for 'solr.core.collection1.shard1.replica_n2' (registry 'solr.core.collection1.shard1.replica_n2') enabled at server: com.sun.jmx.mbeanserver.JmxMBeanServer@1baf2c5a
   [junit4]   2> 2683711 INFO  (qtp962315849-46767) [n:127.0.0.1:39734_kiilu c:collection1 s:shard1  x:collection1_shard1_replica_n2] o.a.s.c.SolrCore [[collection1_shard1_replica_n2] ] Opening new SolrCore at [/x1/jenkins/jenkins-slave/workspace/Lucene-Solr-NightlyTests-7.x/checkout/solr/build/solr-core/test/J2/temp/solr.cloud.ForceLeaderTest_D7C3616BE0F39CD1-001/shard-2-001/cores/collection1_shard1_replica_n2], dataDir=[/x1/jenkins/jenkins-slave/workspace/Lucene-Solr-NightlyTests-7.x/checkout/solr/build/solr-core/test/J2/temp/solr.cloud.ForceLeaderTest_D7C3616BE0F39CD1-001/shard-2-001/cores/collection1_shard1_replica_n2/data/]
   [junit4]   2> 2683714 INFO  (qtp962315849-46767) [n:127.0.0.1:39734_kiilu c:collection1 s:shard1  x:collection1_shard1_replica_n2] o.a.s.u.RandomMergePolicy RandomMergePolicy wrapping class org.apache.lucene.index.AlcoholicMergePolicy: [AlcoholicMergePolicy: minMergeSize=0, mergeFactor=10, maxMergeSize=1785880122, maxMergeSizeForForcedMerge=9223372036854775807, calibrateSizeByDeletes=true, maxMergeDocs=2147483647, maxCFSSegmentSizeMB=8.796093022207999E12, noCFSRatio=0.1]
   [junit4]   2> 2683727 WARN  (qtp962315849-46767) [n:127.0.0.1:39734_kiilu c:collection1 s:shard1  x:collection1_shard1_replica_n2] o.a.s.c.RequestHandlers INVALID paramSet a in requestHandler {type = requestHandler,name = /dump,class = DumpRequestHandler,attributes = {initParams=a, name=/dump, class=DumpRequestHandler},args = {defaults={a=A,b=B}}}
   [junit4]   2> 2683795 INFO  (qtp847944717-46739) [n:127.0.0.1:33132_kiilu c:collection1 s:shard2  x:collection1_shard2_replica_n1] o.a.s.u.UpdateHandler Using UpdateLog implementation: org.apache.solr.update.UpdateLog
   [junit4]   2> 2683795 INFO  (qtp847944717-46739) [n:127.0.0.1:33132_kiilu c:collection1 s:shard2  x:collection1_shard2_replica_n1] o.a.s.u.UpdateLog Initializing UpdateLog: dataDir= defaultSyncLevel=FLUSH numRecordsToKeep=100 maxNumLogsToKeep=10 numVersionBuckets=65536
   [junit4]   2> 2683798 INFO  (qtp847944717-46739) [n:127.0.0.1:33132_kiilu c:collection1 s:shard2  x:collection1_shard2_replica_n1] o.a.s.u.CommitTracker Hard AutoCommit: disabled
   [junit4]   2> 2683798 INFO  (qtp847944717-46739) [n:127.0.0.1:33132_kiilu c:collection1 s:shard2  x:collection1_shard2_replica_n1] o.a.s.u.CommitTracker Soft AutoCommit: disabled
   [junit4]   2> 2683800 INFO  (qtp847944717-46739) [n:127.0.0.1:33132_kiilu c:collection1 s:shard2  x:collection1_shard2_replica_n1] o.a.s.u.RandomMergePolicy RandomMergePolicy wrapping class org.apache.lucene.index.TieredMergePolicy: [TieredMergePolicy: maxMergeAtOnce=20, maxMergeAtOnceExplicit=27, maxMergedSegmentMB=85.259765625, floorSegmentMB=1.9423828125, forceMergeDeletesPctAllowed=11.351351537833635, segmentsPerTier=2.0, maxCFSSegmentSizeMB=8.796093022207999E12, noCFSRatio=0.8803353755890616, deletesPctAllowed=38.96661081862243
   [junit4]   2> 2683800 INFO  (qtp847944717-46739) [n:127.0.0.1:33132_kiilu c:collection1 s:shard2  x:collection1_shard2_replica_n1] o.a.s.s.SolrIndexSearcher Opening [Searcher@3688a1f6[collection1_shard2_replica_n1] main]
   [junit4]   2> 2683802 INFO  (qtp847944717-46739) [n:127.0.0.1:33132_kiilu c:collection1 s:shard2  x:collection1_shard2_replica_n1] o.a.s.r.ManagedResourceStorage Configured ZooKeeperStorageIO with znodeBase: /configs/conf1
   [junit4]   2> 2683802 INFO  (qtp847944717-46739) [n:127.0.0.1:33132_kiilu c:collection1 s:shard2  x:collection1_shard2_replica_n1] o.a.s.r.ManagedResourceStorage Loaded null at path _rest_managed.json using ZooKeeperStorageIO:path=/configs/conf1
   [junit4]   2> 2683803 INFO  (qtp847944717-46739) [n:127.0.0.1:33132_kiilu c:collection1 s:shard2  x:collection1_shard2_replica_n1] o.a.s.h.ReplicationHandler Commits will be reserved for 10000ms.
   [junit4]   2> 2683803 INFO  (qtp847944717-46739) [n:127.0.0.1:33132_kiilu c:collection1 s:shard2  x:collection1_shard2_replica_n1] o.a.s.u.UpdateLog Could not find max version in index or recent updates, using new clock 1622434869621555200
   [junit4]   2> 2683808 INFO  (searcherExecutor-11943-thread-1-processing-n:127.0.0.1:33132_kiilu x:collection1_shard2_replica_n1 c:collection1 s:shard2) [n:127.0.0.1:33132_kiilu c:collection1 s:shard2  x:collection1_shard2_replica_n1] o.a.s.c.SolrCore [collection1_shard2_replica_n1] Registered new searcher Searcher@3688a1f6[collection1_shard2_replica_n1] main{ExitableDirectoryReader(UninvertingDirectoryReader())}
   [junit4]   2> 2683812 INFO  (qtp847944717-46739) [n:127.0.0.1:33132_kiilu c:collection1 s:shard2  x:collection1_shard2_replica_n1] o.a.s.c.ZkShardTerms Successful update of terms at /collections/collection1/terms/shard2 to Terms{values={core_node4=0}, version=0}
   [junit4]   2> 2683812 INFO  (qtp847944717-46739) [n:127.0.0.1:33132_kiilu c:collection1 s:shard2  x:collection1_shard2_replica_n1] o.a.s.c.ShardLeaderElectionContextBase

[...truncated too long message...]

vy-availability-check:
[loadresource] Do not set property disallowed.ivy.jars.list as its length is 0.

-ivy-fail-disallowed-ivy-version:

ivy-fail:

ivy-configure:
[ivy:configure] :: loading settings :: file = /x1/jenkins/jenkins-slave/workspace/Lucene-Solr-NightlyTests-7.x/checkout/lucene/top-level-ivy-settings.xml

resolve:

ivy-availability-check:
[loadresource] Do not set property disallowed.ivy.jars.list as its length is 0.

-ivy-fail-disallowed-ivy-version:

ivy-fail:

ivy-fail:

ivy-configure:
[ivy:configure] :: loading settings :: file = /x1/jenkins/jenkins-slave/workspace/Lucene-Solr-NightlyTests-7.x/checkout/lucene/top-level-ivy-settings.xml

resolve:

ivy-availability-check:
[loadresource] Do not set property disallowed.ivy.jars.list as its length is 0.

-ivy-fail-disallowed-ivy-version:

ivy-fail:

ivy-configure:
[ivy:configure] :: loading settings :: file = /x1/jenkins/jenkins-slave/workspace/Lucene-Solr-NightlyTests-7.x/checkout/lucene/top-level-ivy-settings.xml

resolve:

ivy-availability-check:
[loadresource] Do not set property disallowed.ivy.jars.list as its length is 0.

-ivy-fail-disallowed-ivy-version:

ivy-fail:

ivy-fail:

ivy-configure:
[ivy:configure] :: loading settings :: file = /x1/jenkins/jenkins-slave/workspace/Lucene-Solr-NightlyTests-7.x/checkout/lucene/top-level-ivy-settings.xml

resolve:

ivy-availability-check:
[loadresource] Do not set property disallowed.ivy.jars.list as its length is 0.

-ivy-fail-disallowed-ivy-version:

ivy-fail:

ivy-fail:

ivy-configure:
[ivy:configure] :: loading settings :: file = /x1/jenkins/jenkins-slave/workspace/Lucene-Solr-NightlyTests-7.x/checkout/lucene/top-level-ivy-settings.xml

resolve:

ivy-availability-check:
[loadresource] Do not set property disallowed.ivy.jars.list as its length is 0.

-ivy-fail-disallowed-ivy-version:

ivy-fail:

ivy-fail:

ivy-configure:
[ivy:configure] :: loading settings :: file = /x1/jenkins/jenkins-slave/workspace/Lucene-Solr-NightlyTests-7.x/checkout/lucene/top-level-ivy-settings.xml

resolve:

ivy-availability-check:
[loadresource] Do not set property disallowed.ivy.jars.list as its length is 0.

-ivy-fail-disallowed-ivy-version:

ivy-fail:

ivy-fail:

ivy-configure:
[ivy:configure] :: loading settings :: file = /x1/jenkins/jenkins-slave/workspace/Lucene-Solr-NightlyTests-7.x/checkout/lucene/top-level-ivy-settings.xml

resolve:

ivy-availability-check:
[loadresource] Do not set property disallowed.ivy.jars.list as its length is 0.

-ivy-fail-disallowed-ivy-version:

ivy-fail:

ivy-fail:

ivy-configure:
[ivy:configure] :: loading settings :: file = /x1/jenkins/jenkins-slave/workspace/Lucene-Solr-NightlyTests-7.x/checkout/lucene/top-level-ivy-settings.xml

resolve:

ivy-availability-check:
[loadresource] Do not set property disallowed.ivy.jars.list as its length is 0.

-ivy-fail-disallowed-ivy-version:

ivy-fail:

ivy-fail:

ivy-configure:
[ivy:configure] :: loading settings :: file = /x1/jenkins/jenkins-slave/workspace/Lucene-Solr-NightlyTests-7.x/checkout/lucene/top-level-ivy-settings.xml

resolve:

ivy-availability-check:
[loadresource] Do not set property disallowed.ivy.jars.list as its length is 0.

-ivy-fail-disallowed-ivy-version:

ivy-fail:

ivy-fail:

ivy-configure:
[ivy:configure] :: loading settings :: file = /x1/jenkins/jenkins-slave/workspace/Lucene-Solr-NightlyTests-7.x/checkout/lucene/top-level-ivy-settings.xml

resolve:

ivy-availability-check:
[loadresource] Do not set property disallowed.ivy.jars.list as its length is 0.

-ivy-fail-disallowed-ivy-version:

ivy-fail:

ivy-fail:

ivy-configure:
[ivy:configure] :: loading settings :: file = /x1/jenkins/jenkins-slave/workspace/Lucene-Solr-NightlyTests-7.x/checkout/lucene/top-level-ivy-settings.xml

resolve:

ivy-availability-check:
[loadresource] Do not set property disallowed.ivy.jars.list as its length is 0.

-ivy-fail-disallowed-ivy-version:

ivy-fail:

ivy-fail:

ivy-configure:
[ivy:configure] :: loading settings :: file = /x1/jenkins/jenkins-slave/workspace/Lucene-Solr-NightlyTests-7.x/checkout/lucene/top-level-ivy-settings.xml

resolve:

ivy-availability-check:
[loadresource] Do not set property disallowed.ivy.jars.list as its length is 0.

-ivy-fail-disallowed-ivy-version:

ivy-fail:

ivy-fail:

ivy-configure:
[ivy:configure] :: loading settings :: file = /x1/jenkins/jenkins-slave/workspace/Lucene-Solr-NightlyTests-7.x/checkout/lucene/top-level-ivy-settings.xml

resolve:

jar-checksums:
    [mkdir] Created dir: /x1/jenkins/jenkins-slave/workspace/Lucene-Solr-NightlyTests-7.x/checkout/solr/null1302662850
     [copy] Copying 242 files to /x1/jenkins/jenkins-slave/workspace/Lucene-Solr-NightlyTests-7.x/checkout/solr/null1302662850
   [delete] Deleting directory /x1/jenkins/jenkins-slave/workspace/Lucene-Solr-NightlyTests-7.x/checkout/solr/null1302662850

check-working-copy:
[ivy:cachepath] :: resolving dependencies :: org.eclipse.jgit#org.eclipse.jgit-caller;working
[ivy:cachepath] 	confs: [default]
[ivy:cachepath] 	found org.eclipse.jgit#org.eclipse.jgit;4.6.0.201612231935-r in public
[ivy:cachepath] 	found com.jcraft#jsch;0.1.53 in public
[ivy:cachepath] 	found com.googlecode.javaewah#JavaEWAH;1.1.6 in public
[ivy:cachepath] 	found org.apache.httpcomponents#httpclient;4.3.6 in public
[ivy:cachepath] 	found org.apache.httpcomponents#httpcore;4.3.3 in public
[ivy:cachepath] 	found commons-logging#commons-logging;1.1.3 in public
[ivy:cachepath] 	found commons-codec#commons-codec;1.6 in public
[ivy:cachepath] 	found org.slf4j#slf4j-api;1.7.2 in public
[ivy:cachepath] :: resolution report :: resolve 30ms :: artifacts dl 2ms
	---------------------------------------------------------------------
	|                  |            modules            ||   artifacts   |
	|       conf       | number| search|dwnlded|evicted|| number|dwnlded|
	---------------------------------------------------------------------
	|      default     |   8   |   0   |   0   |   0   ||   8   |   0   |
	---------------------------------------------------------------------
[wc-checker] Initializing working copy...
[wc-checker] SLF4J: Failed to load class "org.slf4j.impl.StaticLoggerBinder".
[wc-checker] SLF4J: Defaulting to no-operation (NOP) logger implementation
[wc-checker] SLF4J: See http://www.slf4j.org/codes.html#StaticLoggerBinder for further details.
[wc-checker] Checking working copy status...

-jenkins-base:

BUILD SUCCESSFUL
Total time: 302 minutes 58 seconds
Archiving artifacts
java.lang.InterruptedException: no matches found within 10000
	at hudson.FilePath$ValidateAntFileMask.hasMatch(FilePath.java:2847)
	at hudson.FilePath$ValidateAntFileMask.invoke(FilePath.java:2726)
	at hudson.FilePath$ValidateAntFileMask.invoke(FilePath.java:2707)
	at hudson.FilePath$FileCallableWrapper.call(FilePath.java:3086)
Also:   hudson.remoting.Channel$CallSiteStackTrace: Remote call to lucene
		at hudson.remoting.Channel.attachCallSiteStackTrace(Channel.java:1741)
		at hudson.remoting.UserRequest$ExceptionResponse.retrieve(UserRequest.java:357)
		at hudson.remoting.Channel.call(Channel.java:955)
		at hudson.FilePath.act(FilePath.java:1072)
		at hudson.FilePath.act(FilePath.java:1061)
		at hudson.FilePath.validateAntFileMask(FilePath.java:2705)
		at hudson.tasks.ArtifactArchiver.perform(ArtifactArchiver.java:243)
		at hudson.tasks.BuildStepCompatibilityLayer.perform(BuildStepCompatibilityLayer.java:81)
		at hudson.tasks.BuildStepMonitor$1.perform(BuildStepMonitor.java:20)
		at hudson.model.AbstractBuild$AbstractBuildExecution.perform(AbstractBuild.java:744)
		at hudson.model.AbstractBuild$AbstractBuildExecution.performAllBuildSteps(AbstractBuild.java:690)
		at hudson.model.Build$BuildExecution.post2(Build.java:186)
		at hudson.model.AbstractBuild$AbstractBuildExecution.post(AbstractBuild.java:635)
		at hudson.model.Run.execute(Run.java:1835)
		at hudson.model.FreeStyleBuild.run(FreeStyleBuild.java:43)
		at hudson.model.ResourceController.execute(ResourceController.java:97)
		at hudson.model.Executor.run(Executor.java:429)
Caused: hudson.FilePath$TunneledInterruptedException
	at hudson.FilePath$FileCallableWrapper.call(FilePath.java:3088)
	at hudson.remoting.UserRequest.perform(UserRequest.java:212)
	at hudson.remoting.UserRequest.perform(UserRequest.java:54)
	at hudson.remoting.Request$2.run(Request.java:369)
	at hudson.remoting.InterceptingExecutorService$1.call(InterceptingExecutorService.java:72)
	at java.util.concurrent.FutureTask.run(FutureTask.java:266)
	at java.util.concurrent.ThreadPoolExecutor.runWorker(ThreadPoolExecutor.java:1142)
	at java.util.concurrent.ThreadPoolExecutor$Worker.run(ThreadPoolExecutor.java:617)
	at java.lang.Thread.run(Thread.java:748)
Caused: java.lang.InterruptedException: java.lang.InterruptedException: no matches found within 10000
	at hudson.FilePath.act(FilePath.java:1074)
	at hudson.FilePath.act(FilePath.java:1061)
	at hudson.FilePath.validateAntFileMask(FilePath.java:2705)
	at hudson.tasks.ArtifactArchiver.perform(ArtifactArchiver.java:243)
	at hudson.tasks.BuildStepCompatibilityLayer.perform(BuildStepCompatibilityLayer.java:81)
	at hudson.tasks.BuildStepMonitor$1.perform(BuildStepMonitor.java:20)
	at hudson.model.AbstractBuild$AbstractBuildExecution.perform(AbstractBuild.java:744)
	at hudson.model.AbstractBuild$AbstractBuildExecution.performAllBuildSteps(AbstractBuild.java:690)
	at hudson.model.Build$BuildExecution.post2(Build.java:186)
	at hudson.model.AbstractBuild$AbstractBuildExecution.post(AbstractBuild.java:635)
	at hudson.model.Run.execute(Run.java:1835)
	at hudson.model.FreeStyleBuild.run(FreeStyleBuild.java:43)
	at hudson.model.ResourceController.execute(ResourceController.java:97)
	at hudson.model.Executor.run(Executor.java:429)
No artifacts found that match the file pattern "**/*.events,heapdumps/**,**/hs_err_pid*". Configuration error?
Recording test results
Build step 'Publish JUnit test result report' changed build result to UNSTABLE
Email was triggered for: Unstable (Test Failures)
Sending email for trigger: Unstable (Test Failures)

Mime
View raw message