lucene-dev mailing list archives

Site index · List index
Message view « Date » · « Thread »
Top « Date » · « Thread »
From Policeman Jenkins Server <jenk...@thetaphi.de>
Subject [JENKINS] Lucene-Solr-master-Windows (32bit/jdk1.8.0_172) - Build # 7696 - Unstable!
Date Tue, 15 Jan 2019 20:12:47 GMT
Build: https://jenkins.thetaphi.de/job/Lucene-Solr-master-Windows/7696/
Java: 32bit/jdk1.8.0_172 -server -XX:+UseG1GC

1 tests failed.
FAILED:  org.apache.solr.cloud.autoscaling.sim.TestSimExtremeIndexing.testScaleUp

Error Message:
{numFound=973000000,start=0,docs=[]} expected:<1000000000> but was:<973000000>

Stack Trace:
java.lang.AssertionError: {numFound=973000000,start=0,docs=[]} expected:<1000000000> but was:<973000000>
	at __randomizedtesting.SeedInfo.seed([6F003D6F2C9463E5:4E5E7BCD20BABD44]:0)
	at org.junit.Assert.fail(Assert.java:88)
	at org.junit.Assert.failNotEquals(Assert.java:834)
	at org.junit.Assert.assertEquals(Assert.java:645)
	at org.apache.solr.cloud.autoscaling.sim.TestSimExtremeIndexing.testScaleUp(TestSimExtremeIndexing.java:135)
	at sun.reflect.NativeMethodAccessorImpl.invoke0(Native Method)
	at sun.reflect.NativeMethodAccessorImpl.invoke(NativeMethodAccessorImpl.java:62)
	at sun.reflect.DelegatingMethodAccessorImpl.invoke(DelegatingMethodAccessorImpl.java:43)
	at java.lang.reflect.Method.invoke(Method.java:498)
	at com.carrotsearch.randomizedtesting.RandomizedRunner.invoke(RandomizedRunner.java:1750)
	at com.carrotsearch.randomizedtesting.RandomizedRunner$8.evaluate(RandomizedRunner.java:938)
	at com.carrotsearch.randomizedtesting.RandomizedRunner$9.evaluate(RandomizedRunner.java:974)
	at com.carrotsearch.randomizedtesting.RandomizedRunner$10.evaluate(RandomizedRunner.java:988)
	at com.carrotsearch.randomizedtesting.rules.SystemPropertiesRestoreRule$1.evaluate(SystemPropertiesRestoreRule.java:57)
	at org.apache.lucene.util.TestRuleSetupTeardownChained$1.evaluate(TestRuleSetupTeardownChained.java:49)
	at org.apache.lucene.util.AbstractBeforeAfterRule$1.evaluate(AbstractBeforeAfterRule.java:45)
	at org.apache.lucene.util.TestRuleThreadAndTestName$1.evaluate(TestRuleThreadAndTestName.java:48)
	at org.apache.lucene.util.TestRuleIgnoreAfterMaxFailures$1.evaluate(TestRuleIgnoreAfterMaxFailures.java:64)
	at org.apache.lucene.util.TestRuleMarkFailure$1.evaluate(TestRuleMarkFailure.java:47)
	at com.carrotsearch.randomizedtesting.rules.StatementAdapter.evaluate(StatementAdapter.java:36)
	at com.carrotsearch.randomizedtesting.ThreadLeakControl$StatementRunner.run(ThreadLeakControl.java:368)
	at com.carrotsearch.randomizedtesting.ThreadLeakControl.forkTimeoutingTask(ThreadLeakControl.java:817)
	at com.carrotsearch.randomizedtesting.ThreadLeakControl$3.evaluate(ThreadLeakControl.java:468)
	at com.carrotsearch.randomizedtesting.RandomizedRunner.runSingleTest(RandomizedRunner.java:947)
	at com.carrotsearch.randomizedtesting.RandomizedRunner$5.evaluate(RandomizedRunner.java:832)
	at com.carrotsearch.randomizedtesting.RandomizedRunner$6.evaluate(RandomizedRunner.java:883)
	at com.carrotsearch.randomizedtesting.RandomizedRunner$7.evaluate(RandomizedRunner.java:894)
	at com.carrotsearch.randomizedtesting.rules.StatementAdapter.evaluate(StatementAdapter.java:36)
	at com.carrotsearch.randomizedtesting.rules.SystemPropertiesRestoreRule$1.evaluate(SystemPropertiesRestoreRule.java:57)
	at org.apache.lucene.util.AbstractBeforeAfterRule$1.evaluate(AbstractBeforeAfterRule.java:45)
	at com.carrotsearch.randomizedtesting.rules.StatementAdapter.evaluate(StatementAdapter.java:36)
	at org.apache.lucene.util.TestRuleStoreClassName$1.evaluate(TestRuleStoreClassName.java:41)
	at com.carrotsearch.randomizedtesting.rules.NoShadowingOrOverridesOnMethodsRule$1.evaluate(NoShadowingOrOverridesOnMethodsRule.java:40)
	at com.carrotsearch.randomizedtesting.rules.NoShadowingOrOverridesOnMethodsRule$1.evaluate(NoShadowingOrOverridesOnMethodsRule.java:40)
	at com.carrotsearch.randomizedtesting.rules.StatementAdapter.evaluate(StatementAdapter.java:36)
	at com.carrotsearch.randomizedtesting.rules.StatementAdapter.evaluate(StatementAdapter.java:36)
	at com.carrotsearch.randomizedtesting.rules.StatementAdapter.evaluate(StatementAdapter.java:36)
	at org.apache.lucene.util.TestRuleAssertionsRequired$1.evaluate(TestRuleAssertionsRequired.java:53)
	at org.apache.lucene.util.TestRuleMarkFailure$1.evaluate(TestRuleMarkFailure.java:47)
	at org.apache.lucene.util.TestRuleIgnoreAfterMaxFailures$1.evaluate(TestRuleIgnoreAfterMaxFailures.java:64)
	at org.apache.lucene.util.TestRuleIgnoreTestSuites$1.evaluate(TestRuleIgnoreTestSuites.java:54)
	at com.carrotsearch.randomizedtesting.rules.StatementAdapter.evaluate(StatementAdapter.java:36)
	at com.carrotsearch.randomizedtesting.ThreadLeakControl$StatementRunner.run(ThreadLeakControl.java:368)
	at java.lang.Thread.run(Thread.java:748)




Build Log:
[...truncated 14021 lines...]
   [junit4] Suite: org.apache.solr.cloud.autoscaling.sim.TestSimExtremeIndexing
   [junit4]   2> Creating dataDir: C:\Users\jenkins\workspace\Lucene-Solr-master-Windows\solr\build\solr-core\test\J0\temp\solr.cloud.autoscaling.sim.TestSimExtremeIndexing_6F003D6F2C9463E5-001\init-core-data-001
   [junit4]   2> 1845109 WARN  (SUITE-TestSimExtremeIndexing-seed#[6F003D6F2C9463E5]-worker) [    ] o.a.s.SolrTestCaseJ4 startTrackingSearchers: numOpens=5 numCloses=5
   [junit4]   2> 1845109 INFO  (SUITE-TestSimExtremeIndexing-seed#[6F003D6F2C9463E5]-worker) [    ] o.a.s.SolrTestCaseJ4 Using PointFields (NUMERIC_POINTS_SYSPROP=true) w/NUMERIC_DOCVALUES_SYSPROP=true
   [junit4]   2> 1845113 INFO  (SUITE-TestSimExtremeIndexing-seed#[6F003D6F2C9463E5]-worker) [    ] o.a.s.SolrTestCaseJ4 Randomized ssl (false) and clientAuth (false) via: @org.apache.solr.util.RandomizeSSL(reason=, value=NaN, ssl=NaN, clientAuth=NaN)
   [junit4]   2> 1845113 INFO  (SUITE-TestSimExtremeIndexing-seed#[6F003D6F2C9463E5]-worker) [    ] o.a.s.SolrTestCaseJ4 SecureRandom sanity checks: test.solr.allowed.securerandom=null & java.security.egd=file:/dev/./urandom
   [junit4]   2> 1845115 INFO  (TEST-TestSimExtremeIndexing.testScaleUp-seed#[6F003D6F2C9463E5]) [    ] o.a.s.SolrTestCaseJ4 ###Starting testScaleUp
   [junit4]   2> 1845128 DEBUG (TEST-TestSimExtremeIndexing.testScaleUp-seed#[6F003D6F2C9463E5]) [    ] o.a.s.c.a.s.SimClusterStateProvider --- new Overseer leader: 127.0.0.1:10065_solr
   [junit4]   2> 1845128 DEBUG (TEST-TestSimExtremeIndexing.testScaleUp-seed#[6F003D6F2C9463E5]) [    ] o.a.s.c.a.s.SimClusterStateProvider ** creating new collection states, currentVersion=0
   [junit4]   2> 1845128 DEBUG (Simulated OverseerAutoScalingTriggerThread) [    ] o.a.s.c.a.OverseerTriggerThread Adding .auto_add_replicas and .scheduled_maintenance triggers
   [junit4]   2> 1845128 DEBUG (TEST-TestSimExtremeIndexing.testScaleUp-seed#[6F003D6F2C9463E5]) [    ] o.a.s.c.a.s.SimClusterStateProvider ** saved cluster state version 0
   [junit4]   2> 1845128 INFO  (TEST-TestSimExtremeIndexing.testScaleUp-seed#[6F003D6F2C9463E5]) [    ] o.a.s.h.a.MetricsHistoryHandler No .system collection, keeping metrics history in memory.
   [junit4]   2> 1845128 DEBUG (Simulated OverseerAutoScalingTriggerThread) [    ] o.a.s.c.a.OverseerTriggerThread Refreshing /autoscaling.json with znode version 1
   [junit4]   2> 1845128 DEBUG (Simulated OverseerAutoScalingTriggerThread) [    ] o.a.s.c.a.OverseerTriggerThread Current znodeVersion 1, lastZnodeVersion 0
   [junit4]   2> 1845128 DEBUG (Simulated OverseerAutoScalingTriggerThread) [    ] o.a.s.c.a.OverseerTriggerThread Processed trigger updates upto znodeVersion 1
   [junit4]   2> 1845129 DEBUG (Simulated OverseerAutoScalingTriggerThread) [    ] o.a.s.c.a.OverseerTriggerThread -- cleaning old nodeLost / nodeAdded markers
   [junit4]   2> 1845129 DEBUG (Simulated OverseerAutoScalingTriggerThread) [    ] o.a.s.c.a.OverseerTriggerThread Current znodeVersion 1, lastZnodeVersion 1
   [junit4]   2> 1845157 DEBUG (simCloudManagerPool-7855-thread-1) [    ] o.a.s.c.a.s.SimClusterStateProvider -- simCreateCollection testScaleUp_collection, currentVersion=1
   [junit4]   2> 1845157 DEBUG (simCloudManagerPool-7855-thread-1) [    ] o.a.s.c.a.s.SimClusterStateProvider ** creating new collection states, currentVersion=1
   [junit4]   2> 1845157 DEBUG (simCloudManagerPool-7855-thread-1) [    ] o.a.s.c.a.s.SimClusterStateProvider ** saved cluster state version 1
   [junit4]   2> 1845164 DEBUG (simCloudManagerPool-7855-thread-1) [    ] o.a.s.c.a.s.SimClusterStateProvider ** creating new collection states, currentVersion=2
   [junit4]   2> 1845165 DEBUG (simCloudManagerPool-7855-thread-1) [    ] o.a.s.c.a.s.SimClusterStateProvider ** saved cluster state version 2
   [junit4]   2> 1845226 DEBUG (simCloudManagerPool-7855-thread-1) [    ] o.a.s.c.a.s.SimClusterStateProvider -- finished createCollection testScaleUp_collection, currentVersion=3
   [junit4]   2> 1845226 DEBUG (TEST-TestSimExtremeIndexing.testScaleUp-seed#[6F003D6F2C9463E5]) [    ] o.a.s.c.a.s.SimClusterStateProvider ** creating new collection states, currentVersion=3
   [junit4]   2> 1845226 DEBUG (TEST-TestSimExtremeIndexing.testScaleUp-seed#[6F003D6F2C9463E5]) [    ] o.a.s.c.a.s.SimClusterStateProvider ** saved cluster state version 3
   [junit4]   2> 1845226 INFO  (TEST-TestSimExtremeIndexing.testScaleUp-seed#[6F003D6F2C9463E5]) [    ] o.a.s.c.CloudTestUtils -- shards without leaders: [shard2, shard1]
   [junit4]   2> 1845227 INFO  (TEST-TestSimExtremeIndexing.testScaleUp-seed#[6F003D6F2C9463E5]) [    ] o.a.s.c.CloudTestUtils -- shards without leaders: [shard2, shard1]
   [junit4]   2> 1845228 INFO  (TEST-TestSimExtremeIndexing.testScaleUp-seed#[6F003D6F2C9463E5]) [    ] o.a.s.c.CloudTestUtils -- shards without leaders: [shard2, shard1]
   [junit4]   2> 1845229 INFO  (TEST-TestSimExtremeIndexing.testScaleUp-seed#[6F003D6F2C9463E5]) [    ] o.a.s.c.CloudTestUtils -- shards without leaders: [shard2, shard1]
   [junit4]   2> 1845232 INFO  (TEST-TestSimExtremeIndexing.testScaleUp-seed#[6F003D6F2C9463E5]) [    ] o.a.s.c.CloudTestUtils -- shards without leaders: [shard2, shard1]
   [junit4]   2> 1845234 INFO  (TEST-TestSimExtremeIndexing.testScaleUp-seed#[6F003D6F2C9463E5]) [    ] o.a.s.c.CloudTestUtils -- shards without leaders: [shard2, shard1]
   [junit4]   2> 1845236 INFO  (TEST-TestSimExtremeIndexing.testScaleUp-seed#[6F003D6F2C9463E5]) [    ] o.a.s.c.CloudTestUtils -- shards without leaders: [shard2, shard1]
   [junit4]   2> 1845237 INFO  (TEST-TestSimExtremeIndexing.testScaleUp-seed#[6F003D6F2C9463E5]) [    ] o.a.s.c.CloudTestUtils -- shards without leaders: [shard2, shard1]
   [junit4]   2> 1845238 INFO  (TEST-TestSimExtremeIndexing.testScaleUp-seed#[6F003D6F2C9463E5]) [    ] o.a.s.c.CloudTestUtils -- shards without leaders: [shard2, shard1]
   [junit4]   2> 1845239 DEBUG (simCloudManagerPool-7855-thread-2) [    ] o.a.s.c.a.s.SimClusterStateProvider ** creating new collection states, currentVersion=4
   [junit4]   2> 1845239 DEBUG (simCloudManagerPool-7855-thread-2) [    ] o.a.s.c.a.s.SimClusterStateProvider ** saved cluster state version 4
   [junit4]   2> 1845240 INFO  (TEST-TestSimExtremeIndexing.testScaleUp-seed#[6F003D6F2C9463E5]) [    ] o.a.s.c.CloudTestUtils -- shards without leaders: [shard2, shard1]
   [junit4]   2> 1845241 INFO  (TEST-TestSimExtremeIndexing.testScaleUp-seed#[6F003D6F2C9463E5]) [    ] o.a.s.c.CloudTestUtils -- shards without leaders: [shard2, shard1]
   [junit4]   2> 1845242 INFO  (TEST-TestSimExtremeIndexing.testScaleUp-seed#[6F003D6F2C9463E5]) [    ] o.a.s.c.CloudTestUtils -- shards without leaders: [shard2, shard1]
   [junit4]   2> 1845243 INFO  (TEST-TestSimExtremeIndexing.testScaleUp-seed#[6F003D6F2C9463E5]) [    ] o.a.s.c.CloudTestUtils -- shards without leaders: [shard2, shard1]
   [junit4]   2> 1845244 DEBUG (simCloudManagerPool-7855-thread-3) [    ] o.a.s.c.a.s.SimClusterStateProvider ** creating new collection states, currentVersion=5
   [junit4]   2> 1845244 DEBUG (simCloudManagerPool-7855-thread-3) [    ] o.a.s.c.a.s.SimClusterStateProvider ** saved cluster state version 5
   [junit4]   2> 1845244 INFO  (TEST-TestSimExtremeIndexing.testScaleUp-seed#[6F003D6F2C9463E5]) [    ] o.a.s.c.CloudTestUtils -- shards without leaders: [shard2, shard1]
   [junit4]   2> 1845245 INFO  (TEST-TestSimExtremeIndexing.testScaleUp-seed#[6F003D6F2C9463E5]) [    ] o.a.s.c.CloudTestUtils -- shards without leaders: [shard2, shard1]
   [junit4]   2> 1845247 INFO  (TEST-TestSimExtremeIndexing.testScaleUp-seed#[6F003D6F2C9463E5]) [    ] o.a.s.c.CloudTestUtils -- shards without leaders: [shard2, shard1]
   [junit4]   2> 1845248 INFO  (TEST-TestSimExtremeIndexing.testScaleUp-seed#[6F003D6F2C9463E5]) [    ] o.a.s.c.CloudTestUtils -- shards without leaders: [shard2, shard1]
   [junit4]   2> 1845248 DEBUG (simCloudManagerPool-7855-thread-4) [    ] o.a.s.c.a.s.SimClusterStateProvider ** creating new collection states, currentVersion=6
   [junit4]   2> 1845248 DEBUG (simCloudManagerPool-7855-thread-4) [    ] o.a.s.c.a.s.SimClusterStateProvider ** saved cluster state version 6
   [junit4]   2> 1845249 INFO  (TEST-TestSimExtremeIndexing.testScaleUp-seed#[6F003D6F2C9463E5]) [    ] o.a.s.c.CloudTestUtils -- shards without leaders: [shard2, shard1]
   [junit4]   2> 1845250 INFO  (TEST-TestSimExtremeIndexing.testScaleUp-seed#[6F003D6F2C9463E5]) [    ] o.a.s.c.CloudTestUtils -- shards without leaders: [shard2, shard1]
   [junit4]   2> 1845252 INFO  (TEST-TestSimExtremeIndexing.testScaleUp-seed#[6F003D6F2C9463E5]) [    ] o.a.s.c.CloudTestUtils -- shards without leaders: [shard2, shard1]
   [junit4]   2> 1845253 DEBUG (simCloudManagerPool-7855-thread-5) [    ] o.a.s.c.a.s.SimClusterStateProvider ** creating new collection states, currentVersion=7
   [junit4]   2> 1845253 DEBUG (simCloudManagerPool-7855-thread-5) [    ] o.a.s.c.a.s.SimClusterStateProvider ** saved cluster state version 7
   [junit4]   2> 1845253 DEBUG (simCloudManagerPool-7855-thread-6) [    ] o.a.s.c.a.s.SimClusterStateProvider -- elected new leader for testScaleUp_collection / shard1 (currentVersion=8): {"core_node1":{
   [junit4]   2>     "core":"testScaleUp_collection_shard1_replica_n1",
   [junit4]   2>     "shard":"shard1",
   [junit4]   2>     "collection":"testScaleUp_collection",
   [junit4]   2>     "node_name":"127.0.0.1:10264_solr",
   [junit4]   2>     "type":"NRT",
   [junit4]   2>     "leader":"true",
   [junit4]   2>     "SEARCHER.searcher.maxDoc":0,
   [junit4]   2>     "SEARCHER.searcher.deletedDocs":0,
   [junit4]   2>     "INDEX.sizeInBytes":10240,
   [junit4]   2>     "state":"active",
   [junit4]   2>     "INDEX.sizeInGB":9.5367431640625E-6,
   [junit4]   2>     "SEARCHER.searcher.numDocs":0}}
   [junit4]   2> 1845254 DEBUG (simCloudManagerPool-7855-thread-8) [    ] o.a.s.c.a.s.SimClusterStateProvider -- elected new leader for testScaleUp_collection / shard2 (currentVersion=8): {"core_node3":{
   [junit4]   2>     "core":"testScaleUp_collection_shard2_replica_n3",
   [junit4]   2>     "shard":"shard2",
   [junit4]   2>     "collection":"testScaleUp_collection",
   [junit4]   2>     "node_name":"127.0.0.1:10103_solr",
   [junit4]   2>     "type":"NRT",
   [junit4]   2>     "leader":"true",
   [junit4]   2>     "SEARCHER.searcher.maxDoc":0,
   [junit4]   2>     "SEARCHER.searcher.deletedDocs":0,
   [junit4]   2>     "INDEX.sizeInBytes":10240,
   [junit4]   2>     "state":"active",
   [junit4]   2>     "INDEX.sizeInGB":9.5367431640625E-6,
   [junit4]   2>     "SEARCHER.searcher.numDocs":0}}
   [junit4]   2> 1845255 DEBUG (TEST-TestSimExtremeIndexing.testScaleUp-seed#[6F003D6F2C9463E5]) [    ] o.a.s.c.a.s.SimClusterStateProvider ** creating new collection states, currentVersion=8
   [junit4]   2> 1845255 DEBUG (TEST-TestSimExtremeIndexing.testScaleUp-seed#[6F003D6F2C9463E5]) [    ] o.a.s.c.a.s.SimClusterStateProvider ** saved cluster state version 8
   [junit4]   2> 1845267 DEBUG (simCloudManagerPool-7855-thread-12) [    ] o.a.s.c.a.AutoScalingHandler Verified autoscaling configuration
   [junit4]   2> 1845267 DEBUG (simCloudManagerPool-7855-thread-12) [    ] o.a.s.c.a.OverseerTriggerThread Refreshing /autoscaling.json with znode version 2
   [junit4]   2> 1845267 DEBUG (Simulated OverseerAutoScalingTriggerThread) [    ] o.a.s.c.a.OverseerTriggerThread Processed trigger updates upto znodeVersion 2
   [junit4]   2> 1845267 DEBUG (Simulated OverseerAutoScalingTriggerThread) [    ] o.a.s.c.a.OverseerTriggerThread -- cleaning old nodeLost / nodeAdded markers
   [junit4]   2> 1845267 DEBUG (Simulated OverseerAutoScalingTriggerThread) [    ] o.a.s.c.a.OverseerTriggerThread Current znodeVersion 2, lastZnodeVersion 2
   [junit4]   2> 1845302 INFO  (TEST-TestSimExtremeIndexing.testScaleUp-seed#[6F003D6F2C9463E5]) [    ] o.a.s.c.a.s.TestSimExtremeIndexing #### Total docs so far: 200,000
   [junit4]   2> 1845308 INFO  (TEST-TestSimExtremeIndexing.testScaleUp-seed#[6F003D6F2C9463E5]) [    ] o.a.s.c.a.s.TestSimExtremeIndexing #### Total docs so far: 400,000
   [junit4]   2> 1845311 INFO  (TEST-TestSimExtremeIndexing.testScaleUp-seed#[6F003D6F2C9463E5]) [    ] o.a.s.c.a.s.TestSimExtremeIndexing #### Total docs so far: 600,000
   [junit4]   2> 1845314 INFO  (TEST-TestSimExtremeIndexing.testScaleUp-seed#[6F003D6F2C9463E5]) [    ] o.a.s.c.a.s.TestSimExtremeIndexing #### Total docs so far: 800,000
   [junit4]   2> 1845316 INFO  (TEST-TestSimExtremeIndexing.testScaleUp-seed#[6F003D6F2C9463E5]) [    ] o.a.s.c.a.s.TestSimExtremeIndexing #### Total docs so far: 1,000,000
   [junit4]   2> 1845316 INFO  (TEST-TestSimExtremeIndexing.testScaleUp-seed#[6F003D6F2C9463E5]) [    ] o.a.s.c.a.s.TestSimExtremeIndexing #### Total docs so far: 1,200,000
   [junit4]   2> 1845323 INFO  (TEST-TestSimExtremeIndexing.testScaleUp-seed#[6F003D6F2C9463E5]) [    ] o.a.s.c.a.s.TestSimExtremeIndexing #### Total docs so far: 1,400,000
   [junit4]   2> 1845327 INFO  (TEST-TestSimExtremeIndexing.testScaleUp-seed#[6F003D6F2C9463E5]) [    ] o.a.s.c.a.s.TestSimExtremeIndexing #### Total docs so far: 1,600,000
   [junit4]   2> 1845329 INFO  (TEST-TestSimExtremeIndexing.testScaleUp-seed#[6F003D6F2C9463E5]) [    ] o.a.s.c.a.s.TestSimExtremeIndexing #### Total docs so far: 1,800,000
   [junit4]   2> 1845330 INFO  (TEST-TestSimExtremeIndexing.testScaleUp-seed#[6F003D6F2C9463E5]) [    ] o.a.s.c.a.s.TestSimExtremeIndexing #### Total docs so far: 2,000,000
   [junit4]   2> 1845336 INFO  (TEST-TestSimExtremeIndexing.testScaleUp-seed#[6F003D6F2C9463E5]) [    ] o.a.s.c.a.s.TestSimExtremeIndexing #### Total docs so far: 2,200,000
   [junit4]   2> 1845340 INFO  (TEST-TestSimExtremeIndexing.testScaleUp-seed#[6F003D6F2C9463E5]) [    ] o.a.s.c.a.s.TestSimExtremeIndexing #### Total docs so far: 2,400,000
   [junit4]   2> 1845344 INFO  (TEST-TestSimExtremeIndexing.testScaleUp-seed#[6F003D6F2C9463E5]) [    ] o.a.s.c.a.s.TestSimExtremeIndexing #### Total docs so far: 2,600,000
   [junit4]   2> 1845347 INFO  (TEST-TestSimExtremeIndexing.testScaleUp-seed#[6F003D6F2C9463E5]) [    ] o.a.s.c.a.s.TestSimExtremeIndexing #### Total docs so far: 2,800,000
   [junit4]   2> 1845349 INFO  (TEST-TestSimExtremeIndexing.testScaleUp-seed#[6F003D6F2C9463E5]) [    ] o.a.s.c.a.s.TestSimExtremeIndexing #### Total docs so far: 3,000,000
   [junit4]   2> 1845353 INFO  (TEST-TestSimExtremeIndexing.testScaleUp-seed#[6F003D6F2C9463E5]) [    ] o.a.s.c.a.s.TestSimExtremeIndexing #### Total docs so far: 3,200,000
   [junit4]   2> 1845356 INFO  (TEST-TestSimExtremeIndexing.testScaleUp-seed#[6F003D6F2C9463E5]) [    ] o.a.s.c.a.s.TestSimExtremeIndexing #### Total docs so far: 3,400,000
   [junit4]   2> 1845360 INFO  (TEST-TestSimExtremeIndexing.testScaleUp-seed#[6F003D6F2C9463E5]) [    ] o.a.s.c.a.s.TestSimExtremeIndexing #### Total docs so far: 3,600,000
   [junit4]   2> 1845362 INFO  (TEST-TestSimExtremeIndexing.testScaleUp-seed#[6F003D6F2C9463E5]) [    ] o.a.s.c.a.s.TestSimExtremeIndexing #### Total docs so far: 3,800,000
   [junit4]   2> 1845365 INFO  (TEST-TestSimExtremeIndexing.testScaleUp-seed#[6F003D6F2C9463E5]) [    ] o.a.s.c.a.s.TestSimExtremeIndexing #### Total docs so far: 4,000,000
   [junit4]   2> 1845370 INFO  (TEST-TestSimExtremeIndexing.testScaleUp-seed#[6F003D6F2C9463E5]) [    ] o.a.s.c.a.s.TestSimExtremeIndexing #### Total docs so far: 4,200,000
   [junit4]   2> 1845373 INFO  (TEST-TestSimExtremeIndexing.testScaleUp-seed#[6F003D6F2C9463E5]) [    ] o.a.s.c.a.s.TestSimExtremeIndexing #### Total docs so far: 4,400,000
   [junit4]   2> 1845377 INFO  (TEST-TestSimExtremeIndexing.testScaleUp-seed#[6F003D6F2C9463E5]) [    ] o.a.s.c.a.s.TestSimExtremeIndexing #### Total docs so far: 4,600,000
   [junit4]   2> 1845378 INFO  (TEST-TestSimExtremeIndexing.testScaleUp-seed#[6F003D6F2C9463E5]) [    ] o.a.s.c.a.s.TestSimExtremeIndexing #### Total docs so far: 4,800,000
   [junit4]   2> 1845382 INFO  (TEST-TestSimExtremeIndexing.testScaleUp-seed#[6F003D6F2C9463E5]) [    ] o.a.s.c.a.s.TestSimExtremeIndexing #### Total docs so far: 5,000,000
   [junit4]   2> 1845386 INFO  (TEST-TestSimExtremeIndexing.testScaleUp-seed#[6F003D6F2C9463E5]) [    ] o.a.s.c.a.s.TestSimExtremeIndexing #### Total docs so far: 5,200,000
   [junit4]   2> 1845389 INFO  (TEST-TestSimExtremeIndexing.testScaleUp-seed#[6F003D6F2C9463E5]) [    ] o.a.s.c.a.s.TestSimExtremeIndexing #### Total docs so far: 5,400,000
   [junit4]   2> 1845392 INFO  (TEST-TestSimExtremeIndexing.testScaleUp-seed#[6F003D6F2C9463E5]) [    ] o.a.s.c.a.s.TestSimExtremeIndexing #### Total docs so far: 5,600,000
   [junit4]   2> 1845395 INFO  (TEST-TestSimExtremeIndexing.testScaleUp-seed#[6F003D6F2C9463E5]) [    ] o.a.s.c.a.s.TestSimExtremeIndexing #### Total docs so far: 5,800,000
   [junit4]   2> 1845398 INFO  (TEST-TestSimExtremeIndexing.testScaleUp-seed#[6F003D6F2C9463E5]) [    ] o.a.s.c.a.s.TestSimExtremeIndexing #### Total docs so far: 6,000,000
   [junit4]   2> 1845400 INFO  (TEST-TestSimExtremeIndexing.testScaleUp-seed#[6F003D6F2C9463E5]) [    ] o.a.s.c.a.s.TestSimExtremeIndexing #### Total docs so far: 6,200,000
   [junit4]   2> 1845407 INFO  (TEST-TestSimExtremeIndexing.testScaleUp-seed#[6F003D6F2C9463E5]) [    ] o.a.s.c.a.s.TestSimExtremeIndexing #### Total docs so far: 6,400,000
   [junit4]   2> 1845409 INFO  (TEST-TestSimExtremeIndexing.testScaleUp-seed#[6F003D6F2C9463E5]) [    ] o.a.s.c.a.s.TestSimExtremeIndexing #### Total docs so far: 6,600,000
   [junit4]   2> 1845413 INFO  (TEST-TestSimExtremeIndexing.testScaleUp-seed#[6F003D6F2C9463E5]) [    ] o.a.s.c.a.s.TestSimExtremeIndexing #### Total docs so far: 6,800,000
   [junit4]   2> 1845417 INFO  (TEST-TestSimExtremeIndexing.testScaleUp-seed#[6F003D6F2C9463E5]) [    ] o.a.s.c.a.s.TestSimExtremeIndexing #### Total docs so far: 7,000,000
   [junit4]   2> 1845421 INFO  (TEST-TestSimExtremeIndexing.testScaleUp-seed#[6F003D6F2C9463E5]) [    ] o.a.s.c.a.s.TestSimExtremeIndexing #### Total docs so far: 7,200,000
   [junit4]   2> 1845426 INFO  (TEST-TestSimExtremeIndexing.testScaleUp-seed#[6F003D6F2C9463E5]) [    ] o.a.s.c.a.s.TestSimExtremeIndexing #### Total docs so far: 7,400,000
   [junit4]   2> 1845433 INFO  (TEST-TestSimExtremeIndexing.testScaleUp-seed#[6F003D6F2C9463E5]) [    ] o.a.s.c.a.s.TestSimExtremeIndexing #### Total docs so far: 7,600,000
   [junit4]   2> 1845435 INFO  (TEST-TestSimExtremeIndexing.testScaleUp-seed#[6F003D6F2C9463E5]) [    ] o.a.s.c.a.s.TestSimExtremeIndexing #### Total docs so far: 7,800,000
   [junit4]   2> 1845438 INFO  (TEST-TestSimExtremeIndexing.testScaleUp-seed#[6F003D6F2C9463E5]) [    ] o.a.s.c.a.s.TestSimExtremeIndexing #### Total docs so far: 8,000,000
   [junit4]   2> 1845442 INFO  (TEST-TestSimExtremeIndexing.testScaleUp-seed#[6F003D6F2C9463E5]) [    ] o.a.s.c.a.s.TestSimExtremeIndexing #### Total docs so far: 8,200,000
   [junit4]   2> 1845444 INFO  (TEST-TestSimExtremeIndexing.testScaleUp-seed#[6F003D6F2C9463E5]) [    ] o.a.s.c.a.s.TestSimExtremeIndexing #### Total docs so far: 8,400,000
   [junit4]   2> 1845448 INFO  (TEST-TestSimExtremeIndexing.testScaleUp-seed#[6F003D6F2C9463E5]) [    ] o.a.s.c.a.s.TestSimExtremeIndexing #### Total docs so far: 8,600,000
   [junit4]   2> 1845451 INFO  (TEST-TestSimExtremeIndexing.testScaleUp-seed#[6F003D6F2C9463E5]) [    ] o.a.s.c.a.s.TestSimExtremeIndexing #### Total docs so far: 8,800,000
   [junit4]   2> 1845455 INFO  (TEST-TestSimExtremeIndexing.testScaleUp-seed#[6F003D6F2C9463E5]) [    ] o.a.s.c.a.s.TestSimExtremeIndexing #### Total docs so far: 9,000,000
   [junit4]   2> 1845459 INFO  (TEST-TestSimExtremeIndexing.testScaleUp-seed#[6F003D6F2C9463E5]) [    ] o.a.s.c.a.s.TestSimExtremeIndexing #### Total docs so far: 9,200,000
   [junit4]   2> 1845463 INFO  (TEST-TestSimExtremeIndexing.testScaleUp-seed#[6F003D6F2C9463E5]) [    ] o.a.s.c.a.s.TestSimExtremeIndexing #### Total docs so far: 9,400,000
   [junit4]   2> 1845465 INFO  (TEST-TestSimExtremeIndexing.testScaleUp-seed#[6F003D6F2C9463E5]) [    ] o.a.s.c.a.s.TestSimExtremeIndexing #### Total docs so far: 9,600,000
   [junit4]   2> 1845469 INFO  (TEST-TestSimExtremeIndexing.testScaleUp-seed#[6F003D6F2C9463E5]) [    ] o.a.s.c.a.s.TestSimExtremeIndexing #### Total docs so far: 9,800,000
   [junit4]   2> 1845472 INFO  (TEST-TestSimExtremeIndexing.testScaleUp-seed#[6F003D6F2C9463E5]) [    ] o.a.s.c.a.s.TestSimExtremeIndexing #### Total docs so far: 10,000,000
   [junit4]   2> 1845475 INFO  (TEST-TestSimExtremeIndexing.testScaleUp-seed#[6F003D6F2C9463E5]) [    ] o.a.s.c.a.s.TestSimExtremeIndexing #### Total docs so far: 10,200,000
   [junit4]   2> 1845476 INFO  (TEST-TestSimExtremeIndexing.testScaleUp-seed#[6F003D6F2C9463E5]) [    ] o.a.s.c.a.s.TestSimExtremeIndexing #### Total docs so far: 10,400,000
   [junit4]   2> 1845481 INFO  (TEST-TestSimExtremeIndexing.testScaleUp-seed#[6F003D6F2C9463E5]) [    ] o.a.s.c.a.s.TestSimExtremeIndexing #### Total docs so far: 10,600,000
   [junit4]   2> 1845484 INFO  (TEST-TestSimExtremeIndexing.testScaleUp-seed#[6F003D6F2C9463E5]) [    ] o.a.s.c.a.s.TestSimExtremeIndexing #### Total docs so far: 10,800,000
   [junit4]   2> 1845488 INFO  (TEST-TestSimExtremeIndexing.testScaleUp-seed#[6F003D6F2C9463E5]) [    ] o.a.s.c.a.s.TestSimExtremeIndexing #### Total docs so far: 11,000,000
   [junit4]   2> 1845491 INFO  (TEST-TestSimExtremeIndexing.testScaleUp-seed#[6F003D6F2C9463E5]) [    ] o.a.s.c.a.s.TestSimExtremeIndexing #### Total docs so far: 11,200,000
   [junit4]   2> 1845494 INFO  (TEST-TestSimExtremeIndexing.testScaleUp-seed#[6F003D6F2C9463E5]) [    ] o.a.s.c.a.s.TestSimExtremeIndexing #### Total docs so far: 11,400,000
   [junit4]   2> 1845497 INFO  (TEST-TestSimExtremeIndexing.testScaleUp-seed#[6F003D6F2C9463E5]) [    ] o.a.s.c.a.s.TestSimExtremeIndexing #### Total docs so far: 11,600,000
   [junit4]   2> 1845500 INFO  (TEST-TestSimExtremeIndexing.testScaleUp-seed#[6F003D6F2C9463E5]) [    ] o.a.s.c.a.s.TestSimExtremeIndexing #### Total docs so far: 11,800,000
   [junit4]   2> 1845503 INFO  (TEST-TestSimExtremeIndexing.testScaleUp-seed#[6F003D6F2C9463E5]) [    ] o.a.s.c.a.s.TestSimExtremeIndexing #### Total docs so far: 12,000,000
   [junit4]   2> 1845506 INFO  (TEST-TestSimExtremeIndexing.testScaleUp-seed#[6F003D6F2C9463E5]) [    ] o.a.s.c.a.s.TestSimExtremeIndexing #### Total docs so far: 12,200,000
   [junit4]   2> 1845509 INFO  (TEST-TestSimExtremeIndexing.testScaleUp-seed#[6F003D6F2C9463E5]) [    ] o.a.s.c.a.s.TestSimExtremeIndexing #### Total docs so far: 12,400,000
   [junit4]   2> 1845512 INFO  (TEST-TestSimExtremeIndexing.testScaleUp-seed#[6F003D6F2C9463E5]) [    ] o.a.s.c.a.s.TestSimExtremeIndexing #### Total docs so far: 12,600,000
   [junit4]   2> 1845515 INFO  (TEST-TestSimExtremeIndexing.testScaleUp-seed#[6F003D6F2C9463E5]) [    ] o.a.s.c.a.s.TestSimExtremeIndexing #### Total docs so far: 12,800,000
   [junit4]   2> 1845516 INFO  (TEST-TestSimExtremeIndexing.testScaleUp-seed#[6F003D6F2C9463E5]) [    ] o.a.s.c.a.s.TestSimExtremeIndexing #### Total docs so far: 13,000,000
   [junit4]   2> 1845521 INFO  (TEST-TestSimExtremeIndexing.testScaleUp-seed#[6F003D6F2C9463E5]) [    ] o.a.s.c.a.s.TestSimExtremeIndexing #### Total docs so far: 13,200,000
   [junit4]   2> 1845524 INFO  (TEST-TestSimExtremeIndexing.testScaleUp-seed#[6F003D6F2C9463E5]) [    ] o.a.s.c.a.s.TestSimExtremeIndexing #### Total docs so far: 13,400,000
   [junit4]   2> 1845527 INFO  (TEST-TestSimExtremeIndexing.testScaleUp-seed#[6F003D6F2C9463E5]) [    ] o.a.s.c.a.s.TestSimExtremeIndexing #### Total docs so far: 13,600,000
   [junit4]   2> 1845530 INFO  (TEST-TestSimExtremeIndexing.testScaleUp-seed#[6F003D6F2C9463E5]) [    ] o.a.s.c.a.s.TestSimExtremeIndexing #### Total docs so far: 13,800,000
   [junit4]   2> 1845533 INFO  (TEST-TestSimExtremeIndexing.testScaleUp-seed#[6F003D6F2C9463E5]) [    ] o.a.s.c.a.s.TestSimExtremeIndexing #### Total docs so far: 14,000,000
   [junit4]   2> 1845536 INFO  (TEST-TestSimExtremeIndexing.testScaleUp-seed#[6F003D6F2C9463E5]) [    ] o.a.s.c.a.s.TestSimExtremeIndexing #### Total docs so far: 14,200,000
   [junit4]   2> 1845537 INFO  (TEST-TestSimExtremeIndexing.testScaleUp-seed#[6F003D6F2C9463E5]) [    ] o.a.s.c.a.s.TestSimExtremeIndexing #### Total docs so far: 14,400,000
   [junit4]   2> 1845542 INFO  (TEST-TestSimExtremeIndexing.testScaleUp-seed#[6F003D6F2C9463E5]) [    ] o.a.s.c.a.s.TestSimExtremeIndexing #### Total docs so far: 14,600,000
   [junit4]   2> 1845545 INFO  (TEST-TestSimExtremeIndexing.testScaleUp-seed#[6F003D6F2C9463E5]) [    ] o.a.s.c.a.s.TestSimExtremeIndexing #### Total docs so far: 14,800,000
   [junit4]   2> 1845546 INFO  (TEST-TestSimExtremeIndexing.testScaleUp-seed#[6F003D6F2C9463E5]) [    ] o.a.s.c.a.s.TestSimExtremeIndexing #### Total docs so far: 15,000,000
   [junit4]   2> 1845550 INFO  (TEST-TestSimExtremeIndexing.testScaleUp-seed#[6F003D6F2C9463E5]) [    ] o.a.s.c.a.s.TestSimExtremeIndexing #### Total docs so far: 15,200,000
   [junit4]   2> 1845553 INFO  (TEST-TestSimExtremeIndexing.testScaleUp-seed#[6F003D6F2C9463E5]) [    ] o.a.s.c.a.s.TestSimExtremeIndexing #### Total docs so far: 15,400,000
   [junit4]   2> 1845553 INFO  (TEST-TestSimExtremeIndexing.testScaleUp-seed#[6F003D6F2C9463E5]) [    ] o.a.s.c.a.s.TestSimExtremeIndexing #### Total docs so far: 15,600,000
   [junit4]   2> 1845558 INFO  (TEST-TestSimExtremeIndexing.testScaleUp-seed#[6F003D6F2C9463E5]) [    ] o.a.s.c.a.s.TestSimExtremeIndexing #### Total docs so far: 15,800,000
   [junit4]   2> 1845561 INFO  (TEST-TestSimExtremeIndexing.testScaleUp-seed#[6F003D6F2C9463E5]) [    ] o.a.s.c.a.s.TestSimExtremeIndexing #### Total docs so far: 16,000,000
   [junit4]   2> 1845564 INFO  (TEST-TestSimExtremeIndexing.testScaleUp-seed#[6F003D6F2C9463E5]) [    ] o.a.s.c.a.s.TestSimExtremeIndexing #### Total docs so far: 16,200,000
   [junit4]   2> 1845566 INFO  (TEST-TestSimExtremeIndexing.testScaleUp-seed#[6F003D6F2C9463E5]) [    ] o.a.s.c.a.s.TestSimExtremeIndexing #### Total docs so far: 16,400,000
   [junit4]   2> 1845571 INFO  (TEST-TestSimExtremeIndexing.testScaleUp-seed#[6F003D6F2C9463E5]) [    ] o.a.s.c.a.s.TestSimExtremeIndexing #### Total docs so far: 16,600,000
   [junit4]   2> 1845573 INFO  (TEST-TestSimExtremeIndexing.testScaleUp-seed#[6F003D6F2C9463E5]) [    ] o.a.s.c.a.s.TestSimExtremeIndexing #### Total docs so far: 16,800,000
   [junit4]   2> 1845576 INFO  (TEST-TestSimExtremeIndexing.testScaleUp-seed#[6F003D6F2C9463E5]) [    ] o.a.s.c.a.s.TestSimExtremeIndexing #### Total docs so far: 17,000,000
   [junit4]   2> 1845580 INFO  (TEST-TestSimExtremeIndexing.testScaleUp-seed#[6F003D6F2C9463E5]) [    ] o.a.s.c.a.s.TestSimExtremeIndexing #### Total docs so far: 17,200,000
   [junit4]   2> 1845582 INFO  (TEST-TestSimExtremeIndexing.testScaleUp-seed#[6F003D6F2C9463E5]) [    ] o.a.s.c.a.s.TestSimExtremeIndexing #### Total docs so far: 17,400,000
   [junit4]   2> 1845583 INFO  (TEST-TestSimExtremeIndexing.testScaleUp-seed#[6F003D6F2C9463E5]) [    ] o.a.s.c.a.s.TestSimExtremeIndexing #### Total docs so far: 17,600,000
   [junit4]   2> 1845589 INFO  (TEST-TestSimExtremeIndexing.testScaleUp-seed#[6F003D6F2C9463E5]) [    ] o.a.s.c.a.s.TestSimExtremeIndexing #### Total docs so far: 17,800,000
   [junit4]   2> 1845591 INFO  (TEST-TestSimExtremeIndexing.testScaleUp-seed#[6F003D6F2C9463E5]) [    ] o.a.s.c.a.s.TestSimExtremeIndexing #### Total docs so far: 18,000,000
   [junit4]   2> 1845591 INFO  (TEST-TestSimExtremeIndexing.testScaleUp-seed#[6F003D6F2C9463E5]) [    ] o.a.s.c.a.s.TestSimExtremeIndexing #### Total docs so far: 18,200,000
   [junit4]   2> 1845592 INFO  (TEST-TestSimExtremeIndexing.testScaleUp-seed#[6F003D6F2C9463E5]) [    ] o.a.s.c.a.s.TestSimExtremeIndexing #### Total docs so far: 18,400,000
   [junit4]   2> 1845592 INFO  (TEST-TestSimExtremeIndexing.testScaleUp-seed#[6F003D6F2C9463E5]) [    ] o.a.s.c.a.s.TestSimExtremeIndexing #### Total docs so far: 18,600,000
   [junit4]   2> 1845592 INFO  (TEST-TestSimExtremeIndexing.testScaleUp-seed#[6F003D6F2C9463E5]) [    ] o.a.s.c.a.s.TestSimExtremeIndexing #### Total docs so far: 18,800,000
   [junit4]   2> 1845593 INFO  (TEST-TestSimExtremeIndexing.testScaleUp-seed#[6F003D6F2C9463E5]) [    ] o.a.s.c.a.s.TestSimExtremeIndexing #### Total docs so far: 19,000,000
   [junit4]   2> 1845594 INFO  (TEST-TestSimExtremeIndexing.testScaleUp-seed#[6F003D6F2C9463E5]) [    ] o.a.s.c.a.s.TestSimExtremeIndexing #### Total docs so far: 19,200,000
   [junit4]   2> 1845594 INFO  (TEST-TestSimExtremeIndexing.testScaleUp-seed#[6F003D6F2C9463E5]) [    ] o.a.s.c.a.s.TestSimExtremeIndexing #### Total docs so far: 19,400,000
   [junit4]   2> 1845595 INFO  (TEST-TestSimExtremeIndexing.testScaleUp-seed#[6F003D6F2C9463E5]) [    ] o.a.s.c.a.s.TestSimExtremeIndexing #### Total docs so far: 19,600,000
   [junit4]   2> 1845596 INFO  (TEST-TestSimExtremeIndexing.testScaleUp-seed#[6F003D6F2C9463E5]) [    ] o.a.s.c.a.s.TestSimExtremeIndexing #### Total docs so far: 19,800,000
   [junit4]   2> 1845596 INFO  (TEST-TestSimExtremeIndexing.testScaleUp-seed#[6F003D6F2C9463E5]) [    ] o.a.s.c.a.s.TestSimExtremeIndexing #### Total docs so far: 20,000,000
   [junit4]   2> 1845597 INFO  (TEST-TestSimExtremeIndexing.testScaleUp-seed#[6F003D6F2C9463E5]) [    ] o.a.s.c.a.s.TestSimExtremeIndexing #### Total docs so far: 20,200,000
   [junit4]   2> 1845597 INFO  (TEST-TestSimExtremeIndexing.testScaleUp-seed#[6F003D6F2C9463E5]) [    ] o.a.s.c.a.s.TestSimExtremeIndexing #### Total docs so far: 20,400,000
   [junit4]   2> 1845597 INFO  (TEST-TestSimExtremeIndexing.testScaleUp-seed#[6F003D6F2C9463E5]) [    ] o.a.s.c.a.s.TestSimExtremeIndexing #### Total docs so far: 20,600,000
   [junit4]   2> 1845599 INFO  (TEST-TestSimExtremeIndexing.testScaleUp-seed#[6F003D6F2C9463E5]) [    ] o.a.s.c.a.s.TestSimExtremeIndexing #### Total docs so far: 20,800,000
   [junit4]   2> 1845599 INFO  (TEST-TestSimExtremeIndexing.testScaleUp-seed#[6F003D6F2C9463E5]) [    ] o.a.s.c.a.s.TestSimExtremeIndexing #### Total docs so far: 21,000,000
   [junit4]   2> 1845599 INFO  (TEST-TestSimExtremeIndexing.testScaleUp-seed#[6F003D6F2C9463E5]) [    ] o.a.s.c.a.s.TestSimExtremeIndexing #### Total docs so far: 21,200,000
   [junit4]   2> 1845600 INFO  (TEST-TestSimExtremeIndexing.testScaleUp-seed#[6F003D6F2C9463E5]) [    ] o.a.s.c.a.s.TestSimExtremeIndexing #### Total docs so far: 21,400,000
   [junit4]   2> 1845601 INFO  (TEST-TestSimExtremeIndexing.testScaleUp-seed#[6F003D6F2C9463E5]) [    ] o.a.s.c.a.s.TestSimExtremeIndexing #### Total docs so far: 21,600,000
   [junit4]   2> 1845601 INFO  (TEST-TestSimExtremeIndexing.testScaleUp-seed#[6F003D6F2C9463E5]) [    ] o.a.s.c.a.s.TestSimExtremeIndexing #### Total docs so far: 21,800,000
   [junit4]   2> 1845601 INFO  (TEST-TestSimExtremeIndexing.testScaleUp-seed#[6F003D6F2C9463E5]) [    ] o.a.s.c.a.s.TestSimExtremeIndexing #### Total docs so far: 22,000,000
   [junit4]   2> 1845601 INFO  (TEST-TestSimExtremeIndexing.testScaleUp-seed#[6F003D6F2C9463E5]) [    ] o.a.s.c.a.s.TestSimExtremeIndexing #### Total docs so far: 22,200,000
   [junit4]   2> 1845603 INFO  (TEST-TestSimExtremeIndexing.testScaleUp-seed#[6F003D6F2C9463E5]) [    ] o.a.s.c.a.s.TestSimExtremeIndexing #### Total docs so far: 22,400,000
   [junit4]   2> 1845604 INFO  (TEST-TestSimExtremeIndexing.testScaleUp-seed#[6F003D6F2C9463E5]) [    ] o.a.s.c.a.s.TestSimExtremeIndexing #### Total docs so far: 22,600,000
   [junit4]   2> 1845604 INFO  (TEST-TestSimExtremeIndexing.testScaleUp-seed#[6F003D6F2C9463E5]) [    ] o.a.s.c.a.s.TestSimExtremeIndexing #### Total docs so far: 22,800,000
   [junit4]   2> 1845605 INFO  (TEST-TestSimExtremeIndexing.testScaleUp-seed#[6F003D6F2C9463E5]) [    ] o.a.s.c.a.s.TestSimExtremeIndexing #### Total docs so far: 23,000,000
   [junit4]   2> 1845605 INFO  (TEST-TestSimExtremeIndexing.testScaleUp-seed#[6F003D6F2C9463E5]) [    ] o.a.s.c.a.s.TestSimExtremeIndexing #### Total docs so far: 23,200,000
   [junit4]   2> 1845605 INFO  (TEST-TestSimExtremeIndexing.testScaleUp-seed#[6F003D6F2C9463E5]) [    ] o.a.s.c.a.s.TestSimExtremeIndexing #### Total docs so far: 23,400,000
   [junit4]   2> 1845608 INFO  (TEST-TestSimExtremeIndexing.testScaleUp-seed#[6F003D6F2C9463E5]) [    ] o.a.s.c.a.s.TestSimExtremeIndexing #### Total docs so far: 23,600,000
   [junit4]   2> 1845609 INFO  (TEST-TestSimExtremeIndexing.testScaleUp-seed#[6F003D6F2C9463E5]) [    ] o.a.s.c.a.s.TestSimExtremeIndexing #### Total docs so far: 23,800,000
   [junit4]   2> 1845609 INFO  (TEST-TestSimExtremeIndexing.testScaleUp-seed#[6F003D6F2C9463E5]) [    ] o.a.s.c.a.s.TestSimExtremeIndexing #### Total docs so far: 24,000,000
   [junit4]   2> 1845609 INFO  (TEST-TestSimExtremeIndexing.testScaleUp-seed#[6F003D6F2C9463E5]) [    ] o.a.s.c.a.s.TestSimExtremeIndexing #### Total docs so far: 24,200,000
   [junit4]   2> 1845611 INFO  (TEST-TestSimExtremeIndexing.testScaleUp-seed#[6F003D6F2C9463E5]) [    ] o.a.s.c.a.s.TestSimExtremeIndexing #### Total docs so far: 24,400,000
   [junit4]   2> 1845642 INFO  (TEST-TestSimExtremeIndexing.testScaleUp-seed#[6F003D6F2C9463E5]) [    ] o.a.s.c.a.s.TestSimExtremeIndexing #### Total docs so far: 24,600,000
   [junit4]   2> 1845643 INFO  (TEST-TestSimExtremeIndexing.testScaleUp-seed#[6F003D6F2C9463E5]) [    ] o.a.s.c.a.s.TestSimExtremeIndexing #### Total docs so far: 24,800,000
   [junit4]   2> 1845643 INFO  (TEST-TestSimExtremeIndexing.testScaleUp-seed#[6F003D6F2C9463E5]) [    ] o.a.s.c.a.s.TestSimExtremeIndexing #### Total docs so far: 25,000,000
   [junit4]   2> 1845644 INFO  (TEST-TestSimExtremeIndexing.testScaleUp-seed#[6F003D6F2C9463E5]) [    ] o.a.s.c.a.s.TestSimExtremeIndexing #### Total docs so far: 25,200,000
   [junit4]   2> 1845644 INFO  (TEST-TestSimExtremeIndexing.testScaleUp-seed#[6F003D6F2C9463E5]) [    ] o.a.s.c.a.s.TestSimExtremeIndexing #### Total docs so far: 25,400,000
   [junit4]   2> 1845646 INFO  (TEST-TestSimExtremeIndexing.testScaleUp-seed#[6F003D6F2C9463E5]) [    ] o.a.s.c.a.s.TestSimExtremeIndexing #### Total docs so far: 25,600,000
   [junit4]   2> 1845656 INFO  (TEST-TestSimExtremeIndexing.testScaleUp-seed#[6F003D6F2C9463E5]) [    ] o.a.s.c.a.s.TestSimExtremeIndexing #### Total docs so far: 25,800,000
   [junit4]   2> 1845657 INFO  (TEST-TestSimExtremeIndexing.testScaleUp-seed#[6F003D6F2C9463E5]) [    ] o.a.s.c.a.s.TestSimExtremeIndexing #### Total docs so far: 26,000,000
   [junit4]   2> 1845657 INFO  (TEST-TestSimExtremeIndexing.testScaleUp-seed#[6F003D6F2C9463E5]) [    ] o.a.s.c.a.s.TestSimExtremeIndexing #### Total docs so far: 26,200,000
   [junit4]   2> 1845658 INFO  (TEST-TestSimExtremeIndexing.testScaleUp-seed#[6F003D6F2C9463E5]) [    ] o.a.s.c.a.s.TestSimExtremeIndexing #### Total docs so far: 26,400,000
   [junit4]   2> 1845658 INFO  (TEST-TestSimExtremeIndexing.testScaleUp-seed#[6F003D6F2C9463E5]) [    ] o.a.s.c.a.s.TestSimExtremeIndexing #### Total docs so far: 26,600,000
   [junit4]   2> 1845659 INFO  (TEST-TestSimExtremeIndexing.testScaleUp-seed#[6F003D6F2C9463E5]) [    ] o.a.s.c.a.s.TestSimExtremeIndexing #### Total docs so far: 26,800,000
   [junit4]   2> 1845660 INFO  (TEST-TestSimExtremeIndexing.testScaleUp-seed#[6F003D6F2C9463E5]) [    ] o.a.s.c.a.s.TestSimExtremeIndexing #### Total docs so far: 27,000,000
   [junit4]   2> 1845660 INFO  (TEST-TestSimExtremeIndexing.testScaleUp-seed#[6F003D6F2C9463E5]) [    ] o.a.s.c.a.s.TestSimExtremeIndexing #### Total docs so far: 27,200,000
   [junit4]   2> 1845661 INFO  (TEST-TestSimExtremeIndexing.testScaleUp-seed#[6F003D6F2C9463E5]) [    ] o.a.s.c.a.s.TestSimExtremeIndexing #### Total docs so far: 27,400,000
   [junit4]   2> 1845661 INFO  (TEST-TestSimExtremeIndexing.testScaleUp-seed#[6F003D6F2C9463E5]) [    ] o.a.s.c.a.s.TestSimExtremeIndexing #### Total docs so far: 27,600,000
   [junit4]   2> 1845661 INFO  (TEST-TestSimExtremeIndexing.testScaleUp-seed#[6F003D6F2C9463E5]) [    ] o.a.s.c.a.s.TestSimExtremeIndexing #### Total docs so far: 27,800,000
   [junit4]   2> 1845662 INFO  (TEST-TestSimExtremeIndexing.testScaleUp-seed#[6F003D6F2C9463E5]) [    ] o.a.s.c.a.s.TestSimExtremeIndexing #### Total docs so far: 28,000,000
   [junit4]   2> 1845663 INFO  (TEST-TestSimExtremeIndexing.testScaleUp-seed#[6F003D6F2C9463E5]) [    ] o.a.s.c.a.s.TestSimExtremeIndexing #### Total docs so far: 28,200,000
   [junit4]   2> 1845663 INFO  (TEST-TestSimExtremeIndexing.testScaleUp-seed#[6F003D6F2C9463E5]) [    ] o.a.s.c.a.s.TestSimExtremeIndexing #### Total docs so far: 28,400,000
   [junit4]   2> 1845664 INFO  (TEST-TestSimExtremeIndexing.testScaleUp-seed#[6F003D6F2C9463E5]) [    ] o.a.s.c.a.s.TestSimExtremeIndexing #### Total docs so far: 28,600,000
   [junit4]   2> 1845665 INFO  (TEST-TestSimExtremeIndexing.testScaleUp-seed#[6F003D6F2C9463E5]) [    ] o.a.s.c.a.s.TestSimExtremeIndexing #### Total docs so far: 28,800,000
   [junit4]   2> 1845666 INFO  (TEST-TestSimExtremeIndexing.testScaleUp-seed#[6F003D6F2C9463E5]) [    ] o.a.s.c.a.s.TestSimExtremeIndexing #### Total docs so far: 29,000,000
   [junit4]   2> 1845666 INFO  (TEST-TestSimExtremeIndexing.testScaleUp-seed#[6F003D6F2C9463E5]) [    ] o.a.s.c.a.s.TestSimExtremeIndexing #### Total docs so far: 29,200,000
   [junit4]   2> 1845666 INFO  (TEST-TestSimExtremeIndexing.testScaleUp-seed#[6F003D6F2C9463E5]) [    ] o.a.s.c.a.s.TestSimExtremeIndexing #### Total docs so far: 29,400,000
   [junit4]   2> 1845668 INFO  (TEST-TestSimExtremeIndexing.testScaleUp-seed#[6F003D6F2C9463E5]) [    ] o.a.s.c.a.s.TestSimExtremeIndexing #### Total docs so far: 29,600,000
   [junit4]   2> 1845669 INFO  (TEST-TestSimExtremeIndexing.testScaleUp-seed#[6F003D6F2C9463E5]) [    ] o.a.s.c.a.s.TestSimExtremeIndexing #### Total docs so far: 29,800,000
   [junit4]   2> 1845670 INFO  (TEST-TestSimExtremeIndexing.testScaleUp-seed#[6F003D6F2C9463E5]) [    ] o.a.s.c.a.s.TestSimExtremeIndexing #### Total docs so far: 30,000,000
   [junit4]   2> 1845670 INFO  (TEST-TestSimExtremeIndexing.testScaleUp-seed#[6F003D6F2C9463E5]) [    ] o.a.s.c.a.s.TestSimExtremeIndexing #### Total docs so far: 30,200,000
   [junit4]   2> 1845670 INFO  (TEST-TestSimExtremeIndexing.testScaleUp-seed#[6F003D6F2C9463E5]) [    ] o.a.s.c.a.s.TestSimExtremeIndexing #### Total docs so far: 30,400,000
   [junit4]   2> 1845672 INFO  (TEST-TestSimExtremeIndexing.testScaleUp-seed#[6F003D6F2C9463E5]) [    ] o.a.s.c.a.s.TestSimExtremeIndexing #### Total docs so far: 30,600,000
   [junit4]   2> 1845673 INFO  (TEST-TestSimExtremeIndexing.testScaleUp-seed#[6F003D6F2C9463E5]) [    ] o.a.s.c.a.s.TestSimExtremeIndexing #### Total docs so far: 30,800,000
   [junit4]   2> 1845673 INFO  (TEST-TestSimExtremeIndexing.testScaleUp-seed#[6F003D6F2C9463E5]) [    ] o.a.s.c.a.s.TestSimExtremeIndexing #### Total docs so far: 31,000,000
   [junit4]   2> 1845674 INFO  (TEST-TestSimExtremeIndexing.testScaleUp-seed#[6F003D6F2C9463E5]) [    ] o.a.s.c.a.s.TestSimExtremeIndexing #### Total docs so far: 31,200,000
   [junit4]   2> 1845674 INFO  (TEST-TestSimExtremeIndexing.testScaleUp-seed#[6F003D6F2C9463E5]) [    ] o.a.s.c.a.s.TestSimExtremeIndexing #### Total docs so far: 31,400,000
   [junit4]   2> 1845674 INFO  (TEST-TestSimExtremeIndexing.testScaleUp-seed#[6F003D6F2C9463E5]) [    ] o.a.s.c.a.s.TestSimExtremeIndexing #### Total docs so far: 31,600,000
   [junit4]   2> 1845675 INFO  (TEST-TestSimExtremeIndexing.testScaleUp-seed#[6F003D6F2C9463E5]) [    ] o.a.s.c.a.s.TestSimExtremeIndexing #### Total docs so far: 31,800,000
   [junit4]   2> 1845675 INFO  (TEST-TestSimExtremeIndexing.testScaleUp-seed#[6F003D6F2C9463E5]) [    ] o.a.s.c.a.s.TestSimExtremeIndexing #### Total docs so far: 32,000,000
   [junit4]   2> 1845676 INFO  (TEST-TestSimExtremeIndexing.testScaleUp-seed#[6F003D6F2C9463E5]) [    ] o.a.s.c.a.s.TestSimExtremeIndexing #### Total docs so far: 32,200,000
   [junit4]   2> 1845676 INFO  (TEST-TestSimExtremeIndexing.testScaleUp-seed#[6F003D6F2C9463E5]) [    ] o.a.s.c.a.s.TestSimExtremeIndexing #### Total docs so far: 32,400,000
   [junit4]   2> 1845677 INFO  (TEST-TestSimExtremeIndexing.testScaleUp-seed#[6F003D6F2C9463E5]) [    ] o.a.s.c.a.s.TestSimExtremeIndexing #### Total docs so far: 32,600,000
   [junit4]   2> 1845678 INFO  (TEST-TestSimExtremeIndexing.testScaleUp-seed#[6F003D6F2C9463E5]) [    ] o.a.s.c.a.s.TestSimExtremeIndexing #### Total docs so far: 32,800,000
   [junit4]   2> 1845678 INFO  (TEST-TestSimExtremeIndexing.testScaleUp-seed#[6F003D6F2C9463E5]) [    ] o.a.s.c.a.s.TestSimExtremeIndexing #### Total docs so far: 33,000,000
   [junit4]   2> 1845678 INFO  (TEST-TestSimExtremeIndexing.testScaleUp-seed#[6F003D6F2C9463E5]) [    ] o.a.s.c.a.s.TestSimExtremeIndexing #### Total docs so far: 33,200,000
   [junit4]   2> 1845678 INFO  (TEST-TestSimExtremeIndexing.testScaleUp-seed#[6F003D6F2C9463E5]) [    ] o.a.s.c.a.s.TestSimExtremeIndexing #### Total docs so far: 33,400,000
   [junit4]   2> 1845679 INFO  (TEST-TestSimExtremeIndexing.testScaleUp-seed#[6F003D6F2C9463E5]) [    ] o.a.s.c.a.s.TestSimExtremeIndexing #### Total docs so far: 33,600,000
   [junit4]   2> 1845680 INFO  (TEST-TestSimExtremeIndexing.testScaleUp-seed#[6F003D6F2C9463E5]) [    ] o.a.s.c.a.s.TestSimExtremeIndexing #### Total docs so far: 33,800,000
   [junit4]   2> 1845680 INFO  (TEST-TestSimExtremeIndexing.testScaleUp-seed#[6F003D6F2C9463E5]) [    ] o.a.s.c.a.s.TestSimExtremeIndexing #### Total docs so far: 34,000,000
   [junit4]   2> 1845681 INFO  (TEST-TestSimExtremeIndexing.testScaleUp-seed#[6F003D6F2C9463E5]) [    ] o.a.s.c.a.s.TestSimExtremeIndexing #### Total docs so far: 34,200,000
   [junit4]   2> 1845681 INFO  (TEST-TestSimExtremeIndexing.testScaleUp-seed#[6F003D6F2C9463E5]) [    ] o.a.s.c.a.s.TestSimExtremeIndexing #### Total docs so far: 34,400,000
   [junit4]   2> 1845682 INFO  (TEST-TestSimExtremeIndexing.testScaleUp-seed#[6F003D6F2C9463E5]) [    ] o.a.s.c.a.s.TestSimExtremeIndexing #### Total docs so far: 34,600,000
   [junit4]   2> 1845682 INFO  (TEST-TestSimExtremeIndexing.testScaleUp-seed#[6F003D6F2C9463E5]) [    ] o.a.s.c.a.s.TestSimExtremeIndexing #### Total docs so far: 34,800,000
   [junit4]   2> 1845683 INFO  (TEST-TestSimExtremeIndexing.testScaleUp-seed#[6F003D6F2C9463E5]) [    ] o.a.s.c.a.s.TestSimExtremeIndexing #### Total docs so far: 35,000,000
   [junit4]   2> 1845683 INFO  (TEST-TestSimExtremeIndexing.testScaleUp-seed#[6F003D6F2C9463E5]) [    ] o.a.s.c.a.s.TestSimExtremeIndexing #### Total docs so far: 35,200,000
   [junit4]   2> 1845684 INFO  (TEST-TestSimExtremeIndexing.testScaleUp-seed#[6F003D6F2C9463E5]) [    ] o.a.s.c.a.s.TestSimExtremeIndexing #### Total docs so far: 35,400,000
   [junit4]   2> 1845684 INFO  (TEST-TestSimExtremeIndexing.testScaleUp-seed#[6F003D6F2C9463E5]) [    ] o.a.s.c.a.s.TestSimExtremeIndexing #### Total docs so far: 35,600,000
   [junit4]   2> 1845684 INFO  (TEST-TestSimExtremeIndexing.testScaleUp-seed#[6F003D6F2C9463E5]) [    ] o.a.s.c.a.s.TestSimExtremeIndexing #### Total docs so far: 35,800,000
   [junit4]   2> 1845685 INFO  (TEST-TestSimExtremeIndexing.testScaleUp-seed#[6F003D6F2C9463E5]) [    ] o.a.s.c.a.s.TestSimExtremeIndexing #### Total docs so far: 36,000,000
   [junit4]   2> 1845686 INFO  (TEST-TestSimExtremeIndexing.testScaleUp-seed#[6F003D6F2C9463E5]) [    ] o.a.s.c.a.s.TestSimExtremeIndexing #### Total docs so far: 36,200,000
   [junit4]   2> 1845706 INFO  (TEST-TestSimExtremeIndexing.testScaleUp-seed#[6F003D6F2C9463E5]) [    ] o.a.s.c.a.s.TestSimExtremeIndexing #### Total docs so far: 36,400,000
   [junit4]   2> 1845708 INFO  (TEST-TestSimExtremeIndexing.testScaleUp-seed#[6F003D6F2C9463E5]) [    ] o.a.s.c.a.s.TestSimExtremeIndexing #### Total docs so far: 36,600,000
   [junit4]   2> 1845708 INFO  (TEST-TestSimExtremeIndexing.testScaleUp-seed#[6F003D6F2C9463E5]) [    ] o.a.s.c.a.s.TestSimExtremeIndexing #### Total docs so far: 36,800,000
   [junit4]   2> 1845709 INFO  (TEST-TestSimExtremeIndexing.testScaleUp-seed#[6F003D6F2C9463E5]) [    ] o.a.s.c.a.s.TestSimExtremeIndexing #### Total docs so far: 37,000,000
   [junit4]   2> 1845710 INFO  (TEST-TestSimExtremeIndexing.testScaleUp-seed#[6F003D6F2C9463E5]) [    ] o.a.s.c.a.s.TestSimExtremeIndexing #### Total docs so far: 37,200,000
   [junit4]   2> 1845710 INFO  (TEST-TestSimExtremeIndexing.testScaleUp-seed#[6F003D6F2C9463E5]) [    ] o.a.s.c.a.s.TestSimExtremeIndexing #### Total docs so far: 37,400,000
   [junit4]   2> 1845711 INFO  (TEST-TestSimExtremeIndexing.testScaleUp-seed#[6F003D6F2C9463E5]) [    ] o.a.s.c.a.s.TestSimExtremeIndexing #### Total docs so far: 37,600,000
   [junit4]   2> 1845712 INFO  (TEST-TestSimExtremeIndexing.testScaleUp-seed#[6F003D6F2C9463E5]) [    ] o.a.s.c.a.s.TestSimExtremeIndexing #### Total docs so far: 37,800,000
   [junit4]   2> 1845712 INFO  (TEST-TestSimExtremeIndexing.testScaleUp-seed#[6F003D6F2C9463E5]) [    ] o.a.s.c.a.s.TestSimExtremeIndexing #### Total docs so far: 38,000,000
   [junit4]   2> 1845712 INFO  (TEST-TestSimExtremeIndexing.testScaleUp-seed#[6F003D6F2C9463E5]) [    ] o.a.s.c.a.s.TestSimExtremeIndexing #### Total docs so far: 38,200,000
   [junit4]   2> 1845712 INFO  (TEST-TestSimExtremeIndexing.testScaleUp-seed#[6F003D6F2C9463E5]) [    ] o.a.s.c.a.s.TestSimExtremeIndexing #### Total docs so far: 38,400,000
   [junit4]   2> 1845712 INFO  (TEST-TestSimExtremeIndexing.testScaleUp-seed#[6F003D6F2C9463E5]) [    ] o.a.s.c.a.s.TestSimExtremeIndexing #### Total docs so far: 38,600,000
   [junit4]   2> 1845713 INFO  (TEST-TestSimExtremeIndexing.testScaleUp-seed#[6F003D6F2C9463E5]) [    ] o.a.s.c.a.s.TestSimExtremeIndexing #### Total docs so far: 38,800,000
   [junit4]   2> 1845713 INFO  (TEST-TestSimExtremeIndexing.testScaleUp-seed#[6F003D6F2C9463E5]) [    ] o.a.s.c.a.s.TestSimExtremeIndexing #### Total docs so far: 39,000,000
   [junit4]   2> 1845714 INFO  (TEST-TestSimExtremeIndexing.testScaleUp-seed#[6F003D6F2C9463E5]) [    ] o.a.s.c.a.s.TestSimExtremeIndexing #### Total docs so far: 39,200,000
   [junit4]   2> 1845714 INFO  (TEST-TestSimExtremeIndexing.testScaleUp-seed#[6F003D6F2C9463E5]) [    ] o.a.s.c.a.s.TestSimExtremeIndexing #### Total docs so far: 39,400,000
   [junit4]   2> 1845714 INFO  (TEST-TestSimExtremeIndexing.testScaleUp-seed#[6F003D6F2C9463E5]) [    ] o.a.s.c.a.s.TestSimExtremeIndexing #### Total docs so far: 39,600,000
   [junit4]   2> 1845715 INFO  (TEST-TestSimExtremeIndexing.testScaleUp-seed#[6F003D6F2C9463E5]) [    ] o.a.s.c.a.s.TestSimExtremeIndexing #### Total docs so far: 39,800,000
   [junit4]   2> 1845716 INFO  (TEST-TestSimExtremeIndexing.testScaleUp-seed#[6F003D6F2C9463E5]) [    ] o.a.s.c.a.s.TestSimExtremeIndexing #### Total docs so far: 40,000,000
   [junit4]   2> 1845716 INFO  (TEST-TestSimExtremeIndexing.testScaleUp-seed#[6F003D6F2C9463E5]) [    ] o.a.s.c.a.s.TestSimExtremeIndexing #### Total docs so far: 40,200,000
   [junit4]   2> 1845716 INFO  (TEST-TestSimExtremeIndexing.testScaleUp-seed#[6F003D6F2C9463E5]) [    ] o.a.s.c.a.s.TestSimExtremeIndexing #### Total docs so far: 40,400,000
   [junit4]   2> 1845717 INFO  (TEST-TestSimExtremeIndexing.testScaleUp-seed#[6F003D6F2C9463E5]) [    ] o.a.s.c.a.s.TestSimExtremeIndexing #### Total docs so far: 40,600,000
   [junit4]   2> 1845717 INFO  (TEST-TestSimExtremeIndexing.testScaleUp-seed#[6F003D6F2C9463E5]) [    ] o.a.s.c.a.s.TestSimExtremeIndexing #### Total docs so far: 40,800,000
   [junit4]   2> 1845718 INFO  (TEST-TestSimExtremeIndexing.testScaleUp-seed#[6F003D6F2C9463E5]) [    ] o.a.s.c.a.s.TestSimExtremeIndexing #### Total docs so far: 41,000,000
   [junit4]   2> 1845719 INFO  (TEST-TestSimExtremeIndexing.testScaleUp-seed#[6F003D6F2C9463E5]) [    ] o.a.s.c.a.s.TestSimExtremeIndexing #### Total docs so far: 41,200,000
   [junit4]   2> 1845719 INFO  (TEST-TestSimExtremeIndexing.testScaleUp-seed#[6F003D6F2C9463E5]) [    ] o.a.s.c.a.s.TestSimExtremeIndexing #### Total docs so far: 41,400,000
   [junit4]   2> 1845719 INFO  (TEST-TestSimExtremeIndexing.testScaleUp-seed#[6F003D6F2C9463E5]) [    ] o.a.s.c.a.s.TestSimExtremeIndexing #### Total docs so far: 41,600,000
   [junit4]   2> 1845720 INFO  (TEST-TestSimExtremeIndexing.testScaleUp-seed#[6F003D6F2C9463E5]) [    ] o.a.s.c.a.s.TestSimExtremeIndexing #### Total docs so far: 41,800,000
   [junit4]   2> 1845720 INFO  (TEST-TestSimExtremeIndexing.testScaleUp-seed#[6F003D6F2C9463E5]) [    ] o.a.s.c.a.s.TestSimExtremeIndexing #### Total docs so far: 42,000,000
   [junit4]   2> 1845720 INFO  (TEST-TestSimExtremeIndexing.testScaleUp-seed#[6F003D6F2C9463E5]) [    ] o.a.s.c.a.s.TestSimExtremeIndexing #### Total docs so far: 42,200,000
   [junit4]   2> 1845721 INFO  (TEST-TestSimExtremeIndexing.testScaleUp-seed#[6F003D6F2C9463E5]) [    ] o.a.s.c.a.s.TestSimExtremeIndexing #### Total docs so far: 42,400,000
   [junit4]   2> 1845721 INFO  (TEST-TestSimExtremeIndexing.testScaleUp-seed#[6F003D6F2C9463E5]) [    ] o.a.s.c.a.s.TestSimExtremeIndexing #### Total docs so far: 42,600,000
   [junit4]   2> 1845722 INFO  (TEST-TestSimExtremeIndexing.testScaleUp-seed#[6F003D6F2C9463E5]) [    ] o.a.s.c.a.s.TestSimExtremeIndexing #### Total docs so far: 42,800,000
   [junit4]   2> 1845722 INFO  (TEST-TestSimExtremeIndexing.testScaleUp-seed#[6F003D6F2C9463E5]) [    ] o.a.s.c.a.s.TestSimExtremeIndexing #### Total docs so far: 43,000,000
   [junit4]   2> 1845722 INFO  (TEST-TestSimExtremeIndexing.testScaleUp-seed#[6F003D6F2C9463E5]) [    ] o.a.s.c.a.s.TestSimExtremeIndexing #### Total docs so far: 43,200,000
   [junit4]   2> 1845723 INFO  (TEST-TestSimExtremeIndexing.testScaleUp-seed#[6F003D6F2C9463E5]) [    ] o.a.s.c.a.s.TestSimExtremeIndexing #### Total docs so far: 43,400,000
   [junit4]   2> 1845723 INFO  (TEST-TestSimExtremeIndexing.testScaleUp-seed#[6F003D6F2C9463E5]) [    ] o.a.s.c.a.s.TestSimExtremeIndexing #### Total docs so far: 43,600,000
   [junit4]   2> 1845724 INFO  (TEST-TestSimExtremeIndexing.testScaleUp-seed#[6F003D6F2C9463E5]) [    ] o.a.s.c.a.s.TestSimExtremeIndexing #### Total docs so far: 43,800,000
   [junit4]   2> 1845724 INFO  (TEST-TestSimExtremeIndexing.testScaleUp-seed#[6F003D6F2C9463E5]) [    ] o.a.s.c.a.s.TestSimExtremeIndexing #### Total docs so far: 44,000,000
   [junit4]   2> 1845725 INFO  (TEST-TestSimExtremeIndexing.testScaleUp-seed#[6F003D6F2C9463E5]) [    ] o.a.s.c.a.s.TestSimExtremeIndexing #### Total docs so far: 44,200,000
   [junit4]   2> 1845725 INFO  (TEST-TestSimExtremeIndexing.testScaleUp-seed#[6F003D6F2C9463E5]) [    ] o.a.s.c.a.s.TestSimExtremeIndexing #### Total docs so far: 44,400,000
   [junit4]   2> 1845725 INFO  (TEST-TestSimExtremeIndexing.testScaleUp-seed#[6F003D6F2C9463E5]) [    ] o.a.s.c.a.s.TestSimExtremeIndexing #### Total docs so far: 44,600,000
   [junit4]   2> 1845725 INFO  (TEST-TestSimExtremeIndexing.testScaleUp-seed#[6F003D6F2C9463E5]) [    ] o.a.s.c.a.s.TestSimExtremeIndexing #### Total docs so far: 44,800,000
   [junit4]   2> 1845726 INFO  (TEST-TestSimExtremeIndexing.testScaleUp-seed#[6F003D6F2C9463E5]) [    ] o.a.s.c.a.s.TestSimExtremeIndexing #### Total docs so far: 45,000,000
   [junit4]   2> 1845726 INFO  (TEST-TestSimExtremeIndexing.testScaleUp-seed#[6F003D6F2C9463E5]) [    ] o.a.s.c.a.s.TestSimExtremeIndexing #### Total docs so far: 45,200,000
   [junit4]   2> 1845726 INFO  (TEST-TestSimExtremeIndexing.testScaleUp-seed#[6F003D6F2C9463E5]) [    ] o.a.s.c.a.s.TestSimExtremeIndexing #### Total docs so far: 45,400,000
   [junit4]   2> 1845727 INFO  (TEST-TestSimExtremeIndexing.testScaleUp-seed#[6F003D6F2C9463E5]) [    ] o.a.s.c.a.s.TestSimExtremeIndexing #### Total docs so far: 45,600,000
   [junit4]   2> 1845728 INFO  (TEST-TestSimExtremeIndexing.testScaleUp-seed#[6F003D6F2C9463E5]) [    ] o.a.s.c.a.s.TestSimExtremeIndexing #### Total docs so far: 45,800,000
   [junit4]   2> 1845728 INFO  (TEST-TestSimExtremeIndexing.testScaleUp-seed#[6F003D6F2C9463E5]) [    ] o.a.s.c.a.s.TestSimExtremeIndexing #### Total docs so far: 46,000,000
   [junit4]   2> 1845729 INFO  (TEST-TestSimExtremeIndexing.testScaleUp-seed#[6F003D6F2C9463E5]) [    ] o.a.s.c.a.s.TestSimExtremeIndexing #### Total docs so far: 46,200,000
   [junit4]   2> 1845729 INFO  (TEST-TestSimExtremeIndexing.testScaleUp-seed#[6F003D6F2C9463E5]) [    ] o.a.s.c.a.s.TestSimExtremeIndexing #### Total docs so far: 46,400,000
   [junit4]   2> 1845729 INFO  (TEST-TestSimExtremeIndexing.testScaleUp-seed#[6F003D6F2C9463E5]) [    ] o.a.s.c.a.s.TestSimExtremeIndexing #### Total docs so far: 46,600,000
   [junit4]   2> 1845730 INFO  (TEST-TestSimExtremeIndexing.testScaleUp-seed#[6F003D6F2C9463E5]) [    ] o.a.s.c.a.s.TestSimExtremeIndexing #### Total docs so far: 46,800,000
   [junit4]   2> 1845730 INFO  (TEST-TestSimExtremeIndexing.testScaleUp-seed#[6F003D6F2C9463E5]) [    ] o.a.s.c.a.s.TestSimExtremeIndexing #### Total docs so far: 47,000,000
   [junit4]   2> 1845731 INFO  (TEST-TestSimExtremeIndexing.testScaleUp-seed#[6F003D6F2C9463E5]) [    ] o.a.s.c.a.s.TestSimExtremeIndexing #### Total docs so far: 47,200,000
   [junit4]   2> 1845731 INFO  (TEST-TestSimExtremeIndexing.testScaleUp-seed#[6F003D6F2C9463E5]) [    ] o.a.s.c.a.s.TestSimExtremeIndexing #### Total docs so far: 47,400,000
   [junit4]   2> 1845732 INFO  (TEST-TestSimExtremeIndexing.testScaleUp-seed#[6F003D6F2C9463E5]) [    ] o.a.s.c.a.s.TestSimExtremeIndexing #### Total docs so far: 47,600,000
   [junit4]   2> 1845732 INFO  (TEST-TestSimExtremeIndexing.testScaleUp-seed#[6F003D6F2C9463E5]) [    ] o.a.s.c.a.s.TestSimExtremeIndexing #### Total docs so far: 47,800,000
   [junit4]   2> 1845732 INFO  (TEST-TestSimExtremeIndexing.testScaleUp-seed#[6F003D6F2C9463E5]) [    ] o.a.s.c.a.s.TestSimExtremeIndexing #### Total docs so far: 48,000,000
   [junit4]   2> 1845733 INFO  (TEST-TestSimExtremeIndexing.testScaleUp-seed#[6F003D6F2C9463E5]) [    ] o.a.s.c.a.s.TestSimExtremeIndexing #### Total docs so far: 48,200,000
   [junit4]   2> 1845733 INFO  (TEST-TestSimExtremeIndexing.testScaleUp-seed#[6F003D6F2C9463E5]) [    ] o.a.s.c.a.s.TestSimExtremeIndexing #### Total docs so far: 48,400,000
   [junit4]   2> 1845733 INFO  (TEST-TestSimExtremeIndexing.testScaleUp-seed#[6F003D6F2C9463E5]) [    ] o.a.s.c.a.s.TestSimExtremeIndexing #### Total docs so far: 48,600,000
   [junit4]   2> 1845734 INFO  (TEST-TestSimExtremeIndexing.testScaleUp-seed#[6F003D6F2C9463E5]) [    ] o.a.s.c.a.s.TestSimExtremeIndexing #### Total docs so far: 48,800,000
   [junit4]   2> 1845734 INFO  (TEST-TestSimExtremeIndexing.testScaleUp-seed#[6F003D6F2C9463E5]) [    ] o.a.s.c.a.s.TestSimExtremeIndexing #### Total docs so far: 49,000,000
   [junit4]   2> 1845734 INFO  (TEST-TestSimExtremeIndexing.testScaleUp-seed#[6F003D6F2C9463E5]) [    ] o.a.s.c.a.s.TestSimExtremeIndexing #### Total docs so far: 49,200,000
   [junit4]   2> 1845735 INFO  (TEST-TestSimExtremeIndexing.testScaleUp-seed#[6F003D6F2C9463E5]) [    ] o.a.s.c.a.s.TestSimExtremeIndexing #### Total docs so far: 49,400,000
   [junit4]   2> 1845737 DEBUG (ScheduledTrigger-7856-thread-4) [    ] o.a.s.c.a.ScheduledTriggers ++++++++ Cooldown inactive - processing event: {
   [junit4]   2>   "id":"1c2a1dc3f6564Teph9eueyjzqd0gm13nxszxfw8",
   [junit4]   2>   "source":"scaleUpTrigger",
   [junit4]   2>   "eventTime":495475417376100,
   [junit4]   2>   "eventType":"INDEXSIZE",
   [junit4]   2>   "properties":{
   [junit4]   2>     "aboveSize":{
   [junit4]   2>       "testScaleUp_collection_shard1_replica_n1":"docs=24700000, bytes=12350010240",
   [junit4]   2>       "testScaleUp_collection_shard2_replica_n3":"docs=24700000, bytes=12350010240"},
   [junit4]   2>     "belowSize":{},
   [junit4]   2>     "requestedOps":[
   [junit4]   2>       {
   [junit4]   2>         "action":"SPLITSHARD",
   [junit4]   2>         "hints":{
   [junit4]   2>           "COLL_SHARD":[{
   [junit4]   2>               "first":"testScaleUp_collection",
   [junit4]   2>               "second":"shard1"}],
   [junit4]   2>           "PARAMS":{"splitMethod":"link"}}},
   [junit4]   2>       {
   [junit4]   2>         "action":"SPLITSHARD",
   [junit4]   2>         "hints":{
   [junit4]   2>           "COLL_SHARD":[{
   [junit4]   2>               "first":"testScaleUp_collection",
   [junit4]   2>               "second":"shard2"}],
   [junit4]   2>           "PARAMS":{"splitMethod":"link"}}}]}}
   [junit4]   2> 1845737 DEBUG (ScheduledTrigger-7856-thread-4) [    ] o.a.s.c.a.ScheduledTriggers Pausing all triggers: [.auto_add_replicas, scaleUpTrigger, .scheduled_maintenance]
   [junit4]   2> 1845737 DEBUG (ScheduledTrigger-7856-thread-4) [    ] o.a.s.c.a.SystemLogListener Collection .system missing, skip sending event {
   [junit4]   2>   "id":"1c2a1dc3f6564Teph9eueyjzqd0gm13nxszxfw8",
   [junit4]   2>   "source":"scaleUpTrigger",
   [junit4]   2>   "eventTime":495475417376100,
   [junit4]   2>   "eventType":"INDEXSIZE",
   [junit4]   2>   "properties":{
   [junit4]   2>     "aboveSize":{
   [junit4]   2>       "testScaleUp_collection_shard1_replica_n1":"docs=24700000, bytes=12350010240",
   [junit4]   2>       "testScaleUp_collection_shard2_replica_n3":"docs=24700000, bytes=12350010240"},
   [junit4]   2>     "belowSize":{},
   [junit4]   2>     "_enqueue_time_":495476765806100,
   [junit4]   2>     "requestedOps":[
   [junit4]   2>       {
   [junit4]   2>         "action":"SPLITSHARD",
   [junit4]   2>         "hints":{
   [junit4]   2>           "COLL_SHARD":[{
   [junit4]   2>               "first":"testScaleUp_collection",
   [junit4]   2>               "second":"shard1"}],
   [junit4]   2>           "PARAMS":{"splitMethod":"link"}}},
   [junit4]   2>       {
   [junit4]   2>         "action":"SPLITSHARD",
   [junit4]   2>         "hints":{
   [junit4]   2>           "COLL_SHARD":[{
   [junit4]   2>               "first":"testScaleUp_collection",
   [junit4]   2>               "second":"shard2"}],
   [junit4]   2>           "PARAMS":{"splitMethod":"link"}}}]}}
   [junit4]   2> 1845738 INFO  (TEST-TestSimExtremeIndexing.testScaleUp-seed#[6F003D6F2C9463E5]) [    ] o.a.s.c.a.s.TestSimExtremeIndexing #### Total docs so far: 49,600,000
   [junit4]   2> 1845738 DEBUG (AutoscalingActionExecutor-7857-thread-1) [    ] o.a.s.c.a.ScheduledTriggers -- processing actions for {
   [junit4]   2>   "id":"1c2a1dc3f6564Teph9eueyjzqd0gm13nxszxfw8",
   [junit4]   2>   "source":"scaleUpTrigger",
   [junit4]   2>   "eventTime":495475417376100,
   [junit4]   2>   "eventType":"INDEXSIZE",
   [junit4]   2>   "properties":{
   [junit4]   2>     "aboveSize":{
   [junit4]   2>       "testScaleUp_collection_shard1_replica_n1":"docs=24700000, bytes=12350010240",
   [junit4]   2>       "testScaleUp_collection_shard2_replica_n3":"docs=24700000, bytes=12350010240"},
   [junit4]   2>     "belowSize":{},
   [junit4]   2>     "_enqueue_time_":495476765806100,
   [junit4]   2>     "requestedOps":[
   [junit4]   2>       {
   [junit4]   2>         "action":"SPLITSHARD",
   [junit4]   2>         "hints":{
   [junit4]   2>           "COLL_SHARD":[{
   [junit4]   2>               "first":"testScaleUp_collection",
   [junit4]   2>               "second":"shard1"}],
   [junit4]   2>           "PARAMS":{"splitMethod":"link"}}},
   [junit4]   2>       {
   [junit4]   2>         "action":"SPLITSHARD",
   [junit4]   2>         "hints":{
   [junit4]   2>           "COLL_SHARD":[{
   [junit4]   2>               "first":"testScaleUp_collection",
   [junit4]   2>               "second":"shard2"}],
   [junit4]   2>           "PARAMS":{"splitMethod":"link"}}}]}}
   [junit4]   2> 1845742 DEBUG (AutoscalingActionExecutor-7857-thread-1) [    ] o.a.s.c.a.ExecutePlanAction -- processing event: {
   [junit4]   2>   "id":"1c2a1dc3f6564Teph9eueyjzqd0gm13nxszxfw8",
   [junit4]   2>   "source":"scaleUpTrigger",
   [junit4]   2>   "eventTime":495475417376100,
   [junit4]   2>   "eventType":"INDEXSIZE",
   [junit4]   2>   "properties":{
   [junit4]   2>     "__start__":2,
   [junit4]   2>     "aboveSize":{
   [junit4]   2>       "testScaleUp_collection_shard1_replica_n1":"docs=24700000, bytes=12350010240",
   [junit4]   2>       "testScaleUp_collection_shard2_replica_n3":"docs=24700000, bytes=12350010240"},
   [junit4]   2>     "belowSize":{},
   [junit4]   2>     "_enqueue_time_":495476765806100,
   [junit4]   2>     "requestedOps":[
   [junit4]   2>       {
   [junit4]   2>         "action":"SPLITSHARD",
   [junit4]   2>         "hints":{
   [junit4]   2>           "COLL_SHARD":[{
   [junit4]   2>               "first":"testScaleUp_collection",
   [junit4]   2>               "second":"shard1"}],
   [junit4]   2>           "PARAMS":{"splitMethod":"link"}}},
   [junit4]   2>       {
   [junit4]   2>         "action":"SPLITSHARD",
   [junit4]   2>         "hints":{
   [junit4]   2>           "COLL_SHARD":[{
   [junit4]   2>               "first":"testScaleUp_collection",
   [junit4]   2>               "second":"shard2"}],
   [junit4]   2>           "PARAMS":{"splitMethod":"link"}}}]}} with context properties: {operations=[{
   [junit4]   2>   "class":"org.apache.solr.client.solrj.request.CollectionAdminRequest$SplitShard",
   [junit4]   2>   "method":"GET",
   [junit4]   2>   "params.action":"SPLITSHARD",
   [junit4]   2>   "params.collection":"testScaleUp_collection",
   [junit4]   2>   "params.shard":"shard1",
   [junit4]   2>   "params.splitMethod":"link"}, {
   [junit4]   2>   "class":"org.apache.solr.client.solrj.request.CollectionAdminRequest$SplitShard",
   [junit4]   2>   "method":"GET",
   [junit4]   2>   "params.action":"SPLITSHARD",
   [junit4]   2>   "params.collection":"testScaleUp_collection",
   [junit4]   2>   "params.shard":"shard2",
   [junit4]   2>   "params.splitMethod":"link"}], AFTER_ACTION=[compute_plan], BEFORE_ACTION=[compute_plan, execute_plan]}
   [junit4]   2> 1845742 DEBUG (AutoscalingActionExecutor-7857-thread-1) [    ] o.a.s.c.a.ExecutePlanAction Executing operation: action=SPLITSHARD&collection=testScaleUp_collection&shard=shard1&splitMethod=link
   [junit4]   2> 1845742 INFO  (TEST-TestSimExtremeIndexing.testScaleUp-seed#[6F003D6F2C9463E5]) [    ] o.a.s.c.a.s.TestSimExtremeIndexing #### Total docs so far: 49,800,000
   [junit4]   2> 1845744 INFO  (TEST-TestSimExtremeIndexing.testScaleUp-seed#[6F003D6F2C9463E5]) [    ] o.a.s.c.a.s.TestSimExtremeIndexing #### Total docs so far: 50,000,000
   [junit4]   2> 1845753 INFO  (TEST-TestSimExtremeIndexing.testScaleUp-seed#[6F003D6F2C9463E5]) [    ] o.a.s.c.a.s.TestSimExtremeIndexing #### Total docs so far: 50,200,000
   [junit4]   2> 1845766 INFO  (TEST-TestSimExtremeIndexing.testScaleUp-seed#[6F003D6F2C9463E5]) [    ] o.a.s.c.a.s.TestSimExtremeIndexing #### Total docs so far: 50,400,000
   [junit4]   2> 1845768 INFO  (TEST-TestSimExtremeIndexing.testScaleUp-seed#[6F003D6F2C9463E5]) [    ] o.a.s.c.a.s.TestSimExtremeIndexing #### Total docs so far: 50,600,000
   [junit4]   2> 1845768 INFO  (TEST-TestSimExtremeIndexing.testScaleUp-seed#[6F003D6F2C9463E5]) [    ] o.a.s.c.a.s.TestSimExtremeIndexing #### Total docs so far: 50,800,000
   [junit4]   2> 1845771 INFO  (TEST-TestSimExtremeIndexing.testScaleUp-seed#[6F003D6F2C9463E5]) [    ] o.a.s.c.a.s.TestSimExtremeIndexing #### Total docs so far: 51,000,000
   [junit4]   2> 1845772 INFO  (TEST-TestSimExtremeIndexing.testScaleUp-seed#[6F003D6F2C9463E5]) [    ] o.a.s.c.a.s.TestSimExtremeIndexing #### Total docs so far: 51,200,000
   [junit4]   2> 1845774 INFO  (TEST-TestSimExtremeIndexing.testScaleUp-seed#[6F003D6F2C9463E5]) [    ] o.a.s.c.a.s.TestSimExtremeIndexing #### Total docs so far: 51,400,000
   [junit4]   2> 1845776 INFO  (TEST-TestSimExtremeIndexing.testScaleUp-seed#[6F003D6F2C9463E5]) [    ] o.a.s.c.a.s.TestSimExtremeIndexing #### Total docs so far: 51,600,000
   [junit4]   2> 1845777 INFO  (TEST-TestSimExtremeIndexing.testScaleUp-seed#[6F003D6F2C9463E5]) [    ] o.a.s.c.a.s.TestSimExtremeIndexing #### Total docs so far: 51,800,000
   [junit4]   2> 1845777 INFO  (TEST-TestSimExtremeIndexing.testScaleUp-seed#[6F003D6F2C9463E5]) [    ] o.a.s.c.a.s.TestSimExtremeIndexing #### Total docs so far: 52,000,000
   [junit4]   2> 1845780 INFO  (TEST-TestSimExtremeIndexing.testScaleUp-seed#[6F003D6F2C9463E5]) [    ] o.a.s.c.a.s.TestSimExtremeIndexing #### Total docs so far: 52,200,000
   [junit4]   2> 1845780 INFO  (TEST-TestSimExtremeIndexing.testScaleUp-seed#[6F003D6F2C9463E5]) [    ] o.a.s.c.a.s.TestSimExtremeIndexing #### Total docs so far: 52,400,000
   [junit4]   2> 1845782 INFO  (TEST-TestSimExtremeIndexing.testScaleUp-seed#[6F003D6F2C9463E5]) [    ] o.a.s.c.a.s.TestSimExtremeIndexing #### Total docs so far: 52,600,000
   [junit4]   2> 1845782 INFO  (TEST-TestSimExtremeIndexing.testScaleUp-seed#[6F003D6F2C9463E5]) [    ] o.a.s.c.a.s.TestSimExtremeIndexing #### Total docs so far: 52,800,000
   [junit4]   2> 1845784 INFO  (TEST-TestSimExtremeIndexing.testScaleUp-seed#[6F003D6F2C9463E5]) [    ] o.a.s.c.a.s.TestSimExtremeIndexing #### Total docs so far: 53,000,000
   [junit4]   2> 1845786 INFO  (TEST-TestSimExtremeIndexing.testScaleUp-seed#[6F003D6F2C9463E5]) [    ] o.a.s.c.a.s.TestSimExtremeIndexing #### Total docs so far: 53,200,000
   [junit4]   2> 1845786 INFO  (TEST-TestSimExtremeIndexing.testScaleUp-seed#[6F003D6F2C9463E5]) [    ] o.a.s.c.a.s.TestSimExtremeIndexing #### Total docs so far: 53,400,000
   [junit4]   2> 1845788 INFO  (TEST-TestSimExtremeIndexing.testScaleUp-seed#[6F003D6F2C9463E5]) [    ] o.a.s.c.a.s.TestSimExtremeIndexing #### Total docs so far: 53,600,000
   [junit4]   2> 1845788 INFO  (simCloudManagerPool-7855-thread-62) [    ] o.a.s.c.a.c.SplitShardCmd numSubShards set at: 2
   [junit4]   2> 1845848 DEBUG (simCloudManagerPool-7855-thread-82) [    ] o.a.s.c.a.s.SimClusterStateProvider ** creating new collection states, currentVersion=9
   [junit4]   2> 1845848 DEBUG (simCloudManagerPool-7855-thread-82) [    ] o.a.s.c.a.s.SimClusterStateProvider ** saved cluster state version 9
   [junit4]   2> 1845848 INFO  (TEST-TestSimExtremeIndexing.testScaleUp-seed#[6F003D6F2C9463E5]) [    ] o.a.s.c.a.s.TestSimExtremeIndexing #### Total docs so far: 53,800,000
   [junit4]   2> 1845853 DEBUG (simCloudManagerPool-7855-thread-83) [    ] o.a.s.c.a.s.SimClusterStateProvider ** creating new collection states, currentVersion=10
   [junit4]   2> 1845853 DEBUG (simCloudManagerPool-7855-thread-83) [    ] o.a.s.c.a.s.SimClusterStateProvider ** saved cluster state version 10
   [junit4]   2> 1845853 INFO  (TEST-TestSimExtremeIndexing.testScaleUp-seed#[6F003D6F2C9463E5]) [    ] o.a.s.c.a.s.TestSimExtremeIndexing #### Total docs so far: 54,000,000
   [junit4]   2> 1845865 DEBUG (simCloudManagerPool-7855-thread-62) [    ] o.a.s.c.a.s.SimClusterStateProvider ** creating new collection states, currentVersion=11
   [junit4]   2> 1845866 DEBUG (simCloudManagerPool-7855-thread-62) [    ] o.a.s.c.a.s.SimClusterStateProvider ** saved cluster state version 11
   [junit4]   2> 1845867 DEBUG (simCloudManagerPool-7855-thread-62) [    ] o.a.s.c.a.s.SimClusterStateProvider ** no leader in testScaleUp_collection / shard1_0:{
   [junit4]   2>   "parent":"shard1",
   [junit4]   2>   "stateTimestamp":"1547579470995720000",
   [junit4]   2>   "range":"80000000-bfffffff",
   [junit4]   2>   "state":"construction",
   [junit4]   2>   "replicas":{
   [junit4]   2>     "core_node10":{
   [junit4]   2>       "core":"testScaleUp_collection_shard1_0_replica_n9",
   [junit4]   2>       "SEARCHER.searcher.maxDoc":12450000,
   [junit4]   2>       "SEARCHER.searcher.deletedDocs":0,
   [junit4]   2>       "INDEX.sizeInBytes":6225020480,
   [junit4]   2>       "node_name":"127.0.0.1:10091_solr",
   [junit4]   2>       "base_url":"http://127.0.0.1:10091/solr",
   [junit4]   2>       "state":"active",
   [junit4]   2>       "type":"NRT",
   [junit4]   2>       "INDEX.sizeInGB":5.797502100467682,
   [junit4]   2>       "SEARCHER.searcher.numDocs":12450000},
   [junit4]   2>     "core_node8":{
   [junit4]   2>       "core":"testScaleUp_collection_shard1_0_replica_n7",
   [junit4]   2>       "SEARCHER.searcher.maxDoc":12450000,
   [junit4]   2>       "SEARCHER.searcher.deletedDocs":0,
   [junit4]   2>       "INDEX.sizeInBytes":6225020480,
   [junit4]   2>       "node_name":"127.0.0.1:10245_solr",
   [junit4]   2>       "base_url":"http://127.0.0.1:10245/solr",
   [junit4]   2>       "state":"active",
   [junit4]   2>       "type":"NRT",
   [junit4]   2>       "INDEX.sizeInGB":5.797502100467682,
   [junit4]   2>       "SEARCHER.searcher.numDocs":12450000}}}
   [junit4]   2> 1845867 DEBUG (simCloudManagerPool-7855-thread-84) [    ] o.a.s.c.a.s.SimClusterStateProvider -- elected new leader for testScaleUp_collection / shard1_1 (currentVersion=12): {"core_node12":{
   [junit4]   2>     "core":"testScaleUp_collection_shard1_1_replica_n11",
   [junit4]   2>     "shard":"shard1_1",
   [junit4]   2>     "collection":"testScaleUp_collection",
   [junit4]   2>     "node_name":"127.0.0.1:10097_solr",
   [junit4]   2>     "type":"NRT",
   [junit4]   2>     "leader":"true",
   [junit4]   2>     "SEARCHER.searcher.maxDoc":12450000,
   [junit4]   2>     "SEARCHER.searcher.deletedDocs":0,
   [junit4]   2>     "INDEX.sizeInBytes":6225010240,
   [junit4]   2>     "base_url":"http://127.0.0.1:10097/solr",
   [junit4]   2>     "state":"active",
   [junit4]   2>     "INDEX.sizeInGB":5.797492563724518,
   [junit4]   2>     "SEARCHER.searcher.numDocs":12450000}}
   [junit4]   2> 1845867 INFO  (TEST-TestSimExtremeIndexing.testScaleUp-seed#[6F003D6F2C9463E5]) [    ] o.a.s.c.a.s.TestSimExtremeIndexing #### Total docs so far: 54,200,000
   [junit4]   2> 1845867 DEBUG (simCloudManagerPool-7855-thread-84) [    ] o.a.s.c.a.s.SimClusterStateProvider -- elected new leader for testScaleUp_collection / shard1_0 (currentVersion=12): {"core_node10":{
   [junit4]   2>     "core":"testScaleUp_collection_shard1_0_replica_n9",
   [junit4]   2>     "shard":"shard1_0",
   [junit4]   2>     "collection":"testScaleUp_collection",
   [junit4]   2>     "node_name":"127.0.0.1:10091_solr",
   [junit4]   2>     "type":"NRT",
   [junit4]   2>     "leader":"true",
   [junit4]   2>     "SEARCHER.searcher.maxDoc":12450000,
   [junit4]   2>     "SEARCHER.searcher.deletedDocs":0,
   [junit4]   2>     "INDEX.sizeInBytes":6225020480,
   [junit4]   2>     "base_url":"http://127.0.0.1:10091/solr",
   [junit4]   2>     "state":"active",
   [junit4]   2>     "INDEX.sizeInGB":5.797502100467682,
   [junit4]   2>     "SEARCHER.searcher.numDocs":12450000}}
   [junit4]   2> 1845867 DEBUG (simCloudManagerPool-7855-thread-62) [    ] o.a.s.c.a.s.SimClusterStateProvider ** creating new collection states, currentVersion=12
   [junit4]   2> 1845868 DEBUG (simCloudManagerPool-7855-thread-62) [    ] o.a.s.c.a.s.SimClusterStateProvider ** saved cluster state version 12
   [junit4]   2> 1845869 DEBUG (simCloudManagerPool-7855-thread-62) [    ] o.a.s.c.a.s.SimClusterStateProvider -- applying 2200000 buffered docs from testScaleUp_collection / shard1, perShard=1100000, remainder=0
   [junit4]   2> 1845869 DEBUG (simCloudManagerPool-7855-thread-88) [    ] o.a.s.c.a.s.SimClusterStateProvider ** creating new collection states, currentVersion=13
   [junit4]   2> 1845869 DEBUG (simCloudManagerPool-7855-thread-88) [    ] o.a.s.c.a.s.SimClusterStateProvider ** saved cluster state version 13
   [junit4]   2> 1845869 INFO  (TEST-TestSimExtremeIndexing.testScaleUp-seed#[6F003D6F2C9463E5]) [    ] o.a.s.c.a.s.TestSimExtremeIndexing #### Total docs so far: 54,400,000
   [junit4]   2> 1845869 DEBUG (AutoscalingActionExecutor-7857-thread-1) [    ] o.a.s.c.a.ExecutePlanAction Executing operation: action=SPLITSHARD&collection=testScaleUp_collection&shard=shard2&splitMethod=link
   [junit4]   2> 1845871 INFO  (TEST-TestSimExtremeIndexing.testScaleUp-seed#[6F003D6F2C9463E5]) [    ] o.a.s.c.a.s.TestSimExtremeIndexing #### Total docs so far: 54,600,000
   [junit4]   2> 1845871 INFO  (TEST-TestSimExtremeIndexing.testScaleUp-seed#[6F003D6F2C9463E5]) [    ] o.a.s.c.a.s.TestSimExtremeIndexing #### Total docs so far: 54,800,000
   [junit4]   2> 1845871 INFO  (TEST-TestSimExtremeIndexing.testScaleUp-seed#[6F003D6F2C9463E5]) [    ] o.a.s.c.a.s.TestSimExtremeIndexing #### Total docs so far: 55,000,000
   [junit4]   2> 1845871 INFO  (TEST-TestSimExtremeIndexing.testScaleUp-seed#[6F003D6F2C9463E5]) [    ] o.a.s.c.a.s.TestSimExtremeIndexing #### Total docs so far: 55,200,000
   [junit4]   2> 1845872 INFO  (TEST-TestSimExtremeIndexing.testScaleUp-seed#[6F003D6F2C9463E5]) [    ] o.a.s.c.a.s.TestSimExtremeIndexing #### Total docs so far: 55,400,000
   [junit4]   2> 1845872 INFO  (TEST-TestSimExtremeIndexing.testScaleUp-seed#[6F003D6F2C9463E5]) [    ] o.a.s.c.a.s.TestSimExtremeIndexing #### Total docs so far: 55,600,000
   [junit4]   2> 1845872 INFO  (TEST-TestSimExtremeIndexing.testScaleUp-seed#[6F003D6F2C9463E5]) [    ] o.a.s.c.a.s.TestSimExtremeIndexing #### Total docs so far: 55,800,000
   [junit4]   2> 1845872 INFO  (TEST-TestSimExtremeIndexing.testScaleUp-seed#[6F003D6F2C9463E5]) [    ] o.a.s.c.a.s.TestSimExtremeIndexing #### Total docs so far: 56,000,000
   [junit4]   2> 1845872 INFO  (TEST-TestSimExtremeIndexing.testScaleUp-seed#[6F003D6F2C9463E5]) [    ] o.a.s.c.a.s.TestSimExtremeIndexing #### Total docs so far: 56,200,000
   [junit4]   2> 1845873 INFO  (TEST-TestSimExtremeIndexing.testScaleUp-seed#[6F003D6F2C9463E5]) [    ] o.a.s.c.a.s.TestSimExtremeIndexing #### Total docs so far: 56,400,000
   [junit4]   2> 1845873 INFO  (TEST-TestSimExtremeIndexing.testScaleUp-seed#[6F003D6F2C9463E5]) [    ] o.a.s.c.a.s.TestSimExtremeIndexing #### Total docs so far: 56,600,000
   [junit4]   2> 1845874 INFO  (TEST-TestSimExtremeIndexing.testScaleUp-seed#[6F003D6F2C9463E5]) [    ] o.a.s.c.a.s.TestSimExtremeIndexing #### Total docs so far: 56,800,000
   [junit4]   2> 1845874 INFO  (TEST-TestSimExtremeIndexing.testScaleUp-seed#[6F003D6F2C9463E5]) [    ] o.a.s.c.a.s.TestSimExtremeIndexing #### Total docs so far: 57,000,000
   [junit4]   2> 1845874 INFO  (TEST-TestSimExtremeIndexing.testScaleUp-seed#[6F003D6F2C9463E5]) [    ] o.a.s.c.a.s.TestSimExtremeIndexing #### Total docs so far: 57,200,000
   [junit4]   2> 1845874 INFO  (TEST-TestSimExtremeIndexing.testScaleUp-seed#[6F003D6F2C9463E5]) [    ] o.a.s.c.a.s.TestSimExtremeIndexing #### Total docs so far: 57,400,000
   [junit4]   2> 1845874 INFO  (TEST-TestSimExtremeIndexing.testScaleUp-seed#[6F003D6F2C9463E5]) [    ] o.a.s.c.a.s.TestSimExtremeIndexing #### Total docs so far: 57,600,000
   [junit4]   2> 1845874 INFO  (TEST-TestSimExtremeIndexing.testScaleUp-seed#[6F003D6F2C9463E5]) [    ] o.a.s.c.a.s.TestSimExtremeIndexing #### Total docs so far: 57,800,000
   [junit4]   2> 1845876 INFO  (TEST-TestSimExtremeIndexing.testScaleUp-seed#[6F003D6F2C9463E5]) [    ] o.a.s.c.a.s.TestSimExtremeIndexing #### Total docs so far: 58,000,000
   [junit4]   2> 1845876 INFO  (TEST-TestSimExtremeIndexing.testScaleUp-seed#[6F003D6F2C9463E5]) [    ] o.a.s.c.a.s.TestSimExtremeIndexing #### Total docs so far: 58,200,000
   [junit4]   2> 1845876 INFO  (TEST-TestSimExtremeIndexing.testScaleUp-seed#[6F003D6F2C9463E5]) [    ] o.a.s.c.a.s.TestSimExtremeIndexing #### Total docs so far: 58,400,000
   [junit4]   2> 1845876 INFO  (TEST-TestSimExtremeIndexing.testScaleUp-seed#[6F003D6F2C9463E5]) [    ] o.a.s.c.a.s.TestSimExtremeIndexing #### Total docs so far: 58,600,000
   [junit4]   2> 1845876 INFO  (TEST-TestSimExtremeIndexing.testScaleUp-seed#[6F003D6F2C9463E5]) [    ] o.a.s.c.a.s.TestSimExtremeIndexing #### Total docs so far: 58,800,000
   [junit4]   2> 1845876 INFO  (TEST-TestSimExtremeIndexing.testScaleUp-seed#[6F003D6F2C9463E5]) [    ] o.a.s.c.a.s.TestSimExtremeIndexing #### Total docs so far: 59,000,000
   [junit4]   2> 1845876 INFO  (TEST-TestSimExtremeIndexing.testScaleUp-seed#[6F003D6F2C9463E5]) [    ] o.a.s.c.a.s.TestSimExtremeIndexing #### Total docs so far: 59,200,000
   [junit4]   2> 1845878 INFO  (TEST-TestSimExtremeIndexing.testScaleUp-seed#[6F003D6F2C9463E5]) [    ] o.a.s.c.a.s.TestSimExtremeIndexing #### Total docs so far: 59,400,000
   [junit4]   2> 1845878 INFO  (TEST-TestSimExtremeIndexing.testScaleUp-seed#[6F003D6F2C9463E5]) [    ] o.a.s.c.a.s.TestSimExtremeIndexing #### Total docs so far: 59,600,000
   [junit4]   2> 1845878 INFO  (TEST-TestSimExtremeIndexing.testScaleUp-seed#[6F003D6F2C9463E5]) [    ] o.a.s.c.a.s.TestSimExtremeIndexing #### Total docs so far: 59,800,000
   [junit4]   2> 1845878 INFO  (TEST-TestSimExtremeIndexing.testScaleUp-seed#[6F003D6F2C9463E5]) [    ] o.a.s.c.a.s.TestSimExtremeIndexing #### Total docs so far: 60,000,000
   [junit4]   2> 1845879 INFO  (TEST-TestSimExtremeIndexing.testScaleUp-seed#[6F003D6F2C9463E5]) [    ] o.a.s.c.a.s.TestSimExtremeIndexing #### Total docs so far: 60,200,000
   [junit4]   2> 1845879 INFO  (TEST-TestSimExtremeIndexing.testScaleUp-seed#[6F003D6F2C9463E5]) [    ] o.a.s.c.a.s.TestSimExtremeIndexing #### Total docs so far: 60,400,000
   [junit4]   2> 1845879 INFO  (TEST-TestSimExtremeIndexing.testScaleUp-seed#[6F003D6F2C9463E5]) [    ] o.a.s.c.a.s.TestSimExtremeIndexing #### Total docs so far: 60,600,000
   [junit4]   2> 1845890 INFO  (TEST-TestSimExtremeIndexing.testScaleUp-seed#[6F003D6F2C9463E5]) [    ] o.a.s.c.a.s.TestSimExtremeIndexing #### Total docs so far: 60,800,000
   [junit4]   2> 1845891 INFO  (TEST-TestSimExtremeIndexing.testScaleUp-seed#[6F003D6F2C9463E5]) [    ] o.a.s.c.a.s.TestSimExtremeIndexing #### Total docs so far: 61,000,000
   [junit4]   2> 1845892 INFO  (TEST-TestSimExtremeIndexing.testScaleUp-seed#[6F003D6F2C9463E5]) [    ] o.a.s.c.a.s.TestSimExtremeIndexing #### Total docs so far: 61,200,000
   [junit4]   2> 1845892 INFO  (TEST-TestSimExtremeIndexing.testScaleUp-seed#[6F003D6F2C9463E5]) [    ] o.a.s.c.a.s.TestSimExtremeIndexing #### Total docs so far: 61,400,000
   [junit4]   2> 1845892 INFO  (TEST-TestSimExtremeIndexing.testScaleUp-seed#[6F003D6F2C9463E5]) [    ] o.a.s.c.a.s.TestSimExtremeIndexing #### Total docs so far: 61,600,000
   [junit4]   2> 1845892 INFO  (TEST-TestSimExtremeIndexing.testScaleUp-seed#[6F003D6F2C9463E5]) [    ] o.a.s.c.a.s.TestSimExtremeIndexing #### Total docs so far: 61,800,000
   [junit4]   2> 1845892 INFO  (TEST-TestSimExtremeIndexing.testScaleUp-seed#[6F003D6F2C9463E5]) [    ] o.a.s.c.a.s.TestSimExtremeIndexing #### Total docs so far: 62,000,000
   [junit4]   2> 1845892 INFO  (TEST-TestSimExtremeIndexing.testScaleUp-seed#[6F003D6F2C9463E5]) [    ] o.a.s.c.a.s.TestSimExtremeIndexing #### Total docs so far: 62,200,000
   [junit4]   2> 1845892 INFO  (TEST-TestSimExtremeIndexing.testScaleUp-seed#[6F003D6F2C9463E5]) [    ] o.a.s.c.a.s.TestSimExtremeIndexing #### Total docs so far: 62,400,000
   [junit4]   2> 1845894 INFO  (TEST-TestSimExtremeIndexing.testScaleUp-seed#[6F003D6F2C9463E5]) [    ] o.a.s.c.a.s.TestSimExtremeIndexing #### Total docs so far: 62,600,000
   [junit4]   2> 1845894 INFO  (TEST-TestSimExtremeIndexing.testScaleUp-seed#[6F003D6F2C9463E5]) [    ] o.a.s.c.a.s.TestSimExtremeIndexing #### Total docs so far: 62,800,000
   [junit4]   2> 1845895 INFO  (TEST-TestSimExtremeIndexing.testScaleUp-seed#[6F003D6F2C9463E5]) [    ] o.a.s.c.a.s.TestSimExtremeIndexing #### Total docs so far: 63,000,000
   [junit4]   2> 1845895 INFO  (TEST-TestSimExtremeIndexing.testScaleUp-seed#[6F003D6F2C9463E5]) [    ] o.a.s.c.a.s.TestSimExtremeIndexing #### Total docs so far: 63,200,000
   [junit4]   2> 1845895 INFO  (TEST-TestSimExtremeIndexing.testScaleUp-seed#[6F003D6F2C9463E5]) [    ] o.a.s.c.a.s.TestSimExtremeIndexing #### Total docs so far: 63,400,000
   [junit4]   2> 1845895 INFO  (TEST-TestSimExtremeIndexing.testScaleUp-seed#[6F003D6F2C9463E5]) [    ] o.a.s.c.a.s.TestSimExtremeIndexing #### Total docs so far: 63,600,000
   [junit4]   2> 1845896 INFO  (TEST-TestSimExtremeIndexing.testScaleUp-seed#[6F003D6F2C9463E5]) [    ] o.a.s.c.a.s.TestSimExtremeIndexing #### Total docs so far: 63,800,000
   [junit4]   2> 1845897 INFO  (TEST-TestSimExtremeIndexing.testScaleUp-seed#[6F003D6F2C9463E5]) [    ] o.a.s.c.a.s.TestSimExtremeIndexing #### Total docs so far: 64,000,000
   [junit4]   2> 1845897 INFO  (TEST-TestSimExtremeIndexing.testScaleUp-seed#[6F003D6F2C9463E5]) [    ] o.a.s.c.a.s.TestSimExtremeIndexing #### Total docs so far: 64,200,000
   [junit4]   2> 1845897 INFO  (TEST-TestSimExtremeIndexing.testScaleUp-seed#[6F003D6F2C9463E5]) [    ] o.a.s.c.a.s.TestSimExtremeIndexing #### Total docs so far: 64,400,000
   [junit4]   2> 1845897 INFO  (TEST-TestSimExtremeIndexing.testScaleUp-seed#[6F003D6F2C9463E5]) [    ] o.a.s.c.a.s.TestSimExtremeIndexing #### Total docs so far: 64,600,000
   [junit4]   2> 1845897 INFO  (TEST-TestSimExtremeIndexing.testScaleUp-seed#[6F003D6F2C9463E5]) [    ] o.a.s.c.a.s.TestSimExtremeIndexing #### Total docs so far: 64,800,000
   [junit4]   2> 1845897 INFO  (TEST-TestSimExtremeIndexing.testScaleUp-seed#[6F003D6F2C9463E5]) [    ] o.a.s.c.a.s.TestSimExtremeIndexing #### Total docs so far: 65,000,000
   [junit4]   2> 1845897 INFO  (TEST-TestSimExtremeIndexing.testScaleUp-seed#[6F003D6F2C9463E5]) [    ] o.a.s.c.a.s.TestSimExtremeIndexing #### Total docs so far: 65,200,000
   [junit4]   2> 1845897 INFO  (TEST-TestSimExtremeIndexing.testScaleUp-seed#[6F003D6F2C9463E5]) [    ] o.a.s.c.a.s.TestSimExtremeIndexing #### Total docs so far: 65,400,000
   [junit4]   2> 1845897 INFO  (TEST-TestSimExtremeIndexing.testScaleUp-seed#[6F003D6F2C9463E5]) [    ] o.a.s.c.a.s.TestSimExtremeIndexing #### Total docs so far: 65,600,000
   [junit4]   2> 1845899 INFO  (TEST-TestSimExtremeIndexing.testScaleUp-seed#[6F003D6F2C9463E5]) [    ] o.a.s.c.a.s.TestSimExtremeIndexing #### Total docs so far: 65,800,000
   [junit4]   2> 1845899 INFO  (TEST-TestSimExtremeIndexing.testScaleUp-seed#[6F003D6F2C9463E5]) [    ] o.a.s.c.a.s.TestSimExtremeIndexing #### Total docs so far: 66,000,000
   [junit4]   2> 1845899 INFO  (TEST-TestSimExtremeIndexing.testScaleUp-seed#[6F003D6F2C9463E5]) [    ] o.a.s.c.a.s.TestSimExtremeIndexing #### Total docs so far: 66,200,000
   [junit4]   2> 1845900 INFO  (TEST-TestSimExtremeIndexing.testScaleUp-seed#[6F003D6F2C9463E5]) [    ] o.a.s.c.a.s.TestSimExtremeIndexing #### Total docs so far: 66,400,000
   [junit4]   2> 1845900 INFO  (TEST-TestSimExtremeIndexing.testScaleUp-seed#[6F003D6F2C9463E5]) [    ] o.a.s.c.a.s.TestSimExtremeIndexing #### Total docs so far: 66,600,000
   [junit4]   2> 1845900 INFO  (TEST-TestSimExtremeIndexing.testScaleUp-seed#[6F003D6F2C9463E5]) [    ] o.a.s.c.a.s.TestSimExtremeIndexing #### Total docs so far: 66,800,000
   [junit4]   2> 1845900 INFO  (TEST-TestSimExtremeIndexing.testScaleUp-seed#[6F003D6F2C9463E5]) [    ] o.a.s.c.a.s.TestSimExtremeIndexing #### Total docs so far: 67,000,000
   [junit4]   2> 1845901 INFO  (TEST-TestSimExtremeIndexing.testScaleUp-seed#[6F003D6F2C9463E5]) [    ] o.a.s.c.a.s.TestSimExtremeIndexing #### Total docs so far: 67,200,000
   [junit4]   2> 1845901 INFO  (TEST-TestSimExtremeIndexing.testScaleUp-seed#[6F003D6F2C9463E5]) [    ] o.a.s.c.a.s.TestSimExtremeIndexing #### Total docs so far: 67,400,000
   [junit4]   2> 1845901 INFO  (TEST-TestSimExtremeIndexing.testScaleUp-seed#[6F003D6F2C9463E5]) [    ] o.a.s.c.a.s.TestSimExtremeIndexing #### Total docs so far: 67,600,000
   [junit4]   2> 1845902 INFO  (TEST-TestSimExtremeIndexing.testScaleUp-seed#[6F003D6F2C9463E5]) [    ] o.a.s.c.a.s.TestSimExtremeIndexing #### Total docs so far: 67,800,000
   [junit4]   2> 1845902 INFO  (TEST-TestSimExtremeIndexing.testScaleUp-seed#[6F003D6F2C9463E5]) [    ] o.a.s.c.a.s.TestSimExtremeIndexing #### Total docs so far: 68,000,000
   [junit4]   2> 1845902 INFO  (TEST-TestSimExtremeIndexing.testScaleUp-seed#[6F003D6F2C9463E5]) [    ] o.a.s.c.a.s.TestSimExtremeIndexing #### Total docs so far: 68,200,000
   [junit4]   2> 1845902 INFO  (TEST-TestSimExtremeIndexing.testScaleUp-seed#[6F003D6F2C9463E5]) [    ] o.a.s.c.a.s.TestSimExtremeIndexing #### Total docs so far: 68,400,000
   [junit4]   2> 1845903 INFO  (TEST-TestSimExtremeIndexing.testScaleUp-seed#[6F003D6F2C9463E5]) [    ] o.a.s.c.a.s.TestSimExtremeIndexing #### Total docs so far: 68,600,000
   [junit4]   2> 1845903 INFO  (TEST-TestSimExtremeIndexing.testScaleUp-seed#[6F003D6F2C9463E5]) [    ] o.a.s.c.a.s.TestSimExtremeIndexing #### Total docs so far: 68,800,000
   [junit4]   2> 1845903 INFO  (TEST-TestSimExtremeIndexing.testScaleUp-seed#[6F003D6F2C9463E5]) [    ] o.a.s.c.a.s.TestSimExtremeIndexing #### Total docs so far: 69,000,000
   [junit4]   2> 1845903 INFO  (TEST-TestSimExtremeIndexing.testScaleUp-seed#[6F003D6F2C9463E5]) [    ] o.a.s.c.a.s.TestSimExtremeIndexing #### Total docs so far: 69,200,000
   [junit4]   2> 1845904 INFO  (TEST-TestSimExtremeIndexing.testScaleUp-seed#[6F003D6F2C9463E5]) [    ] o.a.s.c.a.s.TestSimExtremeIndexing #### Total docs so far: 69,400,000
   [junit4]   2> 1845904 INFO  (TEST-TestSimExtremeIndexing.testScaleUp-seed#[6F003D6F2C9463E5]) [    ] o.a.s.c.a.s.TestSimExtremeIndexing #### Total docs so far: 69,600,000
   [junit4]   2> 1845904 INFO  (TEST-TestSimExtremeIndexing.testScaleUp-seed#[6F003D6F2C9463E5]) [    ] o.a.s.c.a.s.TestSimExtremeIndexing #### Total docs so far: 69,800,000
   [junit4]   2> 1845904 INFO  (TEST-TestSimExtremeIndexing.testScaleUp

[...truncated too long message...]

shard1_0_0_1"}],
   [junit4]   2>           "PARAMS":{"splitMethod":"link"}}}]}}
   [junit4]   2> 	at org.apache.solr.cloud.autoscaling.ExecutePlanAction.process(ExecutePlanAction.java:120) ~[java/:?]
   [junit4]   2> 	at org.apache.solr.cloud.autoscaling.ScheduledTriggers.lambda$null$3(ScheduledTriggers.java:324) ~[java/:?]
   [junit4]   2> 	... 6 more
   [junit4]   2> Caused by: org.apache.solr.common.SolrException: Unexpected exception executing operation: action=SPLITSHARD&async=scaleUpTrigger/1c2e5d7980c84Teph9eueyjzqd0gm13nxszxfwe/0&waitForFinalState=true&collection=testScaleUp_collection&shard=shard1_0_0_0&splitMethod=link
   [junit4]   2> 	at org.apache.solr.cloud.autoscaling.ExecutePlanAction.process(ExecutePlanAction.java:110) ~[java/:?]
   [junit4]   2> 	at org.apache.solr.cloud.autoscaling.ScheduledTriggers.lambda$null$3(ScheduledTriggers.java:324) ~[java/:?]
   [junit4]   2> 	... 6 more
   [junit4]   2> Caused by: java.io.IOException: java.lang.InterruptedException
   [junit4]   2> 	at org.apache.solr.cloud.autoscaling.sim.SimCloudManager.request(SimCloudManager.java:656) ~[test/:?]
   [junit4]   2> 	at org.apache.solr.cloud.autoscaling.ExecutePlanAction.process(ExecutePlanAction.java:80) ~[java/:?]
   [junit4]   2> 	at org.apache.solr.cloud.autoscaling.ScheduledTriggers.lambda$null$3(ScheduledTriggers.java:324) ~[java/:?]
   [junit4]   2> 	... 6 more
   [junit4]   2> Caused by: java.lang.InterruptedException
   [junit4]   2> 	at java.util.concurrent.FutureTask.awaitDone(FutureTask.java:404) ~[?:1.8.0_172]
   [junit4]   2> 	at java.util.concurrent.FutureTask.get(FutureTask.java:191) ~[?:1.8.0_172]
   [junit4]   2> 	at org.apache.solr.cloud.autoscaling.sim.SimCloudManager.request(SimCloudManager.java:654) ~[test/:?]
   [junit4]   2> 	at org.apache.solr.cloud.autoscaling.ExecutePlanAction.process(ExecutePlanAction.java:80) ~[java/:?]
   [junit4]   2> 	at org.apache.solr.cloud.autoscaling.ScheduledTriggers.lambda$null$3(ScheduledTriggers.java:324) ~[java/:?]
   [junit4]   2> 	... 6 more
   [junit4]   2> 1849830 DEBUG (AutoscalingActionExecutor-7857-thread-1) [    ] o.a.s.c.a.ScheduledTriggers -- processing took 127582 ms for event id=1c2e5d7980c84Teph9eueyjzqd0gm13nxszxfwe
   [junit4]   2> 1849830 DEBUG (TEST-TestSimExtremeIndexing.testScaleUp-seed#[6F003D6F2C9463E5]) [    ] o.a.s.c.a.ScheduledTriggers Awaiting termination for scheduled thread pool executor
   [junit4]   2> 1849830 DEBUG (TEST-TestSimExtremeIndexing.testScaleUp-seed#[6F003D6F2C9463E5]) [    ] o.a.s.c.a.ScheduledTriggers ScheduledTriggers closed completely
   [junit4]   2> 1849830 DEBUG (TEST-TestSimExtremeIndexing.testScaleUp-seed#[6F003D6F2C9463E5]) [    ] o.a.s.c.a.OverseerTriggerThread OverseerTriggerThread has been closed explicitly
   [junit4]   2> 1849831 INFO  (TEST-TestSimExtremeIndexing.testScaleUp-seed#[6F003D6F2C9463E5]) [    ] o.a.s.SolrTestCaseJ4 ###Ending testScaleUp
   [junit4]   2> NOTE: reproduce with: ant test  -Dtestcase=TestSimExtremeIndexing -Dtests.method=testScaleUp -Dtests.seed=6F003D6F2C9463E5 -Dtests.slow=true -Dtests.locale=it -Dtests.timezone=Asia/Krasnoyarsk -Dtests.asserts=true -Dtests.file.encoding=UTF-8
   [junit4] FAILURE 4.72s J0 | TestSimExtremeIndexing.testScaleUp <<<
   [junit4]    > Throwable #1: java.lang.AssertionError: {numFound=973000000,start=0,docs=[]} expected:<1000000000> but was:<973000000>
   [junit4]    > 	at __randomizedtesting.SeedInfo.seed([6F003D6F2C9463E5:4E5E7BCD20BABD44]:0)
   [junit4]    > 	at org.apache.solr.cloud.autoscaling.sim.TestSimExtremeIndexing.testScaleUp(TestSimExtremeIndexing.java:135)
   [junit4]    > 	at java.lang.Thread.run(Thread.java:748)
   [junit4]   2> NOTE: leaving temporary files on disk at: C:\Users\jenkins\workspace\Lucene-Solr-master-Windows\solr\build\solr-core\test\J0\temp\solr.cloud.autoscaling.sim.TestSimExtremeIndexing_6F003D6F2C9463E5-001
   [junit4]   2> NOTE: test params are: codec=FastDecompressionCompressingStoredFields(storedFieldsFormat=CompressingStoredFieldsFormat(compressionMode=FAST_DECOMPRESSION, chunkSize=14662, maxDocsPerChunk=921, blockSize=2), termVectorsFormat=CompressingTermVectorsFormat(compressionMode=FAST_DECOMPRESSION, chunkSize=14662, blockSize=2)), sim=Asserting(org.apache.lucene.search.similarities.AssertingSimilarity@12abe21), locale=it, timezone=Asia/Krasnoyarsk
   [junit4]   2> NOTE: Windows 10 10.0 x86/Oracle Corporation 1.8.0_172 (32-bit)/cpus=3,threads=1,free=172926472,total=536870912
   [junit4]   2> NOTE: All tests run in this JVM: [PeerSyncWithLeaderAndIndexFingerprintCachingTest, TestRealTimeGet, TestReplicationHandlerBackup, TestGeoJSONResponseWriter, TestIntervalFaceting, TestSubQueryTransformerCrossCore, TestDownShardTolerantSearch, TestInitParams, TestRandomFaceting, SolrInfoBeanTest, TestSimComputePlanAction, TestCloudPhrasesIdentificationComponent, TestPivotHelperCode, ExitableDirectoryReaderTest, TestHashPartitioner, TestNestedDocsSort, TestSegmentSorting, AnalysisAfterCoreReloadTest, CreateCollectionCleanupTest, MoveReplicaTest, TestSimNodeLostTrigger, TestLMJelinekMercerSimilarityFactory, RegexBoostProcessorTest, TestManagedSchemaThreadSafety, UnloadDistributedZkTest, TestConfigSets, QueryParsingTest, TestQuerySenderNoQuery, TestMultiValuedNumericRangeQuery, OpenCloseCoreStressTest, RecoveryZkTest, SOLR749Test, OverseerTaskQueueTest, ReplaceNodeNoTargetTest, CdcrRequestHandlerTest, TestCloudSchemaless, OpenExchangeRatesOrgProviderTest, SolrMetricsIntegrationTest, BooleanFieldTest, TestFieldTypeResource, TestSimTriggerIntegration, TestGraphTermsQParserPlugin, ZkShardTermsTest, DeleteNodeTest, HdfsBasicDistributedZk2Test, CustomCollectionTest, TestTrie, TestCSVResponseWriter, SortByFunctionTest, TestPhraseSuggestions, DateMathParserTest, NodeLostTriggerIntegrationTest, TestDistribIDF, TestJsonFacetsStatsParsing, TestValueSourceCache, OverseerRolesTest, TestBadConfig, TestRestoreCore, TestReversedWildcardFilterFactory, DocExpirationUpdateProcessorFactoryTest, TestSolrConfigHandlerConcurrent, ShardRoutingTest, TestGroupingSearch, CollectionPropsTest, JsonLoaderTest, StatelessScriptUpdateProcessorFactoryTest, TestDistributedSearch, PreAnalyzedFieldManagedSchemaCloudTest, MetricTriggerIntegrationTest, TestDeprecatedFilters, SolrCloudReportersTest, SuggestComponentContextFilterQueryTest, UniqFieldsUpdateProcessorFactoryTest, TestPostingsSolrHighlighter, OverseerCollectionConfigSetProcessorTest, TestPayloadScoreQParserPlugin, ChaosMonkeySafeLeaderWithPullReplicasTest, TestJavabinTupleStreamParser, TestUpdate, CoreSorterTest, TestFastOutputStream, TestCloudJSONFacetJoinDomain, UUIDFieldTest, IgnoreCommitOptimizeUpdateProcessorFactoryTest, BinaryUpdateRequestHandlerTest, TestDistributedGrouping, SolrCmdDistributorTest, TestFieldSortValues, TestSchemaResource, DebugComponentTest, TriggerSetPropertiesIntegrationTest, ScheduledMaintenanceTriggerTest, TaggingAttributeTest, TestCloudPseudoReturnFields, TestCustomStream, OutOfBoxZkACLAndCredentialsProvidersTest, SearchRateTriggerTest, SpellCheckCollatorWithCollapseTest, DistributedQueryElevationComponentTest, TestSimDistributedQueue, TestPullReplicaErrorHandling, TestSolrFieldCacheBean, CopyFieldTest, RootFieldTest, TestClusterProperties, TestExpandComponent, DistributedSuggestComponentTest, PrimitiveFieldTypeTest, TestStressUserVersions, TestLegacyField, HttpTriggerListenerTest, SimpleFacetsTest, TestConfigSetsAPIExclusivity, TestRestManager, TestScoreJoinQPScore, ClassificationUpdateProcessorTest, HighlighterMaxOffsetTest, EchoParamsTest, TestMacros, BlockJoinFacetRandomTest, SortSpecParsingTest, DistributedQueryComponentCustomSortTest, AssignTest, RuleEngineTest, CollectionsAPIDistributedZkTest, OrderedExecutorTest, TestIBSimilarityFactory, TestAddFieldRealTimeGet, DistribCursorPagingTest, ZkCLITest, TestDocTermOrds, MBeansHandlerTest, TestComplexPhraseLeadingWildcard, DisMaxRequestHandlerTest, DocValuesTest, TestDynamicLoading, TestLazyCores, TokenizerChainTest, BasicZkTest, TestSolrXml, TestMiniSolrCloudClusterSSL, SuggesterWFSTTest, TestExactStatsCache, TestCollationFieldDocValues, TestSolr4Spatial2, TestWithCollection, TestHdfsBackupRestoreCore, HttpPartitionTest, TestLegacyNumericRangeQueryBuilder, RequestHandlersTest, TestLegacyFieldCache, TestPushWriter, ReplicationFactorTest, TestDistribDocBasedVersion, TestSolrCoreProperties, TestSolrCloudWithDelegationTokens, WrapperMergePolicyFactoryTest, TestSolrCloudWithSecureImpersonation, BasicDistributedZk2Test, TestComponentsName, TestDFISimilarityFactory, IndexBasedSpellCheckerTest, Tagger2Test, TestTlogReplica, TestDocSet, TestStressRecovery, AddReplicaTest, CachingDirectoryFactoryTest, PKIAuthenticationIntegrationTest, UpdateLogTest, TestNonDefinedSimilarityFactory, OutputWriterTest, NodeMarkersRegistrationTest, NotRequiredUniqueKeyTest, HLLUtilTest, AlternateDirectoryTest, URLClassifyProcessorTest, BJQParserTest, AtomicUpdateProcessorFactoryTest, TestSimExtremeIndexing]
   [junit4] Completed [403/837 (1!)] on J0 in 4.87s, 1 test, 1 failure <<< FAILURES!

[...truncated 46609 lines...]
[repro] Jenkins log URL: https://jenkins.thetaphi.de/job/Lucene-Solr-master-Windows/7696/consoleText

[repro] Revision: b7f99fe55a6fb6e7b38828676750b3512d6899a1

[repro] Ant options: "-Dargs=-server -XX:+UseG1GC"

[repro] ant clean

[...truncated 6 lines...]
[repro] Test suites by module:
[repro]    solr\core
[repro]       TestSimExtremeIndexing
[repro] ant compile-test

[...truncated 3612 lines...]
[repro] ant test-nocompile -Dtests.dups=5 -Dtests.maxfailures=5 -Dtests.class="*.TestSimExtremeIndexing" -Dtests.showOutput=onerror "-Dargs=-server -XX:+UseG1GC" -Dtests.seed=6F003D6F2C9463E5 -Dtests.slow=true -Dtests.locale=it -Dtests.timezone=Asia/Krasnoyarsk -Dtests.asserts=true -Dtests.file.encoding=UTF-8

[...truncated 68 lines...]
[repro] Failures:
[repro]   0/5 failed: org.apache.solr.cloud.autoscaling.sim.TestSimExtremeIndexing
[repro] Exiting with code 0

[...truncated 75 lines...]

Mime
View raw message