lucene-dev mailing list archives

Site index · List index
Message view « Date » · « Thread »
Top « Date » · « Thread »
From Policeman Jenkins Server <jenk...@thetaphi.de>
Subject [JENKINS] Lucene-Solr-7.x-Windows (64bit/jdk1.8.0_172) - Build # 947 - Unstable!
Date Tue, 08 Jan 2019 08:38:30 GMT
Build: https://jenkins.thetaphi.de/job/Lucene-Solr-7.x-Windows/947/
Java: 64bit/jdk1.8.0_172 -XX:+UseCompressedOops -XX:+UseParallelGC

3 tests failed.
FAILED:  org.apache.solr.cloud.autoscaling.sim.TestSimTriggerIntegration.testNodeLostTriggerRestoreState

Error Message:
The trigger did not fire at all

Stack Trace:
java.lang.AssertionError: The trigger did not fire at all
	at __randomizedtesting.SeedInfo.seed([3FBB6C55D2E91506:1444B90E489100D6]:0)
	at org.junit.Assert.fail(Assert.java:88)
	at org.junit.Assert.assertTrue(Assert.java:41)
	at org.apache.solr.cloud.autoscaling.sim.TestSimTriggerIntegration.testNodeLostTriggerRestoreState(TestSimTriggerIntegration.java:332)
	at sun.reflect.NativeMethodAccessorImpl.invoke0(Native Method)
	at sun.reflect.NativeMethodAccessorImpl.invoke(NativeMethodAccessorImpl.java:62)
	at sun.reflect.DelegatingMethodAccessorImpl.invoke(DelegatingMethodAccessorImpl.java:43)
	at java.lang.reflect.Method.invoke(Method.java:498)
	at com.carrotsearch.randomizedtesting.RandomizedRunner.invoke(RandomizedRunner.java:1750)
	at com.carrotsearch.randomizedtesting.RandomizedRunner$8.evaluate(RandomizedRunner.java:938)
	at com.carrotsearch.randomizedtesting.RandomizedRunner$9.evaluate(RandomizedRunner.java:974)
	at com.carrotsearch.randomizedtesting.RandomizedRunner$10.evaluate(RandomizedRunner.java:988)
	at com.carrotsearch.randomizedtesting.rules.SystemPropertiesRestoreRule$1.evaluate(SystemPropertiesRestoreRule.java:57)
	at org.apache.lucene.util.TestRuleSetupTeardownChained$1.evaluate(TestRuleSetupTeardownChained.java:49)
	at org.apache.lucene.util.AbstractBeforeAfterRule$1.evaluate(AbstractBeforeAfterRule.java:45)
	at org.apache.lucene.util.TestRuleThreadAndTestName$1.evaluate(TestRuleThreadAndTestName.java:48)
	at org.apache.lucene.util.TestRuleIgnoreAfterMaxFailures$1.evaluate(TestRuleIgnoreAfterMaxFailures.java:64)
	at org.apache.lucene.util.TestRuleMarkFailure$1.evaluate(TestRuleMarkFailure.java:47)
	at com.carrotsearch.randomizedtesting.rules.StatementAdapter.evaluate(StatementAdapter.java:36)
	at com.carrotsearch.randomizedtesting.ThreadLeakControl$StatementRunner.run(ThreadLeakControl.java:368)
	at com.carrotsearch.randomizedtesting.ThreadLeakControl.forkTimeoutingTask(ThreadLeakControl.java:817)
	at com.carrotsearch.randomizedtesting.ThreadLeakControl$3.evaluate(ThreadLeakControl.java:468)
	at com.carrotsearch.randomizedtesting.RandomizedRunner.runSingleTest(RandomizedRunner.java:947)
	at com.carrotsearch.randomizedtesting.RandomizedRunner$5.evaluate(RandomizedRunner.java:832)
	at com.carrotsearch.randomizedtesting.RandomizedRunner$6.evaluate(RandomizedRunner.java:883)
	at com.carrotsearch.randomizedtesting.RandomizedRunner$7.evaluate(RandomizedRunner.java:894)
	at com.carrotsearch.randomizedtesting.rules.StatementAdapter.evaluate(StatementAdapter.java:36)
	at com.carrotsearch.randomizedtesting.rules.SystemPropertiesRestoreRule$1.evaluate(SystemPropertiesRestoreRule.java:57)
	at org.apache.lucene.util.AbstractBeforeAfterRule$1.evaluate(AbstractBeforeAfterRule.java:45)
	at com.carrotsearch.randomizedtesting.rules.StatementAdapter.evaluate(StatementAdapter.java:36)
	at org.apache.lucene.util.TestRuleStoreClassName$1.evaluate(TestRuleStoreClassName.java:41)
	at com.carrotsearch.randomizedtesting.rules.NoShadowingOrOverridesOnMethodsRule$1.evaluate(NoShadowingOrOverridesOnMethodsRule.java:40)
	at com.carrotsearch.randomizedtesting.rules.NoShadowingOrOverridesOnMethodsRule$1.evaluate(NoShadowingOrOverridesOnMethodsRule.java:40)
	at com.carrotsearch.randomizedtesting.rules.StatementAdapter.evaluate(StatementAdapter.java:36)
	at com.carrotsearch.randomizedtesting.rules.StatementAdapter.evaluate(StatementAdapter.java:36)
	at com.carrotsearch.randomizedtesting.rules.StatementAdapter.evaluate(StatementAdapter.java:36)
	at org.apache.lucene.util.TestRuleAssertionsRequired$1.evaluate(TestRuleAssertionsRequired.java:53)
	at org.apache.lucene.util.TestRuleMarkFailure$1.evaluate(TestRuleMarkFailure.java:47)
	at org.apache.lucene.util.TestRuleIgnoreAfterMaxFailures$1.evaluate(TestRuleIgnoreAfterMaxFailures.java:64)
	at org.apache.lucene.util.TestRuleIgnoreTestSuites$1.evaluate(TestRuleIgnoreTestSuites.java:54)
	at com.carrotsearch.randomizedtesting.rules.StatementAdapter.evaluate(StatementAdapter.java:36)
	at com.carrotsearch.randomizedtesting.ThreadLeakControl$StatementRunner.run(ThreadLeakControl.java:368)
	at java.lang.Thread.run(Thread.java:748)


FAILED:  org.apache.solr.cloud.autoscaling.sim.TestSimTriggerIntegration.testCooldown

Error Message:
The trigger did not fire at all

Stack Trace:
java.lang.AssertionError: The trigger did not fire at all
	at __randomizedtesting.SeedInfo.seed([3FBB6C55D2E91506:E0501B1AC4360F4]:0)
	at org.junit.Assert.fail(Assert.java:88)
	at org.junit.Assert.assertTrue(Assert.java:41)
	at org.apache.solr.cloud.autoscaling.sim.TestSimTriggerIntegration.testCooldown(TestSimTriggerIntegration.java:1149)
	at sun.reflect.NativeMethodAccessorImpl.invoke0(Native Method)
	at sun.reflect.NativeMethodAccessorImpl.invoke(NativeMethodAccessorImpl.java:62)
	at sun.reflect.DelegatingMethodAccessorImpl.invoke(DelegatingMethodAccessorImpl.java:43)
	at java.lang.reflect.Method.invoke(Method.java:498)
	at com.carrotsearch.randomizedtesting.RandomizedRunner.invoke(RandomizedRunner.java:1750)
	at com.carrotsearch.randomizedtesting.RandomizedRunner$8.evaluate(RandomizedRunner.java:938)
	at com.carrotsearch.randomizedtesting.RandomizedRunner$9.evaluate(RandomizedRunner.java:974)
	at com.carrotsearch.randomizedtesting.RandomizedRunner$10.evaluate(RandomizedRunner.java:988)
	at com.carrotsearch.randomizedtesting.rules.SystemPropertiesRestoreRule$1.evaluate(SystemPropertiesRestoreRule.java:57)
	at org.apache.lucene.util.TestRuleSetupTeardownChained$1.evaluate(TestRuleSetupTeardownChained.java:49)
	at org.apache.lucene.util.AbstractBeforeAfterRule$1.evaluate(AbstractBeforeAfterRule.java:45)
	at org.apache.lucene.util.TestRuleThreadAndTestName$1.evaluate(TestRuleThreadAndTestName.java:48)
	at org.apache.lucene.util.TestRuleIgnoreAfterMaxFailures$1.evaluate(TestRuleIgnoreAfterMaxFailures.java:64)
	at org.apache.lucene.util.TestRuleMarkFailure$1.evaluate(TestRuleMarkFailure.java:47)
	at com.carrotsearch.randomizedtesting.rules.StatementAdapter.evaluate(StatementAdapter.java:36)
	at com.carrotsearch.randomizedtesting.ThreadLeakControl$StatementRunner.run(ThreadLeakControl.java:368)
	at com.carrotsearch.randomizedtesting.ThreadLeakControl.forkTimeoutingTask(ThreadLeakControl.java:817)
	at com.carrotsearch.randomizedtesting.ThreadLeakControl$3.evaluate(ThreadLeakControl.java:468)
	at com.carrotsearch.randomizedtesting.RandomizedRunner.runSingleTest(RandomizedRunner.java:947)
	at com.carrotsearch.randomizedtesting.RandomizedRunner$5.evaluate(RandomizedRunner.java:832)
	at com.carrotsearch.randomizedtesting.RandomizedRunner$6.evaluate(RandomizedRunner.java:883)
	at com.carrotsearch.randomizedtesting.RandomizedRunner$7.evaluate(RandomizedRunner.java:894)
	at com.carrotsearch.randomizedtesting.rules.StatementAdapter.evaluate(StatementAdapter.java:36)
	at com.carrotsearch.randomizedtesting.rules.SystemPropertiesRestoreRule$1.evaluate(SystemPropertiesRestoreRule.java:57)
	at org.apache.lucene.util.AbstractBeforeAfterRule$1.evaluate(AbstractBeforeAfterRule.java:45)
	at com.carrotsearch.randomizedtesting.rules.StatementAdapter.evaluate(StatementAdapter.java:36)
	at org.apache.lucene.util.TestRuleStoreClassName$1.evaluate(TestRuleStoreClassName.java:41)
	at com.carrotsearch.randomizedtesting.rules.NoShadowingOrOverridesOnMethodsRule$1.evaluate(NoShadowingOrOverridesOnMethodsRule.java:40)
	at com.carrotsearch.randomizedtesting.rules.NoShadowingOrOverridesOnMethodsRule$1.evaluate(NoShadowingOrOverridesOnMethodsRule.java:40)
	at com.carrotsearch.randomizedtesting.rules.StatementAdapter.evaluate(StatementAdapter.java:36)
	at com.carrotsearch.randomizedtesting.rules.StatementAdapter.evaluate(StatementAdapter.java:36)
	at com.carrotsearch.randomizedtesting.rules.StatementAdapter.evaluate(StatementAdapter.java:36)
	at org.apache.lucene.util.TestRuleAssertionsRequired$1.evaluate(TestRuleAssertionsRequired.java:53)
	at org.apache.lucene.util.TestRuleMarkFailure$1.evaluate(TestRuleMarkFailure.java:47)
	at org.apache.lucene.util.TestRuleIgnoreAfterMaxFailures$1.evaluate(TestRuleIgnoreAfterMaxFailures.java:64)
	at org.apache.lucene.util.TestRuleIgnoreTestSuites$1.evaluate(TestRuleIgnoreTestSuites.java:54)
	at com.carrotsearch.randomizedtesting.rules.StatementAdapter.evaluate(StatementAdapter.java:36)
	at com.carrotsearch.randomizedtesting.ThreadLeakControl$StatementRunner.run(ThreadLeakControl.java:368)
	at java.lang.Thread.run(Thread.java:748)


FAILED:  org.apache.solr.cloud.autoscaling.sim.TestSimTriggerIntegration.testNodeMarkersRegistration

Error Message:
Path /autoscaling/nodeAdded/127.0.0.1:10077_solr should have been deleted

Stack Trace:
java.lang.AssertionError: Path /autoscaling/nodeAdded/127.0.0.1:10077_solr should have been deleted
	at __randomizedtesting.SeedInfo.seed([3FBB6C55D2E91506:2701E459DCDCD8E9]:0)
	at org.junit.Assert.fail(Assert.java:88)
	at org.junit.Assert.assertTrue(Assert.java:41)
	at org.junit.Assert.assertFalse(Assert.java:64)
	at org.apache.solr.cloud.autoscaling.sim.TestSimTriggerIntegration.testNodeMarkersRegistration(TestSimTriggerIntegration.java:892)
	at sun.reflect.NativeMethodAccessorImpl.invoke0(Native Method)
	at sun.reflect.NativeMethodAccessorImpl.invoke(NativeMethodAccessorImpl.java:62)
	at sun.reflect.DelegatingMethodAccessorImpl.invoke(DelegatingMethodAccessorImpl.java:43)
	at java.lang.reflect.Method.invoke(Method.java:498)
	at com.carrotsearch.randomizedtesting.RandomizedRunner.invoke(RandomizedRunner.java:1750)
	at com.carrotsearch.randomizedtesting.RandomizedRunner$8.evaluate(RandomizedRunner.java:938)
	at com.carrotsearch.randomizedtesting.RandomizedRunner$9.evaluate(RandomizedRunner.java:974)
	at com.carrotsearch.randomizedtesting.RandomizedRunner$10.evaluate(RandomizedRunner.java:988)
	at com.carrotsearch.randomizedtesting.rules.SystemPropertiesRestoreRule$1.evaluate(SystemPropertiesRestoreRule.java:57)
	at org.apache.lucene.util.TestRuleSetupTeardownChained$1.evaluate(TestRuleSetupTeardownChained.java:49)
	at org.apache.lucene.util.AbstractBeforeAfterRule$1.evaluate(AbstractBeforeAfterRule.java:45)
	at org.apache.lucene.util.TestRuleThreadAndTestName$1.evaluate(TestRuleThreadAndTestName.java:48)
	at org.apache.lucene.util.TestRuleIgnoreAfterMaxFailures$1.evaluate(TestRuleIgnoreAfterMaxFailures.java:64)
	at org.apache.lucene.util.TestRuleMarkFailure$1.evaluate(TestRuleMarkFailure.java:47)
	at com.carrotsearch.randomizedtesting.rules.StatementAdapter.evaluate(StatementAdapter.java:36)
	at com.carrotsearch.randomizedtesting.ThreadLeakControl$StatementRunner.run(ThreadLeakControl.java:368)
	at com.carrotsearch.randomizedtesting.ThreadLeakControl.forkTimeoutingTask(ThreadLeakControl.java:817)
	at com.carrotsearch.randomizedtesting.ThreadLeakControl$3.evaluate(ThreadLeakControl.java:468)
	at com.carrotsearch.randomizedtesting.RandomizedRunner.runSingleTest(RandomizedRunner.java:947)
	at com.carrotsearch.randomizedtesting.RandomizedRunner$5.evaluate(RandomizedRunner.java:832)
	at com.carrotsearch.randomizedtesting.RandomizedRunner$6.evaluate(RandomizedRunner.java:883)
	at com.carrotsearch.randomizedtesting.RandomizedRunner$7.evaluate(RandomizedRunner.java:894)
	at com.carrotsearch.randomizedtesting.rules.StatementAdapter.evaluate(StatementAdapter.java:36)
	at com.carrotsearch.randomizedtesting.rules.SystemPropertiesRestoreRule$1.evaluate(SystemPropertiesRestoreRule.java:57)
	at org.apache.lucene.util.AbstractBeforeAfterRule$1.evaluate(AbstractBeforeAfterRule.java:45)
	at com.carrotsearch.randomizedtesting.rules.StatementAdapter.evaluate(StatementAdapter.java:36)
	at org.apache.lucene.util.TestRuleStoreClassName$1.evaluate(TestRuleStoreClassName.java:41)
	at com.carrotsearch.randomizedtesting.rules.NoShadowingOrOverridesOnMethodsRule$1.evaluate(NoShadowingOrOverridesOnMethodsRule.java:40)
	at com.carrotsearch.randomizedtesting.rules.NoShadowingOrOverridesOnMethodsRule$1.evaluate(NoShadowingOrOverridesOnMethodsRule.java:40)
	at com.carrotsearch.randomizedtesting.rules.StatementAdapter.evaluate(StatementAdapter.java:36)
	at com.carrotsearch.randomizedtesting.rules.StatementAdapter.evaluate(StatementAdapter.java:36)
	at com.carrotsearch.randomizedtesting.rules.StatementAdapter.evaluate(StatementAdapter.java:36)
	at org.apache.lucene.util.TestRuleAssertionsRequired$1.evaluate(TestRuleAssertionsRequired.java:53)
	at org.apache.lucene.util.TestRuleMarkFailure$1.evaluate(TestRuleMarkFailure.java:47)
	at org.apache.lucene.util.TestRuleIgnoreAfterMaxFailures$1.evaluate(TestRuleIgnoreAfterMaxFailures.java:64)
	at org.apache.lucene.util.TestRuleIgnoreTestSuites$1.evaluate(TestRuleIgnoreTestSuites.java:54)
	at com.carrotsearch.randomizedtesting.rules.StatementAdapter.evaluate(StatementAdapter.java:36)
	at com.carrotsearch.randomizedtesting.ThreadLeakControl$StatementRunner.run(ThreadLeakControl.java:368)
	at java.lang.Thread.run(Thread.java:748)




Build Log:
[...truncated 12593 lines...]
   [junit4] Suite: org.apache.solr.cloud.autoscaling.sim.TestSimTriggerIntegration
   [junit4]   2> 9950 INFO  (SUITE-TestSimTriggerIntegration-seed#[3FBB6C55D2E91506]-worker) [    ] o.a.s.SolrTestCaseJ4 SecureRandom sanity checks: test.solr.allowed.securerandom=null & java.security.egd=file:/dev/./urandom
   [junit4]   2> Creating dataDir: C:\Users\jenkins\workspace\Lucene-Solr-7.x-Windows\solr\build\solr-core\test\J0\temp\solr.cloud.autoscaling.sim.TestSimTriggerIntegration_3FBB6C55D2E91506-001\init-core-data-001
   [junit4]   2> 10207 INFO  (SUITE-TestSimTriggerIntegration-seed#[3FBB6C55D2E91506]-worker) [    ] o.a.s.SolrTestCaseJ4 Using PointFields (NUMERIC_POINTS_SYSPROP=true) w/NUMERIC_DOCVALUES_SYSPROP=false
   [junit4]   2> 10316 INFO  (SUITE-TestSimTriggerIntegration-seed#[3FBB6C55D2E91506]-worker) [    ] o.e.j.u.log Logging initialized @9921ms to org.eclipse.jetty.util.log.Slf4jLog
   [junit4]   2> 10332 INFO  (SUITE-TestSimTriggerIntegration-seed#[3FBB6C55D2E91506]-worker) [    ] o.a.s.SolrTestCaseJ4 Randomized ssl (true) and clientAuth (false) via: @org.apache.solr.util.RandomizeSSL(reason=, value=NaN, ssl=NaN, clientAuth=NaN)
   [junit4] IGNOR/A 0.01s J0 | TestSimTriggerIntegration.testCooldown
   [junit4]    > Assumption #1: 'badapple' test group is disabled (@BadApple(bugUrl=https://issues.apache.org/jira/browse/SOLR-12028))
   [junit4] IGNOR/A 0.00s J0 | TestSimTriggerIntegration.testEventFromRestoredState
   [junit4]    > Assumption #1: 'badapple' test group is disabled (@BadApple(bugUrl=https://issues.apache.org/jira/browse/SOLR-12028))
   [junit4] IGNOR/A 0.00s J0 | TestSimTriggerIntegration.testNodeLostTrigger
   [junit4]    > Assumption #1: 'awaitsfix' test group is disabled (@AwaitsFix(bugUrl=https://issues.apache.org/jira/browse/SOLR-12028))
   [junit4] IGNOR/A 0.00s J0 | TestSimTriggerIntegration.testSearchRate
   [junit4]    > Assumption #1: 'awaitsfix' test group is disabled (@AwaitsFix(bugUrl=https://issues.apache.org/jira/browse/SOLR-12028))
   [junit4] IGNOR/A 0.00s J0 | TestSimTriggerIntegration.testTriggerThrottling
   [junit4]    > Assumption #1: 'badapple' test group is disabled (@BadApple(bugUrl=https://issues.apache.org/jira/browse/SOLR-12028))
   [junit4] IGNOR/A 0.00s J0 | TestSimTriggerIntegration.testListeners
   [junit4]    > Assumption #1: 'badapple' test group is disabled (@BadApple(bugUrl=https://issues.apache.org/jira/browse/SOLR-12028))
   [junit4]   2> 10906 INFO  (TEST-TestSimTriggerIntegration.testNodeLostTriggerRestoreState-seed#[3FBB6C55D2E91506]) [    ] o.a.s.SolrTestCaseJ4 ###Starting testNodeLostTriggerRestoreState
   [junit4]   2> 11068 INFO  (TEST-TestSimTriggerIntegration.testNodeLostTriggerRestoreState-seed#[3FBB6C55D2E91506]) [    ] o.a.s.c.SolrResourceLoader solr home defaulted to 'solr/' (could not find system property or JNDI)
   [junit4]   2> 11546 DEBUG (TEST-TestSimTriggerIntegration.testNodeLostTriggerRestoreState-seed#[3FBB6C55D2E91506]) [    ] o.a.s.c.a.s.SimClusterStateProvider --- new Overseer leader: 127.0.0.1:10000_solr
   [junit4]   2> 11553 DEBUG (Simulated OverseerAutoScalingTriggerThread) [    ] o.a.s.c.a.OverseerTriggerThread Adding .auto_add_replicas and .scheduled_maintenance triggers
   [junit4]   2> 11558 DEBUG (Simulated OverseerAutoScalingTriggerThread) [    ] o.a.s.c.a.OverseerTriggerThread Refreshing /autoscaling.json with znode version 1
   [junit4]   2> 11614 DEBUG (TEST-TestSimTriggerIntegration.testNodeLostTriggerRestoreState-seed#[3FBB6C55D2E91506]) [    ] o.a.s.c.a.s.SimClusterStateProvider ** creating new collection states, currentVersion=0
   [junit4]   2> 11619 DEBUG (TEST-TestSimTriggerIntegration.testNodeLostTriggerRestoreState-seed#[3FBB6C55D2E91506]) [    ] o.a.s.c.a.s.SimClusterStateProvider ** saved cluster state version 0
   [junit4]   2> 11619 INFO  (TEST-TestSimTriggerIntegration.testNodeLostTriggerRestoreState-seed#[3FBB6C55D2E91506]) [    ] o.a.s.h.a.MetricsHistoryHandler No .system collection, keeping metrics history in memory.
   [junit4]   2> 11982 DEBUG (simCloudManagerPool-2-thread-2) [    ] o.a.s.c.a.AutoScalingHandler Verified autoscaling configuration
   [junit4]   2> 12053 DEBUG (Simulated OverseerAutoScalingTriggerThread) [    ] o.a.s.c.a.OverseerTriggerThread Current znodeVersion 1, lastZnodeVersion 0
   [junit4]   2> 12053 DEBUG (Simulated OverseerAutoScalingTriggerThread) [    ] o.a.s.c.a.OverseerTriggerThread Processed trigger updates upto znodeVersion 1
   [junit4]   2> 12059 DEBUG (simCloudManagerPool-2-thread-2) [    ] o.a.s.c.a.OverseerTriggerThread Refreshing /autoscaling.json with znode version 2
   [junit4]   2> 12072 DEBUG (simCloudManagerPool-2-thread-3) [    ] o.a.s.c.a.AutoScalingHandler Verified autoscaling configuration
   [junit4]   2> 12073 DEBUG (simCloudManagerPool-2-thread-3) [    ] o.a.s.c.a.OverseerTriggerThread Refreshing /autoscaling.json with znode version 3
   [junit4]   2> 12078 DEBUG (TEST-TestSimTriggerIntegration.testNodeLostTriggerRestoreState-seed#[3FBB6C55D2E91506]) [    ] o.a.s.c.a.s.SimClusterStateProvider  -- created marker: /autoscaling/nodeLost/127.0.0.1:10002_solr
   [junit4]   2> 12081 DEBUG (Simulated OverseerAutoScalingTriggerThread) [    ] o.a.s.c.a.NodeLostTrigger NodeLostTrigger .auto_add_replicas - Initial livenodes: [127.0.0.1:10001_solr, 127.0.0.1:10000_solr]
   [junit4]   2> 12083 DEBUG (Simulated OverseerAutoScalingTriggerThread) [    ] o.a.s.c.a.NodeLostTrigger Adding lost node from marker path: 127.0.0.1:10002_solr
   [junit4]   2> 12083 DEBUG (Simulated OverseerAutoScalingTriggerThread) [    ] o.a.s.c.a.OverseerTriggerThread -- cleaning old nodeLost / nodeAdded markers
   [junit4]   2> 12083 DEBUG (Simulated OverseerAutoScalingTriggerThread) [    ] o.a.s.c.a.OverseerTriggerThread Current znodeVersion 3, lastZnodeVersion 1
   [junit4]   2> 12083 DEBUG (Simulated OverseerAutoScalingTriggerThread) [    ] o.a.s.c.a.OverseerTriggerThread Processed trigger updates upto znodeVersion 3
   [junit4]   2> 12086 INFO  (Simulated OverseerAutoScalingTriggerThread) [    ] o.a.s.c.a.s.TestSimTriggerIntegration TestTriggerAction init
   [junit4]   2> 12086 DEBUG (Simulated OverseerAutoScalingTriggerThread) [    ] o.a.s.c.a.NodeLostTrigger NodeLostTrigger node_lost_restore_trigger - Initial livenodes: [127.0.0.1:10001_solr, 127.0.0.1:10000_solr]
   [junit4]   2> 12086 DEBUG (Simulated OverseerAutoScalingTriggerThread) [    ] o.a.s.c.a.OverseerTriggerThread -- cleaning old nodeLost / nodeAdded markers
   [junit4]   2> 12086 DEBUG (Simulated OverseerAutoScalingTriggerThread) [    ] o.a.s.c.a.OverseerTriggerThread Current znodeVersion 3, lastZnodeVersion 3
   [junit4]   2> 12089 DEBUG (ScheduledTrigger-3-thread-2) [    ] o.a.s.c.a.NodeLostTrigger Running NodeLostTrigger: .auto_add_replicas with currently live nodes: 2 and last live nodes: 2
   [junit4]   2> 12091 DEBUG (ScheduledTrigger-3-thread-3) [    ] o.a.s.c.a.NodeLostTrigger Running NodeLostTrigger: node_lost_restore_trigger with currently live nodes: 2 and last live nodes: 2
   [junit4]   2> 12086 WARN  (ScheduledTrigger-3-thread-1) [    ] o.a.s.c.a.TriggerEventQueue Exception peeking queue of trigger .scheduled_maintenance
   [junit4]   2> java.lang.InterruptedException: null
   [junit4]   2> 	at java.util.concurrent.locks.AbstractQueuedSynchronizer.acquireInterruptibly(AbstractQueuedSynchronizer.java:1220) ~[?:1.8.0_172]
   [junit4]   2> 	at java.util.concurrent.locks.ReentrantLock.lockInterruptibly(ReentrantLock.java:335) ~[?:1.8.0_172]
   [junit4]   2> 	at org.apache.solr.cloud.autoscaling.sim.GenericDistributedQueue.firstChild(GenericDistributedQueue.java:380) ~[test/:?]
   [junit4]   2> 	at org.apache.solr.cloud.autoscaling.sim.GenericDistributedQueue.firstElement(GenericDistributedQueue.java:515) ~[test/:?]
   [junit4]   2> 	at org.apache.solr.cloud.autoscaling.sim.GenericDistributedQueue.peek(GenericDistributedQueue.java:152) ~[test/:?]
   [junit4]   2> 	at org.apache.solr.cloud.autoscaling.TriggerEventQueue.peekEvent(TriggerEventQueue.java:69) [java/:?]
   [junit4]   2> 	at org.apache.solr.cloud.autoscaling.ScheduledTriggers$TriggerWrapper.run(ScheduledTriggers.java:598) [java/:?]
   [junit4]   2> 	at java.util.concurrent.Executors$RunnableAdapter.call(Executors.java:511) [?:1.8.0_172]
   [junit4]   2> 	at java.util.concurrent.FutureTask.runAndReset(FutureTask.java:308) [?:1.8.0_172]
   [junit4]   2> 	at java.util.concurrent.ScheduledThreadPoolExecutor$ScheduledFutureTask.access$301(ScheduledThreadPoolExecutor.java:180) [?:1.8.0_172]
   [junit4]   2> 	at java.util.concurrent.ScheduledThreadPoolExecutor$ScheduledFutureTask.run(ScheduledThreadPoolExecutor.java:294) [?:1.8.0_172]
   [junit4]   2> 	at java.util.concurrent.ThreadPoolExecutor.runWorker(ThreadPoolExecutor.java:1149) [?:1.8.0_172]
   [junit4]   2> 	at java.util.concurrent.ThreadPoolExecutor$Worker.run(ThreadPoolExecutor.java:624) [?:1.8.0_172]
   [junit4]   2> 	at java.lang.Thread.run(Thread.java:748) [?:1.8.0_172]
   [junit4]   2> 12099 DEBUG (ScheduledTrigger-3-thread-1) [    ] o.a.s.c.a.ScheduledTrigger ScheduledTrigger ran but was already closed
   [junit4]   2> 12109 DEBUG (simCloudManagerPool-2-thread-4) [    ] o.a.s.c.a.AutoScalingHandler Verified autoscaling configuration
   [junit4]   2> 12111 DEBUG (simCloudManagerPool-2-thread-4) [    ] o.a.s.c.a.OverseerTriggerThread Refreshing /autoscaling.json with znode version 4
   [junit4]   2> 12112 DEBUG (Simulated OverseerAutoScalingTriggerThread) [    ] o.a.s.c.a.OverseerTriggerThread Processed trigger updates upto znodeVersion 4
   [junit4]   2> 12112 INFO  (Simulated OverseerAutoScalingTriggerThread) [    ] o.a.s.c.a.s.TestSimTriggerIntegration TestTriggerAction init
   [junit4]   2> 12112 DEBUG (Simulated OverseerAutoScalingTriggerThread) [    ] o.a.s.c.a.NodeLostTrigger NodeLostTrigger node_lost_restore_trigger - Initial livenodes: [127.0.0.1:10001_solr, 127.0.0.1:10000_solr]
   [junit4]   2> 12112 DEBUG (Simulated OverseerAutoScalingTriggerThread) [    ] o.a.s.c.a.OverseerTriggerThread -- cleaning old nodeLost / nodeAdded markers
   [junit4]   2> 12112 DEBUG (ScheduledTrigger-3-thread-2) [    ] o.a.s.c.a.NodeLostTrigger Running NodeLostTrigger: .auto_add_replicas with currently live nodes: 2 and last live nodes: 2
   [junit4]   2> 12112 DEBUG (ScheduledTrigger-3-thread-3) [    ] o.a.s.c.a.NodeLostTrigger Running NodeLostTrigger: node_lost_restore_trigger with currently live nodes: 2 and last live nodes: 2
   [junit4]   2> 12112 DEBUG (Simulated OverseerAutoScalingTriggerThread) [    ] o.a.s.c.a.OverseerTriggerThread Current znodeVersion 4, lastZnodeVersion 4
   [junit4]   2> 12135 DEBUG (ScheduledTrigger-3-thread-2) [    ] o.a.s.c.a.NodeLostTrigger Running NodeLostTrigger: .auto_add_replicas with currently live nodes: 2 and last live nodes: 2
   [junit4]   2> 12135 DEBUG (ScheduledTrigger-3-thread-1) [    ] o.a.s.c.a.NodeLostTrigger Running NodeLostTrigger: node_lost_restore_trigger with currently live nodes: 2 and last live nodes: 2
   [junit4]   2> 12155 DEBUG (ScheduledTrigger-3-thread-2) [    ] o.a.s.c.a.NodeLostTrigger Running NodeLostTrigger: .auto_add_replicas with currently live nodes: 2 and last live nodes: 2
   [junit4]   2> 12155 DEBUG (ScheduledTrigger-3-thread-2) [    ] o.a.s.c.a.NodeLostTrigger Running NodeLostTrigger: node_lost_restore_trigger with currently live nodes: 2 and last live nodes: 2
   [junit4]   2> 12177 DEBUG (ScheduledTrigger-3-thread-3) [    ] o.a.s.c.a.NodeLostTrigger Running NodeLostTrigger: node_lost_restore_trigger with currently live nodes: 2 and last live nodes: 2
   [junit4]   2> 12177 DEBUG (ScheduledTrigger-3-thread-4) [    ] o.a.s.c.a.NodeLostTrigger Running NodeLostTrigger: .auto_add_replicas with currently live nodes: 2 and last live nodes: 2
   [junit4]   2> 12198 DEBUG (ScheduledTrigger-3-thread-2) [    ] o.a.s.c.a.NodeLostTrigger Running NodeLostTrigger: .auto_add_replicas with currently live nodes: 2 and last live nodes: 2
   [junit4]   2> 12198 DEBUG (ScheduledTrigger-3-thread-3) [    ] o.a.s.c.a.NodeLostTrigger Running NodeLostTrigger: node_lost_restore_trigger with currently live nodes: 2 and last live nodes: 2
   [junit4]   2> 12219 DEBUG (ScheduledTrigger-3-thread-3) [    ] o.a.s.c.a.NodeLostTrigger Running NodeLostTrigger: node_lost_restore_trigger with currently live nodes: 2 and last live nodes: 2
   [junit4]   2> 12219 DEBUG (ScheduledTrigger-3-thread-4) [    ] o.a.s.c.a.NodeLostTrigger Running NodeLostTrigger: .auto_add_replicas with currently live nodes: 2 and last live nodes: 2
   [junit4]   2> 12240 DEBUG (ScheduledTrigger-3-thread-2) [    ] o.a.s.c.a.NodeLostTrigger Running NodeLostTrigger: .auto_add_replicas with currently live nodes: 2 and last live nodes: 2
   [junit4]   2> 12240 DEBUG (ScheduledTrigger-3-thread-1) [    ] o.a.s.c.a.NodeLostTrigger Running NodeLostTrigger: node_lost_restore_trigger with currently live nodes: 2 and last live nodes: 2
   [junit4]   2> 12261 DEBUG (ScheduledTrigger-3-thread-2) [    ] o.a.s.c.a.NodeLostTrigger Running NodeLostTrigger: .auto_add_replicas with currently live nodes: 2 and last live nodes: 2
   [junit4]   2> 12261 DEBUG (ScheduledTrigger-3-thread-4) [    ] o.a.s.c.a.NodeLostTrigger Running NodeLostTrigger: node_lost_restore_trigger with currently live nodes: 2 and last live nodes: 2
   [junit4]   2> 12283 DEBUG (ScheduledTrigger-3-thread-2) [    ] o.a.s.c.a.NodeLostTrigger Running NodeLostTrigger: .auto_add_replicas with currently live nodes: 2 and last live nodes: 2
   [junit4]   2> 12283 DEBUG (ScheduledTrigger-3-thread-3) [    ] o.a.s.c.a.NodeLostTrigger Running NodeLostTrigger: node_lost_restore_trigger with currently live nodes: 2 and last live nodes: 2
   [junit4]   2> 12308 DEBUG (ScheduledTrigger-3-thread-3) [    ] o.a.s.c.a.NodeLostTrigger Running NodeLostTrigger: node_lost_restore_trigger with currently live nodes: 2 and last live nodes: 2
   [junit4]   2> 12308 DEBUG (ScheduledTrigger-3-thread-4) [    ] o.a.s.c.a.NodeLostTrigger Running NodeLostTrigger: .auto_add_replicas with currently live nodes: 2 and last live nodes: 2
   [junit4]   2> 12328 DEBUG (ScheduledTrigger-3-thread-2) [    ] o.a.s.c.a.NodeLostTrigger Running NodeLostTrigger: .auto_add_replicas with currently live nodes: 2 and last live nodes: 2
   [junit4]   2> 12328 DEBUG (ScheduledTrigger-3-thread-4) [    ] o.a.s.c.a.NodeLostTrigger Running NodeLostTrigger: node_lost_restore_trigger with currently live nodes: 2 and last live nodes: 2
   [junit4]   2> 12350 DEBUG (ScheduledTrigger-3-thread-4) [    ] o.a.s.c.a.NodeLostTrigger Running NodeLostTrigger: .auto_add_replicas with currently live nodes: 2 and last live nodes: 2
   [junit4]   2> 12351 DEBUG (ScheduledTrigger-3-thread-4) [    ] o.a.s.c.a.NodeLostTrigger Running NodeLostTrigger: node_lost_restore_trigger with currently live nodes: 2 and last live nodes: 2
   [junit4]   2> 12371 DEBUG (ScheduledTrigger-3-thread-4) [    ] o.a.s.c.a.NodeLostTrigger Running NodeLostTrigger: .auto_add_replicas with currently live nodes: 2 and last live nodes: 2
   [junit4]   2> 12371 DEBUG (ScheduledTrigger-3-thread-4) [    ] o.a.s.c.a.NodeLostTrigger Running NodeLostTrigger: node_lost_restore_trigger with currently live nodes: 2 and last live nodes: 2
   [junit4]   2> 12392 DEBUG (ScheduledTrigger-3-thread-2) [    ] o.a.s.c.a.NodeLostTrigger Running NodeLostTrigger: .auto_add_replicas with currently live nodes: 2 and last live nodes: 2
   [junit4]   2> 12392 DEBUG (ScheduledTrigger-3-thread-2) [    ] o.a.s.c.a.NodeLostTrigger Running NodeLostTrigger: node_lost_restore_trigger with currently live nodes: 2 and last live nodes: 2
   [junit4]   2> 12427 DEBUG (ScheduledTrigger-3-thread-2) [    ] o.a.s.c.a.NodeLostTrigger Running NodeLostTrigger: .auto_add_replicas with currently live nodes: 2 and last live nodes: 2
   [junit4]   2> 12427 DEBUG (ScheduledTrigger-3-thread-2) [    ] o.a.s.c.a.NodeLostTrigger Running NodeLostTrigger: node_lost_restore_trigger with currently live nodes: 2 and last live nodes: 2
   [junit4]   2> 12458 DEBUG (ScheduledTrigger-3-thread-2) [    ] o.a.s.c.a.NodeLostTrigger Running NodeLostTrigger: .auto_add_replicas with currently live nodes: 2 and last live nodes: 2
   [junit4]   2> 12458 DEBUG (ScheduledTrigger-3-thread-2) [    ] o.a.s.c.a.NodeLostTrigger Running NodeLostTrigger: node_lost_restore_trigger with currently live nodes: 2 and last live nodes: 2
   [junit4]   2> 12480 DEBUG (ScheduledTrigger-3-thread-4) [    ] o.a.s.c.a.NodeLostTrigger Running NodeLostTrigger: .auto_add_replicas with currently live nodes: 2 and last live nodes: 2
   [junit4]   2> 12480 DEBUG (ScheduledTrigger-3-thread-4) [    ] o.a.s.c.a.NodeLostTrigger Running NodeLostTrigger: node_lost_restore_trigger with currently live nodes: 2 and last live nodes: 2
   [junit4]   2> 12500 DEBUG (ScheduledTrigger-3-thread-3) [    ] o.a.s.c.a.NodeLostTrigger Running NodeLostTrigger: node_lost_restore_trigger with currently live nodes: 2 and last live nodes: 2
   [junit4]   2> 12501 DEBUG (ScheduledTrigger-3-thread-2) [    ] o.a.s.c.a.NodeLostTrigger Running NodeLostTrigger: .auto_add_replicas with currently live nodes: 2 and last live nodes: 2
   [junit4]   2> 12521 DEBUG (ScheduledTrigger-3-thread-3) [    ] o.a.s.c.a.NodeLostTrigger Running NodeLostTrigger: node_lost_restore_trigger with currently live nodes: 2 and last live nodes: 2
   [junit4]   2> 12521 DEBUG (ScheduledTrigger-3-thread-3) [    ] o.a.s.c.a.NodeLostTrigger Running NodeLostTrigger: .auto_add_replicas with currently live nodes: 2 and last live nodes: 2
   [junit4]   2> 12542 DEBUG (ScheduledTrigger-3-thread-2) [    ] o.a.s.c.a.NodeLostTrigger Running NodeLostTrigger: .auto_add_replicas with currently live nodes: 2 and last live nodes: 2
   [junit4]   2> 12542 DEBUG (ScheduledTrigger-3-thread-3) [    ] o.a.s.c.a.NodeLostTrigger Running NodeLostTrigger: node_lost_restore_trigger with currently live nodes: 2 and last live nodes: 2
   [junit4]   2> 12563 DEBUG (ScheduledTrigger-3-thread-2) [    ] o.a.s.c.a.NodeLostTrigger Running NodeLostTrigger: .auto_add_replicas with currently live nodes: 2 and last live nodes: 2
   [junit4]   2> 12563 DEBUG (ScheduledTrigger-3-thread-2) [    ] o.a.s.c.a.NodeLostTrigger Running NodeLostTrigger: node_lost_restore_trigger with currently live nodes: 2 and last live nodes: 2
   [junit4]   2> 12584 DEBUG (ScheduledTrigger-3-thread-2) [    ] o.a.s.c.a.NodeLostTrigger Running NodeLostTrigger: .auto_add_replicas with currently live nodes: 2 and last live nodes: 2
   [junit4]   2> 12584 DEBUG (ScheduledTrigger-3-thread-2) [    ] o.a.s.c.a.NodeLostTrigger Running NodeLostTrigger: node_lost_restore_trigger with currently live nodes: 2 and last live nodes: 2
   [junit4]   2> 12605 DEBUG (ScheduledTrigger-3-thread-2) [    ] o.a.s.c.a.NodeLostTrigger Running NodeLostTrigger: .auto_add_replicas with currently live nodes: 2 and last live nodes: 2
   [junit4]   2> 12605 DEBUG (ScheduledTrigger-3-thread-4) [    ] o.a.s.c.a.NodeLostTrigger Running NodeLostTrigger: node_lost_restore_trigger with currently live nodes: 2 and last live nodes: 2
   [junit4]   2> 12625 DEBUG (ScheduledTrigger-3-thread-1) [    ] o.a.s.c.a.NodeLostTrigger Running NodeLostTrigger: .auto_add_replicas with currently live nodes: 2 and last live nodes: 2
   [junit4]   2> 12625 DEBUG (ScheduledTrigger-3-thread-4) [    ] o.a.s.c.a.NodeLostTrigger Running NodeLostTrigger: node_lost_restore_trigger with currently live nodes: 2 and last live nodes: 2
   [junit4]   2> 12647 DEBUG (ScheduledTrigger-3-thread-1) [    ] o.a.s.c.a.NodeLostTrigger Running NodeLostTrigger: .auto_add_replicas with currently live nodes: 2 and last live nodes: 2
   [junit4]   2> 12647 DEBUG (ScheduledTrigger-3-thread-2) [    ] o.a.s.c.a.NodeLostTrigger Running NodeLostTrigger: node_lost_restore_trigger with currently live nodes: 2 and last live nodes: 2
   [junit4]   2> 12667 DEBUG (ScheduledTrigger-3-thread-4) [    ] o.a.s.c.a.NodeLostTrigger Running NodeLostTrigger: .auto_add_replicas with currently live nodes: 2 and last live nodes: 2
   [junit4]   2> 12667 DEBUG (ScheduledTrigger-3-thread-2) [    ] o.a.s.c.a.NodeLostTrigger Running NodeLostTrigger: node_lost_restore_trigger with currently live nodes: 2 and last live nodes: 2
   [junit4]   2> 12688 DEBUG (ScheduledTrigger-3-thread-3) [    ] o.a.s.c.a.NodeLostTrigger Running NodeLostTrigger: node_lost_restore_trigger with currently live nodes: 2 and last live nodes: 2
   [junit4]   2> 12688 DEBUG (ScheduledTrigger-3-thread-4) [    ] o.a.s.c.a.NodeLostTrigger Running NodeLostTrigger: .auto_add_replicas with currently live nodes: 2 and last live nodes: 2
   [junit4]   2> 12709 DEBUG (ScheduledTrigger-3-thread-2) [    ] o.a.s.c.a.NodeLostTrigger Running NodeLostTrigger: .auto_add_replicas with currently live nodes: 2 and last live nodes: 2
   [junit4]   2> 12709 DEBUG (ScheduledTrigger-3-thread-3) [    ] o.a.s.c.a.NodeLostTrigger Running NodeLostTrigger: node_lost_restore_trigger with currently live nodes: 2 and last live nodes: 2
   [junit4]   2> 12730 DEBUG (ScheduledTrigger-3-thread-4) [    ] o.a.s.c.a.NodeLostTrigger Running NodeLostTrigger: .auto_add_replicas with currently live nodes: 2 and last live nodes: 2
   [junit4]   2> 12730 DEBUG (ScheduledTrigger-3-thread-3) [    ] o.a.s.c.a.NodeLostTrigger Running NodeLostTrigger: node_lost_restore_trigger with currently live nodes: 2 and last live nodes: 2
   [junit4]   2> 12751 DEBUG (ScheduledTrigger-3-thread-3) [    ] o.a.s.c.a.NodeLostTrigger Running NodeLostTrigger: node_lost_restore_trigger with currently live nodes: 2 and last live nodes: 2
   [junit4]   2> 12751 DEBUG (ScheduledTrigger-3-thread-3) [    ] o.a.s.c.a.NodeLostTrigger Running NodeLostTrigger: .auto_add_replicas with currently live nodes: 2 and last live nodes: 2
   [junit4]   2> 12772 DEBUG (ScheduledTrigger-3-thread-3) [    ] o.a.s.c.a.NodeLostTrigger Running NodeLostTrigger: node_lost_restore_trigger with currently live nodes: 2 and last live nodes: 2
   [junit4]   2> 12772 DEBUG (ScheduledTrigger-3-thread-1) [    ] o.a.s.c.a.NodeLostTrigger Running NodeLostTrigger: .auto_add_replicas with currently live nodes: 2 and last live nodes: 2
   [junit4]   2> 12793 DEBUG (ScheduledTrigger-3-thread-3) [    ] o.a.s.c.a.NodeLostTrigger Running NodeLostTrigger: node_lost_restore_trigger with currently live nodes: 2 and last live nodes: 2
   [junit4]   2> 12793 DEBUG (ScheduledTrigger-3-thread-2) [    ] o.a.s.c.a.NodeLostTrigger Running NodeLostTrigger: .auto_add_replicas with currently live nodes: 2 and last live nodes: 2
   [junit4]   2> 12814 DEBUG (ScheduledTrigger-3-thread-3) [    ] o.a.s.c.a.NodeLostTrigger Running NodeLostTrigger: node_lost_restore_trigger with currently live nodes: 2 and last live nodes: 2
   [junit4]   2> 12815 DEBUG (ScheduledTrigger-3-thread-3) [    ] o.a.s.c.a.NodeLostTrigger Running NodeLostTrigger: .auto_add_replicas with currently live nodes: 2 and last live nodes: 2
   [junit4]   2> 12835 DEBUG (ScheduledTrigger-3-thread-3) [    ] o.a.s.c.a.NodeLostTrigger Running NodeLostTrigger: node_lost_restore_trigger with currently live nodes: 2 and last live nodes: 2
   [junit4]   2> 12838 DEBUG (ScheduledTrigger-3-thread-2) [    ] o.a.s.c.a.NodeLostTrigger Running NodeLostTrigger: .auto_add_replicas with currently live nodes: 2 and last live nodes: 2
   [junit4]   2> 12856 DEBUG (ScheduledTrigger-3-thread-2) [    ] o.a.s.c.a.NodeLostTrigger Running NodeLostTrigger: node_lost_restore_trigger with currently live nodes: 2 and last live nodes: 2
   [junit4]   2> 12859 DEBUG (ScheduledTrigger-3-thread-1) [    ] o.a.s.c.a.NodeLostTrigger Running NodeLostTrigger: .auto_add_replicas with currently live nodes: 2 and last live nodes: 2
   [junit4]   2> 12877 DEBUG (ScheduledTrigger-3-thread-1) [    ] o.a.s.c.a.NodeLostTrigger Running NodeLostTrigger: node_lost_restore_trigger with currently live nodes: 2 and last live nodes: 2
   [junit4]   2> 12880 DEBUG (ScheduledTrigger-3-thread-1) [    ] o.a.s.c.a.NodeLostTrigger Running NodeLostTrigger: .auto_add_replicas with currently live nodes: 2 and last live nodes: 2
   [junit4]   2> 12900 DEBUG (ScheduledTrigger-3-thread-2) [    ] o.a.s.c.a.NodeLostTrigger Running NodeLostTrigger: node_lost_restore_trigger with currently live nodes: 2 and last live nodes: 2
   [junit4]   2> 12901 DEBUG (ScheduledTrigger-3-thread-3) [    ] o.a.s.c.a.NodeLostTrigger Running NodeLostTrigger: .auto_add_replicas with currently live nodes: 2 and last live nodes: 2
   [junit4]   2> 12939 DEBUG (ScheduledTrigger-3-thread-3) [    ] o.a.s.c.a.NodeLostTrigger Running NodeLostTrigger: .auto_add_replicas with currently live nodes: 2 and last live nodes: 2
   [junit4]   2> 12939 DEBUG (ScheduledTrigger-3-thread-3) [    ] o.a.s.c.a.NodeLostTrigger Running NodeLostTrigger: node_lost_restore_trigger with currently live nodes: 2 and last live nodes: 2
   [junit4]   2> 12961 DEBUG (ScheduledTrigger-3-thread-2) [    ] o.a.s.c.a.NodeLostTrigger Running NodeLostTrigger: node_lost_restore_trigger with currently live nodes: 2 and last live nodes: 2
   [junit4]   2> 12961 DEBUG (ScheduledTrigger-3-thread-3) [    ] o.a.s.c.a.NodeLostTrigger Running NodeLostTrigger: .auto_add_replicas with currently live nodes: 2 and last live nodes: 2
   [junit4]   2> 12985 DEBUG (ScheduledTrigger-3-thread-2) [    ] o.a.s.c.a.NodeLostTrigger Running NodeLostTrigger: node_lost_restore_trigger with currently live nodes: 2 and last live nodes: 2
   [junit4]   2> 12985 DEBUG (ScheduledTrigger-3-thread-2) [    ] o.a.s.c.a.NodeLostTrigger Running NodeLostTrigger: .auto_add_replicas with currently live nodes: 2 and last live nodes: 2
   [junit4]   2> 13006 DEBUG (ScheduledTrigger-3-thread-2) [    ] o.a.s.c.a.NodeLostTrigger Running NodeLostTrigger: node_lost_restore_trigger with currently live nodes: 2 and last live nodes: 2
   [junit4]   2> 13006 DEBUG (ScheduledTrigger-3-thread-1) [    ] o.a.s.c.a.NodeLostTrigger Running NodeLostTrigger: .auto_add_replicas with currently live nodes: 2 and last live nodes: 2
   [junit4]   2> 13027 DEBUG (ScheduledTrigger-3-thread-2) [    ] o.a.s.c.a.NodeLostTrigger Running NodeLostTrigger: node_lost_restore_trigger with currently live nodes: 2 and last live nodes: 2
   [junit4]   2> 13027 DEBUG (ScheduledTrigger-3-thread-3) [    ] o.a.s.c.a.NodeLostTrigger Running NodeLostTrigger: .auto_add_replicas with currently live nodes: 2 and last live nodes: 2
   [junit4]   2> 13048 DEBUG (ScheduledTrigger-3-thread-4) [    ] o.a.s.c.a.NodeLostTrigger Running NodeLostTrigger: .auto_add_replicas with currently live nodes: 2 and last live nodes: 2
   [junit4]   2> 13048 DEBUG (ScheduledTrigger-3-thread-2) [    ] o.a.s.c.a.NodeLostTrigger Running NodeLostTrigger: node_lost_restore_trigger with currently live nodes: 2 and last live nodes: 2
   [junit4]   2> 13069 DEBUG (ScheduledTrigger-3-thread-1) [    ] o.a.s.c.a.NodeLostTrigger Running NodeLostTrigger: node_lost_restore_trigger with currently live nodes: 2 and last live nodes: 2
   [junit4]   2> 13069 DEBUG (ScheduledTrigger-3-thread-4) [    ] o.a.s.c.a.NodeLostTrigger Running NodeLostTrigger: .auto_add_replicas with currently live nodes: 2 and last live nodes: 2
   [junit4]   2> 13089 DEBUG (ScheduledTrigger-3-thread-4) [    ] o.a.s.c.a.NodeLostTrigger Running NodeLostTrigger: .auto_add_replicas with currently live nodes: 2 and last live nodes: 2
   [junit4]   2> 13089 DEBUG (ScheduledTrigger-3-thread-2) [    ] o.a.s.c.a.NodeLostTrigger Running NodeLostTrigger: node_lost_restore_trigger with currently live nodes: 2 and last live nodes: 2
   [junit4]   2> 13110 DEBUG (ScheduledTrigger-3-thread-4) [    ] o.a.s.c.a.NodeLostTrigger Running NodeLostTrigger: .auto_add_replicas with currently live nodes: 2 and last live nodes: 2
   [junit4]   2> 13110 DEBUG (ScheduledTrigger-3-thread-3) [    ] o.a.s.c.a.NodeLostTrigger Running NodeLostTrigger: node_lost_restore_trigger with currently live nodes: 2 and last live nodes: 2
   [junit4]   2> 13130 DEBUG (ScheduledTrigger-3-thread-2) [    ] o.a.s.c.a.NodeLostTrigger Running NodeLostTrigger: node_lost_restore_trigger with currently live nodes: 2 and last live nodes: 2
   [junit4]   2> 13130 DEBUG (ScheduledTrigger-3-thread-4) [    ] o.a.s.c.a.NodeLostTrigger Running NodeLostTrigger: .auto_add_replicas with currently live nodes: 2 and last live nodes: 2
   [junit4]   2> 13151 DEBUG (ScheduledTrigger-3-thread-2) [    ] o.a.s.c.a.NodeLostTrigger Running NodeLostTrigger: node_lost_restore_trigger with currently live nodes: 2 and last live nodes: 2
   [junit4]   2> 13151 DEBUG (ScheduledTrigger-3-thread-3) [    ] o.a.s.c.a.NodeLostTrigger Running NodeLostTrigger: .auto_add_replicas with currently live nodes: 2 and last live nodes: 2
   [junit4]   2> 13172 DEBUG (ScheduledTrigger-3-thread-4) [    ] o.a.s.c.a.NodeLostTrigger Running NodeLostTrigger: .auto_add_replicas with currently live nodes: 2 and last live nodes: 2
   [junit4]   2> 13172 DEBUG (ScheduledTrigger-3-thread-2) [    ] o.a.s.c.a.NodeLostTrigger Running NodeLostTrigger: node_lost_restore_trigger with currently live nodes: 2 and last live nodes: 2
   [junit4]   2> 13194 DEBUG (ScheduledTrigger-3-thread-4) [    ] o.a.s.c.a.NodeLostTrigger Running NodeLostTrigger: .auto_add_replicas with currently live nodes: 2 and last live nodes: 2
   [junit4]   2> 13194 DEBUG (ScheduledTrigger-3-thread-3) [    ] o.a.s.c.a.NodeLostTrigger Running NodeLostTrigger: node_lost_restore_trigger with currently live nodes: 2 and last live nodes: 2
   [junit4]   2> 13214 DEBUG (ScheduledTrigger-3-thread-4) [    ] o.a.s.c.a.NodeLostTrigger Running NodeLostTrigger: .auto_add_replicas with currently live nodes: 2 and last live nodes: 2
   [junit4]   2> 13214 DEBUG (ScheduledTrigger-3-thread-2) [    ] o.a.s.c.a.NodeLostTrigger Running NodeLostTrigger: node_lost_restore_trigger with currently live nodes: 2 and last live nodes: 2
   [junit4]   2> 13235 DEBUG (ScheduledTrigger-3-thread-3) [    ] o.a.s.c.a.NodeLostTrigger Running NodeLostTrigger: node_lost_restore_trigger with currently live nodes: 2 and last live nodes: 2
   [junit4]   2> 13235 DEBUG (ScheduledTrigger-3-thread-4) [    ] o.a.s.c.a.NodeLostTrigger Running NodeLostTrigger: .auto_add_replicas with currently live nodes: 2 and last live nodes: 2
   [junit4]   2> 13257 DEBUG (ScheduledTrigger-3-thread-2) [    ] o.a.s.c.a.NodeLostTrigger Running NodeLostTrigger: .auto_add_replicas with currently live nodes: 2 and last live nodes: 2
   [junit4]   2> 13257 DEBUG (ScheduledTrigger-3-thread-3) [    ] o.a.s.c.a.NodeLostTrigger Running NodeLostTrigger: node_lost_restore_trigger with currently live nodes: 2 and last live nodes: 2
   [junit4]   2> 13278 DEBUG (ScheduledTrigger-3-thread-2) [    ] o.a.s.c.a.NodeLostTrigger Running NodeLostTrigger: .auto_add_replicas with currently live nodes: 2 and last live nodes: 2
   [junit4]   2> 13278 DEBUG (ScheduledTrigger-3-thread-1) [    ] o.a.s.c.a.NodeLostTrigger Running NodeLostTrigger: node_lost_restore_trigger with currently live nodes: 2 and last live nodes: 2
   [junit4]   2> 13300 DEBUG (ScheduledTrigger-3-thread-2) [    ] o.a.s.c.a.NodeLostTrigger Running NodeLostTrigger: .auto_add_replicas with currently live nodes: 2 and last live nodes: 2
   [junit4]   2> 13300 DEBUG (ScheduledTrigger-3-thread-4) [    ] o.a.s.c.a.NodeLostTrigger Running NodeLostTrigger: node_lost_restore_trigger with currently live nodes: 2 and last live nodes: 2
   [junit4]   2> 13321 DEBUG (ScheduledTrigger-3-thread-1) [    ] o.a.s.c.a.NodeLostTrigger Running NodeLostTrigger: node_lost_restore_trigger with currently live nodes: 2 and last live nodes: 2
   [junit4]   2> 13321 DEBUG (ScheduledTrigger-3-thread-2) [    ] o.a.s.c.a.NodeLostTrigger Running NodeLostTrigger: .auto_add_replicas with currently live nodes: 2 and last live nodes: 2
   [junit4]   2> 13343 DEBUG (ScheduledTrigger-3-thread-1) [    ] o.a.s.c.a.NodeLostTrigger Running NodeLostTrigger: node_lost_restore_trigger with currently live nodes: 2 and last live nodes: 2
   [junit4]   2> 13343 DEBUG (ScheduledTrigger-3-thread-4) [    ] o.a.s.c.a.NodeLostTrigger Running NodeLostTrigger: .auto_add_replicas with currently live nodes: 2 and last live nodes: 2
   [junit4]   2> 13364 DEBUG (ScheduledTrigger-3-thread-2) [    ] o.a.s.c.a.NodeLostTrigger Running NodeLostTrigger: .auto_add_replicas with currently live nodes: 2 and last live nodes: 2
   [junit4]   2> 13364 DEBUG (ScheduledTrigger-3-thread-1) [    ] o.a.s.c.a.NodeLostTrigger Running NodeLostTrigger: node_lost_restore_trigger with currently live nodes: 2 and last live nodes: 2
   [junit4]   2> 13385 DEBUG (ScheduledTrigger-3-thread-2) [    ] o.a.s.c.a.NodeLostTrigger Running NodeLostTrigger: .auto_add_replicas with currently live nodes: 2 and last live nodes: 2
   [junit4]   2> 13385 DEBUG (ScheduledTrigger-3-thread-3) [    ] o.a.s.c.a.NodeLostTrigger Running NodeLostTrigger: node_lost_restore_trigger with currently live nodes: 2 and last live nodes: 2
   [junit4]   2> 13406 DEBUG (ScheduledTrigger-3-thread-1) [    ] o.a.s.c.a.NodeLostTrigger Running NodeLostTrigger: .auto_add_replicas with currently live nodes: 2 and last live nodes: 2
   [junit4]   2> 13406 DEBUG (ScheduledTrigger-3-thread-4) [    ] o.a.s.c.a.NodeLostTrigger Running NodeLostTrigger: node_lost_restore_trigger with currently live nodes: 2 and last live nodes: 2
   [junit4]   2> 13428 DEBUG (ScheduledTrigger-3-thread-4) [    ] o.a.s.c.a.NodeLostTrigger Running NodeLostTrigger: node_lost_restore_trigger with currently live nodes: 2 and last live nodes: 2
   [junit4]   2> 13428 DEBUG (ScheduledTrigger-3-thread-3) [    ] o.a.s.c.a.NodeLostTrigger Running NodeLostTrigger: .auto_add_replicas with currently live nodes: 2 and last live nodes: 2
   [junit4]   2> 13449 DEBUG (ScheduledTrigger-3-thread-2) [    ] o.a.s.c.a.NodeLostTrigger Running NodeLostTrigger: .auto_add_replicas with currently live nodes: 2 and last live nodes: 2
   [junit4]   2> 13449 DEBUG (ScheduledTrigger-3-thread-4) [    ] o.a.s.c.a.NodeLostTrigger Running NodeLostTrigger: node_lost_restore_trigger with currently live nodes: 2 and last live nodes: 2
   [junit4]   2> 13470 DEBUG (ScheduledTrigger-3-thread-4) [    ] o.a.s.c.a.NodeLostTrigger Running NodeLostTrigger: node_lost_restore_trigger with currently live nodes: 2 and last live nodes: 2
   [junit4]   2> 13470 DEBUG (ScheduledTrigger-3-thread-1) [    ] o.a.s.c.a.NodeLostTrigger Running NodeLostTrigger: .auto_add_replicas with currently live nodes: 2 and last live nodes: 2
   [junit4]   2> 13491 DEBUG (ScheduledTrigger-3-thread-2) [    ] o.a.s.c.a.NodeLostTrigger Running NodeLostTrigger: node_lost_restore_trigger with currently live nodes: 2 and last live nodes: 2
   [junit4]   2> 13491 DEBUG (ScheduledTrigger-3-thread-3) [    ] o.a.s.c.a.NodeLostTrigger Running NodeLostTrigger: .auto_add_replicas with currently live nodes: 2 and last live nodes: 2
   [junit4]   2> 13512 DEBUG (ScheduledTrigger-3-thread-3) [    ] o.a.s.c.a.NodeLostTrigger Running NodeLostTrigger: .auto_add_replicas with currently live nodes: 2 and last live nodes: 2
   [junit4]   2> 13512 DEBUG (ScheduledTrigger-3-thread-3) [    ] o.a.s.c.a.NodeLostTrigger Running NodeLostTrigger: node_lost_restore_trigger with currently live nodes: 2 and last live nodes: 2
   [junit4]   2> 13534 DEBUG (ScheduledTrigger-3-thread-1) [    ] o.a.s.c.a.NodeLostTrigger Running NodeLostTrigger: node_lost_restore_trigger with currently live nodes: 2 and last live nodes: 2
   [junit4]   2> 13534 DEBUG (ScheduledTrigger-3-thread-3) [    ] o.a.s.c.a.NodeLostTrigger Running NodeLostTrigger: .auto_add_replicas with currently live nodes: 2 and last live nodes: 2
   [junit4]   2> 13555 DEBUG (ScheduledTrigger-3-thread-3) [    ] o.a.s.c.a.NodeLostTrigger Running NodeLostTrigger: node_lost_restore_trigger with currently live nodes: 2 and last live nodes: 2
   [junit4]   2> 13555 DEBUG (ScheduledTrigger-3-thread-2) [    ] o.a.s.c.a.NodeLostTrigger Running NodeLostTrigger: .auto_add_replicas with currently live nodes: 2 and last live nodes: 2
   [junit4]   2> 13576 DEBUG (ScheduledTrigger-3-thread-2) [    ] o.a.s.c.a.NodeLostTrigger Running NodeLostTrigger: .auto_add_replicas with currently live nodes: 2 and last live nodes: 2
   [junit4]   2> 13576 DEBUG (ScheduledTrigger-3-thread-1) [    ] o.a.s.c.a.NodeLostTrigger Running NodeLostTrigger: node_lost_restore_trigger with currently live nodes: 2 and last live nodes: 2
   [junit4]   2> 13598 DEBUG (ScheduledTrigger-3-thread-4) [    ] o.a.s.c.a.NodeLostTrigger Running NodeLostTrigger: .auto_add_replicas with currently live nodes: 2 and last live nodes: 2
   [junit4]   2> 13598 DEBUG (ScheduledTrigger-3-thread-1) [    ] o.a.s.c.a.NodeLostTrigger Running NodeLostTrigger: node_lost_restore_trigger with currently live nodes: 2 and last live nodes: 2
   [junit4]   2> 13619 DEBUG (ScheduledTrigger-3-thread-1) [    ] o.a.s.c.a.NodeLostTrigger Running NodeLostTrigger: node_lost_restore_trigger with currently live nodes: 2 and last live nodes: 2
   [junit4]   2> 13619 DEBUG (ScheduledTrigger-3-thread-3) [    ] o.a.s.c.a.NodeLostTrigger Running NodeLostTrigger: .auto_add_replicas with currently live nodes: 2 and last live nodes: 2
   [junit4]   2> 13640 DEBUG (ScheduledTrigger-3-thread-4) [    ] o.a.s.c.a.NodeLostTrigger Running NodeLostTrigger: .auto_add_replicas with currently live nodes: 2 and last live nodes: 2
   [junit4]   2> 13640 DEBUG (ScheduledTrigger-3-thread-1) [    ] o.a.s.c.a.NodeLostTrigger Running NodeLostTrigger: node_lost_restore_trigger with currently live nodes: 2 and last live nodes: 2
   [junit4]   2> 13661 DEBUG (ScheduledTrigger-3-thread-4) [    ] o.a.s.c.a.NodeLostTrigger Running NodeLostTrigger: .auto_add_replicas with currently live nodes: 2 and last live nodes: 2
   [junit4]   2> 13661 DEBUG (ScheduledTrigger-3-thread-4) [    ] o.a.s.c.a.NodeLostTrigger Running NodeLostTrigger: node_lost_restore_trigger with currently live nodes: 2 and last live nodes: 2
   [junit4]   2> 13681 DEBUG (ScheduledTrigger-3-thread-1) [    ] o.a.s.c.a.NodeLostTrigger Running NodeLostTrigger: node_lost_restore_trigger with currently live nodes: 2 and last live nodes: 2
   [junit4]   2> 13681 DEBUG (ScheduledTrigger-3-thread-4) [    ] o.a.s.c.a.NodeLostTrigger Running NodeLostTrigger: .auto_add_replicas with currently live nodes: 2 and last live nodes: 2
   [junit4]   2> 13702 DEBUG (ScheduledTrigger-3-thread-1) [    ] o.a.s.c.a.NodeLostTrigger Running NodeLostTrigger: node_lost_restore_trigger with currently live nodes: 2 and last live nodes: 2
   [junit4]   2> 13702 DEBUG (ScheduledTrigger-3-thread-2) [    ] o.a.s.c.a.NodeLostTrigger Running NodeLostTrigger: .auto_add_replicas with currently live nodes: 2 and last live nodes: 2
   [junit4]   2> 13722 DEBUG (ScheduledTrigger-3-thread-3) [    ] o.a.s.c.a.NodeLostTrigger Running NodeLostTrigger: node_lost_restore_trigger with currently live nodes: 2 and last live nodes: 2
   [junit4]   2> 13722 DEBUG (ScheduledTrigger-3-thread-2) [    ] o.a.s.c.a.NodeLostTrigger Running NodeLostTrigger: .auto_add_replicas with currently live nodes: 2 and last live nodes: 2
   [junit4]   2> 13744 DEBUG (ScheduledTrigger-3-thread-3) [    ] o.a.s.c.a.NodeLostTrigger Running NodeLostTrigger: node_lost_restore_trigger with currently live nodes: 2 and last live nodes: 2
   [junit4]   2> 13744 DEBUG (ScheduledTrigger-3-thread-4) [    ] o.a.s.c.a.NodeLostTrigger Running NodeLostTrigger: .auto_add_replicas with currently live nodes: 2 and last live nodes: 2
   [junit4]   2> 13764 DEBUG (ScheduledTrigger-3-thread-3) [    ] o.a.s.c.a.NodeLostTrigger Running NodeLostTrigger: node_lost_restore_trigger with currently live nodes: 2 and last live nodes: 2
   [junit4]   2> 13764 DEBUG (ScheduledTrigger-3-thread-3) [    ] o.a.s.c.a.NodeLostTrigger Running NodeLostTrigger: .auto_add_replicas with currently live nodes: 2 and last live nodes: 2
   [junit4]   2> 13786 DEBUG (ScheduledTrigger-3-thread-2) [    ] o.a.s.c.a.NodeLostTrigger Running NodeLostTrigger: node_lost_restore_trigger with currently live nodes: 2 and last live nodes: 2
   [junit4]   2> 13786 DEBUG (ScheduledTrigger-3-thread-4) [    ] o.a.s.c.a.NodeLostTrigger Running NodeLostTrigger: .auto_add_replicas with currently live nodes: 2 and last live nodes: 2
   [junit4]   2> 13808 DEBUG (ScheduledTrigger-3-thread-2) [    ] o.a.s.c.a.NodeLostTrigger Running NodeLostTrigger: node_lost_restore_trigger with currently live nodes: 2 and last live nodes: 2
   [junit4]   2> 13808 DEBUG (ScheduledTrigger-3-thread-3) [    ] o.a.s.c.a.NodeLostTrigger Running NodeLostTrigger: .auto_add_replicas with currently live nodes: 2 and last live nodes: 2
   [junit4]   2> 13828 DEBUG (ScheduledTrigger-3-thread-4) [    ] o.a.s.c.a.NodeLostTrigger Running NodeLostTrigger: .auto_add_replicas with currently live nodes: 2 and last live nodes: 2
   [junit4]   2> 13828 DEBUG (ScheduledTrigger-3-thread-2) [    ] o.a.s.c.a.NodeLostTrigger Running NodeLostTrigger: node_lost_restore_trigger with currently live nodes: 2 and last live nodes: 2
   [junit4]   2> 13849 DEBUG (ScheduledTrigger-3-thread-2) [    ] o.a.s.c.a.NodeLostTrigger Running NodeLostTrigger: node_lost_restore_trigger with currently live nodes: 2 and last live nodes: 2
   [junit4]   2> 13849 DEBUG (ScheduledTrigger-3-thread-1) [    ] o.a.s.c.a.NodeLostTrigger Running NodeLostTrigger: .auto_add_replicas with currently live nodes: 2 and last live nodes: 2
   [junit4]   2> 13869 DEBUG (ScheduledTrigger-3-thread-4) [    ] o.a.s.c.a.NodeLostTrigger Running NodeLostTrigger: .auto_add_replicas with currently live nodes: 2 and last live nodes: 2
   [junit4]   2> 13869 DEBUG (ScheduledTrigger-3-thread-3) [    ] o.a.s.c.a.NodeLostTrigger Running NodeLostTrigger: node_lost_restore_trigger with currently live nodes: 2 and last live nodes: 2
   [junit4]   2> 13891 DEBUG (ScheduledTrigger-3-thread-2) [    ] o.a.s.c.a.NodeLostTrigger Running NodeLostTrigger: node_lost_restore_trigger with currently live nodes: 2 and last live nodes: 2
   [junit4]   2> 13891 DEBUG (ScheduledTrigger-3-thread-4) [    ] o.a.s.c.a.NodeLostTrigger Running NodeLostTrigger: .auto_add_replicas with currently live nodes: 2 and last live nodes: 2
   [junit4]   2> 13896 DEBUG (TEST-TestSimTriggerIntegration.testNodeLostTriggerRestoreState-seed#[3FBB6C55D2E91506]) [    ] o.a.s.c.a.ScheduledTriggers Shutting down scheduled thread pool executor now
   [junit4]   2> 13897 DEBUG (TEST-TestSimTriggerIntegration.testNodeLostTriggerRestoreState-seed#[3FBB6C55D2E91506]) [    ] o.a.s.c.a.ScheduledTriggers Shutting down action executor now
   [junit4]   2> 13897 DEBUG (TEST-TestSimTriggerIntegration.testNodeLostTriggerRestoreState-seed#[3FBB6C55D2E91506]) [    ] o.a.s.c.a.ScheduledTriggers Awaiting termination for action executor
   [junit4]   2> 13897 DEBUG (TEST-TestSimTriggerIntegration.testNodeLostTriggerRestoreState-seed#[3FBB6C55D2E91506]) [    ] o.a.s.c.a.ScheduledTriggers Awaiting termination for scheduled thread pool executor
   [junit4]   2> 13897 DEBUG (TEST-TestSimTriggerIntegration.testNodeLostTriggerRestoreState-seed#[3FBB6C55D2E91506]) [    ] o.a.s.c.a.ScheduledTriggers ScheduledTriggers closed completely
   [junit4]   2> 13897 DEBUG (TEST-TestSimTriggerIntegration.testNodeLostTriggerRestoreState-seed#[3FBB6C55D2E91506]) [    ] o.a.s.c.a.OverseerTriggerThread OverseerTriggerThread has been closed explicitly
   [junit4]   2> 13898 INFO  (Simulated OverseerAutoScalingTriggerThread) [    ] o.a.s.c.a.OverseerTriggerThread OverseerTriggerThread woken up but we are closed, exiting.
   [junit4]   2> 13899 INFO  (TEST-TestSimTriggerIntegration.testNodeLostTriggerRestoreState-seed#[3FBB6C55D2E91506]) [    ] o.a.s.SolrTestCaseJ4 ###Ending testNodeLostTriggerRestoreState
   [junit4]   2> NOTE: reproduce with: ant test  -Dtestcase=TestSimTriggerIntegration -Dtests.method=testNodeLostTriggerRestoreState -Dtests.seed=3FBB6C55D2E91506 -Dtests.slow=true -Dtests.locale=nl-NL -Dtests.timezone=America/Toronto -Dtests.asserts=true -Dtests.file.encoding=Cp1252
   [junit4] FAILURE 3.08s J0 | TestSimTriggerIntegration.testNodeLostTriggerRestoreState <<<
   [junit4]    > Throwable #1: java.lang.AssertionError: The trigger did not fire at all
   [junit4]    > 	at __randomizedtesting.SeedInfo.seed([3FBB6C55D2E91506:1444B90E489100D6]:0)
   [junit4]    > 	at org.apache.solr.cloud.autoscaling.sim.TestSimTriggerIntegration.testNodeLostTriggerRestoreState(TestSimTriggerIntegration.java:332)
   [junit4]    > 	at java.lang.Thread.run(Thread.java:748)
   [junit4] IGNOR/A 0.00s J0 | TestSimTriggerIntegration.testEventQueue
   [junit4]    > Assumption #1: 'awaitsfix' test group is disabled (@AwaitsFix(bugUrl=https://issues.apache.org/jira/browse/SOLR-12028))
   [junit4] IGNOR/A 0.00s J0 | TestSimTriggerIntegration.testNodeMarkersRegistration
   [junit4]    > Assumption #1: 'badapple' test group is disabled (@BadApple(bugUrl=https://issues.apache.org/jira/browse/SOLR-12028))
   [junit4] IGNOR/A 0.00s J0 | TestSimTriggerIntegration.testNodeAddedTrigger
   [junit4]    > Assumption #1: 'badapple' test group is disabled (@BadApple(bugUrl=https://issues.apache.org/jira/browse/SOLR-12028))
   [junit4] IGNOR/A 0.00s J0 | TestSimTriggerIntegration.testNodeAddedTriggerRestoreState
   [junit4]    > Assumption #1: 'badapple' test group is disabled (@BadApple(bugUrl=https://issues.apache.org/jira/browse/SOLR-12028))
   [junit4]   2> NOTE: leaving temporary files on disk at: C:\Users\jenkins\workspace\Lucene-Solr-7.x-Windows\solr\build\solr-core\test\J0\temp\solr.cloud.autoscaling.sim.TestSimTriggerIntegration_3FBB6C55D2E91506-001
   [junit4]   2> NOTE: test params are: codec=Lucene70, sim=RandomSimilarity(queryNorm=false): {}, locale=nl-NL, timezone=America/Toronto
   [junit4]   2> NOTE: Windows 10 10.0 amd64/Oracle Corporation 1.8.0_172 (64-bit)/cpus=3,threads=1,free=59749880,total=99090432
   [junit4]   2> NOTE: All tests run in this JVM: [TestSimTriggerIntegration]
   [junit4] Completed [2/835 (1!)] on J0 in 12.69s, 11 tests, 1 failure, 10 skipped <<< FAILURES!

[...truncated 51969 lines...]
[asciidoctor:convert] asciidoctor: ERROR: about-this-guide.adoc: line 1: invalid part, must have at least one section (e.g., chapter, appendix, etc.)
[asciidoctor:convert] asciidoctor: ERROR: solr-glossary.adoc: line 1: invalid part, must have at least one section (e.g., chapter, appendix, etc.)
     [java] Processed 2458 links (2009 relative) to 3221 anchors in 247 files
     [echo] Validated Links & Anchors via: C:\Users\jenkins\workspace\Lucene-Solr-7.x-Windows\solr\build\solr-ref-guide/bare-bones-html/

-documentation-lint:
    [jtidy] Checking for broken html (such as invalid tags)...
   [delete] Deleting directory C:\Users\jenkins\workspace\Lucene-Solr-7.x-Windows\lucene\build\jtidy_tmp
     [echo] Checking for broken links...
     [exec] 
     [exec] Crawl/parse...
     [exec] 
     [exec] Verify...
     [echo] Checking for malformed docs...

jar-checksums:

resolve:

ivy-availability-check:
[loadresource] Do not set property disallowed.ivy.jars.list as its length is 0.

-ivy-fail-disallowed-ivy-version:

ivy-fail:

ivy-configure:
[ivy:configure] :: loading settings :: file = C:\Users\jenkins\workspace\Lucene-Solr-7.x-Windows\lucene\top-level-ivy-settings.xml

resolve:

ivy-availability-check:
[loadresource] Do not set property disallowed.ivy.jars.list as its length is 0.

-ivy-fail-disallowed-ivy-version:

ivy-fail:

ivy-configure:
[ivy:configure] :: loading settings :: file = C:\Users\jenkins\workspace\Lucene-Solr-7.x-Windows\lucene\top-level-ivy-settings.xml

resolve:

resolve:

ivy-availability-check:
[loadresource] Do not set property disallowed.ivy.jars.list as its length is 0.

-ivy-fail-disallowed-ivy-version:

ivy-fail:

ivy-configure:
[ivy:configure] :: loading settings :: file = C:\Users\jenkins\workspace\Lucene-Solr-7.x-Windows\lucene\top-level-ivy-settings.xml

resolve:

ivy-availability-check:
[loadresource] Do not set property disallowed.ivy.jars.list as its length is 0.

-ivy-fail-disallowed-ivy-version:

ivy-fail:

ivy-configure:
[ivy:configure] :: loading settings :: file = C:\Users\jenkins\workspace\Lucene-Solr-7.x-Windows\lucene\top-level-ivy-settings.xml

resolve:

ivy-availability-check:
[loadresource] Do not set property disallowed.ivy.jars.list as its length is 0.

-ivy-fail-disallowed-ivy-version:

ivy-fail:

ivy-configure:
[ivy:configure] :: loading settings :: file = C:\Users\jenkins\workspace\Lucene-Solr-7.x-Windows\lucene\top-level-ivy-settings.xml

resolve:

ivy-availability-check:
[loadresource] Do not set property disallowed.ivy.jars.list as its length is 0.

-ivy-fail-disallowed-ivy-version:

ivy-fail:

ivy-configure:
[ivy:configure] :: loading settings :: file = C:\Users\jenkins\workspace\Lucene-Solr-7.x-Windows\lucene\top-level-ivy-settings.xml

resolve:

ivy-availability-check:
[loadresource] Do not set property disallowed.ivy.jars.list as its length is 0.

-ivy-fail-disallowed-ivy-version:

ivy-fail:

ivy-configure:
[ivy:configure] :: loading settings :: file = C:\Users\jenkins\workspace\Lucene-Solr-7.x-Windows\lucene\top-level-ivy-settings.xml

resolve:

ivy-availability-check:
[loadresource] Do not set property disallowed.ivy.jars.list as its length is 0.

-ivy-fail-disallowed-ivy-version:

ivy-fail:

ivy-configure:
[ivy:configure] :: loading settings :: file = C:\Users\jenkins\workspace\Lucene-Solr-7.x-Windows\lucene\top-level-ivy-settings.xml

resolve:

ivy-availability-check:
[loadresource] Do not set property disallowed.ivy.jars.list as its length is 0.

-ivy-fail-disallowed-ivy-version:

ivy-fail:

ivy-configure:
[ivy:configure] :: loading settings :: file = C:\Users\jenkins\workspace\Lucene-Solr-7.x-Windows\lucene\top-level-ivy-settings.xml

resolve:

ivy-availability-check:
[loadresource] Do not set property disallowed.ivy.jars.list as its length is 0.

-ivy-fail-disallowed-ivy-version:

ivy-fail:

ivy-configure:
[ivy:configure] :: loading settings :: file = C:\Users\jenkins\workspace\Lucene-Solr-7.x-Windows\lucene\top-level-ivy-settings.xml

resolve:

ivy-availability-check:
[loadresource] Do not set property disallowed.ivy.jars.list as its length is 0.

-ivy-fail-disallowed-ivy-version:

ivy-fail:

ivy-configure:
[ivy:configure] :: loading settings :: file = C:\Users\jenkins\workspace\Lucene-Solr-7.x-Windows\lucene\top-level-ivy-settings.xml

resolve:

ivy-availability-check:
[loadresource] Do not set property disallowed.ivy.jars.list as its length is 0.

-ivy-fail-disallowed-ivy-version:

ivy-fail:

ivy-configure:
[ivy:configure] :: loading settings :: file = C:\Users\jenkins\workspace\Lucene-Solr-7.x-Windows\lucene\top-level-ivy-settings.xml

resolve:

ivy-availability-check:
[loadresource] Do not set property disallowed.ivy.jars.list as its length is 0.

-ivy-fail-disallowed-ivy-version:

ivy-fail:

ivy-configure:
[ivy:configure] :: loading settings :: file = C:\Users\jenkins\workspace\Lucene-Solr-7.x-Windows\lucene\top-level-ivy-settings.xml

resolve:

ivy-availability-check:
[loadresource] Do not set property disallowed.ivy.jars.list as its length is 0.

-ivy-fail-disallowed-ivy-version:

ivy-fail:

ivy-configure:
[ivy:configure] :: loading settings :: file = C:\Users\jenkins\workspace\Lucene-Solr-7.x-Windows\lucene\top-level-ivy-settings.xml

resolve:

ivy-availability-check:
[loadresource] Do not set property disallowed.ivy.jars.list as its length is 0.

-ivy-fail-disallowed-ivy-version:

ivy-fail:

ivy-configure:
[ivy:configure] :: loading settings :: file = C:\Users\jenkins\workspace\Lucene-Solr-7.x-Windows\lucene\top-level-ivy-settings.xml

resolve:

ivy-availability-check:
[loadresource] Do not set property disallowed.ivy.jars.list as its length is 0.

-ivy-fail-disallowed-ivy-version:

ivy-fail:

ivy-configure:
[ivy:configure] :: loading settings :: file = C:\Users\jenkins\workspace\Lucene-Solr-7.x-Windows\lucene\top-level-ivy-settings.xml

resolve:

ivy-availability-check:
[loadresource] Do not set property disallowed.ivy.jars.list as its length is 0.

-ivy-fail-disallowed-ivy-version:

ivy-fail:

ivy-configure:
[ivy:configure] :: loading settings :: file = C:\Users\jenkins\workspace\Lucene-Solr-7.x-Windows\lucene\top-level-ivy-settings.xml

resolve:

ivy-availability-check:
[loadresource] Do not set property disallowed.ivy.jars.list as its length is 0.

-ivy-fail-disallowed-ivy-version:

ivy-fail:

ivy-configure:
[ivy:configure] :: loading settings :: file = C:\Users\jenkins\workspace\Lucene-Solr-7.x-Windows\lucene\top-level-ivy-settings.xml

resolve:

ivy-availability-check:
[loadresource] Do not set property disallowed.ivy.jars.list as its length is 0.

-ivy-fail-disallowed-ivy-version:

ivy-fail:

ivy-configure:
[ivy:configure] :: loading settings :: file = C:\Users\jenkins\workspace\Lucene-Solr-7.x-Windows\lucene\top-level-ivy-settings.xml

resolve:

ivy-availability-check:
[loadresource] Do not set property disallowed.ivy.jars.list as its length is 0.

-ivy-fail-disallowed-ivy-version:

ivy-fail:

ivy-configure:
[ivy:configure] :: loading settings :: file = C:\Users\jenkins\workspace\Lucene-Solr-7.x-Windows\lucene\top-level-ivy-settings.xml

resolve:

ivy-availability-check:
[loadresource] Do not set property disallowed.ivy.jars.list as its length is 0.

-ivy-fail-disallowed-ivy-version:

ivy-fail:

ivy-configure:
[ivy:configure] :: loading settings :: file = C:\Users\jenkins\workspace\Lucene-Solr-7.x-Windows\lucene\top-level-ivy-settings.xml

resolve:

ivy-availability-check:
[loadresource] Do not set property disallowed.ivy.jars.list as its length is 0.

-ivy-fail-disallowed-ivy-version:

ivy-fail:

ivy-configure:
[ivy:configure] :: loading settings :: file = C:\Users\jenkins\workspace\Lucene-Solr-7.x-Windows\lucene\top-level-ivy-settings.xml

resolve:

ivy-availability-check:
[loadresource] Do not set property disallowed.ivy.jars.list as its length is 0.

-ivy-fail-disallowed-ivy-version:

ivy-fail:

ivy-configure:
[ivy:configure] :: loading settings :: file = C:\Users\jenkins\workspace\Lucene-Solr-7.x-Windows\lucene\top-level-ivy-settings.xml

resolve:

ivy-availability-check:
[loadresource] Do not set property disallowed.ivy.jars.list as its length is 0.

-ivy-fail-disallowed-ivy-version:

ivy-fail:

ivy-configure:
[ivy:configure] :: loading settings :: file = C:\Users\jenkins\workspace\Lucene-Solr-7.x-Windows\lucene\top-level-ivy-settings.xml

resolve:

ivy-availability-check:
[loadresource] Do not set property disallowed.ivy.jars.list as its length is 0.

-ivy-fail-disallowed-ivy-version:

ivy-fail:

ivy-configure:
[ivy:configure] :: loading settings :: file = C:\Users\jenkins\workspace\Lucene-Solr-7.x-Windows\lucene\top-level-ivy-settings.xml

resolve:

ivy-availability-check:
[loadresource] Do not set property disallowed.ivy.jars.list as its length is 0.

-ivy-fail-disallowed-ivy-version:

ivy-fail:

ivy-configure:
[ivy:configure] :: loading settings :: file = C:\Users\jenkins\workspace\Lucene-Solr-7.x-Windows\lucene\top-level-ivy-settings.xml

common.resolve:

resolve:

ivy-availability-check:
[loadresource] Do not set property disallowed.ivy.jars.list as its length is 0.

-ivy-fail-disallowed-ivy-version:

ivy-fail:

ivy-configure:
[ivy:configure] :: loading settings :: file = C:\Users\jenkins\workspace\Lucene-Solr-7.x-Windows\lucene\top-level-ivy-settings.xml

resolve:

ivy-availability-check:
[loadresource] Do not set property disallowed.ivy.jars.list as its length is 0.

-ivy-fail-disallowed-ivy-version:

ivy-fail:

ivy-configure:
[ivy:configure] :: loading settings :: file = C:\Users\jenkins\workspace\Lucene-Solr-7.x-Windows\lucene\top-level-ivy-settings.xml

resolve:

ivy-availability-check:
[loadresource] Do not set property disallowed.ivy.jars.list as its length is 0.

-ivy-fail-disallowed-ivy-version:

ivy-fail:

ivy-configure:
[ivy:configure] :: loading settings :: file = C:\Users\jenkins\workspace\Lucene-Solr-7.x-Windows\lucene\top-level-ivy-settings.xml

resolve:

ivy-availability-check:
[loadresource] Do not set property disallowed.ivy.jars.list as its length is 0.

-ivy-fail-disallowed-ivy-version:

ivy-fail:

ivy-configure:
[ivy:configure] :: loading settings :: file = C:\Users\jenkins\workspace\Lucene-Solr-7.x-Windows\lucene\top-level-ivy-settings.xml

resolve:

ivy-availability-check:
[loadresource] Do not set property disallowed.ivy.jars.list as its length is 0.

-ivy-fail-disallowed-ivy-version:

ivy-fail:

ivy-configure:
[ivy:configure] :: loading settings :: file = C:\Users\jenkins\workspace\Lucene-Solr-7.x-Windows\lucene\top-level-ivy-settings.xml

resolve:

jar-checksums:
    [mkdir] Created dir: C:\Users\jenkins\workspace\Lucene-Solr-7.x-Windows\lucene\null702223033
     [copy] Copying 36 files to C:\Users\jenkins\workspace\Lucene-Solr-7.x-Windows\lucene\null702223033
   [delete] Deleting directory C:\Users\jenkins\workspace\Lucene-Solr-7.x-Windows\lucene\null702223033

resolve-example:

ivy-availability-check:
[loadresource] Do not set property disallowed.ivy.jars.list as its length is 0.

-ivy-fail-disallowed-ivy-version:

ivy-fail:

ivy-configure:
[ivy:configure] :: loading settings :: file = C:\Users\jenkins\workspace\Lucene-Solr-7.x-Windows\lucene\top-level-ivy-settings.xml

resolve:

resolve-server:

ivy-availability-check:
[loadresource] Do not set property disallowed.ivy.jars.list as its length is 0.

-ivy-fail-disallowed-ivy-version:

ivy-fail:

ivy-fail:

ivy-configure:
[ivy:configure] :: loading settings :: file = C:\Users\jenkins\workspace\Lucene-Solr-7.x-Windows\lucene\top-level-ivy-settings.xml

resolve:

resolve:

ivy-availability-check:
[loadresource] Do not set property disallowed.ivy.jars.list as its length is 0.

-ivy-fail-disallowed-ivy-version:

ivy-fail:

ivy-fail:

ivy-configure:
[ivy:configure] :: loading settings :: file = C:\Users\jenkins\workspace\Lucene-Solr-7.x-Windows\lucene\top-level-ivy-settings.xml

resolve:

ivy-availability-check:
[loadresource] Do not set property disallowed.ivy.jars.list as its length is 0.

-ivy-fail-disallowed-ivy-version:

ivy-fail:

ivy-fail:

ivy-configure:
[ivy:configure] :: loading settings :: file = C:\Users\jenkins\workspace\Lucene-Solr-7.x-Windows\lucene\top-level-ivy-settings.xml

resolve:

ivy-availability-check:
[loadresource] Do not set property disallowed.ivy.jars.list as its length is 0.

-ivy-fail-disallowed-ivy-version:

ivy-fail:

ivy-configure:
[ivy:configure] :: loading settings :: file = C:\Users\jenkins\workspace\Lucene-Solr-7.x-Windows\lucene\top-level-ivy-settings.xml

resolve:

ivy-availability-check:
[loadresource] Do not set property disallowed.ivy.jars.list as its length is 0.

-ivy-fail-disallowed-ivy-version:

ivy-fail:

ivy-fail:

ivy-configure:
[ivy:configure] :: loading settings :: file = C:\Users\jenkins\workspace\Lucene-Solr-7.x-Windows\lucene\top-level-ivy-settings.xml

resolve:

ivy-availability-check:
[loadresource] Do not set property disallowed.ivy.jars.list as its length is 0.

-ivy-fail-disallowed-ivy-version:

ivy-fail:

ivy-configure:
[ivy:configure] :: loading settings :: file = C:\Users\jenkins\workspace\Lucene-Solr-7.x-Windows\lucene\top-level-ivy-settings.xml

resolve:

ivy-availability-check:
[loadresource] Do not set property disallowed.ivy.jars.list as its length is 0.

-ivy-fail-disallowed-ivy-version:

ivy-fail:

ivy-fail:

ivy-configure:
[ivy:configure] :: loading settings :: file = C:\Users\jenkins\workspace\Lucene-Solr-7.x-Windows\lucene\top-level-ivy-settings.xml

resolve:

ivy-availability-check:
[loadresource] Do not set property disallowed.ivy.jars.list as its length is 0.

-ivy-fail-disallowed-ivy-version:

ivy-fail:

ivy-fail:

ivy-configure:
[ivy:configure] :: loading settings :: file = C:\Users\jenkins\workspace\Lucene-Solr-7.x-Windows\lucene\top-level-ivy-settings.xml

resolve:

ivy-availability-check:
[loadresource] Do not set property disallowed.ivy.jars.list as its length is 0.

-ivy-fail-disallowed-ivy-version:

ivy-fail:

ivy-fail:

ivy-configure:
[ivy:configure] :: loading settings :: file = C:\Users\jenkins\workspace\Lucene-Solr-7.x-Windows\lucene\top-level-ivy-settings.xml

resolve:

ivy-availability-check:
[loadresource] Do not set property disallowed.ivy.jars.list as its length is 0.

-ivy-fail-disallowed-ivy-version:

ivy-fail:

ivy-fail:

ivy-configure:
[ivy:configure] :: loading settings :: file = C:\Users\jenkins\workspace\Lucene-Solr-7.x-Windows\lucene\top-level-ivy-settings.xml

resolve:

ivy-availability-check:
[loadresource] Do not set property disallowed.ivy.jars.list as its length is 0.

-ivy-fail-disallowed-ivy-version:

ivy-fail:

ivy-fail:

ivy-configure:
[ivy:configure] :: loading settings :: file = C:\Users\jenkins\workspace\Lucene-Solr-7.x-Windows\lucene\top-level-ivy-settings.xml

resolve:

ivy-availability-check:
[loadresource] Do not set property disallowed.ivy.jars.list as its length is 0.

-ivy-fail-disallowed-ivy-version:

ivy-fail:

ivy-fail:

ivy-configure:
[ivy:configure] :: loading settings :: file = C:\Users\jenkins\workspace\Lucene-Solr-7.x-Windows\lucene\top-level-ivy-settings.xml

resolve:

ivy-availability-check:
[loadresource] Do not set property disallowed.ivy.jars.list as its length is 0.

-ivy-fail-disallowed-ivy-version:

ivy-fail:

ivy-fail:

ivy-configure:
[ivy:configure] :: loading settings :: file = C:\Users\jenkins\workspace\Lucene-Solr-7.x-Windows\lucene\top-level-ivy-settings.xml

resolve:

ivy-availability-check:
[loadresource] Do not set property disallowed.ivy.jars.list as its length is 0.

-ivy-fail-disallowed-ivy-version:

ivy-fail:

ivy-fail:

ivy-configure:
[ivy:configure] :: loading settings :: file = C:\Users\jenkins\workspace\Lucene-Solr-7.x-Windows\lucene\top-level-ivy-settings.xml

resolve:

ivy-availability-check:
[loadresource] Do not set property disallowed.ivy.jars.list as its length is 0.

-ivy-fail-disallowed-ivy-version:

ivy-fail:

ivy-fail:

ivy-configure:
[ivy:configure] :: loading settings :: file = C:\Users\jenkins\workspace\Lucene-Solr-7.x-Windows\lucene\top-level-ivy-settings.xml

resolve:

ivy-availability-check:
[loadresource] Do not set property disallowed.ivy.jars.list as its length is 0.

-ivy-fail-disallowed-ivy-version:

ivy-fail:

ivy-fail:

ivy-configure:
[ivy:configure] :: loading settings :: file = C:\Users\jenkins\workspace\Lucene-Solr-7.x-Windows\lucene\top-level-ivy-settings.xml

resolve:

jar-checksums:
    [mkdir] Created dir: C:\Users\jenkins\workspace\Lucene-Solr-7.x-Windows\solr\null398339667
     [copy] Copying 242 files to C:\Users\jenkins\workspace\Lucene-Solr-7.x-Windows\solr\null398339667
   [delete] Deleting directory C:\Users\jenkins\workspace\Lucene-Solr-7.x-Windows\solr\null398339667

check-working-copy:
[ivy:cachepath] :: resolving dependencies :: org.eclipse.jgit#org.eclipse.jgit-caller;working
[ivy:cachepath] 	confs: [default]
[ivy:cachepath] 	found org.eclipse.jgit#org.eclipse.jgit;4.6.0.201612231935-r in public
[ivy:cachepath] 	found com.jcraft#jsch;0.1.53 in public
[ivy:cachepath] 	found com.googlecode.javaewah#JavaEWAH;1.1.6 in public
[ivy:cachepath] 	found org.apache.httpcomponents#httpclient;4.3.6 in public
[ivy:cachepath] 	found org.apache.httpcomponents#httpcore;4.3.3 in public
[ivy:cachepath] 	found commons-logging#commons-logging;1.1.3 in public
[ivy:cachepath] 	found commons-codec#commons-codec;1.6 in public
[ivy:cachepath] 	found org.slf4j#slf4j-api;1.7.2 in public
[ivy:cachepath] :: resolution report :: resolve 123ms :: artifacts dl 7ms
	---------------------------------------------------------------------
	|                  |            modules            ||   artifacts   |
	|       conf       | number| search|dwnlded|evicted|| number|dwnlded|
	---------------------------------------------------------------------
	|      default     |   8   |   0   |   0   |   0   ||   8   |   0   |
	---------------------------------------------------------------------
[wc-checker] Initializing working copy...
[wc-checker] SLF4J: Failed to load class "org.slf4j.impl.StaticLoggerBinder".
[wc-checker] SLF4J: Defaulting to no-operation (NOP) logger implementation
[wc-checker] SLF4J: See http://www.slf4j.org/codes.html#StaticLoggerBinder for further details.
[wc-checker] Checking working copy status...

-jenkins-base:

BUILD SUCCESSFUL
Total time: 102 minutes 13 seconds
Setting ANT_1_8_2_HOME=C:\Users\jenkins\tools\hudson.tasks.Ant_AntInstallation\ANT_1.8.2
[Lucene-Solr-7.x-Windows] $ cmd /c call C:\Users\jenkins\AppData\Local\Temp\jenkins2055033424365717849.bat

C:\Users\jenkins\workspace\Lucene-Solr-7.x-Windows>IF EXIST lucene\build move /y lucene\build lucene\build.orig 
        1 dir(s) moved.

C:\Users\jenkins\workspace\Lucene-Solr-7.x-Windows>IF EXIST solr\build move /y solr\build solr\build.orig 
        1 dir(s) moved.

C:\Users\jenkins\workspace\Lucene-Solr-7.x-Windows>set ANT_HOME=C:\Users\jenkins\tools\hudson.tasks.Ant_AntInstallation\ANT_1.8.2 

C:\Users\jenkins\workspace\Lucene-Solr-7.x-Windows>set PATH=C:\Users\jenkins\tools\hudson.tasks.Ant_AntInstallation\ANT_1.8.2\bin;C:\Users\jenkins\tools\java\64bit\jdk1.8.0_172\bin;C:\Program Files (x86)\Common Files\Oracle\Java\javapath;C:\ProgramData\Oracle\Java\javapath;C:\Python35\Scripts\;C:\Python35\;C:\Perl64\site\bin;C:\Perl64\bin;C:\WINDOWS\system32;C:\WINDOWS;C:\WINDOWS\System32\Wbem;C:\WINDOWS\System32\WindowsPowerShell\v1.0\;C:\WINDOWS\System32\OpenSSH\;C:\Users\jenkins\AppData\Local\Microsoft\WindowsApps 

C:\Users\jenkins\workspace\Lucene-Solr-7.x-Windows>C:\Python35\python.exe -u dev-tools\scripts\reproduceJenkinsFailures.py --no-git https://jenkins.thetaphi.de/job/Lucene-Solr-7.x-Windows/947/consoleText 
[repro] Jenkins log URL: https://jenkins.thetaphi.de/job/Lucene-Solr-7.x-Windows/947/consoleText

[repro] Revision: acfa8a2b3386801cc972a1d99982f71305318d92

[repro] Ant options: "-Dargs=-XX:+UseCompressedOops -XX:+UseParallelGC"
[repro] Repro line:  ant test  -Dtestcase=TestSimTriggerIntegration -Dtests.method=testNodeLostTriggerRestoreState -Dtests.seed=3FBB6C55D2E91506 -Dtests.slow=true -Dtests.locale=nl-NL -Dtests.timezone=America/Toronto -Dtests.asserts=true -Dtests.file.encoding=Cp1252


[repro] ant clean
Buildfile: C:\Users\jenkins\workspace\Lucene-Solr-7.x-Windows\build.xml

clean:

clean:

clean:

BUILD SUCCESSFUL
Total time: 0 seconds
[repro] Test suites by module:
[repro]    solr\core
[repro]       TestSimTriggerIntegration
[repro] ant compile-test
Buildfile: C:\Users\jenkins\workspace\Lucene-Solr-7.x-Windows\solr\core\build.xml

check-analyzers-icu-uptodate:

jar-analyzers-icu:

-mrjar-classes-uptodate:

ivy-availability-check:
[loadresource] Do not set property disallowed.ivy.jars.list as its length is 0.

-ivy-fail-disallowed-ivy-version:

ivy-fail:

ivy-configure:
[ivy:configure] :: Apache Ivy 2.4.0 - 20141213170938 :: http://ant.apache.org/ivy/ ::
[ivy:configure] :: loading settings :: file = C:\Users\jenkins\workspace\Lucene-Solr-7.x-Windows\lucene\top-level-ivy-settings.xml

resolve-groovy:
[ivy:cachepath] :: resolving dependencies :: org.codehaus.groovy#groovy-all-caller;working
[ivy:cachepath] 	confs: [default]
[ivy:cachepath] 	found org.codehaus.groovy#groovy-all;2.4.15 in public
[ivy:cachepath] :: resolution report :: resolve 118ms :: artifacts dl 4ms
	---------------------------------------------------------------------
	|                  |            modules            ||   artifacts   |
	|       conf       | number| search|dwnlded|evicted|| number|dwnlded|
	---------------------------------------------------------------------
	|      default     |   1   |   0   |   0   |   0   ||   1   |   0   |
	---------------------------------------------------------------------

check-analyzers-common-uptodate:

jar-analyzers-common:

-mrjar-classes-uptodate:

ivy-availability-check:
[loadresource] Do not set property disallowed.ivy.jars.list as its length is 0.

-ivy-fail-disallowed-ivy-version:

ivy-fail:

ivy-configure:
[ivy:configure] :: loading settings :: file = C:\Users\jenkins\workspace\Lucene-Solr-7.x-Windows\lucene\top-level-ivy-settings.xml

resolve-groovy:

-check-git-state:

-git-cleanroot:

-copy-git-state:
     [copy] Copying 1 file to C:\Users\jenkins\workspace\Lucene-Solr-7.x-Windows\lucene\build

git-autoclean:

resolve:

common.init:

compile-lucene-core:

-check-git-state:

-git-cleanroot:

-copy-git-state:

git-autoclean:

ivy-availability-check:
[loadresource] Do not set property disallowed.ivy.jars.list as its length is 0.

-ivy-fail-disallowed-ivy-version:

ivy-fail:

ivy-configure:
[ivy:configure] :: loading settings :: file = C:\Users\jenkins\workspace\Lucene-Solr-7.x-Windows\lucene\top-level-ivy-settings.xml

resolve:

init:

-clover.disable:

-clover.load:

-clover.classpath:

-clover.setup:

clover:

compile-core:
    [mkdir] Created dir: C:\Users\jenkins\workspace\Lucene-Solr-7.x-Windows\lucene\build\core\classes\java
    [javac] Compiling 859 source files to C:\Users\jenkins\workspace\Lucene-Solr-7.x-Windows\lucene\build\core\classes\java
    [javac] C:\Users\jenkins\workspace\Lucene-Solr-7.x-Windows\lucene\core\src\java\org\apache\lucene\index\FrozenBufferedUpdates.java:246: warning: [try] auto-closeable resource finalizer is never referenced in body of corresponding try statement
    [javac]         try (Closeable finalizer = () -> finishApply(writer, segStates, success.get(), delFiles)) {
    [javac]                        ^
    [javac] C:\Users\jenkins\workspace\Lucene-Solr-7.x-Windows\lucene\core\src\java\org\apache\lucene\index\NumericDocValuesFieldUpdates.java:37: warning: [rawtypes] found raw type: AbstractPagedMutable
    [javac]     private final AbstractPagedMutable values;
    [javac]                   ^
    [javac]   missing type arguments for generic class AbstractPagedMutable<T>
    [javac]   where T is a type-variable:
    [javac]     T extends AbstractPagedMutable<T> declared in class AbstractPagedMutable
    [javac] C:\Users\jenkins\workspace\Lucene-Solr-7.x-Windows\lucene\core\src\java\org\apache\lucene\index\NumericDocValuesFieldUpdates.java:41: warning: [rawtypes] found raw type: AbstractPagedMutable
    [javac]     Iterator(int size, long minValue, AbstractPagedMutable values, PagedMutable docs, long delGen) {
    [javac]                                       ^
    [javac]   missing type arguments for generic class AbstractPagedMutable<T>
    [javac]   where T is a type-variable:
    [javac]     T extends AbstractPagedMutable<T> declared in class AbstractPagedMutable
    [javac] C:\Users\jenkins\workspace\Lucene-Solr-7.x-Windows\lucene\core\src\java\org\apache\lucene\index\NumericDocValuesFieldUpdates.java:61: warning: [rawtypes] found raw type: AbstractPagedMutable
    [javac]   private AbstractPagedMutable values;
    [javac]           ^
    [javac]   missing type arguments for generic class AbstractPagedMutable<T>
    [javac]   where T is a type-variable:
    [javac]     T extends AbstractPagedMutable<T> declared in class AbstractPagedMutable
    [javac] Note: Some input files use or override a deprecated API.
    [javac] Note: Recompile with -Xlint:deprecation for details.
    [javac] 4 warnings
    [javac] Creating empty C:\Users\jenkins\workspace\Lucene-Solr-7.x-Windows\lucene\build\core\classes\java\org\apache\lucene\util\graph\package-info.class
    [javac] Creating empty C:\Users\jenkins\workspace\Lucene-Solr-7.x-Windows\lucene\build\core\classes\java\org\apache\lucene\document\package-info.class
    [javac] Creating empty C:\Users\jenkins\workspace\Lucene-Solr-7.x-Windows\lucene\build\core\classes\java\org\apache\lucene\package-info.class
    [javac] Creating empty C:\Users\jenkins\workspace\Lucene-Solr-7.x-Windows\lucene\build\core\classes\java\org\apache\lucene\util\bkd\package-info.class
    [javac] Creating empty C:\Users\jenkins\workspace\Lucene-Solr-7.x-Windows\lucene\build\core\classes\java\org\apache\lucene\codecs\compressing\package-info.class
    [javac] Creating empty C:\Users\jenkins\workspace\Lucene-Solr-7.x-Windows\lucene\build\core\classes\java\org\apache\lucene\codecs\lucene60\package-info.class
    [javac] Creating empty C:\Users\jenkins\workspace\Lucene-Solr-7.x-Windows\lucene\build\core\classes\java\org\apache\lucene\codecs\package-info.class
    [javac] Creating empty C:\Users\jenkins\workspace\Lucene-Solr-7.x-Windows\lucene\build\core\classes\java\org\apache\lucene\util\package-info.class
    [javac] Creating empty C:\Users\jenkins\workspace\Lucene-Solr-7.x-Windows\lucene\build\core\classes\java\org\apache\lucene\index\package-info.class
    [javac] Creating empty C:\Users\jenkins\workspace\Lucene-Solr-7.x-Windows\lucene\build\core\classes\java\org\apache\lucene\util\fst\package-info.class
    [javac] Creating empty C:\Users\jenkins\workspace\Lucene-Solr-7.x-Windows\lucene\build\core\classes\java\org\apache\lucene\analysis\tokenattributes\package-info.class
    [javac] Creating empty C:\Users\jenkins\workspace\Lucene-Solr-7.x-Windows\lucene\build\core\classes\java\org\apache\lucene\search\package-info.class
    [javac] Creating empty C:\Users\jenkins\workspace\Lucene-Solr-7.x-Windows\lucene\build\core\classes\java\org\apache\lucene\codecs\lucene62\package-info.class
    [javac] Creating empty C:\Users\jenkins\workspace\Lucene-Solr-7.x-Windows\lucene\build\core\classes\java\org\apache\lucene\util\packed\package-info.class
    [javac] Creating empty C:\Users\jenkins\workspace\Lucene-Solr-7.x-Windows\lucene\build\core\classes\java\org\apache\lucene\util\mutable\package-info.class
    [javac] Creating empty C:\Users\jenkins\workspace\Lucene-Solr-7.x-Windows\lucene\build\core\classes\java\org\apache\lucene\codecs\lucene70\package-info.class
    [javac] Creating empty C:\Users\jenkins\workspace\Lucene-Solr-7.x-Windows\lucene\build\core\classes\java\org\apache\lucene\codecs\perfield\package-info.class
    [javac] Creating empty C:\Users\jenkins\workspace\Lucene-Solr-7.x-Windows\lucene\build\core\classes\java\org\apache\lucene\analysis\package-info.class
    [javac] Creating empty C:\Users\jenkins\workspace\Lucene-Solr-7.x-Windows\lucene\build\core\classes\java\org\apache\lucene\analysis\standard\package-info.class
    [javac] Creating empty C:\Users\jenkins\workspace\Lucene-Solr-7.x-Windows\lucene\build\core\classes\java\org\apache\lucene\store\package-info.class
    [javac] Creating empty C:\Users\jenkins\workspace\Lucene-Solr-7.x-Windows\lucene\build\core\classes\java\org\apache\lucene\codecs\blocktree\package-info.class
    [javac] Creating empty C:\Users\jenkins\workspace\Lucene-Solr-7.x-Windows\lucene\build\core\classes\java\org\apache\lucene\search\spans\package-info.class
    [javac] Creating empty C:\Users\jenkins\workspace\Lucene-Solr-7.x-Windows\lucene\build\core\classes\java\org\apache\lucene\search\similarities\package-info.class
    [javac] Creating empty C:\Users\jenkins\workspace\Lucene-Solr-7.x-Windows\lucene\build\core\classes\java\org\apache\lucene\util\automaton\package-info.class
    [javac] Creating empty C:\Users\jenkins\workspace\Lucene-Solr-7.x-Windows\lucene\build\core\classes\java\org\apache\lucene\codecs\lucene50\package-info.class
    [javac] Creating empty C:\Users\jenkins\workspace\Lucene-Solr-7.x-Windows\lucene\build\core\classes\java\org\apache\lucene\geo\package-info.class
     [copy] Copying 3 files to C:\Users\jenkins\workspace\Lucene-Solr-7.x-Windows\lucene\build\core\classes\java

init:

-clover.disable:

-clover.load:

-clover.classpath:

-clover.setup:

clover:

compile-core:
    [mkdir] Created dir: C:\Users\jenkins\workspace\Lucene-Solr-7.x-Windows\lucene\build\analysis\common\classes\java
    [javac] Compiling 476 source files to C:\Users\jenkins\workspace\Lucene-Solr-7.x-Windows\lucene\build\analysis\common\classes\java
    [javac] Note: Some input files use or override a deprecated API.
    [javac] Note: Recompile with -Xlint:deprecation for details.
    [javac] Creating empty C:\Users\jenkins\workspace\Lucene-Solr-7.x-Windows\lucene\build\analysis\common\classes\java\org\apache\lucene\analysis\hunspell\packa

[...truncated too long message...]

tZnodeVersion 4
   [junit4]   2> 27004 DEBUG (ScheduledTrigger-162-thread-2) [    ] o.a.s.c.a.NodeAddedTrigger NodeAddedTrigger node_added_restore_trigger firing registered processor for nodes: [127.0.0.1:10083_solr] added at times [1556007050193200], now=1556008703508200
   [junit4]   2> 27004 DEBUG (ScheduledTrigger-162-thread-2) [    ] o.a.s.c.a.ScheduledTriggers ++++++++ Cooldown inactive - processing event: {
   [junit4]   2>   "id":"5872e1f7ea930Tevw0kvodts19wqe774ufkstvi",
   [junit4]   2>   "source":"node_added_restore_trigger",
   [junit4]   2>   "eventTime":1556007050193200,
   [junit4]   2>   "eventType":"NODEADDED",
   [junit4]   2>   "properties":{
   [junit4]   2>     "eventTimes":[1556007050193200],
   [junit4]   2>     "preferredOperation":"movereplica",
   [junit4]   2>     "nodeNames":["127.0.0.1:10083_solr"]}}
   [junit4]   2> 27008 DEBUG (ScheduledTrigger-162-thread-2) [    ] o.a.s.c.a.ScheduledTriggers Pausing all triggers: [.auto_add_replicas, node_added_restore_trigger]
   [junit4]   2> 27008 DEBUG (ScheduledTrigger-162-thread-2) [    ] o.a.s.c.a.SystemLogListener Collection .system missing, skip sending event {
   [junit4]   2>   "id":"5872e1f7ea930Tevw0kvodts19wqe774ufkstvi",
   [junit4]   2>   "source":"node_added_restore_trigger",
   [junit4]   2>   "eventTime":1556007050193200,
   [junit4]   2>   "eventType":"NODEADDED",
   [junit4]   2>   "properties":{
   [junit4]   2>     "eventTimes":[1556007050193200],
   [junit4]   2>     "preferredOperation":"movereplica",
   [junit4]   2>     "_enqueue_time_":1556008892283200,
   [junit4]   2>     "nodeNames":["127.0.0.1:10083_solr"]}}
   [junit4]   2> 27008 DEBUG (ScheduledTrigger-162-thread-2) [    ] o.a.s.c.a.NodeAddedTrigger Removing new node from tracking: 127.0.0.1:10083_solr
   [junit4]   2> 27009 DEBUG (AutoscalingActionExecutor-163-thread-1) [    ] o.a.s.c.a.ScheduledTriggers -- processing actions for {
   [junit4]   2>   "id":"5872e1f7ea930Tevw0kvodts19wqe774ufkstvi",
   [junit4]   2>   "source":"node_added_restore_trigger",
   [junit4]   2>   "eventTime":1556007050193200,
   [junit4]   2>   "eventType":"NODEADDED",
   [junit4]   2>   "properties":{
   [junit4]   2>     "eventTimes":[1556007050193200],
   [junit4]   2>     "preferredOperation":"movereplica",
   [junit4]   2>     "_enqueue_time_":1556008892283200,
   [junit4]   2>     "nodeNames":["127.0.0.1:10083_solr"]}}
   [junit4]   2> 27010 INFO  (Simulated OverseerAutoScalingTriggerThread) [    ] o.a.s.c.a.OverseerTriggerThread OverseerTriggerThread woken up but we are closed, exiting.
   [junit4]   2> 27010 DEBUG (TEST-TestSimTriggerIntegration.testNodeAddedTriggerRestoreState-seed#[3FBB6C55D2E91506]) [    ] o.a.s.c.a.ScheduledTriggers Shutting down scheduled thread pool executor now
   [junit4]   2> 27010 DEBUG (TEST-TestSimTriggerIntegration.testNodeAddedTriggerRestoreState-seed#[3FBB6C55D2E91506]) [    ] o.a.s.c.a.ScheduledTriggers Shutting down action executor now
   [junit4]   2> 27010 DEBUG (TEST-TestSimTriggerIntegration.testNodeAddedTriggerRestoreState-seed#[3FBB6C55D2E91506]) [    ] o.a.s.c.a.ScheduledTriggers Awaiting termination for action executor
   [junit4]   2> 27010 WARN  (AutoscalingActionExecutor-163-thread-1) [    ] o.a.s.c.a.SystemLogListener Exception sending event. Collection: .system, event: {
   [junit4]   2>   "id":"5872e1f7ea930Tevw0kvodts19wqe774ufkstvi",
   [junit4]   2>   "source":"node_added_restore_trigger",
   [junit4]   2>   "eventTime":1556007050193200,
   [junit4]   2>   "eventType":"NODEADDED",
   [junit4]   2>   "properties":{
   [junit4]   2>     "eventTimes":[1556007050193200],
   [junit4]   2>     "preferredOperation":"movereplica",
   [junit4]   2>     "_enqueue_time_":1556008892283200,
   [junit4]   2>     "nodeNames":["127.0.0.1:10083_solr"]}}, exception: java.io.IOException: already closed
   [junit4]   2> 27010 WARN  (AutoscalingActionExecutor-163-thread-1) [    ] o.a.s.c.a.ScheduledTriggers Unhandled exception executing actions
   [junit4]   2> org.apache.solr.common.AlreadyClosedException: ScheduledTrigger node_added_restore_trigger has been closed.
   [junit4]   2> 	at org.apache.solr.cloud.autoscaling.ScheduledTriggers$TriggerWrapper.dequeue(ScheduledTriggers.java:571) ~[java/:?]
   [junit4]   2> 	at org.apache.solr.cloud.autoscaling.ScheduledTriggers.lambda$null$3(ScheduledTriggers.java:335) ~[java/:?]
   [junit4]   2> 	at java.util.concurrent.Executors$RunnableAdapter.call(Executors.java:511) ~[?:1.8.0_172]
   [junit4]   2> 	at java.util.concurrent.FutureTask.run(FutureTask.java:266) ~[?:1.8.0_172]
   [junit4]   2> 	at org.apache.solr.common.util.ExecutorUtil$MDCAwareThreadPoolExecutor.lambda$execute$0(ExecutorUtil.java:209) ~[java/:?]
   [junit4]   2> 	at java.util.concurrent.ThreadPoolExecutor.runWorker(ThreadPoolExecutor.java:1149) [?:1.8.0_172]
   [junit4]   2> 	at java.util.concurrent.ThreadPoolExecutor$Worker.run(ThreadPoolExecutor.java:624) [?:1.8.0_172]
   [junit4]   2> 	at java.lang.Thread.run(Thread.java:748) [?:1.8.0_172]
   [junit4]   2> 27011 DEBUG (AutoscalingActionExecutor-163-thread-1) [    ] o.a.s.c.a.ScheduledTriggers -- processing took 114 ms for event id=5872e1f7ea930Tevw0kvodts19wqe774ufkstvi
   [junit4]   2> 27011 DEBUG (TEST-TestSimTriggerIntegration.testNodeAddedTriggerRestoreState-seed#[3FBB6C55D2E91506]) [    ] o.a.s.c.a.ScheduledTriggers Awaiting termination for scheduled thread pool executor
   [junit4]   2> 27012 DEBUG (TEST-TestSimTriggerIntegration.testNodeAddedTriggerRestoreState-seed#[3FBB6C55D2E91506]) [    ] o.a.s.c.a.ScheduledTriggers ScheduledTriggers closed completely
   [junit4]   2> 27012 DEBUG (TEST-TestSimTriggerIntegration.testNodeAddedTriggerRestoreState-seed#[3FBB6C55D2E91506]) [    ] o.a.s.c.a.OverseerTriggerThread OverseerTriggerThread has been closed explicitly
   [junit4]   2> 27013 INFO  (TEST-TestSimTriggerIntegration.testNodeAddedTriggerRestoreState-seed#[3FBB6C55D2E91506]) [    ] o.a.s.SolrTestCaseJ4 ###Ending testNodeAddedTriggerRestoreState
   [junit4] OK      0.06s J0 | TestSimTriggerIntegration.testNodeAddedTriggerRestoreState
   [junit4]   2> NOTE: leaving temporary files on disk at: C:\Users\jenkins\workspace\Lucene-Solr-7.x-Windows\solr\build\solr-core\test\J0\temp\solr.cloud.autoscaling.sim.TestSimTriggerIntegration_3FBB6C55D2E91506-002
   [junit4]   2> NOTE: test params are: codec=Lucene70, sim=RandomSimilarity(queryNorm=false): {}, locale=nl-NL, timezone=America/Toronto
   [junit4]   2> NOTE: Windows 10 10.0 amd64/Oracle Corporation 1.8.0_172 (64-bit)/cpus=3,threads=1,free=47714472,total=85983232
   [junit4]   2> NOTE: All tests run in this JVM: [TestSimTriggerIntegration, TestSimTriggerIntegration, TestSimTriggerIntegration]
   [junit4] Completed [5/5 (3!)] on J0 in 2.90s, 11 tests, 1 failure, 3 skipped <<< FAILURES!
   [junit4] 
   [junit4] 
   [junit4] Tests with failures [seed: 3FBB6C55D2E91506]:
   [junit4]   - org.apache.solr.cloud.autoscaling.sim.TestSimTriggerIntegration.testCooldown
   [junit4]   - org.apache.solr.cloud.autoscaling.sim.TestSimTriggerIntegration.testNodeMarkersRegistration
   [junit4]   - org.apache.solr.cloud.autoscaling.sim.TestSimTriggerIntegration.testNodeMarkersRegistration
   [junit4] 
   [junit4] 
   [junit4] JVM J0:     1.18 ..    27.90 =    26.72s
   [junit4] JVM J1:     1.14 ..    25.08 =    23.95s
   [junit4] Execution time total: 27 seconds
   [junit4] Tests summary: 5 suites, 55 tests, 3 failures, 15 ignored (15 assumptions)

BUILD FAILED
C:\Users\jenkins\workspace\Lucene-Solr-7.x-Windows\lucene\common-build.xml:1572: The following error occurred while executing this line:
C:\Users\jenkins\workspace\Lucene-Solr-7.x-Windows\lucene\common-build.xml:1099: There were test failures: 5 suites, 55 tests, 3 failures, 15 ignored (15 assumptions) [seed: 3FBB6C55D2E91506]

Total time: 30 seconds

[repro] Setting last failure code to 1

[repro] Failures:
[repro]   3/5 failed: org.apache.solr.cloud.autoscaling.sim.TestSimTriggerIntegration
[repro] Exiting with code 1

C:\Users\jenkins\workspace\Lucene-Solr-7.x-Windows>IF EXIST lucene\build move /y lucene\build lucene\build.repro 
        1 dir(s) moved.

C:\Users\jenkins\workspace\Lucene-Solr-7.x-Windows>IF EXIST solr\build move /y solr\build solr\build.repro 
        1 dir(s) moved.

C:\Users\jenkins\workspace\Lucene-Solr-7.x-Windows>IF EXIST lucene\build.orig move /y lucene\build.orig lucene\build 
        1 dir(s) moved.

C:\Users\jenkins\workspace\Lucene-Solr-7.x-Windows>IF EXIST solr\build.orig move /y solr\build.orig solr\build 
        1 dir(s) moved.

C:\Users\jenkins\workspace\Lucene-Solr-7.x-Windows>exit 0 
Archiving artifacts
Setting ANT_1_8_2_HOME=C:\Users\jenkins\tools\hudson.tasks.Ant_AntInstallation\ANT_1.8.2
[WARNINGS] Parsing warnings in console log with parser Java Compiler (javac)
Setting ANT_1_8_2_HOME=C:\Users\jenkins\tools\hudson.tasks.Ant_AntInstallation\ANT_1.8.2
Setting ANT_1_8_2_HOME=C:\Users\jenkins\tools\hudson.tasks.Ant_AntInstallation\ANT_1.8.2
<Git Blamer> Using GitBlamer to create author and commit information for all warnings.
<Git Blamer> GIT_COMMIT=acfa8a2b3386801cc972a1d99982f71305318d92, workspace=C:\Users\jenkins\workspace\Lucene-Solr-7.x-Windows
[WARNINGS] Computing warning deltas based on reference build #946
Recording test results
Setting ANT_1_8_2_HOME=C:\Users\jenkins\tools\hudson.tasks.Ant_AntInstallation\ANT_1.8.2
Build step 'Publish JUnit test result report' changed build result to UNSTABLE
Email was triggered for: Unstable (Test Failures)
Sending email for trigger: Unstable (Test Failures)
Setting ANT_1_8_2_HOME=C:\Users\jenkins\tools\hudson.tasks.Ant_AntInstallation\ANT_1.8.2
Setting ANT_1_8_2_HOME=C:\Users\jenkins\tools\hudson.tasks.Ant_AntInstallation\ANT_1.8.2
Setting ANT_1_8_2_HOME=C:\Users\jenkins\tools\hudson.tasks.Ant_AntInstallation\ANT_1.8.2
Setting ANT_1_8_2_HOME=C:\Users\jenkins\tools\hudson.tasks.Ant_AntInstallation\ANT_1.8.2

Mime
View raw message