lucene-dev mailing list archives

Site index · List index
Message view « Date » · « Thread »
Top « Date » · « Thread »
From Policeman Jenkins Server <jenk...@thetaphi.de>
Subject [JENKINS] Lucene-Solr-8.x-Solaris (64bit/jdk1.8.0) - Build # 4 - Unstable!
Date Sat, 12 Jan 2019 07:45:30 GMT
Build: https://jenkins.thetaphi.de/job/Lucene-Solr-8.x-Solaris/4/
Java: 64bit/jdk1.8.0 -XX:+UseCompressedOops -XX:+UseSerialGC

1 tests failed.
FAILED:  org.apache.solr.cloud.TestCloudRecovery2.test

Error Message:
Error from server at http://127.0.0.1:44362/solr: 3 Async exceptions during distributed update:  java.net.ConnectException: Connection refused java.net.ConnectException: Connection refused java.net.ConnectException: Connection refused

Stack Trace:
org.apache.solr.client.solrj.impl.HttpSolrClient$RemoteSolrException: Error from server at http://127.0.0.1:44362/solr: 3 Async exceptions during distributed update: 
java.net.ConnectException: Connection refused
java.net.ConnectException: Connection refused
java.net.ConnectException: Connection refused
	at __randomizedtesting.SeedInfo.seed([FD138BE537932327:7547B43F996F4EDF]:0)
	at org.apache.solr.client.solrj.impl.HttpSolrClient.executeMethod(HttpSolrClient.java:650)
	at org.apache.solr.client.solrj.impl.HttpSolrClient.request(HttpSolrClient.java:256)
	at org.apache.solr.client.solrj.impl.HttpSolrClient.request(HttpSolrClient.java:245)
	at org.apache.solr.client.solrj.SolrRequest.process(SolrRequest.java:207)
	at org.apache.solr.client.solrj.request.UpdateRequest.commit(UpdateRequest.java:237)
	at org.apache.solr.cloud.TestCloudRecovery2.test(TestCloudRecovery2.java:67)
	at sun.reflect.NativeMethodAccessorImpl.invoke0(Native Method)
	at sun.reflect.NativeMethodAccessorImpl.invoke(NativeMethodAccessorImpl.java:62)
	at sun.reflect.DelegatingMethodAccessorImpl.invoke(DelegatingMethodAccessorImpl.java:43)
	at java.lang.reflect.Method.invoke(Method.java:498)
	at com.carrotsearch.randomizedtesting.RandomizedRunner.invoke(RandomizedRunner.java:1750)
	at com.carrotsearch.randomizedtesting.RandomizedRunner$8.evaluate(RandomizedRunner.java:938)
	at com.carrotsearch.randomizedtesting.RandomizedRunner$9.evaluate(RandomizedRunner.java:974)
	at com.carrotsearch.randomizedtesting.RandomizedRunner$10.evaluate(RandomizedRunner.java:988)
	at com.carrotsearch.randomizedtesting.rules.SystemPropertiesRestoreRule$1.evaluate(SystemPropertiesRestoreRule.java:57)
	at org.apache.lucene.util.TestRuleSetupTeardownChained$1.evaluate(TestRuleSetupTeardownChained.java:49)
	at org.apache.lucene.util.AbstractBeforeAfterRule$1.evaluate(AbstractBeforeAfterRule.java:45)
	at org.apache.lucene.util.TestRuleThreadAndTestName$1.evaluate(TestRuleThreadAndTestName.java:48)
	at org.apache.lucene.util.TestRuleIgnoreAfterMaxFailures$1.evaluate(TestRuleIgnoreAfterMaxFailures.java:64)
	at org.apache.lucene.util.TestRuleMarkFailure$1.evaluate(TestRuleMarkFailure.java:47)
	at com.carrotsearch.randomizedtesting.rules.StatementAdapter.evaluate(StatementAdapter.java:36)
	at com.carrotsearch.randomizedtesting.ThreadLeakControl$StatementRunner.run(ThreadLeakControl.java:368)
	at com.carrotsearch.randomizedtesting.ThreadLeakControl.forkTimeoutingTask(ThreadLeakControl.java:817)
	at com.carrotsearch.randomizedtesting.ThreadLeakControl$3.evaluate(ThreadLeakControl.java:468)
	at com.carrotsearch.randomizedtesting.RandomizedRunner.runSingleTest(RandomizedRunner.java:947)
	at com.carrotsearch.randomizedtesting.RandomizedRunner$5.evaluate(RandomizedRunner.java:832)
	at com.carrotsearch.randomizedtesting.RandomizedRunner$6.evaluate(RandomizedRunner.java:883)
	at com.carrotsearch.randomizedtesting.RandomizedRunner$7.evaluate(RandomizedRunner.java:894)
	at com.carrotsearch.randomizedtesting.rules.StatementAdapter.evaluate(StatementAdapter.java:36)
	at com.carrotsearch.randomizedtesting.rules.SystemPropertiesRestoreRule$1.evaluate(SystemPropertiesRestoreRule.java:57)
	at org.apache.lucene.util.AbstractBeforeAfterRule$1.evaluate(AbstractBeforeAfterRule.java:45)
	at com.carrotsearch.randomizedtesting.rules.StatementAdapter.evaluate(StatementAdapter.java:36)
	at org.apache.lucene.util.TestRuleStoreClassName$1.evaluate(TestRuleStoreClassName.java:41)
	at com.carrotsearch.randomizedtesting.rules.NoShadowingOrOverridesOnMethodsRule$1.evaluate(NoShadowingOrOverridesOnMethodsRule.java:40)
	at com.carrotsearch.randomizedtesting.rules.NoShadowingOrOverridesOnMethodsRule$1.evaluate(NoShadowingOrOverridesOnMethodsRule.java:40)
	at com.carrotsearch.randomizedtesting.rules.StatementAdapter.evaluate(StatementAdapter.java:36)
	at com.carrotsearch.randomizedtesting.rules.StatementAdapter.evaluate(StatementAdapter.java:36)
	at com.carrotsearch.randomizedtesting.rules.StatementAdapter.evaluate(StatementAdapter.java:36)
	at org.apache.lucene.util.TestRuleAssertionsRequired$1.evaluate(TestRuleAssertionsRequired.java:53)
	at org.apache.lucene.util.TestRuleMarkFailure$1.evaluate(TestRuleMarkFailure.java:47)
	at org.apache.lucene.util.TestRuleIgnoreAfterMaxFailures$1.evaluate(TestRuleIgnoreAfterMaxFailures.java:64)
	at org.apache.lucene.util.TestRuleIgnoreTestSuites$1.evaluate(TestRuleIgnoreTestSuites.java:54)
	at com.carrotsearch.randomizedtesting.rules.StatementAdapter.evaluate(StatementAdapter.java:36)
	at com.carrotsearch.randomizedtesting.ThreadLeakControl$StatementRunner.run(ThreadLeakControl.java:368)
	at java.lang.Thread.run(Thread.java:748)




Build Log:
[...truncated 13901 lines...]
   [junit4] Suite: org.apache.solr.cloud.TestCloudRecovery2
   [junit4]   2> Creating dataDir: /export/home/jenkins/workspace/Lucene-Solr-8.x-Solaris/solr/build/solr-core/test/J0/temp/solr.cloud.TestCloudRecovery2_FD138BE537932327-001/init-core-data-001
   [junit4]   2> 1318847 INFO  (SUITE-TestCloudRecovery2-seed#[FD138BE537932327]-worker) [    ] o.a.s.c.MiniSolrCloudCluster Starting cluster of 2 servers in /export/home/jenkins/workspace/Lucene-Solr-8.x-Solaris/solr/build/solr-core/test/J0/temp/solr.cloud.TestCloudRecovery2_FD138BE537932327-001/tempDir-001
   [junit4]   2> 1318847 INFO  (SUITE-TestCloudRecovery2-seed#[FD138BE537932327]-worker) [    ] o.a.s.c.ZkTestServer STARTING ZK TEST SERVER
   [junit4]   2> 1318847 INFO  (ZkTestServer Run Thread) [    ] o.a.s.c.ZkTestServer client port:0.0.0.0/0.0.0.0:0
   [junit4]   2> 1318847 INFO  (ZkTestServer Run Thread) [    ] o.a.s.c.ZkTestServer Starting server
   [junit4]   2> 1318947 INFO  (SUITE-TestCloudRecovery2-seed#[FD138BE537932327]-worker) [    ] o.a.s.c.ZkTestServer start zk server on port:47980
   [junit4]   2> 1318947 INFO  (SUITE-TestCloudRecovery2-seed#[FD138BE537932327]-worker) [    ] o.a.s.c.ZkTestServer parse host and port list: 127.0.0.1:47980
   [junit4]   2> 1318947 INFO  (SUITE-TestCloudRecovery2-seed#[FD138BE537932327]-worker) [    ] o.a.s.c.ZkTestServer connecting to 127.0.0.1 47980
   [junit4]   2> 1318951 INFO  (zkConnectionManagerCallback-8738-thread-1) [    ] o.a.s.c.c.ConnectionManager zkClient has connected
   [junit4]   2> 1318955 INFO  (zkConnectionManagerCallback-8740-thread-1) [    ] o.a.s.c.c.ConnectionManager zkClient has connected
   [junit4]   2> 1318957 INFO  (zkConnectionManagerCallback-8742-thread-1) [    ] o.a.s.c.c.ConnectionManager zkClient has connected
   [junit4]   2> 1318960 WARN  (jetty-launcher-8743-thread-2) [    ] o.e.j.s.AbstractConnector Ignoring deprecated socket close linger time
   [junit4]   2> 1318960 WARN  (jetty-launcher-8743-thread-1) [    ] o.e.j.s.AbstractConnector Ignoring deprecated socket close linger time
   [junit4]   2> 1318960 INFO  (jetty-launcher-8743-thread-2) [    ] o.a.s.c.s.e.JettySolrRunner Start Jetty (original configured port=0)
   [junit4]   2> 1318960 INFO  (jetty-launcher-8743-thread-1) [    ] o.a.s.c.s.e.JettySolrRunner Start Jetty (original configured port=0)
   [junit4]   2> 1318960 INFO  (jetty-launcher-8743-thread-2) [    ] o.a.s.c.s.e.JettySolrRunner Trying to start Jetty on port 0 try number 1 ...
   [junit4]   2> 1318960 INFO  (jetty-launcher-8743-thread-1) [    ] o.a.s.c.s.e.JettySolrRunner Trying to start Jetty on port 0 try number 1 ...
   [junit4]   2> 1318961 INFO  (jetty-launcher-8743-thread-2) [    ] o.e.j.s.Server jetty-9.4.14.v20181114; built: 2018-11-14T21:20:31.478Z; git: c4550056e785fb5665914545889f21dc136ad9e6; jvm 1.8.0_191-b12
   [junit4]   2> 1318961 INFO  (jetty-launcher-8743-thread-1) [    ] o.e.j.s.Server jetty-9.4.14.v20181114; built: 2018-11-14T21:20:31.478Z; git: c4550056e785fb5665914545889f21dc136ad9e6; jvm 1.8.0_191-b12
   [junit4]   2> 1318962 INFO  (jetty-launcher-8743-thread-2) [    ] o.e.j.s.session DefaultSessionIdManager workerName=node0
   [junit4]   2> 1318962 INFO  (jetty-launcher-8743-thread-2) [    ] o.e.j.s.session No SessionScavenger set, using defaults
   [junit4]   2> 1318962 INFO  (jetty-launcher-8743-thread-2) [    ] o.e.j.s.session node0 Scavenging every 660000ms
   [junit4]   2> 1318962 INFO  (jetty-launcher-8743-thread-1) [    ] o.e.j.s.session DefaultSessionIdManager workerName=node0
   [junit4]   2> 1318962 INFO  (jetty-launcher-8743-thread-1) [    ] o.e.j.s.session No SessionScavenger set, using defaults
   [junit4]   2> 1318962 INFO  (jetty-launcher-8743-thread-1) [    ] o.e.j.s.session node0 Scavenging every 660000ms
   [junit4]   2> 1318962 INFO  (jetty-launcher-8743-thread-2) [    ] o.e.j.s.h.ContextHandler Started o.e.j.s.ServletContextHandler@731fb3ac{/solr,null,AVAILABLE}
   [junit4]   2> 1318962 INFO  (jetty-launcher-8743-thread-1) [    ] o.e.j.s.h.ContextHandler Started o.e.j.s.ServletContextHandler@60ac3677{/solr,null,AVAILABLE}
   [junit4]   2> 1318963 INFO  (jetty-launcher-8743-thread-2) [    ] o.e.j.s.AbstractConnector Started ServerConnector@f27ac32{HTTP/1.1,[http/1.1, h2c]}{127.0.0.1:37295}
   [junit4]   2> 1318963 INFO  (jetty-launcher-8743-thread-2) [    ] o.e.j.s.Server Started @1319374ms
   [junit4]   2> 1318963 INFO  (jetty-launcher-8743-thread-2) [    ] o.a.s.c.s.e.JettySolrRunner Jetty properties: {hostContext=/solr, hostPort=37295}
   [junit4]   2> 1318963 ERROR (jetty-launcher-8743-thread-2) [    ] o.a.s.u.StartupLoggingUtils Missing Java Option solr.log.dir. Logging may be missing or incomplete.
   [junit4]   2> 1318963 INFO  (jetty-launcher-8743-thread-2) [    ] o.a.s.s.SolrDispatchFilter Using logger factory org.apache.logging.slf4j.Log4jLoggerFactory
   [junit4]   2> 1318963 INFO  (jetty-launcher-8743-thread-2) [    ] o.a.s.s.SolrDispatchFilter  ___      _       Welcome to Apache Solr™ version 8.0.0
   [junit4]   2> 1318963 INFO  (jetty-launcher-8743-thread-2) [    ] o.a.s.s.SolrDispatchFilter / __| ___| |_ _   Starting in cloud mode on port null
   [junit4]   2> 1318963 INFO  (jetty-launcher-8743-thread-2) [    ] o.a.s.s.SolrDispatchFilter \__ \/ _ \ | '_|  Install dir: null
   [junit4]   2> 1318963 INFO  (jetty-launcher-8743-thread-2) [    ] o.a.s.s.SolrDispatchFilter |___/\___/_|_|    Start time: 2019-01-12T06:47:59.975Z
   [junit4]   2> 1318963 INFO  (jetty-launcher-8743-thread-1) [    ] o.e.j.s.AbstractConnector Started ServerConnector@10266d50{HTTP/1.1,[http/1.1, h2c]}{127.0.0.1:44362}
   [junit4]   2> 1318963 INFO  (jetty-launcher-8743-thread-1) [    ] o.e.j.s.Server Started @1319374ms
   [junit4]   2> 1318963 INFO  (jetty-launcher-8743-thread-1) [    ] o.a.s.c.s.e.JettySolrRunner Jetty properties: {hostContext=/solr, hostPort=44362}
   [junit4]   2> 1318963 ERROR (jetty-launcher-8743-thread-1) [    ] o.a.s.u.StartupLoggingUtils Missing Java Option solr.log.dir. Logging may be missing or incomplete.
   [junit4]   2> 1318963 INFO  (jetty-launcher-8743-thread-1) [    ] o.a.s.s.SolrDispatchFilter Using logger factory org.apache.logging.slf4j.Log4jLoggerFactory
   [junit4]   2> 1318963 INFO  (jetty-launcher-8743-thread-1) [    ] o.a.s.s.SolrDispatchFilter  ___      _       Welcome to Apache Solr™ version 8.0.0
   [junit4]   2> 1318963 INFO  (jetty-launcher-8743-thread-1) [    ] o.a.s.s.SolrDispatchFilter / __| ___| |_ _   Starting in cloud mode on port null
   [junit4]   2> 1318963 INFO  (jetty-launcher-8743-thread-1) [    ] o.a.s.s.SolrDispatchFilter \__ \/ _ \ | '_|  Install dir: null
   [junit4]   2> 1318963 INFO  (jetty-launcher-8743-thread-1) [    ] o.a.s.s.SolrDispatchFilter |___/\___/_|_|    Start time: 2019-01-12T06:47:59.975Z
   [junit4]   2> 1318965 INFO  (zkConnectionManagerCallback-8745-thread-1) [    ] o.a.s.c.c.ConnectionManager zkClient has connected
   [junit4]   2> 1318966 INFO  (zkConnectionManagerCallback-8747-thread-1) [    ] o.a.s.c.c.ConnectionManager zkClient has connected
   [junit4]   2> 1318966 INFO  (jetty-launcher-8743-thread-1) [    ] o.a.s.s.SolrDispatchFilter solr.xml found in ZooKeeper. Loading...
   [junit4]   2> 1318966 INFO  (jetty-launcher-8743-thread-2) [    ] o.a.s.s.SolrDispatchFilter solr.xml found in ZooKeeper. Loading...
   [junit4]   2> 1319697 WARN  (jetty-launcher-8743-thread-1) [    ] o.e.j.u.s.S.config No Client EndPointIdentificationAlgorithm configured for SslContextFactory@360727bf[provider=null,keyStore=null,trustStore=null]
   [junit4]   2> 1319701 WARN  (jetty-launcher-8743-thread-1) [    ] o.e.j.u.s.S.config No Client EndPointIdentificationAlgorithm configured for SslContextFactory@6a5b3b7d[provider=null,keyStore=null,trustStore=null]
   [junit4]   2> 1319703 INFO  (jetty-launcher-8743-thread-1) [    ] o.a.s.c.ZkContainer Zookeeper client=127.0.0.1:47980/solr
   [junit4]   2> 1319704 INFO  (zkConnectionManagerCallback-8753-thread-1) [    ] o.a.s.c.c.ConnectionManager zkClient has connected
   [junit4]   2> 1319708 INFO  (zkConnectionManagerCallback-8755-thread-1) [    ] o.a.s.c.c.ConnectionManager zkClient has connected
   [junit4]   2> 1319864 INFO  (jetty-launcher-8743-thread-1) [n:127.0.0.1:44362_solr    ] o.a.s.c.OverseerElectionContext I am going to be the leader 127.0.0.1:44362_solr
   [junit4]   2> 1319866 INFO  (jetty-launcher-8743-thread-1) [n:127.0.0.1:44362_solr    ] o.a.s.c.Overseer Overseer (id=72085803315101702-127.0.0.1:44362_solr-n_0000000000) starting
   [junit4]   2> 1319878 INFO  (zkConnectionManagerCallback-8762-thread-1) [    ] o.a.s.c.c.ConnectionManager zkClient has connected
   [junit4]   2> 1319882 INFO  (jetty-launcher-8743-thread-1) [n:127.0.0.1:44362_solr    ] o.a.s.c.s.i.ZkClientClusterStateProvider Cluster at 127.0.0.1:47980/solr ready
   [junit4]   2> 1319883 INFO  (OverseerStateUpdate-72085803315101702-127.0.0.1:44362_solr-n_0000000000) [n:127.0.0.1:44362_solr    ] o.a.s.c.Overseer Starting to work on the main queue : 127.0.0.1:44362_solr
   [junit4]   2> 1319883 INFO  (jetty-launcher-8743-thread-1) [n:127.0.0.1:44362_solr    ] o.a.s.c.ZkController Register node as live in ZooKeeper:/live_nodes/127.0.0.1:44362_solr
   [junit4]   2> 1319913 INFO  (jetty-launcher-8743-thread-1) [n:127.0.0.1:44362_solr    ] o.a.s.h.a.MetricsHistoryHandler No .system collection, keeping metrics history in memory.
   [junit4]   2> 1319942 INFO  (zkCallback-8754-thread-1) [    ] o.a.s.c.c.ZkStateReader Updated live nodes from ZooKeeper... (0) -> (1)
   [junit4]   2> 1319948 INFO  (zkCallback-8761-thread-1) [    ] o.a.s.c.c.ZkStateReader Updated live nodes from ZooKeeper... (0) -> (1)
   [junit4]   2> 1319957 DEBUG (OverseerAutoScalingTriggerThread-72085803315101702-127.0.0.1:44362_solr-n_0000000000) [    ] o.a.s.c.a.NodeLostTrigger NodeLostTrigger .auto_add_replicas - Initial livenodes: [127.0.0.1:44362_solr]
   [junit4]   2> 1319959 DEBUG (ScheduledTrigger-8284-thread-1) [    ] o.a.s.c.a.NodeLostTrigger Running NodeLostTrigger: .auto_add_replicas with currently live nodes: 1 and last live nodes: 1
   [junit4]   2> 1319975 INFO  (jetty-launcher-8743-thread-1) [n:127.0.0.1:44362_solr    ] o.a.s.m.r.SolrJmxReporter JMX monitoring for 'solr_44362.solr.node' (registry 'solr.node') enabled at server: com.sun.jmx.mbeanserver.JmxMBeanServer@4c07dbb7
   [junit4]   2> 1319983 INFO  (jetty-launcher-8743-thread-1) [n:127.0.0.1:44362_solr    ] o.a.s.m.r.SolrJmxReporter JMX monitoring for 'solr_44362.solr.jvm' (registry 'solr.jvm') enabled at server: com.sun.jmx.mbeanserver.JmxMBeanServer@4c07dbb7
   [junit4]   2> 1319983 INFO  (jetty-launcher-8743-thread-1) [n:127.0.0.1:44362_solr    ] o.a.s.m.r.SolrJmxReporter JMX monitoring for 'solr_44362.solr.jetty' (registry 'solr.jetty') enabled at server: com.sun.jmx.mbeanserver.JmxMBeanServer@4c07dbb7
   [junit4]   2> 1319984 INFO  (jetty-launcher-8743-thread-1) [n:127.0.0.1:44362_solr    ] o.a.s.c.CorePropertiesLocator Found 0 core definitions underneath /export/home/jenkins/workspace/Lucene-Solr-8.x-Solaris/solr/build/solr-core/test/J0/temp/solr.cloud.TestCloudRecovery2_FD138BE537932327-001/tempDir-001/node1/.
   [junit4]   2> 1320977 DEBUG (ScheduledTrigger-8284-thread-2) [    ] o.a.s.c.a.NodeLostTrigger Running NodeLostTrigger: .auto_add_replicas with currently live nodes: 1 and last live nodes: 1
   [junit4]   2> 1321889 WARN  (jetty-launcher-8743-thread-2) [    ] o.e.j.u.s.S.config No Client EndPointIdentificationAlgorithm configured for SslContextFactory@43ab139d[provider=null,keyStore=null,trustStore=null]
   [junit4]   2> 1321892 WARN  (jetty-launcher-8743-thread-2) [    ] o.e.j.u.s.S.config No Client EndPointIdentificationAlgorithm configured for SslContextFactory@62cb23be[provider=null,keyStore=null,trustStore=null]
   [junit4]   2> 1321893 INFO  (jetty-launcher-8743-thread-2) [    ] o.a.s.c.ZkContainer Zookeeper client=127.0.0.1:47980/solr
   [junit4]   2> 1321895 INFO  (zkConnectionManagerCallback-8769-thread-1) [    ] o.a.s.c.c.ConnectionManager zkClient has connected
   [junit4]   2> 1321898 INFO  (zkConnectionManagerCallback-8771-thread-1) [    ] o.a.s.c.c.ConnectionManager zkClient has connected
   [junit4]   2> 1321906 INFO  (jetty-launcher-8743-thread-2) [n:127.0.0.1:37295_solr    ] o.a.s.c.c.ZkStateReader Updated live nodes from ZooKeeper... (0) -> (1)
   [junit4]   2> 1321911 INFO  (jetty-launcher-8743-thread-2) [n:127.0.0.1:37295_solr    ] o.a.s.c.ZkController Publish node=127.0.0.1:37295_solr as DOWN
   [junit4]   2> 1321912 INFO  (jetty-launcher-8743-thread-2) [n:127.0.0.1:37295_solr    ] o.a.s.c.TransientSolrCoreCacheDefault Allocating transient cache for 2147483647 transient cores
   [junit4]   2> 1321913 INFO  (jetty-launcher-8743-thread-2) [n:127.0.0.1:37295_solr    ] o.a.s.c.ZkController Register node as live in ZooKeeper:/live_nodes/127.0.0.1:37295_solr
   [junit4]   2> 1321914 INFO  (zkCallback-8761-thread-1) [    ] o.a.s.c.c.ZkStateReader Updated live nodes from ZooKeeper... (1) -> (2)
   [junit4]   2> 1321914 INFO  (zkCallback-8754-thread-1) [    ] o.a.s.c.c.ZkStateReader Updated live nodes from ZooKeeper... (1) -> (2)
   [junit4]   2> 1321915 INFO  (zkCallback-8770-thread-1) [    ] o.a.s.c.c.ZkStateReader Updated live nodes from ZooKeeper... (1) -> (2)
   [junit4]   2> 1321936 INFO  (zkConnectionManagerCallback-8778-thread-1) [    ] o.a.s.c.c.ConnectionManager zkClient has connected
   [junit4]   2> 1321937 INFO  (jetty-launcher-8743-thread-2) [n:127.0.0.1:37295_solr    ] o.a.s.c.c.ZkStateReader Updated live nodes from ZooKeeper... (0) -> (2)
   [junit4]   2> 1321939 INFO  (jetty-launcher-8743-thread-2) [n:127.0.0.1:37295_solr    ] o.a.s.c.s.i.ZkClientClusterStateProvider Cluster at 127.0.0.1:47980/solr ready
   [junit4]   2> 1321939 INFO  (jetty-launcher-8743-thread-2) [n:127.0.0.1:37295_solr    ] o.a.s.h.a.MetricsHistoryHandler No .system collection, keeping metrics history in memory.
   [junit4]   2> 1321956 INFO  (jetty-launcher-8743-thread-2) [n:127.0.0.1:37295_solr    ] o.a.s.m.r.SolrJmxReporter JMX monitoring for 'solr_37295.solr.node' (registry 'solr.node') enabled at server: com.sun.jmx.mbeanserver.JmxMBeanServer@4c07dbb7
   [junit4]   2> 1321963 INFO  (jetty-launcher-8743-thread-2) [n:127.0.0.1:37295_solr    ] o.a.s.m.r.SolrJmxReporter JMX monitoring for 'solr_37295.solr.jvm' (registry 'solr.jvm') enabled at server: com.sun.jmx.mbeanserver.JmxMBeanServer@4c07dbb7
   [junit4]   2> 1321963 INFO  (jetty-launcher-8743-thread-2) [n:127.0.0.1:37295_solr    ] o.a.s.m.r.SolrJmxReporter JMX monitoring for 'solr_37295.solr.jetty' (registry 'solr.jetty') enabled at server: com.sun.jmx.mbeanserver.JmxMBeanServer@4c07dbb7
   [junit4]   2> 1321964 INFO  (jetty-launcher-8743-thread-2) [n:127.0.0.1:37295_solr    ] o.a.s.c.CorePropertiesLocator Found 0 core definitions underneath /export/home/jenkins/workspace/Lucene-Solr-8.x-Solaris/solr/build/solr-core/test/J0/temp/solr.cloud.TestCloudRecovery2_FD138BE537932327-001/tempDir-001/node2/.
   [junit4]   2> 1321977 DEBUG (ScheduledTrigger-8284-thread-1) [    ] o.a.s.c.a.NodeLostTrigger Running NodeLostTrigger: .auto_add_replicas with currently live nodes: 2 and last live nodes: 1
   [junit4]   2> 1322001 INFO  (zkConnectionManagerCallback-8784-thread-1) [    ] o.a.s.c.c.ConnectionManager zkClient has connected
   [junit4]   2> 1322003 INFO  (SUITE-TestCloudRecovery2-seed#[FD138BE537932327]-worker) [    ] o.a.s.c.c.ZkStateReader Updated live nodes from ZooKeeper... (0) -> (2)
   [junit4]   2> 1322005 INFO  (SUITE-TestCloudRecovery2-seed#[FD138BE537932327]-worker) [    ] o.a.s.c.s.i.ZkClientClusterStateProvider Cluster at 127.0.0.1:47980/solr ready
   [junit4]   2> 1322010 INFO  (qtp1736642649-27538) [n:127.0.0.1:37295_solr    ] o.a.s.h.a.CollectionsHandler Invoked Collection Action :create with params collection.configName=config&maxShardsPerNode=2&name=collection1&nrtReplicas=2&action=CREATE&numShards=1&wt=javabin&version=2 and sendToOCPQueue=true
   [junit4]   2> 1322014 INFO  (OverseerThreadFactory-8286-thread-1-processing-n:127.0.0.1:44362_solr) [n:127.0.0.1:44362_solr    ] o.a.s.c.a.c.CreateCollectionCmd Create collection collection1
   [junit4]   2> 1322125 INFO  (qtp1736642649-27541) [n:127.0.0.1:37295_solr    ] o.a.s.s.HttpSolrCall [admin] webapp=null path=/admin/metrics params={prefix=CONTAINER.fs.usableSpace,CONTAINER.fs.totalSpace,CORE.coreName&wt=javabin&version=2&group=solr.node,solr.core} status=0 QTime=0
   [junit4]   2> 1322127 INFO  (qtp1736642649-27542) [n:127.0.0.1:37295_solr    ] o.a.s.s.HttpSolrCall [admin] webapp=null path=/admin/metrics params={prefix=CONTAINER.fs.usableSpace,CONTAINER.fs.totalSpace,CORE.coreName&wt=javabin&version=2&group=solr.node,solr.core} status=0 QTime=0
   [junit4]   2> 1322129 INFO  (qtp1736642649-27543) [n:127.0.0.1:37295_solr    ] o.a.s.s.HttpSolrCall [admin] webapp=null path=/admin/metrics params={prefix=CONTAINER.fs.usableSpace,CONTAINER.fs.totalSpace,CORE.coreName&wt=javabin&version=2&group=solr.node,solr.core} status=0 QTime=0
   [junit4]   2> 1322130 INFO  (qtp1736642649-27537) [n:127.0.0.1:37295_solr    ] o.a.s.s.HttpSolrCall [admin] webapp=null path=/admin/metrics params={prefix=CONTAINER.fs.usableSpace,CONTAINER.fs.totalSpace,CORE.coreName&wt=javabin&version=2&group=solr.node,solr.core} status=0 QTime=0
   [junit4]   2> 1322131 INFO  (qtp1736642649-27539) [n:127.0.0.1:37295_solr    ] o.a.s.s.HttpSolrCall [admin] webapp=null path=/admin/metrics params={prefix=CONTAINER.fs.usableSpace,CONTAINER.fs.totalSpace,CORE.coreName&wt=javabin&version=2&group=solr.node,solr.core} status=0 QTime=0
   [junit4]   2> 1322133 INFO  (qtp1740512968-27545) [n:127.0.0.1:44362_solr    ] o.a.s.s.HttpSolrCall [admin] webapp=null path=/admin/metrics params={prefix=CONTAINER.fs.usableSpace,CONTAINER.fs.totalSpace,CORE.coreName&wt=javabin&version=2&group=solr.node,solr.core} status=0 QTime=0
   [junit4]   2> 1322135 INFO  (qtp1740512968-27547) [n:127.0.0.1:44362_solr    ] o.a.s.s.HttpSolrCall [admin] webapp=null path=/admin/metrics params={prefix=CONTAINER.fs.usableSpace,CONTAINER.fs.totalSpace,CORE.coreName&wt=javabin&version=2&group=solr.node,solr.core} status=0 QTime=0
   [junit4]   2> 1322136 INFO  (qtp1740512968-27548) [n:127.0.0.1:44362_solr    ] o.a.s.s.HttpSolrCall [admin] webapp=null path=/admin/metrics params={prefix=CONTAINER.fs.usableSpace,CONTAINER.fs.totalSpace,CORE.coreName&wt=javabin&version=2&group=solr.node,solr.core} status=0 QTime=0
   [junit4]   2> 1322136 INFO  (qtp1740512968-27546) [n:127.0.0.1:44362_solr    ] o.a.s.s.HttpSolrCall [admin] webapp=null path=/admin/metrics params={prefix=CONTAINER.fs.usableSpace,CONTAINER.fs.totalSpace,CORE.coreName&wt=javabin&version=2&group=solr.node,solr.core} status=0 QTime=0
   [junit4]   2> 1322137 INFO  (qtp1740512968-27535) [n:127.0.0.1:44362_solr    ] o.a.s.s.HttpSolrCall [admin] webapp=null path=/admin/metrics params={prefix=CONTAINER.fs.usableSpace,CONTAINER.fs.totalSpace,CORE.coreName&wt=javabin&version=2&group=solr.node,solr.core} status=0 QTime=0
   [junit4]   2> 1322146 INFO  (OverseerStateUpdate-72085803315101702-127.0.0.1:44362_solr-n_0000000000) [n:127.0.0.1:44362_solr    ] o.a.s.c.o.SliceMutator createReplica() {
   [junit4]   2>   "operation":"ADDREPLICA",
   [junit4]   2>   "collection":"collection1",
   [junit4]   2>   "shard":"shard1",
   [junit4]   2>   "core":"collection1_shard1_replica_n1",
   [junit4]   2>   "state":"down",
   [junit4]   2>   "base_url":"http://127.0.0.1:44362/solr",
   [junit4]   2>   "type":"NRT",
   [junit4]   2>   "waitForFinalState":"false"} 
   [junit4]   2> 1322148 INFO  (OverseerStateUpdate-72085803315101702-127.0.0.1:44362_solr-n_0000000000) [n:127.0.0.1:44362_solr    ] o.a.s.c.o.SliceMutator createReplica() {
   [junit4]   2>   "operation":"ADDREPLICA",
   [junit4]   2>   "collection":"collection1",
   [junit4]   2>   "shard":"shard1",
   [junit4]   2>   "core":"collection1_shard1_replica_n2",
   [junit4]   2>   "state":"down",
   [junit4]   2>   "base_url":"http://127.0.0.1:37295/solr",
   [junit4]   2>   "type":"NRT",
   [junit4]   2>   "waitForFinalState":"false"} 
   [junit4]   2> 1322351 INFO  (qtp1736642649-27541) [n:127.0.0.1:37295_solr    x:collection1_shard1_replica_n2] o.a.s.h.a.CoreAdminOperation core create command qt=/admin/cores&coreNodeName=core_node4&collection.configName=config&newCollection=true&name=collection1_shard1_replica_n2&action=CREATE&numShards=1&collection=collection1&shard=shard1&wt=javabin&version=2&replicaType=NRT
   [junit4]   2> 1322351 INFO  (qtp1740512968-27544) [n:127.0.0.1:44362_solr    x:collection1_shard1_replica_n1] o.a.s.h.a.CoreAdminOperation core create command qt=/admin/cores&coreNodeName=core_node3&collection.configName=config&newCollection=true&name=collection1_shard1_replica_n1&action=CREATE&numShards=1&collection=collection1&shard=shard1&wt=javabin&version=2&replicaType=NRT
   [junit4]   2> 1322351 INFO  (qtp1740512968-27544) [n:127.0.0.1:44362_solr    x:collection1_shard1_replica_n1] o.a.s.c.TransientSolrCoreCacheDefault Allocating transient cache for 2147483647 transient cores
   [junit4]   2> 1322997 DEBUG (ScheduledTrigger-8284-thread-2) [    ] o.a.s.c.a.NodeLostTrigger Running NodeLostTrigger: .auto_add_replicas with currently live nodes: 2 and last live nodes: 2
   [junit4]   2> 1323366 INFO  (qtp1736642649-27541) [n:127.0.0.1:37295_solr c:collection1 s:shard1 r:core_node4 x:collection1_shard1_replica_n2] o.a.s.c.SolrConfig Using Lucene MatchVersion: 8.0.0
   [junit4]   2> 1323366 INFO  (qtp1740512968-27544) [n:127.0.0.1:44362_solr c:collection1 s:shard1 r:core_node3 x:collection1_shard1_replica_n1] o.a.s.c.SolrConfig Using Lucene MatchVersion: 8.0.0
   [junit4]   2> 1323373 INFO  (qtp1736642649-27541) [n:127.0.0.1:37295_solr c:collection1 s:shard1 r:core_node4 x:collection1_shard1_replica_n2] o.a.s.s.IndexSchema [collection1_shard1_replica_n2] Schema name=minimal
   [junit4]   2> 1323374 INFO  (qtp1736642649-27541) [n:127.0.0.1:37295_solr c:collection1 s:shard1 r:core_node4 x:collection1_shard1_replica_n2] o.a.s.s.IndexSchema Loaded schema minimal/1.1 with uniqueid field id
   [junit4]   2> 1323375 INFO  (qtp1736642649-27541) [n:127.0.0.1:37295_solr c:collection1 s:shard1 r:core_node4 x:collection1_shard1_replica_n2] o.a.s.c.CoreContainer Creating SolrCore 'collection1_shard1_replica_n2' using configuration from collection collection1, trusted=true
   [junit4]   2> 1323375 INFO  (qtp1736642649-27541) [n:127.0.0.1:37295_solr c:collection1 s:shard1 r:core_node4 x:collection1_shard1_replica_n2] o.a.s.m.r.SolrJmxReporter JMX monitoring for 'solr_37295.solr.core.collection1.shard1.replica_n2' (registry 'solr.core.collection1.shard1.replica_n2') enabled at server: com.sun.jmx.mbeanserver.JmxMBeanServer@4c07dbb7
   [junit4]   2> 1323375 INFO  (qtp1736642649-27541) [n:127.0.0.1:37295_solr c:collection1 s:shard1 r:core_node4 x:collection1_shard1_replica_n2] o.a.s.c.SolrCore [[collection1_shard1_replica_n2] ] Opening new SolrCore at [/export/home/jenkins/workspace/Lucene-Solr-8.x-Solaris/solr/build/solr-core/test/J0/temp/solr.cloud.TestCloudRecovery2_FD138BE537932327-001/tempDir-001/node2/collection1_shard1_replica_n2], dataDir=[/export/home/jenkins/workspace/Lucene-Solr-8.x-Solaris/solr/build/solr-core/test/J0/temp/solr.cloud.TestCloudRecovery2_FD138BE537932327-001/tempDir-001/node2/./collection1_shard1_replica_n2/data/]
   [junit4]   2> 1323377 INFO  (qtp1740512968-27544) [n:127.0.0.1:44362_solr c:collection1 s:shard1 r:core_node3 x:collection1_shard1_replica_n1] o.a.s.s.IndexSchema [collection1_shard1_replica_n1] Schema name=minimal
   [junit4]   2> 1323388 INFO  (qtp1740512968-27544) [n:127.0.0.1:44362_solr c:collection1 s:shard1 r:core_node3 x:collection1_shard1_replica_n1] o.a.s.s.IndexSchema Loaded schema minimal/1.1 with uniqueid field id
   [junit4]   2> 1323388 INFO  (qtp1740512968-27544) [n:127.0.0.1:44362_solr c:collection1 s:shard1 r:core_node3 x:collection1_shard1_replica_n1] o.a.s.c.CoreContainer Creating SolrCore 'collection1_shard1_replica_n1' using configuration from collection collection1, trusted=true
   [junit4]   2> 1323388 INFO  (qtp1740512968-27544) [n:127.0.0.1:44362_solr c:collection1 s:shard1 r:core_node3 x:collection1_shard1_replica_n1] o.a.s.m.r.SolrJmxReporter JMX monitoring for 'solr_44362.solr.core.collection1.shard1.replica_n1' (registry 'solr.core.collection1.shard1.replica_n1') enabled at server: com.sun.jmx.mbeanserver.JmxMBeanServer@4c07dbb7
   [junit4]   2> 1323388 INFO  (qtp1740512968-27544) [n:127.0.0.1:44362_solr c:collection1 s:shard1 r:core_node3 x:collection1_shard1_replica_n1] o.a.s.c.SolrCore [[collection1_shard1_replica_n1] ] Opening new SolrCore at [/export/home/jenkins/workspace/Lucene-Solr-8.x-Solaris/solr/build/solr-core/test/J0/temp/solr.cloud.TestCloudRecovery2_FD138BE537932327-001/tempDir-001/node1/collection1_shard1_replica_n1], dataDir=[/export/home/jenkins/workspace/Lucene-Solr-8.x-Solaris/solr/build/solr-core/test/J0/temp/solr.cloud.TestCloudRecovery2_FD138BE537932327-001/tempDir-001/node1/./collection1_shard1_replica_n1/data/]
   [junit4]   2> 1323444 INFO  (qtp1736642649-27541) [n:127.0.0.1:37295_solr c:collection1 s:shard1 r:core_node4 x:collection1_shard1_replica_n2] o.a.s.u.UpdateHandler Using UpdateLog implementation: org.apache.solr.update.UpdateLog
   [junit4]   2> 1323444 INFO  (qtp1736642649-27541) [n:127.0.0.1:37295_solr c:collection1 s:shard1 r:core_node4 x:collection1_shard1_replica_n2] o.a.s.u.UpdateLog Initializing UpdateLog: dataDir=null defaultSyncLevel=FLUSH numRecordsToKeep=100 maxNumLogsToKeep=10 numVersionBuckets=65536
   [junit4]   2> 1323446 INFO  (qtp1736642649-27541) [n:127.0.0.1:37295_solr c:collection1 s:shard1 r:core_node4 x:collection1_shard1_replica_n2] o.a.s.u.CommitTracker Hard AutoCommit: disabled
   [junit4]   2> 1323446 INFO  (qtp1736642649-27541) [n:127.0.0.1:37295_solr c:collection1 s:shard1 r:core_node4 x:collection1_shard1_replica_n2] o.a.s.u.CommitTracker Soft AutoCommit: disabled
   [junit4]   2> 1323447 INFO  (qtp1740512968-27544) [n:127.0.0.1:44362_solr c:collection1 s:shard1 r:core_node3 x:collection1_shard1_replica_n1] o.a.s.u.UpdateHandler Using UpdateLog implementation: org.apache.solr.update.UpdateLog
   [junit4]   2> 1323447 INFO  (qtp1740512968-27544) [n:127.0.0.1:44362_solr c:collection1 s:shard1 r:core_node3 x:collection1_shard1_replica_n1] o.a.s.u.UpdateLog Initializing UpdateLog: dataDir=null defaultSyncLevel=FLUSH numRecordsToKeep=100 maxNumLogsToKeep=10 numVersionBuckets=65536
   [junit4]   2> 1323448 INFO  (qtp1736642649-27541) [n:127.0.0.1:37295_solr c:collection1 s:shard1 r:core_node4 x:collection1_shard1_replica_n2] o.a.s.s.SolrIndexSearcher Opening [Searcher@622aa187[collection1_shard1_replica_n2] main]
   [junit4]   2> 1323449 INFO  (qtp1740512968-27544) [n:127.0.0.1:44362_solr c:collection1 s:shard1 r:core_node3 x:collection1_shard1_replica_n1] o.a.s.u.CommitTracker Hard AutoCommit: disabled
   [junit4]   2> 1323449 INFO  (qtp1740512968-27544) [n:127.0.0.1:44362_solr c:collection1 s:shard1 r:core_node3 x:collection1_shard1_replica_n1] o.a.s.u.CommitTracker Soft AutoCommit: disabled
   [junit4]   2> 1323449 INFO  (qtp1736642649-27541) [n:127.0.0.1:37295_solr c:collection1 s:shard1 r:core_node4 x:collection1_shard1_replica_n2] o.a.s.r.ManagedResourceStorage Configured ZooKeeperStorageIO with znodeBase: /configs/config
   [junit4]   2> 1323450 INFO  (qtp1736642649-27541) [n:127.0.0.1:37295_solr c:collection1 s:shard1 r:core_node4 x:collection1_shard1_replica_n2] o.a.s.r.ManagedResourceStorage Loaded null at path _rest_managed.json using ZooKeeperStorageIO:path=/configs/config
   [junit4]   2> 1323450 INFO  (qtp1740512968-27544) [n:127.0.0.1:44362_solr c:collection1 s:shard1 r:core_node3 x:collection1_shard1_replica_n1] o.a.s.s.SolrIndexSearcher Opening [Searcher@47a9d86e[collection1_shard1_replica_n1] main]
   [junit4]   2> 1323450 INFO  (qtp1736642649-27541) [n:127.0.0.1:37295_solr c:collection1 s:shard1 r:core_node4 x:collection1_shard1_replica_n2] o.a.s.h.ReplicationHandler Commits will be reserved for 10000ms.
   [junit4]   2> 1323450 INFO  (qtp1736642649-27541) [n:127.0.0.1:37295_solr c:collection1 s:shard1 r:core_node4 x:collection1_shard1_replica_n2] o.a.s.u.UpdateLog Could not find max version in index or recent updates, using new clock 1622436148110426112
   [junit4]   2> 1323451 INFO  (qtp1740512968-27544) [n:127.0.0.1:44362_solr c:collection1 s:shard1 r:core_node3 x:collection1_shard1_replica_n1] o.a.s.r.ManagedResourceStorage Configured ZooKeeperStorageIO with znodeBase: /configs/config
   [junit4]   2> 1323452 INFO  (qtp1740512968-27544) [n:127.0.0.1:44362_solr c:collection1 s:shard1 r:core_node3 x:collection1_shard1_replica_n1] o.a.s.r.ManagedResourceStorage Loaded null at path _rest_managed.json using ZooKeeperStorageIO:path=/configs/config
   [junit4]   2> 1323452 INFO  (qtp1740512968-27544) [n:127.0.0.1:44362_solr c:collection1 s:shard1 r:core_node3 x:collection1_shard1_replica_n1] o.a.s.h.ReplicationHandler Commits will be reserved for 10000ms.
   [junit4]   2> 1323453 INFO  (qtp1740512968-27544) [n:127.0.0.1:44362_solr c:collection1 s:shard1 r:core_node3 x:collection1_shard1_replica_n1] o.a.s.u.UpdateLog Could not find max version in index or recent updates, using new clock 1622436148113571840
   [junit4]   2> 1323453 INFO  (searcherExecutor-8298-thread-1-processing-n:127.0.0.1:37295_solr x:collection1_shard1_replica_n2 c:collection1 s:shard1 r:core_node4) [n:127.0.0.1:37295_solr c:collection1 s:shard1 r:core_node4 x:collection1_shard1_replica_n2] o.a.s.c.SolrCore [collection1_shard1_replica_n2] Registered new searcher Searcher@622aa187[collection1_shard1_replica_n2] main{ExitableDirectoryReader(UninvertingDirectoryReader())}
   [junit4]   2> 1323456 INFO  (searcherExecutor-8299-thread-1-processing-n:127.0.0.1:44362_solr x:collection1_shard1_replica_n1 c:collection1 s:shard1 r:core_node3) [n:127.0.0.1:44362_solr c:collection1 s:shard1 r:core_node3 x:collection1_shard1_replica_n1] o.a.s.c.SolrCore [collection1_shard1_replica_n1] Registered new searcher Searcher@47a9d86e[collection1_shard1_replica_n1] main{ExitableDirectoryReader(UninvertingDirectoryReader())}
   [junit4]   2> 1323457 INFO  (qtp1736642649-27541) [n:127.0.0.1:37295_solr c:collection1 s:shard1 r:core_node4 x:collection1_shard1_replica_n2] o.a.s.c.ZkShardTerms Successful update of terms at /collections/collection1/terms/shard1 to Terms{values={core_node4=0}, version=0}
   [junit4]   2> 1323457 INFO  (qtp1736642649-27541) [n:127.0.0.1:37295_solr c:collection1 s:shard1 r:core_node4 x:collection1_shard1_replica_n2] o.a.s.c.ShardLeaderElectionContextBase make sure parent is created /collections/collection1/leaders/shard1
   [junit4]   2> 1323463 INFO  (qtp1740512968-27544) [n:127.0.0.1:44362_solr c:collection1 s:shard1 r:core_node3 x:collection1_shard1_replica_n1] o.a.s.c.ZkShardTerms Successful update of terms at /collections/collection1/terms/shard1 to Terms{values={core_node3=0, core_node4=0}, version=1}
   [junit4]   2> 1323464 INFO  (qtp1740512968-27544) [n:127.0.0.1:44362_solr c:collection1 s:shard1 r:core_node3 x:collection1_shard1_replica_n1] o.a.s.c.ShardLeaderElectionContextBase make sure parent is created /collections/collection1/leaders/shard1
   [junit4]   2> 1323464 INFO  (qtp1736642649-27541) [n:127.0.0.1:37295_solr c:collection1 s:shard1 r:core_node4 x:collection1_shard1_replica_n2] o.a.s.c.ShardLeaderElectionContext Waiting until we see more replicas up for shard shard1: total=2 found=1 timeoutin=9998ms
   [junit4]   2> 1323966 INFO  (qtp1736642649-27541) [n:127.0.0.1:37295_solr c:collection1 s:shard1 r:core_node4 x:collection1_shard1_replica_n2] o.a.s.c.ShardLeaderElectionContext Enough replicas found to continue.
   [junit4]   2> 1323966 INFO  (qtp1736642649-27541) [n:127.0.0.1:37295_solr c:collection1 s:shard1 r:core_node4 x:collection1_shard1_replica_n2] o.a.s.c.ShardLeaderElectionContext I may be the new leader - try and sync
   [junit4]   2> 1323966 INFO  (qtp1736642649-27541) [n:127.0.0.1:37295_solr c:collection1 s:shard1 r:core_node4 x:collection1_shard1_replica_n2] o.a.s.c.SyncStrategy Sync replicas to http://127.0.0.1:37295/solr/collection1_shard1_replica_n2/
   [junit4]   2> 1323967 INFO  (qtp1736642649-27541) [n:127.0.0.1:37295_solr c:collection1 s:shard1 r:core_node4 x:collection1_shard1_replica_n2] o.a.s.u.PeerSync PeerSync: core=collection1_shard1_replica_n2 url=http://127.0.0.1:37295/solr START replicas=[http://127.0.0.1:44362/solr/collection1_shard1_replica_n1/] nUpdates=100
   [junit4]   2> 1323968 INFO  (qtp1736642649-27541) [n:127.0.0.1:37295_solr c:collection1 s:shard1 r:core_node4 x:collection1_shard1_replica_n2] o.a.s.u.PeerSync PeerSync: core=collection1_shard1_replica_n2 url=http://127.0.0.1:37295/solr DONE.  We have no versions.  sync failed.
   [junit4]   2> 1323969 INFO  (qtp1740512968-27547) [n:127.0.0.1:44362_solr c:collection1 s:shard1 r:core_node3 x:collection1_shard1_replica_n1] o.a.s.c.S.Request [collection1_shard1_replica_n1]  webapp=/solr path=/get params={distrib=false&qt=/get&fingerprint=false&getVersions=100&wt=javabin&version=2} status=0 QTime=0
   [junit4]   2> 1323970 INFO  (qtp1736642649-27541) [n:127.0.0.1:37295_solr c:collection1 s:shard1 r:core_node4 x:collection1_shard1_replica_n2] o.a.s.c.SyncStrategy Leader's attempt to sync with shard failed, moving to the next candidate
   [junit4]   2> 1323970 INFO  (qtp1736642649-27541) [n:127.0.0.1:37295_solr c:collection1 s:shard1 r:core_node4 x:collection1_shard1_replica_n2] o.a.s.c.ShardLeaderElectionContext We failed sync, but we have no versions - we can't sync in that case - we were active before, so become leader anyway
   [junit4]   2> 1323970 INFO  (qtp1736642649-27541) [n:127.0.0.1:37295_solr c:collection1 s:shard1 r:core_node4 x:collection1_shard1_replica_n2] o.a.s.c.ShardLeaderElectionContextBase Creating leader registration node /collections/collection1/leaders/shard1/leader after winning as /collections/collection1/leader_elect/shard1/election/72085803315101705-core_node4-n_0000000000
   [junit4]   2> 1323972 INFO  (qtp1736642649-27541) [n:127.0.0.1:37295_solr c:collection1 s:shard1 r:core_node4 x:collection1_shard1_replica_n2] o.a.s.c.ShardLeaderElectionContext I am the new leader: http://127.0.0.1:37295/solr/collection1_shard1_replica_n2/ shard1
   [junit4]   2> 1323997 DEBUG (ScheduledTrigger-8284-thread-1) [    ] o.a.s.c.a.NodeLostTrigger Running NodeLostTrigger: .auto_add_replicas with currently live nodes: 2 and last live nodes: 2
   [junit4]   2> 1324074 INFO  (zkCallback-8770-thread-1) [    ] o.a.s.c.c.ZkStateReader A cluster state change: [WatchedEvent state:SyncConnected type:NodeDataChanged path:/collections/collection1/state.json] for collection [collection1] has occurred - updating... (live nodes size: [2])
   [junit4]   2> 1324078 INFO  (qtp1736642649-27541) [n:127.0.0.1:37295_solr c:collection1 s:shard1 r:core_node4 x:collection1_shard1_replica_n2] o.a.s.c.ZkController I am the leader, no recovery necessary
   [junit4]   2> 1324097 INFO  (qtp1736642649-27541) [n:127.0.0.1:37295_solr c:collection1 s:shard1 r:core_node4 x:collection1_shard1_replica_n2] o.a.s.s.HttpSolrCall [admin] webapp=null path=/admin/cores params={qt=/admin/cores&coreNodeName=core_node4&collection.configName=config&newCollection=true&name=collection1_shard1_replica_n2&action=CREATE&numShards=1&collection=collection1&shard=shard1&wt=javabin&version=2&replicaType=NRT} status=0 QTime=1746
   [junit4]   2> 1324181 INFO  (zkCallback-8770-thread-1) [    ] o.a.s.c.c.ZkStateReader A cluster state change: [WatchedEvent state:SyncConnected type:NodeDataChanged path:/collections/collection1/state.json] for collection [collection1] has occurred - updating... (live nodes size: [2])
   [junit4]   2> 1324181 INFO  (zkCallback-8770-thread-2) [    ] o.a.s.c.c.ZkStateReader A cluster state change: [WatchedEvent state:SyncConnected type:NodeDataChanged path:/collections/collection1/state.json] for collection [collection1] has occurred - updating... (live nodes size: [2])
   [junit4]   2> 1324471 INFO  (qtp1740512968-27544) [n:127.0.0.1:44362_solr c:collection1 s:shard1 r:core_node3 x:collection1_shard1_replica_n1] o.a.s.s.HttpSolrCall [admin] webapp=null path=/admin/cores params={qt=/admin/cores&coreNodeName=core_node3&collection.configName=config&newCollection=true&name=collection1_shard1_replica_n1&action=CREATE&numShards=1&collection=collection1&shard=shard1&wt=javabin&version=2&replicaType=NRT} status=0 QTime=2121
   [junit4]   2> 1324474 INFO  (qtp1736642649-27538) [n:127.0.0.1:37295_solr    ] o.a.s.h.a.CollectionsHandler Wait for new collection to be active for at most 45 seconds. Check all shard replicas
   [junit4]   2> 1324573 INFO  (zkCallback-8754-thread-1) [    ] o.a.s.c.c.ZkStateReader A cluster state change: [WatchedEvent state:SyncConnected type:NodeDataChanged path:/collections/collection1/state.json] for collection [collection1] has occurred - updating... (live nodes size: [2])
   [junit4]   2> 1324573 INFO  (zkCallback-8770-thread-1) [    ] o.a.s.c.c.ZkStateReader A cluster state change: [WatchedEvent state:SyncConnected type:NodeDataChanged path:/collections/collection1/state.json] for collection [collection1] has occurred - updating... (live nodes size: [2])
   [junit4]   2> 1324573 INFO  (zkCallback-8770-thread-2) [    ] o.a.s.c.c.ZkStateReader A cluster state change: [WatchedEvent state:SyncConnected type:NodeDataChanged path:/collections/collection1/state.json] for collection [collection1] has occurred - updating... (live nodes size: [2])
   [junit4]   2> 1324573 INFO  (zkCallback-8754-thread-2) [    ] o.a.s.c.c.ZkStateReader A cluster state change: [WatchedEvent state:SyncConnected type:NodeDataChanged path:/collections/collection1/state.json] for collection [collection1] has occurred - updating... (live nodes size: [2])
   [junit4]   2> 1324574 INFO  (qtp1736642649-27538) [n:127.0.0.1:37295_solr    ] o.a.s.s.HttpSolrCall [admin] webapp=null path=/admin/collections params={collection.configName=config&maxShardsPerNode=2&name=collection1&nrtReplicas=2&action=CREATE&numShards=1&wt=javabin&version=2} status=0 QTime=2564
   [junit4]   2> 1324574 INFO  (SUITE-TestCloudRecovery2-seed#[FD138BE537932327]-worker) [    ] o.a.s.c.AbstractDistribZkTestBase Wait for recoveries to finish - collection: collection1 failOnTimeout:true timeout (sec):30
   [junit4]   2> 1324575 INFO  (SUITE-TestCloudRecovery2-seed#[FD138BE537932327]-worker) [    ] o.a.s.c.AbstractDistribZkTestBase Recoveries finished - collection: collection1
   [junit4]   2> 1324609 INFO  (TEST-TestCloudRecovery2.test-seed#[FD138BE537932327]) [    ] o.a.s.c.CoreContainer Shutting down CoreContainer instance=1696621440
   [junit4]   2> 1324609 INFO  (TEST-TestCloudRecovery2.test-seed#[FD138BE537932327]) [    ] o.a.s.c.ZkController Remove node as live in ZooKeeper:/live_nodes/127.0.0.1:37295_solr
   [junit4]   2> 1324609 INFO  (TEST-TestCloudRecovery2.test-seed#[FD138BE537932327]) [    ] o.a.s.c.CoreContainer Publish this node as DOWN...
   [junit4]   2> 1324609 INFO  (TEST-TestCloudRecovery2.test-seed#[FD138BE537932327]) [    ] o.a.s.c.ZkController Publish node=127.0.0.1:37295_solr as DOWN
   [junit4]   2> 1324612 INFO  (coreCloseExecutor-8308-thread-1) [n:127.0.0.1:37295_solr c:collection1 s:shard1 r:core_node4 x:collection1_shard1_replica_n2] o.a.s.c.SolrCore [collection1_shard1_replica_n2]  CLOSING SolrCore org.apache.solr.core.SolrCore@448b388d
   [junit4]   2> 1324612 INFO  (coreCloseExecutor-8308-thread-1) [n:127.0.0.1:37295_solr c:collection1 s:shard1 r:core_node4 x:collection1_shard1_replica_n2] o.a.s.m.SolrMetricManager Closing metric reporters for registry=solr.core.collection1.shard1.replica_n2, tag=448b388d
   [junit4]   2> 1324612 INFO  (coreCloseExecutor-8308-thread-1) [n:127.0.0.1:37295_solr c:collection1 s:shard1 r:core_node4 x:collection1_shard1_replica_n2] o.a.s.m.r.SolrJmxReporter Closing reporter [org.apache.solr.metrics.reporters.SolrJmxReporter@59c4744f: rootName = solr_37295, domain = solr.core.collection1.shard1.replica_n2, service url = null, agent id = null] for registry solr.core.collection1.shard1.replica_n2 / com.codahale.metrics.MetricRegistry@4c5c9289
   [junit4]   2> 1324658 INFO  (coreCloseExecutor-8308-thread-1) [n:127.0.0.1:37295_solr c:collection1 s:shard1 r:core_node4 x:collection1_shard1_replica_n2] o.a.s.m.SolrMetricManager Closing metric reporters for registry=solr.collection.collection1.shard1.leader, tag=448b388d
   [junit4]   2> 1324659 INFO  (TEST-TestCloudRecovery2.test-seed#[FD138BE537932327]) [    ] o.a.s.m.SolrMetricManager Closing metric reporters for registry=solr.node, tag=null
   [junit4]   2> 1324659 INFO  (TEST-TestCloudRecovery2.test-seed#[FD138BE537932327]) [    ] o.a.s.m.r.SolrJmxReporter Closing reporter [org.apache.solr.metrics.reporters.SolrJmxReporter@2d0212c6: rootName = solr_37295, domain = solr.node, service url = null, agent id = null] for registry solr.node / com.codahale.metrics.MetricRegistry@8fa9e6
   [junit4]   2> 1324665 INFO  (TEST-TestCloudRecovery2.test-seed#[FD138BE537932327]) [    ] o.a.s.m.SolrMetricManager Closing metric reporters for registry=solr.jvm, tag=null
   [junit4]   2> 1324665 INFO  (TEST-TestCloudRecovery2.test-seed#[FD138BE537932327]) [    ] o.a.s.m.r.SolrJmxReporter Closing reporter [org.apache.solr.metrics.reporters.SolrJmxReporter@2473b657: rootName = solr_37295, domain = solr.jvm, service url = null, agent id = null] for registry solr.jvm / com.codahale.metrics.MetricRegistry@1571a5a7
   [junit4]   2> 1324668 INFO  (TEST-TestCloudRecovery2.test-seed#[FD138BE537932327]) [    ] o.a.s.m.SolrMetricManager Closing metric reporters for registry=solr.jetty, tag=null
   [junit4]   2> 1324668 INFO  (TEST-TestCloudRecovery2.test-seed#[FD138BE537932327]) [    ] o.a.s.m.r.SolrJmxReporter Closing reporter [org.apache.solr.metrics.reporters.SolrJmxReporter@33d671be: rootName = solr_37295, domain = solr.jetty, service url = null, agent id = null] for registry solr.jetty / com.codahale.metrics.MetricRegistry@2e97c9fe
   [junit4]   2> 1324668 INFO  (TEST-TestCloudRecovery2.test-seed#[FD138BE537932327]) [    ] o.a.s.m.SolrMetricManager Closing metric reporters for registry=solr.cluster, tag=null
   [junit4]   1> Done close org.apache.solr.common.util.ExecutorUtil$MDCAwareThreadPoolExecutor@2be2c760[Terminated, pool size = 0, active threads = 0, queued tasks = 0, completed tasks = 1]
   [junit4]   1> Done close org.apache.solr.common.util.ExecutorUtil$MDCAwareThreadPoolExecutor@69242185[Terminated, pool size = 0, active threads = 0, queued tasks = 0, completed tasks = 1]
   [junit4]   2> 1324675 WARN  (NIOServerCxn.Factory:0.0.0.0/0.0.0.0:0) [    ] o.a.z.s.NIOServerCnxn Unable to read additional data from client sessionid 0x10019a7fbf20009, likely client has closed socket
   [junit4]   2> 1324678 INFO  (zkCallback-8754-thread-2) [n:127.0.0.1:44362_solr c:collection1 s:shard1 r:core_node3 x:collection1_shard1_replica_n1] o.a.s.c.ShardLeaderElectionContext I may be the new leader - try and sync
   [junit4]   2> 1324679 INFO  (TEST-TestCloudRecovery2.test-seed#[FD138BE537932327]) [    ] o.e.j.s.AbstractConnector Stopped ServerConnector@f27ac32{HTTP/1.1,[http/1.1, h2c]}{127.0.0.1:0}
   [junit4]   2> 1324681 INFO  (zkCallback-8783-thread-1) [    ] o.a.s.c.c.ZkStateReader Updated live nodes from ZooKeeper... (2) -> (1)
   [junit4]   2> 1324681 INFO  (TEST-TestCloudRecovery2.test-seed#[FD138BE537932327]) [    ] o.e.j.s.h.ContextHandler Stopped o.e.j.s.ServletContextHandler@731fb3ac{/solr,null,UNAVAILABLE}
   [junit4]   2> 1324681 INFO  (TEST-TestCloudRecovery2.test-seed#[FD138BE537932327]) [    ] o.e.j.s.session node0 Stopped scavenging
   [junit4]   2> 1324685 INFO  (zkCallback-8754-thread-1) [    ] o.a.s.c.c.ZkStateReader Updated live nodes from ZooKeeper... (2) -> (1)
   [junit4]   2> 1324685 INFO  (zkCallback-8761-thread-1) [    ] o.a.s.c.c.ZkStateReader Updated live nodes from ZooKeeper... (2) -> (1)
   [junit4]   2> 1324690 ERROR (updateExecutor-8749-thread-1-processing-x:collection1_shard1_replica_n1 r:core_node3 null n:127.0.0.1:44362_solr c:collection1 s:shard1) [n:127.0.0.1:44362_solr c:collection1 s:shard1 r:core_node3 x:collection1_shard1_replica_n1] o.a.s.u.ErrorReportingConcurrentUpdateSolrClient error
   [junit4]   2> java.io.IOException: java.net.ConnectException: Connection refused
   [junit4]   2> 	at org.eclipse.jetty.client.util.DeferredContentProvider.flush(DeferredContentProvider.java:193) ~[jetty-client-9.4.14.v20181114.jar:9.4.14.v20181114]
   [junit4]   2> 	at org.eclipse.jetty.client.util.OutputStreamContentProvider$DeferredOutputStream.flush(OutputStreamContentProvider.java:152) ~[jetty-client-9.4.14.v20181114.jar:9.4.14.v20181114]
   [junit4]   2> 	at org.eclipse.jetty.client.util.OutputStreamContentProvider$DeferredOutputStream.write(OutputStreamContentProvider.java:146) ~[jetty-client-9.4.14.v20181114.jar:9.4.14.v20181114]
   [junit4]   2> 	at org.apache.solr.common.util.FastOutputStream.flush(FastOutputStream.java:216) ~[java/:?]
   [junit4]   2> 	at org.apache.solr.common.util.FastOutputStream.flushBuffer(FastOutputStream.java:209) ~[java/:?]
   [junit4]   2> 	at org.apache.solr.common.util.JavaBinCodec.marshal(JavaBinCodec.java:167) ~[java/:?]
   [junit4]   2> 	at org.apache.solr.client.solrj.request.JavaBinUpdateRequestCodec.marshal(JavaBinUpdateRequestCodec.java:102) ~[java/:?]
   [junit4]   2> 	at org.apache.solr.client.solrj.impl.BinaryRequestWriter.write(BinaryRequestWriter.java:83) ~[java/:?]
   [junit4]   2> 	at org.apache.solr.client.solrj.impl.Http2SolrClient.send(Http2SolrClient.java:332) ~[java/:?]
   [junit4]   2> 	at org.apache.solr.client.solrj.impl.ConcurrentUpdateHttp2SolrClient$Runner.sendUpdateStream(ConcurrentUpdateHttp2SolrClient.java:231) ~[java/:?]
   [junit4]   2> 	at org.apache.solr.client.solrj.impl.ConcurrentUpdateHttp2SolrClient$Runner.run(ConcurrentUpdateHttp2SolrClient.java:176) ~[java/:?]
   [junit4]   2> 	at com.codahale.metrics.InstrumentedExecutorService$InstrumentedRunnable.run(InstrumentedExecutorService.java:176) ~[metrics-core-3.2.6.jar:3.2.6]
   [junit4]   2> 	at org.apache.solr.common.util.ExecutorUtil$MDCAwareThreadPoolExecutor.lambda$execute$0(ExecutorUtil.java:209) ~[java/:?]
   [junit4]   2> 	at java.util.concurrent.ThreadPoolExecutor.runWorker(ThreadPoolExecutor.java:1149) [?:1.8.0_191]
   [junit4]   2> 	at java.util.concurrent.ThreadPoolExecutor$Worker.run(ThreadPoolExecutor.java:624) [?:1.8.0_191]
   [junit4]   2> 	at java.lang.Thread.run(Thread.java:748) [?:1.8.0_191]
   [junit4]   2> 	Suppressed: java.io.IOException: java.net.ConnectException: Connection refused
   [junit4]   2> 		at org.eclipse.jetty.client.util.DeferredContentProvider.flush(DeferredContentProvider.java:193) ~[jetty-client-9.4.14.v20181114.jar:9.4.14.v20181114]
   [junit4]   2> 		at org.eclipse.jetty.client.util.OutputStreamContentProvider$DeferredOutputStream.flush(OutputStreamContentProvider.java:152) ~[jetty-client-9.4.14.v20181114.jar:9.4.14.v20181114]
   [junit4]   2> 		at org.eclipse.jetty.client.util.OutputStreamContentProvider$DeferredOutputStream.write(OutputStreamContentProvider.java:146) ~[jetty-client-9.4.14.v20181114.jar:9.4.14.v20181114]
   [junit4]   2> 		at org.apache.solr.common.util.FastOutputStream.flush(FastOutputStream.java:216) ~[java/:?]
   [junit4]   2> 		at org.apache.solr.common.util.FastOutputStream.flushBuffer(FastOutputStream.java:209) ~[java/:?]
   [junit4]   2> 		at org.apache.solr.common.util.JavaBinCodec.close(JavaBinCodec.java:1297) ~[java/:?]
   [junit4]   2> 		at org.apache.solr.client.solrj.request.JavaBinUpdateRequestCodec.marshal(JavaBinUpdateRequestCodec.java:103) ~[java/:?]
   [junit4]   2> 		at org.apache.solr.client.solrj.impl.BinaryRequestWriter.write(BinaryRequestWriter.java:83) ~[java/:?]
   [junit4]   2> 		at org.apache.solr.client.solrj.impl.Http2SolrClient.send(Http2SolrClient.java:332) ~[java/:?]
   [junit4]   2> 		at org.apache.solr.client.solrj.impl.ConcurrentUpdateHttp2SolrClient$Runner.sendUpdateStream(ConcurrentUpdateHttp2SolrClient.java:231) ~[java/:?]
   [junit4]   2> 		at org.apache.solr.client.solrj.impl.ConcurrentUpdateHttp2SolrClient$Runner.run(ConcurrentUpdateHttp2SolrClient.java:176) ~[java/:?]
   [junit4]   2> 		at com.codahale.metrics.InstrumentedExecutorService$InstrumentedRunnable.run(InstrumentedExecutorService.java:176) ~[metrics-core-3.2.6.jar:3.2.6]
   [junit4]   2> 		at org.apache.solr.common.util.ExecutorUtil$MDCAwareThreadPoolExecutor.lambda$execute$0(ExecutorUtil.java:209) ~[java/:?]
   [junit4]   2> 		at java.util.concurrent.ThreadPoolExecutor.runWorker(ThreadPoolExecutor.java:1149) [?:1.8.0_191]
   [junit4]   2> 		at java.util.concurrent.ThreadPoolExecutor$Worker.run(ThreadPoolExecutor.java:624) [?:1.8.0_191]
   [junit4]   2> 		at java.lang.Thread.run(Thread.java:748) [?:1.8.0_191]
   [junit4]   2> 	Caused by: java.net.ConnectException: Connection refused
   [junit4]   2> 		at sun.nio.ch.SocketChannelImpl.checkConnect(Native Method) ~[?:1.8.0_191]
   [junit4]   2> 		at sun.nio.ch.SocketChannelImpl.finishConnect(SocketChannelImpl.java:717) ~[?:1.8.0_191]
   [junit4]   2> 		at sun.nio.ch.SocketAdaptor.connect(SocketAdaptor.java:111) ~[?:1.8.0_191]
   [junit4]   2> 		at org.eclipse.jetty.http2.client.HTTP2Client.connect(HTTP2Client.java:397) ~[http2-client-9.4.14.v20181114.jar:9.4.14.v20181114]
   [junit4]   2> 		at org.eclipse.jetty.http2.client.http.HttpClientTransportOverHTTP2.connect(HttpClientTransportOverHTTP2.java:146) ~[http2-http-client-transport-9.4.14.v20181114.jar:9.4.14.v20181114]
   [junit4]   2> 		at org.eclipse.jetty.http2.client.http.HttpClientTransportOverHTTP2.connect(HttpClientTransportOverHTTP2.java:141) ~[http2-http-client-transport-9.4.14.v20181114.jar:9.4.14.v20181114]
   [junit4]   2> 		at org.eclipse.jetty.client.HttpClient$1.connect(HttpClient.java:619) ~[jetty-client-9.4.14.v20181114.jar:9.4.14.v20181114]
   [junit4]   2> 		at org.eclipse.jetty.client.HttpClient$1.succeeded(HttpClient.java:596) ~[jetty-client-9.4.14.v20181114.jar:9.4.14.v20181114]
   [junit4]   2> 		at org.eclipse.jetty.client.HttpClient$1.succeeded(HttpClient.java:589) ~[jetty-client-9.4.14.v20181114.jar:9.4.14.v20181114]
   [junit4]   2> 		at org.eclipse.jetty.util.SocketAddressResolver$Async.lambda$resolve$1(SocketAddressResolver.java:181) ~[jetty-util-9.4.14.v20181114.jar:9.4.14.v20181114]
   [junit4]   2> 		... 4 more
   [junit4]   2> Caused by: java.net.ConnectException: Connection refused
   [junit4]   2> 	at sun.nio.ch.SocketChannelImpl.checkConnect(Native Method) ~[?:1.8.0_191]
   [junit4]   2> 	at sun.nio.ch.SocketChannelImpl.finishConnect(SocketChannelImpl.java:717) ~[?:1.8.0_191]
   [junit4]   2> 	at sun.nio.ch.SocketAdaptor.connect(SocketAdaptor.java:111) ~[?:1.8.0_191]
   [junit4]   2> 	at org.eclipse.jetty.http2.client.HTTP2Client.connect(HTTP2Client.java:397) ~[http2-client-9.4.14.v20181114.jar:9.4.14.v20181114]
   [junit4]   2> 	at org.eclipse.jetty.http2.client.http.HttpClientTransportOverHTTP2.connect(HttpClientTransportOverHTTP2.java:146) ~[http2-http-client-transport-9.4.14.v20181114.jar:9.4.14.v20181114]
   [junit4]   2> 	at org.eclipse.jetty.http2.client.http.HttpClientTransportOverHTTP2.connect(HttpClientTransportOverHTTP2.java:141) ~[http2-http-client-transport-9.4.14.v20181114.jar:9.4.14.v20181114]
   [junit4]   2> 	at org.eclipse.jetty.client.HttpClient$1.connect(HttpClient.java:619) ~[jetty-client-9.4.14.v20181114.jar:9.4.14.v20181114]
   [junit4]   2> 	at org.eclipse.jetty.client.HttpClient$1.succeeded(HttpClient.java:596) ~[jetty-client-9.4.14.v20181114.jar:9.4.14.v20181114]
   [junit4]   2> 	at org.eclipse.jetty.client.HttpClient$1.succeeded(HttpClient.java:589) ~[jetty-client-9.4.14.v20181114.jar:9.4.14.v20181114]
   [junit4]   2> 	at org.eclipse.jetty.util.SocketAddressResolver$Async.lambda$resolve$1(SocketAddressResolver.java:181) ~[jetty-util-9.4.14.v20181114.jar:9.4.14.v20181114]
   [junit4]   2> 	... 4 more
   [junit4]   2> 1324705 ERROR (updateExecutor-8749-thread-1-processing-x:collection1_shard1_replica_n1 r:core_node3 null n:127.0.0.1:44362_solr c:collection1 s:shard1) [n:127.0.0.1:44362_solr c:collection1 s:shard1 r:core_node3 x:collection1_shard1_replica_n1] o.a.s.u.ErrorReportingConcurrentUpdateSolrClient error
   [junit4]   2> java.io.IOException: java.net.ConnectException: Connection refused
   [junit4]   2> 	at org.eclipse.jetty.client.util.DeferredContentProvider.flush(DeferredContentProvider.java:193) ~[jetty-client-9.4.14.v20181114.jar:9.4.14.v20181114]
   [junit4]   2> 	at org.eclipse.jetty.client.util.OutputStreamContentProvider$DeferredOutputStream.flush(OutputStreamContentProvider.java:152) ~[jetty-client-9.4.14.v20181114.jar:9.4.14.v20181114]
   [junit4]   2> 	at org.eclipse.jetty.client.util.OutputStreamContentProvider$DeferredOutputStream.write(OutputStreamContentProvider.java:146) ~[jetty-client-9.4.14.v20181114.jar:9.4.14.v20181114]
   [junit4]   2> 	at org.apache.solr.common.util.FastOutputStream.flush(FastOutputStream.java:216) ~[java/:?]
   [junit4]   2> 	at org.apache.solr.common.util.FastOutputStream.flushBuffer(FastOutputStream.java:209) ~[java/:?]
   [junit4]   2> 	at org.apache.solr.common.util.JavaBinCodec.marshal(JavaBinCodec.java:167) ~[java/:?]
   [junit4]   2> 	at org.apache.solr.client.solrj.request.JavaBinUpdateRequestCodec.marshal(JavaBinUpdateRequestCodec.java:102) ~[java/:?]
   [junit4]   2> 	at org.apache.solr.client.solrj.impl.BinaryRequestWriter.write(BinaryRequestWriter.java:83) ~[java/:?]
   [junit4]   2> 	at org.apache.solr.client.solrj.impl.Http2SolrClient.send(Http2SolrClient.java:332) ~[java/:?]
   [junit4]   2> 	at org.apache.solr.client.solrj.impl.ConcurrentUpdateHttp2SolrClient$Runner.sendUpdateStream(ConcurrentUpdateHttp2SolrClient.java:231) ~[java/:?]
   [junit4]   2> 	at org.apache.solr.client.solrj.impl.ConcurrentUpdateHttp2SolrClient$Runner.run(ConcurrentUpdateHttp2SolrClient.java:176) ~[java/:?]
   [junit4]   2> 	at com.codahale.metrics.InstrumentedExecutorService$InstrumentedRunnable.run(InstrumentedExecutorService.java:176) ~[metrics-core-3.2.6.jar:3.2.6]
   [junit4]   2> 	at org.apache.solr.common.util.ExecutorUtil$MDCAwareThreadPoolExecutor.lambda$execute$0(ExecutorUtil.java:209) ~[java/:?]
   [junit4]   2> 	at java.util.concurrent.ThreadPoolExecutor.runWorker(ThreadPoolExecutor.java:1149) [?:1.8.0_191]
   [junit4]   2> 	at java.util.concurrent.ThreadPoolExecutor$Worker.run(ThreadPoolExecutor.java:624) [?:1.8.0_191]
   [junit4]   2> 	at java.lang.Thread.run(Thread.java:748) [?:1.8.0_191]
   [junit4]   2> 	Suppressed: java.io.IOException: java.net.ConnectException: Connection refused
   [junit4]   2> 		at org.eclipse.jetty.client.util.DeferredContentProvider.flush(DeferredContentProvider.java:193) ~[jetty-client-9.4.14.v20181114.jar:9.4.14.v20181114]
   [junit4]   2> 		at org.eclipse.jetty.client.util.OutputStreamContentProvider$DeferredOutputStream.flush(OutputStreamContentProvider.java:152) ~[jetty-client-9.4.14.v20181114.jar:9.4.14.v20181114]
   [junit4]   2> 		at org.eclipse.jetty.client.util.OutputStreamContentProvider$DeferredOutputStream.write(OutputStreamContentProvider.java:146) ~[jetty-client-9.4.14.v20181114.jar:9.4.14.v20181114]
   [junit4]   2> 		at org.apache.solr.common.util.FastOutputStream.flush(FastOutputStream.java:216) ~[java/:?]
   [junit4]   2> 		at org.apache.solr.common.util.FastOutputStream.flushBuffer(FastOutputStream.java:209) ~[java/:?]
   [junit4]   2> 		at org.apache.solr.common.util.JavaBinCodec.close(JavaBinCodec.java:1297) ~[java/:?]
   [junit4]   2> 		at org.apache.solr.client.solrj.request.JavaBinUpdateRequestCodec.marshal(JavaBinUpdateRequestCodec.java:103) ~[java/:?]
   [junit4]   2> 		at org.apache.solr.client.solrj.impl.BinaryRequestWriter.write(BinaryRequestWriter.java:83) ~[java/:?]
   [junit4]   2> 		at org.apache.solr.client.solrj.impl.Http2SolrClient.send(Http2SolrClient.java:332) ~[java/:?]
   [junit4]   2> 		at org.apache.solr.client.solrj.impl.ConcurrentUpdateHttp2SolrClient$Runner.sendUpdateStream(ConcurrentUpdateHttp2SolrClient.java:231) ~[java/:?]
   [junit4]   2> 		at org.apache.solr.client.solrj.impl.ConcurrentUpdateHttp2SolrClient$Runner.run(ConcurrentUpdateHttp2SolrClient.java:176) ~[java/:?]
   [junit4]   2> 		at com.codahale.metrics.InstrumentedExecutorService$InstrumentedRunnable.run(InstrumentedExecutorService.java:176) ~[metrics-core-3.2.6.jar:3.2.6]
   [junit4]   2> 		at org.apache.solr.common.util.ExecutorUtil$MDCAwareThreadPoolExecutor.lambda$execute$0(ExecutorUtil.java:209) ~[java/:?]
   [junit4]   2> 		at java.util.concurrent.ThreadPoolExecutor.runWorker(ThreadPoolExecutor.java:1149) [?:1.8.0_191]
   [junit4]   2> 		at java.util.concurrent.ThreadPoolExecutor$Worker.run(ThreadPoolExecutor.java:624) [?:1.8.0_191]
   [junit4]   2> 		at java.lang.Thread.run(Thread.java:748) [?:1.8.0_191]
   [junit4]   2> 	Caused by: java.net.ConnectException: Connection refused
   [junit4]   2> 		at sun.nio.ch.SocketChannelImpl.checkConnect(Native Method) ~[?:1.8.0_191]
   [junit4]   2> 		at sun.nio.ch.SocketChannelImpl.finishConnect(SocketChannelImpl.java:717) ~[?:1.8.0_191]
   [junit4]   2> 		at sun.nio.ch.SocketAdaptor.connect(SocketAdaptor.java:111) ~[?:1.8.0_191]
   [junit4]   2> 		at org.eclipse.jetty.http2.client.HTTP2Client.connect(HTTP2Client.java:397) ~[http2-client-9.4.14.v20181114.jar:9.4.14.v20181114]
   [junit4]   2> 		at org.eclipse.jetty.http2.client.http.HttpClientTransportOverHTTP2.connect(HttpClientTransportOverHTTP2.java:146) ~[http2-http-client-transport-9.4.14.v20181114.jar:9.4.14.v20181114]
   [junit4]   2> 		at org.eclipse.jetty.http2.client.http.HttpClientTransportOverHTTP2.connect(HttpClientTransportOverHTTP2.java:141) ~[http2-http-client-transport-9.4.14.v20181114.jar:9.4.14.v20181114]
   [junit4]   2> 		at org.eclipse.jetty.client.HttpClient$1.connect(HttpClient.java:619) ~[jetty-client-9.4.14.v20181114.jar:9.4.14.v20181114]
   [junit4]   2> 		at org.eclipse.jetty.client.HttpClient$1.succeeded(HttpClient.java:596) ~[jetty-client-9.4.14.v20181114.jar:9.4.14.v20181114]
   [junit4]   2> 		at org.eclipse.jetty.client.HttpClient$1.succeeded(HttpClient.java:589) ~[jetty-client-9.4.14.v20181114.jar:9.4.14.v20181114]
   [junit4]   2> 		at org.eclipse.jetty.util.SocketAddressResolver$Async.lambda$resolve$1(SocketAddressResolver.java:181) ~[jetty-util-9.4.14.v20181114.jar:9.4.14.v20181114]
   [junit4]   2> 		... 4 more
   [junit4]   2> Caused by: java.net.ConnectException: Connection refused
   [junit4]   2> 	at sun.nio.ch.SocketChannelImpl.checkConnect(Native Method) ~[?:1.8.0_191]
   [junit4]   2> 	at sun.nio.ch.SocketChannelImpl.finishConnect(SocketChannelImpl.java:717) ~[?:1.8.0_191]
   [junit4]   2> 	at sun.nio.ch.SocketAdaptor.connect(SocketAdaptor.java:111) ~[?:1.8.0_191]
   [junit4]   2> 	at org.eclipse.jetty.http2.client.HTTP2Client.connect(HTTP2Client.java:397) ~[http2-client-9.4.14.v20181114.jar:9.4.14.v20181114]
   [junit4]   2> 	at org.eclipse.jetty.http2.client.http.HttpClientTransportOverHTTP2.connect(HttpClientTransportOverHTTP2.java:146) ~[http2-http-client-transport-9.4.14.v20181114.jar:9.4.14.v20181114]
   [junit4]   2> 	at org.eclipse.jetty.http2.client.http.HttpClientTransportOverHTTP2.connect(HttpClientTransportOverHTTP2.java:141) ~[http2-http-client-transport-9.4.14.v20181114.jar:9.4.14.v20181114]
   [junit4]   2> 	at org.eclipse.jetty.client.HttpClient$1.connect(HttpClient.java:619) ~[jetty-client-9.4.14.v20181114.jar:9.4.14.v20181114]
   [junit4]   2> 	at org.eclipse.jetty.client.HttpClient$1.succeeded(HttpClient.java:596) ~[jetty-client-9.4.14.v20181114.jar:9.4.14.v20181114]
   [junit4]   2> 	at org.eclipse.jetty.client.HttpClient$1.succeeded(HttpClient.java:589) ~[jetty-client-9.4.14.v20181114.jar:9.4.14.v20181114]
   [junit4]   2> 	at org.eclipse.jetty.util.SocketAddressResolver$Async.lambda$resolve$1(SocketAddressResolver.java:181) ~[jetty-util-9.4.14.v20181114.jar:9.4.14.v20181114]
   [junit4]   2> 	... 4 more
   [junit4]   2> 1324713 ERROR (updateExecutor-8749-thread-1-processing-x:collection1_shard1_replica_n1 r:core_node3 null n:127.0.0.1:44362_solr c:collection1 s:shard1) [n:127.0.0.1:44362_solr c:collection1 s:shard1 r:core_node3 x:collection1_shard1_replica_n1] o.a.s.u.ErrorReportingConcurrentUpdateSolrClient error
   [junit4]   2> java.io.IOException: java.net.ConnectException: Connection refused
   [junit4]   2> 	at org.eclipse.jetty.client.util.DeferredContentProvider.flush(DeferredContentProvider.java:193) ~[jetty-client-9.4.14.v20181114.jar:9.4.14.v20181114]
   [junit4]   2> 	at org.eclipse.jetty.client.util.OutputStreamContentProvider$DeferredOutputStream.flush(OutputStreamContentProvider.java:152) ~[jetty-client-9.4.14.v20181114.jar:9.4.14.v20181114]
   [junit4]   2> 	at org.eclipse.jetty.client.util.OutputStreamContentProvider$DeferredOutputStream.write(OutputStreamContentProvider.java:146) ~[jetty-client-9.4.14.v20181114.jar:9.4.14.v20181114]
   [junit4]   2> 	at org.apache.solr.common.util.FastOutputStream.flush(FastOutputStream.java:216) ~[java/:?]
   [junit4]   2> 	at org.apache.solr.common.util.FastOutputStream.flushBuffer(FastOutputStream.java:209) ~[java/:?]
   [junit4]   2> 	at org.apache.solr.common.util.JavaBinCodec.marshal(JavaBinCodec.java:167) ~[java/:?]
   [junit4]   2> 	at org.apache.solr.client.solrj.request.JavaBinUpdateRequestCodec.marshal(JavaBinUpdateRequestCodec.java:102) ~[java/:?]
   [junit4]   2> 	at org.apache.solr.client.solrj.impl.BinaryRequestWriter.write(BinaryRequestWriter.java:83) ~[java/:?]
   [junit4]   2> 	at org.apache.solr.client.solrj.impl.Http2SolrClient.send(Http2SolrClient.java:332) ~[java/:?]
   [junit4]   2> 	at org.apache.solr.client.solrj.impl.ConcurrentUpdateHttp2SolrClient$Runner.sendUpdateStream(ConcurrentUpdateHttp2SolrClient.java:231) ~[java/:?]
   [junit4]   2> 	at org.apache.solr.client.solrj.impl.ConcurrentUpdateHttp2SolrClient$Runner.run(ConcurrentUpdateHttp2SolrClient.java:176) ~[java/:?]
   [junit4]   2> 	at com.codahale.metrics.InstrumentedExecutorService$InstrumentedRunnable.run(InstrumentedExecutorService.java:176) ~[metrics-core-3.2.6.jar:3.2.6]
   [junit4]   2> 	at org.apache.solr.common.util.ExecutorUtil$MDCAwareThreadPoolExecutor.lambda$execute$0(ExecutorUtil.java:209) ~[java/:?]
   [junit4]   2> 	at java.util.concurrent.ThreadPoolExecutor.runWorker(ThreadPoolExecutor.java:1149) [?:1.8.0_191]
   [junit4]   2> 	at java.util.concurrent.ThreadPoolExecutor$Worker.run(ThreadPoolExecutor.java:624) [?:1.8.0_191]
   [junit4]   2> 	at java.lang.Thread.run(Thread.java:748) [?:1.8.0_191]
   [junit4]   2> 	Suppressed: java.io.IOException: java.net.ConnectException: Connection refused
   [junit4]   2> 		at org.eclipse.jetty.client.util.DeferredContentProvider.flush(DeferredContentProvider.java:193) ~[jetty-client-9.4.14.v20181114.jar:9.4.14.v20181114]
   [junit4]   2> 		at org.eclipse.jetty.client.util.OutputStreamContentProvider$DeferredOutputStream.flush(OutputStreamContentProvider.java:152) ~[jetty-client-9.4.14.v20181114.jar:9.4.14.v20181114]
   [junit4]   2> 		at org.eclipse.jetty.client.util.OutputStreamContentProvider$DeferredOutputStream.write(OutputStreamContentProvider.java:146) ~[jetty-client-9.4.14.v20181114.jar:9.4.14.v20181114]
   [junit4]   2> 		at org.apache.solr.common.util.FastOutputStream.flush(FastOutputStream.java:216) ~[java/:?]
   [junit4]   2> 		at org.apache.solr.common.util.FastOutputStream.flushBuffer(FastOutputStream.java:209) ~[java/:?]
   [junit4]   2> 		at org.apache.solr.common.util.JavaBinCodec.close(JavaBinCodec.java:1297) ~[java/:?]
   [junit4]   2> 		at org.apache.solr.client.solrj.request.JavaBinUpdateRequestCodec.marshal(JavaBinUpdateRequestCodec.java:103) ~[java/:?]
   [junit4]   2> 		at org.apache.solr.client.solrj.impl.BinaryRequestWriter.write(BinaryRequestWriter.java:83) ~[java/:?]
   [junit4]   2> 		at org.apache.solr.client.solrj.impl.Http2SolrClient.send(Http2SolrClient.java:332) ~[java/:?]
   [junit4]   2> 		at org.apache.solr.client.solrj.impl.ConcurrentUpdateHttp2SolrClient$Runner.sendUpdateStream(ConcurrentUpdateHttp2SolrClient.java:231) ~[java/:?]
   [junit4]   2> 		at org.apache.solr.client.solrj.impl.ConcurrentUpdateHttp2SolrClient$Runner.run(ConcurrentUpdateHttp2SolrClient.java:176) ~[java/:?]
   [junit4]   2> 		at com.codahale.metrics.InstrumentedExecutorService$InstrumentedRunnable.run(InstrumentedExecutorService.java:176) ~[metrics-core-3.2.6.jar:3.2.6]
   [junit4]   2> 		at org.apache.solr.common.util.ExecutorUtil$MDCAwareThreadPoolExecutor.lambda$execute$0(ExecutorUtil.java:209) ~[java/:?]
   [junit4]   2> 		at java.util.concurrent.ThreadPoolExecutor.runWorker(ThreadPoolExecutor.java:1149) [?:1.8.0_191]
   [junit4]   2> 		at java.util.concurrent.ThreadPoolExecutor$Worker.run(ThreadPoolExecutor.java:624) [?:1.8.0_191]
   [junit4]   2> 		at java.lang.Thread.run(Thread.java:748) [?:1.8.0_191]
   [junit4]   2> 	Caused by: java.net.ConnectException: Connection refused
   [junit4]   2> 		at sun.nio.ch.SocketChannelImpl.checkConnect(Native Method) ~[?:1.8.0_191]
   [junit4]   2> 		at sun.nio.ch.SocketChannelImpl.finishConnect(SocketChannelImpl.java:717) ~[?:1.8.0_191]
   [junit4]   2> 		at sun.nio.ch.SocketAdaptor.connect(SocketAdaptor.java:111) ~[?:1.8.0_191]
   [junit4]   2> 		at org.eclipse.jetty.http2.client.HTTP2Client.connect(HTTP2Client.java:397) ~[http2-client-9.4.14.v20181114.jar:9.4.14.v20181114]
   [junit4]   2> 		at org.eclipse.jetty.http2.client.http.HttpClientTransportOverHTTP2.connect(HttpClientTransportOverHTTP2.java:146) ~[http2-http-client-transport-9.4.14.v20181114.jar:9.4.14.v20181114]
   [junit4]   2> 		at org.eclipse.jetty.http2.client.http.HttpClientTransportOverHTTP2.connect(HttpClientTransportOverHTTP2.java:141) ~[http2-http-client-transport-9.4.14.v20181114.jar:9.4.14.v20181114]
   [junit4]   2> 		at org.eclipse.jetty.client.HttpClient$1.connect(HttpClient.java:619) ~[jetty-client-9.4.14.v20181114.jar:9.4.14.v20181114]
   [junit4]   2> 		at org.eclipse.jetty.client.HttpClient$1.succeeded(HttpClient.java:596) ~[jetty-client-9.4.14.v20181114.jar:9.4.14.v20181114]
   [junit4]   2> 		at org.eclipse.jetty.client.HttpClient$1.succeeded(HttpClient.java:589) ~[jetty-client-9.4.14.v20181114.jar:9.4.14.v20181114]
   [junit4]   2> 		at org.eclipse.jetty.util.SocketAddressResolver$Async.lambda$resolve$1(SocketAddressResolver.java:181) ~[jetty-util-9.4.14.v20181114.jar:9.4.14.v20181114]
   [junit4]   2> 		... 4 more
   [junit4]   2> Caused by: java.net.ConnectException: Connection refused
   [junit4]   2> 	at sun.nio.ch.SocketChannelImpl.checkConnect(Native Method) ~[?:1.8.0_191]
   [junit4]   2> 	at sun.nio.ch.SocketChannelImpl.finishConnect(SocketChannelImpl.java:717) ~[?:1.8.0_191]
   [junit4]   2> 	at sun.nio.ch.SocketAdaptor.connect(SocketAdaptor.java:111) ~[?:1.8.0_191]
   [junit4]   2> 	at org.eclipse.jetty.http2.client.HTTP2Client.connect(HTTP2Client.java:397) ~[http2-client-9.4.14.v20181114.jar:9.4.14.v20181114]
   [junit4]   2> 	at org.eclipse.jetty.http2.client.http.HttpClientTransportOverHTTP2.connect(HttpClientTransportOverHTTP2.java:146) ~[http2-http-client-transport-9.4.14.v20181114.jar:9.4.14.v20181114]
   [junit4]   2> 	at org.eclipse.jetty.http2.client.http.HttpClientTransportOverHTTP2.connect(HttpClientTransportOverHTTP2.java:141) ~[http2-http-client-transport-9.4.14.v20181114.jar:9.4.14.v20181114]
   [junit4]   2> 	at org.eclipse.jetty.client.HttpClient$1.connect(HttpClient.java:619) ~[jetty-client-9.4.14.v20181114.jar:9.4.14.v20181114]
   [junit4]   2> 	at org.eclipse.jetty.client.HttpClient$1.succeeded(HttpClient.java:596) ~[jetty-client-9.4.14.v20181114.jar:9.4.14.v20181114]
   [junit4]   2> 	at org.eclipse.jetty.client.HttpClient$1.succeeded(HttpClient.java:589) ~[jetty-client-9.4.14.v20181114.jar:9.4.14.v20181114]
   [junit4]   2> 	at org.eclipse.jetty.util.SocketAddressResolver$Async.lambda$resolve$1(SocketAddressResolver.java:181) ~[jetty-util-9.4.14.v20181114.jar:9.4.14.v20181114]
   [junit4]   2> 	... 4 more
   [junit4]   2> 1324782 INFO  (zkCallback-8754-thread-1) [    ] o.a.s.c.c.ZkStateReader A cluster state change: [WatchedEvent state:SyncConnected type:NodeDataChanged path:/collections/collection1/state.json] for collection [collection1] has occurred - updating... (live nodes size: [1])
   [junit4]   2> 1324782 INFO  (zkCallback-8754-thread-3) [    ] o.a.s.c.c.ZkStateReader A cluster state change: [WatchedEvent state:SyncConnected type:NodeDataChanged path:/collections/collection1/state.json] for collection [collection1] has occurred - updating... (live nodes size: [1])
   [junit4]   2> 1324997 DEBUG (ScheduledTrigger-8284-thread-2) [    ] o.a.s.c.a.NodeLostTrigger Running NodeLostTrigger: .auto_add_replicas with currently live nodes: 1 and last live nodes: 2
   [junit4]   2> 1324998 DEBUG (ScheduledTrigger-8284-thread-2) [    ] o.a.s.c.a.NodeLostTrigger Tracking lost node: 127.0.0.1:37295_solr
   [junit4]   2> 1325999 DEBUG (ScheduledTrigger-8284-thread-3) [    ] o.a.s.c.a.NodeLostTrigger Running NodeLostTrigger: .auto_add_replicas with currently live nodes: 1 and last live nodes: 1
   [junit4]   2> 1326017 INFO  (OverseerCollectionConfigSetProcessor-72085803315101702-127.0.0.1:44362_solr-n_0000000000) [n:127.0.0.1:44362_solr    ] o.a.s.c.OverseerTaskQueue Response ZK path: /overseer/collection-queue-work/qnr-0000000000 doesn't exist.  Requestor may have disconnected from ZooKeeper
   [junit4]   2> 1326998 DEBUG (ScheduledTrigger-8284-thread-2) [    ] o.a.s.c.a.NodeLostTrigger Running NodeLostTrigger: .auto_add_replicas with currently live nodes: 1 and last live nodes: 1
   [junit4]   2> 1327179 INFO  (zkCallback-8754-thread-2) [n:127.0.0.1:44362_solr c:collection1 s:shard1 r:core_node3 x:collection1_shard1_replica_n1] o.a.s.c.SyncStrategy Sync replicas to http://127.0.0.1:44362/solr/collection1_shard1_replica_n1/
   [junit4]   2> 1327179 INFO  (zkCallback-8754-thread-2) [n:127.0.0.1:44362_solr c:collection1 s:shard1 r:core_node3 x:collection1_shard1_replica_n1] o.a.s.c.SyncStrategy Sync Success - now sync replicas to me
   [junit4]   2> 1327179 INFO  (zkCallback-8754-thread-2) [n:127.0.0.1:44362_solr c:collection1 s:shard1 r:core_node3 x:collection1_shard1_replica_n1] o.a.s.c.SyncStrategy http://127.0.0.1:44362/solr/collection1_shard1_replica_n1/ has no replicas
   [junit4]   2> 1327179 INFO  (zkCallback-8754-thread-2) [n:127.0.0.1:44362_solr c:collection1 s:shard1 r:core_node3 x:collection1_shard1_replica_n1] o.a.s.c.ShardLeaderElectionContextBase Creating leader registration node /collections/collection1/leaders/shard1/leader after winning as /collections/collection1/leader_elect/shard1/election/72085803315101702-core_node3-n_0000000001
   [junit4]   2> 1327182 INFO  (zkCallback-8754-thread-2) [n:127.0.0.1:44362_solr c:collection1 s:shard1 r:core_node3 x:collection1_shard1_replica_n1] o.a.s.c.ShardLeaderElectionContext I am the new leader: http://127.0.0.1:44362/solr/collection1_shard1_replica_n1/ shard1
   [junit4]   2> 1327184 INFO  (zkCallback-8754-thread-3) [    ] o.a.s.c.c.ZkStateReader A cluster state change: [WatchedEvent state:SyncConnected type:NodeDataChanged path:/collections/collection1/state.json] for collection [collection1] has occurred - updating... (live nodes size: [1])
   [junit4]   2> 1327184 INFO  (zkCallback-8754-thread-2) [    ] o.a.s.c.c.ZkStateReader A cluster state change: [WatchedEvent state:SyncConnected type:NodeDataChanged path:/collections/collection1/state.json] for collection [collection1] has occurred - updating... (live nodes size: [1])
   [junit4]   2> 1327189 INFO  (qtp1740512968-27545) [n:127.0.0.1:44362_solr c:collection1 s:shard1 r:core_node3 x:collection1_shard1_replica_n1] o.a.s.u.SolrCmdDistributor SolrCmdDistributor found 3 errors
   [junit4]   2> 1327189 INFO  (qtp1740512968-27545) [n:127.0.0.1:44362_solr c:collection1 s:shard1 r:core_node3 x:collection1_shard1_replica_n1] o.a.s.u.DirectUpdateHandler2 start commit{_version_=1622436152031051801,optimize=false,openSearcher=true,waitSearcher=true,expungeDeletes=false,softCommit=false,prepareCommit=false}
   [junit4]   2> 1327189 INFO  (qtp1740512968-27545) [n:127.0.0.1:44362_solr c:collection1 s:shard1 r:core_node3 x:collection1_shard1_replica_n1] o.a.s.u.SolrIndexWriter Calling setCommitData with IW:org.apache.solr.update.SolrIndexWriter@1bb89321 commitCommandVersion:1622436152031051801
   [junit4]   2> 1327227 INFO  (qtp1740512968-27545) [n:127.0.0.1:44362_solr c:collection1 s:shard1 r:core_node3 x:collection1_shard1_replica_n1] o.a.s.s.SolrIndexSearcher Opening [Searcher@13b14588[collection1_shard1_replica_n1] main]
   [junit4]   2> 1327227 INFO  (qtp1740512968-27545) [n:127.0.0.1:44362_solr c:collection1 s:shard1 r:core_node3 x:collection1_shard1_replica_n1] o.a.s.u.DirectUpdateHandler2 end_commit_flush
   [junit4]   2> 1327228 INFO  (searcherExecutor-8299-thread-1-processing-n:127.0.0.1:44362_solr x:collection1_shard1_replica_n1 c:collection1 s:shard1 r:core_node3) [n:127.0.0.1:44362_solr c:collection1 s:shard1 r:core_node3 x:collection1_shard1_replica_n1] o.a.s.c.SolrCore [collection1_shard1_replica_n1] Registered new searcher Searcher@13b14588[collection1_shard1_replica_n1] main{ExitableDirectoryReader(UninvertingDirectoryReader(Uninverting(_0(8.0.0):C97:[diagnostics={os=SunOS, java.vendor=Oracle Corporation, java.version=1.8.0_191, java.vm.version=25.191-b12, lucene.version=8.0.0, os.arch=amd64, java.runtime.version=1.8.0_191-b12, source=flush, os.version=5.11, timestamp=1547275688223}]:[attributes={Lucene50StoredFieldsFormat.mode=BEST_SPEED}])))}
   [junit4]   2> 1327229 INFO  (qtp1740512968-27545) [n:127.0.0.1:44362_solr c:collection1 s:shard1 r:core_node3 x:collection1_shard1_replica_n1] o.a.s.c.ZkShardTerms Successful update of terms at /collections/collection1/terms/shard1 to Terms{values={core_node3=1, core_node4=0}, version=2}
   [junit4]   2> 1327229 ERROR (qtp1740512968-27545) [n:127.0.0.1:44362_solr c:collection1 s:shard1 r:core_node3 x:collection1_shard1_replica_n1] o.a.s.h.RequestHandlerBase org.apache.solr.update.processor.DistributedUpdateProcessor$DistributedUpdatesAsyncException: 3 Async exceptions during distributed update: 
   [junit4]   2> java.net.ConnectException: Connection refused
   [junit4]   2> java.net.ConnectException: Connection refused
   [junit4]   2> java.net.ConnectException: Connection refused
   [junit4]   2> 	at org.apache.solr.update.processor.DistributedUpdateProcessor.doFinish(DistributedUpdateProcessor.java:956)
   [junit4]   2> 	at org.apache.solr.update.processor.DistributedUpdateProcessor.finish(DistributedUpdateProcessor.java:2051)
   [junit4]   2> 	at org.apache.solr.update.processor.LogUpdateProcessorFactory$LogUpdateProcessor.finish(LogUpdateProcessorFactory.java:182)
   [junit4]   2> 	at org.apache.solr.handler.ContentStreamHandlerBase.handleRequestBody(ContentStreamHandlerBase.java:78)
   [junit4]   2> 	at org.apache.solr.handler.RequestHandlerBase.handleRequest(RequestHandlerBase.java:199)
   [junit4]   2> 	at org.apache.solr.core.SolrCore.execute(SolrCore.java:2559)
   [junit4]   2> 	at org.apache.solr.servlet.HttpSolrCall.execute(HttpSolrCall.java:711)
   [junit4]   2> 	at org.apache.solr.servlet.HttpSolrCall.call(HttpSolrCall.java:516)
   [junit4]   2> 	at org.apache.solr.servlet.SolrDispatchFilter.doFilter(SolrDispatchFilter.java:394)
   [junit4]   2> 	at org.apache.solr.servlet.SolrDispatchFilter.doFilter(SolrDispatchFilter.java:340)
   [junit4]   2> 	at org.eclipse.jetty.servlet.ServletHandler$CachedChain.doFilter(ServletHandler.java:1610)
   [junit4]   2> 	at org.apache.solr.client.solrj.embedded.JettySolrRunner$DebugFilter.doFilter(JettySolrRunner.java:164)
   [junit4]   2> 	at org.eclipse.jetty.servlet.ServletHandler$CachedChain.doFilter(ServletHandler.java:1610)
   [junit4]   2> 	at org.eclipse.jetty.servlet.ServletHandler.doHandle(ServletHandler.java:540)
   [junit4]   2> 	at org.eclipse.jetty.server.handler.ScopedHandler.nextHandle(ScopedHandler.java:255)
   [junit4]   2> 	at org.eclipse.jetty.server.session.SessionHandler.doHandle(SessionHandler.java:1588)
   [junit4]   2> 	at org.eclipse.jetty.server.handler.ScopedHandler.nextHandle(ScopedHandler.java:255)
   [junit4]   2> 	at org.eclipse.jetty.server.handler.ContextHandler.doHandle(ContextHandler.java:1345)
   [junit4]   2> 	at org.eclipse.jetty.server.handler.ScopedHandler.nextScope(ScopedHandler.java:203)
   [junit4]   2> 	at org.eclipse.jetty.servlet.ServletHandler.doScope(ServletHandler.java:480)
   [junit4]   2> 	at org.eclipse.jetty.server.session.SessionHandler.doScope(SessionHandler.java:1557)
   [junit4]   2> 	at org.eclipse.jetty.server.handler.ScopedHandler.nextScope(ScopedHandler.java:201)
   [junit4]   2> 	at org.eclipse.jetty.server.handler.ContextHandler.doScope(ContextHandler.java:1247)
   [junit4]   2> 	at org.eclipse.jetty.server.handler.ScopedHandler.handle(ScopedHandler.java:144)
   [junit4]   2> 	at org.eclipse.jetty.server.handler.gzip.GzipHandler.handle(GzipHandler.java:703)
   [junit4]   2> 	at org.eclipse.jetty.server.handler.HandlerWrapper.handle(HandlerWrapper.java:132)
   [junit4]   2> 	at org.eclipse.jetty.server.Server.handle(Server.java:502)
   [junit4]   2> 	at org.eclipse.jetty.server.HttpChannel.handle(HttpChannel.java:364)
   [junit4]   2> 	at org.eclipse.jetty.server.HttpConnection.onFillable(HttpConnection.java:260)
   [junit4]   2> 	at org.eclipse.jetty.io.AbstractConnection$ReadCallback.succeeded(AbstractConnection.java:305)
   [junit4]   2> 	at org.eclipse.jetty.io.FillInterest.fillable(FillInterest.java:103)
   [junit4]   2> 	at org.eclipse.jetty.io.ChannelEndPoint$2.run(ChannelEndPoint.java:118)
   [junit4]   2> 	at org.eclipse.jetty.util.thread.QueuedThreadPool.runJob(QueuedThreadPool.java:765)
   [junit4]   2> 	at org.eclipse.jetty.util.thread.QueuedThreadPool$2.run(QueuedThreadPool.java:683)
   [junit4]   2> 	at java.lang.Thread.run(Thread.java:748)
   [junit4]   2> 
   [junit4]   2> 1327229 INFO  (qtp1740512968-27545) [n:127.0.0.1:44362_solr c:collection1 s:shard1 r:core_node3 x:collection1_shard1_replica_n1] o.a.s.c.S.Request [collection1_shard1_replica_n1]  webapp=/solr path=/update params={commit=true&wt=javabin&version=2} status=-1 QTime=2545
   [junit4]   2> 1327229 ERROR (qtp1740512968-27545) [n:127.0.0.1:44362_solr c:collection1 s:shard1 r:core_node3 x:collection1_shard1_replica_n1] o.a.s.s.HttpSolrCall null:org.apache.solr.update.processor.DistributedUpdateProcessor$DistributedUpdatesAsyncException: 3 Async exceptions during distributed update: 
   [junit4]   2> java.net.ConnectException: Connection refused
   [junit4]   2> java.net.ConnectException: Connection refused
   [junit4]   2> java.net.ConnectException: Connection refused
   [junit4]   2> 	at org.apache.solr.update.processor.DistributedUpdateProcessor.doFinish(DistributedUpdateProcessor.java:956)
   [junit4]   2> 	at org.apache.solr.update.processor.DistributedUpdateProcessor.finish(DistributedUpdateProcessor.java:2051)
   [junit4]   2> 	at org.apache.solr.update.processor.LogUpdateProcessorFactory$LogUpdateProcessor.finish(LogUpdateProcessorFactory.java:182)
   [junit4]   2> 	at org.apache.solr.handler.ContentStreamHandlerBase.handleRequestBody(ContentStreamHandlerBase.java:78)
   [junit4]   2> 	at org.apache.solr.handler.RequestHandlerBase.handleRequest(RequestHandlerBase.java:199)
   [junit4]   2> 	at org.apache.solr.core.SolrCore.execute(SolrCore.java:2559)
   [junit4]   2> 	at org.apache.solr.servlet.HttpSolrCall.execute(HttpSolrCall.java:711)
   [junit4]   2> 	at org.apache.solr.servlet.HttpSolrCall.call(HttpSolrCall.java:516)
   [junit4]   2> 	at org.apache.solr.servlet.SolrDispatchFilter.doFilter(SolrDispatchFilter.java:394)
   [junit4]   2> 	at org.apache.solr.servlet.SolrDispatchFilter.doFilter(SolrDispatchFilter.java:340)
   [junit4]   2> 	at org.eclipse.jetty.servlet.ServletHandler$CachedChain.doFilter(ServletHandler.java:1610)
   [junit4]   2> 	at org.apache.solr.client.solrj.embedded.JettySolrRunner$DebugFilter.doFilter(JettySolrRunner.java:164)
   [junit4]   2> 	at org.eclipse.jetty.servlet.ServletHandler$CachedChain.doFilter(ServletHandler.java:1610)
   [junit4]   2> 	at org.eclipse.jetty.servlet.ServletHandler.doHandle(ServletHandler.java:540)
   [junit4]   2> 	at org.eclipse.jetty.server.handler.ScopedHandler.nextHandle(ScopedHandler.java:255)
   [junit4]   2> 	at org.eclipse.jetty.server.session.SessionHandler.doHandle(SessionHandler.java:1588)
   [junit4]   2> 	at org.eclipse.jetty.server.handler.ScopedHandler.nextHandle(ScopedHandler.java:255)
   [junit4]   2> 	at org.eclipse.jetty.server.handler.ContextHandler.doHandle(ContextHandler.java:1345)
   [junit4]   2> 	at org.eclipse.jetty.server.handler.ScopedHandler.nextScope(ScopedHandler.java:203)
   [junit4]   2> 	at org.eclipse.jetty.servlet.ServletHandler.doScope(ServletHandler.java:480)
   [junit4]   2> 	at org.eclipse.jetty.server.session.SessionHandler.doScope(SessionHandler.java:1557)
   [junit4]   2> 	at org.eclipse.jetty.server.handler.ScopedHandler.nextScope(ScopedHandler.java:201)
   [junit4]   2> 	at org.eclipse.jetty.server.handler.ContextHandler.doScope(ContextHandler.java:1247)
   [junit4]   2> 	at org.eclipse.jetty.server.handler.ScopedHandler.handle(ScopedHandler.java:144)
   [junit4]   2> 	at org.eclipse.jetty.server.handler.gzip.GzipHandler.handle(GzipHandler.java:703)
   [junit4]   2> 	at org.eclipse.jetty.server.handler.HandlerWrapper.handle(HandlerWrapper.java:132)
   [junit4]   2> 	at org.eclipse.jetty.server.Server.handle(Server.java:502)
   [junit4]   2> 	at org.eclipse.jetty.server.HttpChannel.handle(HttpChannel.java:364)
   [junit4]   2> 	at org.eclipse.jetty.server.HttpConnection.onFillable(HttpConnection.java:260)
   [junit4]   2> 	at org.eclipse.jetty.io.AbstractConnection$ReadCallback.succeeded(AbstractConnection.java:305)
   [junit4]   2> 	at org.eclipse.jetty.io.FillInterest.fillable(FillInterest.java:103)
   [junit4]   2> 	at org.eclipse.jetty.io.ChannelEndPoint$2.run(ChannelEndPoint.java:118)
   [junit4]   2> 	at org.eclipse.jetty.util.thread.QueuedThreadPool.runJob(QueuedThreadPool.java:765)
   [junit4]   2> 	at org.eclipse.jetty.util.thread.QueuedThreadPool$2.run(QueuedThreadPool.java:683)
   [junit4]   2> 	at java.lang.Thread.run(Thread.java:748)
   [junit4]   2> 
   [junit4]   2> 1327230 WARN  (qtp1740512968-27545) [n:127.0.0.1:44362_solr c:collection1 s:shard1 r:core_node3 x:collection1_shard1_replica_n1] o.a.s.s.HttpSolrCall invalid return code: -1
   [junit4]   2> NOTE: reproduce with: ant test  -Dtestcase=TestCloudRecovery2 -Dtests.method=test -Dtests.seed=FD138BE537932327 -Dtests.slow=true -Dtests.locale=nl -Dtests.timezone=Africa/Asmara -Dtests.asserts=true -Dtests.file.encoding=UTF-8
   [junit4] ERROR   2.66s J0 | TestCloudRecovery2.test <<<
   [junit4]    > Throwable #1: org.apache.solr.client.solrj.impl.HttpSolrClient$RemoteSolrException: Error from server at http://127.0.0.1:44362/solr: 3 Async exceptions during distributed update: 
   [junit4]    > java.net.ConnectException: Connection refused
   [junit4]    > java.net.ConnectException: Connection refused
   [junit4]    > java.net.ConnectException: Connection refused
   [junit4]    > 	at __randomizedtesting.SeedInfo.seed([FD138BE537932327:7547B43F996F4EDF]:0)
   [junit4]    > 	at org.apache.solr.client.solrj.impl.HttpSolrClient.executeMethod(HttpSolrClient.java:650)
   [junit4]    > 	at org.apache.solr.client.solrj.impl.HttpSolrClient.request(HttpSolrClient.java:256)
   [junit4]    > 	at org.apache.solr.client.solrj.impl.HttpSolrClient.request(HttpSolrClient.java:245)
   [junit4]    > 	at org.apache.solr.client.solrj.SolrRequest.process(SolrRequest.java:207)
   [junit4]    > 	at org.apache.solr.client.solrj.request.UpdateRequest.commit(UpdateRequest.java:237)
   [junit4]    > 	at org.apache.solr.cloud.TestCloudRecovery2.test(TestCloudRecovery2.java:67)
   [junit4]    > 	at java.lang.Thread.run(Thread.java:748)
   [junit4]   2> 1327236 INFO  (jetty-closer-8790-thread-1) [    ] o.a.s.c.CoreContainer Shutting down CoreContainer instance=1587010770
   [junit4]   2> 1327236 INFO  (jetty-closer-8790-thread-1) [    ] o.a.s.c.ZkController Remove node as live in ZooKeeper:/live_nodes/127.0.0.1:44362_solr
   [junit4]   2> 1327237 INFO  (jetty-closer-8790-thread-1) [    ] o.a.s.c.CoreContainer Publish this node as DOWN...
   [junit4]   2> 1327237 INFO  (jetty-closer-8790-thread-1) [    ] o.a.s.c.ZkController Publish node=127.0.0.1:44362_solr as DOWN
   [junit4]   2> 1327240 INFO  (coreCloseExecutor-8310-thread-1) [n:127.0.0.1:44362_solr c:collection1 s:shard1 r:core_node3 x:collection1_shard1_replica_n1] o.a.s.c.SolrCore [collection1_shard1_replica_n1]  CLOSING SolrCore org.apache.solr.core.SolrCore@14b0a7d4
   [junit4]   2> 1327240 INFO  (coreCloseExecutor-8310-thread-1) [n:127.0.0.1:44362_solr c:collection1 s:shard1 r:core_node3 x:collection1_shard1_replica_n1] o.a.

[...truncated too long message...]

t/home/jenkins/workspace/Lucene-Solr-8.x-Solaris/solr/build/solr-core/classes/test
    [javac] Compiling 938 source files to /export/home/jenkins/workspace/Lucene-Solr-8.x-Solaris/solr/build/solr-core/classes/test
    [javac] Note: Some input files use or override a deprecated API.
    [javac] Note: Recompile with -Xlint:deprecation for details.
    [javac] Note: Some input files use unchecked or unsafe operations.
    [javac] Note: Recompile with -Xlint:unchecked for details.
    [javac] Creating empty /export/home/jenkins/workspace/Lucene-Solr-8.x-Solaris/solr/build/solr-core/classes/test/org/apache/solr/cloud/autoscaling/sim/package-info.class
     [copy] Copying 1 file to /export/home/jenkins/workspace/Lucene-Solr-8.x-Solaris/solr/build/solr-core/classes/test

common-solr.compile-test:

compile-test:

BUILD SUCCESSFUL
Total time: 59 seconds
[repro] ant test-nocompile -Dtests.dups=5 -Dtests.maxfailures=5 -Dtests.class="*.TestCloudRecovery2" -Dtests.showOutput=onerror "-Dargs=-XX:+UseCompressedOops -XX:+UseSerialGC" -Dtests.seed=FD138BE537932327 -Dtests.slow=true -Dtests.locale=nl -Dtests.timezone=Africa/Asmara -Dtests.asserts=true -Dtests.file.encoding=UTF-8
Buildfile: /export/home/jenkins/workspace/Lucene-Solr-8.x-Solaris/solr/core/build.xml

-clover.disable:

ivy-configure:
[ivy:configure] :: Apache Ivy 2.4.0 - 20141213170938 :: http://ant.apache.org/ivy/ ::
[ivy:configure] :: loading settings :: file = /export/home/jenkins/workspace/Lucene-Solr-8.x-Solaris/lucene/top-level-ivy-settings.xml

install-junit4-taskdef:

ivy-availability-check:
[loadresource] Do not set property disallowed.ivy.jars.list as its length is 0.

-ivy-fail-disallowed-ivy-version:

ivy-fail:

resolve-groovy:
[ivy:cachepath] :: resolving dependencies :: org.codehaus.groovy#groovy-all-caller;working
[ivy:cachepath] 	confs: [default]
[ivy:cachepath] 	found org.codehaus.groovy#groovy-all;2.4.15 in public
[ivy:cachepath] :: resolution report :: resolve 16ms :: artifacts dl 1ms
	---------------------------------------------------------------------
	|                  |            modules            ||   artifacts   |
	|       conf       | number| search|dwnlded|evicted|| number|dwnlded|
	---------------------------------------------------------------------
	|      default     |   1   |   0   |   0   |   0   ||   1   |   0   |
	---------------------------------------------------------------------

-init-totals:

-test:
    [mkdir] Created dir: /export/home/jenkins/workspace/Lucene-Solr-8.x-Solaris/solr/build/solr-core/test
[junit4:pickseed] Seed property 'tests.seed' already defined: FD138BE537932327
    [mkdir] Created dir: /export/home/jenkins/workspace/Lucene-Solr-8.x-Solaris/solr/build/solr-core/test/temp
   [junit4] <JUnit4> says ahoj! Master seed: FD138BE537932327
   [junit4] Executing 5 suites with 2 JVMs.
   [junit4] 
   [junit4] Started J1 PID(2013@serv1-vm3).
   [junit4] Started J0 PID(2014@serv1-vm3).
   [junit4] Suite: org.apache.solr.cloud.TestCloudRecovery2
   [junit4] OK      10.9s J1 | TestCloudRecovery2.test
   [junit4] Completed [1/5] on J1 in 22.41s, 1 test
   [junit4] 
   [junit4] Suite: org.apache.solr.cloud.TestCloudRecovery2
   [junit4] OK      11.6s J0 | TestCloudRecovery2.test
   [junit4] Completed [2/5] on J0 in 23.36s, 1 test
   [junit4] 
   [junit4] Suite: org.apache.solr.cloud.TestCloudRecovery2
   [junit4] OK      10.9s J1 | TestCloudRecovery2.test
   [junit4] Completed [3/5] on J1 in 15.81s, 1 test
   [junit4] 
   [junit4] Suite: org.apache.solr.cloud.TestCloudRecovery2
   [junit4] OK      12.2s J0 | TestCloudRecovery2.test
   [junit4] Completed [4/5] on J0 in 17.17s, 1 test
   [junit4] 
   [junit4] Suite: org.apache.solr.cloud.TestCloudRecovery2
   [junit4] OK      8.86s J1 | TestCloudRecovery2.test
   [junit4] Completed [5/5] on J1 in 12.71s, 1 test
   [junit4] 
   [junit4] JVM J0:     0.74 ..    42.10 =    41.36s
   [junit4] JVM J1:     0.73 ..    52.59 =    51.86s
   [junit4] Execution time total: 52 seconds
   [junit4] Tests summary: 5 suites, 5 tests
   [junit4] Could not remove temporary path: /export/home/jenkins/workspace/Lucene-Solr-8.x-Solaris/solr/build/solr-core/test/J0 (java.nio.file.DirectoryNotEmptyException: Remaining files: [/export/home/jenkins/workspace/Lucene-Solr-8.x-Solaris/solr/build/solr-core/test/J0/temp])
   [junit4] Could not remove temporary path: /export/home/jenkins/workspace/Lucene-Solr-8.x-Solaris/solr/build/solr-core/test/J1 (java.nio.file.DirectoryNotEmptyException: Remaining files: [/export/home/jenkins/workspace/Lucene-Solr-8.x-Solaris/solr/build/solr-core/test/J1/temp])
     [echo] 5 slowest tests:
[junit4:tophints] 165.30s | org.apache.solr.cloud.api.collections.ShardSplitTest
[junit4:tophints] 145.01s | org.apache.solr.search.facet.TestJsonFacets
[junit4:tophints] 117.67s | org.apache.solr.update.SoftAutoCommitTest
[junit4:tophints] 104.96s | org.apache.solr.cloud.CollectionsAPISolrJTest
[junit4:tophints]  92.72s | org.apache.solr.handler.TestReplicationHandler

-check-totals:

test-nocompile:

BUILD SUCCESSFUL
Total time: 55 seconds
[repro] Failures:
[repro]   0/5 failed: org.apache.solr.cloud.TestCloudRecovery2
[repro] Exiting with code 0
+ mv lucene/build lucene/build.repro
+ mv solr/build solr/build.repro
+ mv lucene/build.orig lucene/build
+ mv solr/build.orig solr/build
Archiving artifacts
Setting ANT_1_8_2_HOME=/export/home/jenkins/tools/hudson.tasks.Ant_AntInstallation/ANT_1.8.2
java.lang.InterruptedException: no matches found within 10000
	at hudson.FilePath$ValidateAntFileMask.hasMatch(FilePath.java:2847)
	at hudson.FilePath$ValidateAntFileMask.invoke(FilePath.java:2726)
	at hudson.FilePath$ValidateAntFileMask.invoke(FilePath.java:2707)
	at hudson.FilePath$FileCallableWrapper.call(FilePath.java:3086)
Also:   hudson.remoting.Channel$CallSiteStackTrace: Remote call to Solaris VBOX
		at hudson.remoting.Channel.attachCallSiteStackTrace(Channel.java:1743)
		at hudson.remoting.UserRequest$ExceptionResponse.retrieve(UserRequest.java:357)
		at hudson.remoting.Channel.call(Channel.java:957)
		at hudson.FilePath.act(FilePath.java:1072)
		at hudson.FilePath.act(FilePath.java:1061)
		at hudson.FilePath.validateAntFileMask(FilePath.java:2705)
		at hudson.tasks.ArtifactArchiver.perform(ArtifactArchiver.java:243)
		at hudson.tasks.BuildStepCompatibilityLayer.perform(BuildStepCompatibilityLayer.java:81)
		at hudson.tasks.BuildStepMonitor$1.perform(BuildStepMonitor.java:20)
		at hudson.model.AbstractBuild$AbstractBuildExecution.perform(AbstractBuild.java:744)
		at hudson.model.AbstractBuild$AbstractBuildExecution.performAllBuildSteps(AbstractBuild.java:690)
		at hudson.model.Build$BuildExecution.post2(Build.java:186)
		at hudson.model.AbstractBuild$AbstractBuildExecution.post(AbstractBuild.java:635)
		at hudson.model.Run.execute(Run.java:1835)
		at hudson.model.FreeStyleBuild.run(FreeStyleBuild.java:43)
		at hudson.model.ResourceController.execute(ResourceController.java:97)
		at hudson.model.Executor.run(Executor.java:429)
Caused: hudson.FilePath$TunneledInterruptedException
	at hudson.FilePath$FileCallableWrapper.call(FilePath.java:3088)
	at hudson.remoting.UserRequest.perform(UserRequest.java:212)
	at hudson.remoting.UserRequest.perform(UserRequest.java:54)
	at hudson.remoting.Request$2.run(Request.java:369)
	at hudson.remoting.InterceptingExecutorService$1.call(InterceptingExecutorService.java:72)
	at java.util.concurrent.FutureTask.run(FutureTask.java:266)
	at java.util.concurrent.ThreadPoolExecutor.runWorker(ThreadPoolExecutor.java:1149)
	at java.util.concurrent.ThreadPoolExecutor$Worker.run(ThreadPoolExecutor.java:624)
	at java.lang.Thread.run(Thread.java:748)
Caused: java.lang.InterruptedException: java.lang.InterruptedException: no matches found within 10000
	at hudson.FilePath.act(FilePath.java:1074)
	at hudson.FilePath.act(FilePath.java:1061)
	at hudson.FilePath.validateAntFileMask(FilePath.java:2705)
	at hudson.tasks.ArtifactArchiver.perform(ArtifactArchiver.java:243)
	at hudson.tasks.BuildStepCompatibilityLayer.perform(BuildStepCompatibilityLayer.java:81)
	at hudson.tasks.BuildStepMonitor$1.perform(BuildStepMonitor.java:20)
	at hudson.model.AbstractBuild$AbstractBuildExecution.perform(AbstractBuild.java:744)
	at hudson.model.AbstractBuild$AbstractBuildExecution.performAllBuildSteps(AbstractBuild.java:690)
	at hudson.model.Build$BuildExecution.post2(Build.java:186)
	at hudson.model.AbstractBuild$AbstractBuildExecution.post(AbstractBuild.java:635)
	at hudson.model.Run.execute(Run.java:1835)
	at hudson.model.FreeStyleBuild.run(FreeStyleBuild.java:43)
	at hudson.model.ResourceController.execute(ResourceController.java:97)
	at hudson.model.Executor.run(Executor.java:429)
No artifacts found that match the file pattern "**/*.events,heapdumps/**,**/*_pid*.log". Configuration error?
[WARNINGS] Parsing warnings in console log with parser Java Compiler (javac)
Setting ANT_1_8_2_HOME=/export/home/jenkins/tools/hudson.tasks.Ant_AntInstallation/ANT_1.8.2
Setting ANT_1_8_2_HOME=/export/home/jenkins/tools/hudson.tasks.Ant_AntInstallation/ANT_1.8.2
<Git Blamer> Using GitBlamer to create author and commit information for all warnings.
<Git Blamer> GIT_COMMIT=0f1da2bc14ef1bb79e21558247ef3c72e802924e, workspace=/export/home/jenkins/workspace/Lucene-Solr-8.x-Solaris
[WARNINGS] Computing warning deltas based on reference build #3
Recording test results
Setting ANT_1_8_2_HOME=/export/home/jenkins/tools/hudson.tasks.Ant_AntInstallation/ANT_1.8.2
Build step 'Publish JUnit test result report' changed build result to UNSTABLE
Email was triggered for: Unstable (Test Failures)
Sending email for trigger: Unstable (Test Failures)
Setting ANT_1_8_2_HOME=/export/home/jenkins/tools/hudson.tasks.Ant_AntInstallation/ANT_1.8.2
Setting ANT_1_8_2_HOME=/export/home/jenkins/tools/hudson.tasks.Ant_AntInstallation/ANT_1.8.2
Setting ANT_1_8_2_HOME=/export/home/jenkins/tools/hudson.tasks.Ant_AntInstallation/ANT_1.8.2
Setting ANT_1_8_2_HOME=/export/home/jenkins/tools/hudson.tasks.Ant_AntInstallation/ANT_1.8.2

Mime
View raw message