lucene-dev mailing list archives

Site index · List index
Message view « Date » · « Thread »
Top « Date » · « Thread »
From Policeman Jenkins Server <jenk...@thetaphi.de>
Subject [JENKINS] Lucene-Solr-7.x-Windows (64bit/jdk-9.0.4) - Build # 958 - Unstable!
Date Tue, 15 Jan 2019 05:27:18 GMT
Build: https://jenkins.thetaphi.de/job/Lucene-Solr-7.x-Windows/958/
Java: 64bit/jdk-9.0.4 -XX:+UseCompressedOops -XX:+UseG1GC

2 tests failed.
FAILED:  org.apache.solr.cloud.MissingSegmentRecoveryTest.testLeaderRecovery

Error Message:
Expected a collection with one shard and two replicas Timeout waiting to see state for collection=MissingSegmentRecoveryTest :DocCollection(MissingSegmentRecoveryTest//collections/MissingSegmentRecoveryTest/state.json/7)={   "pullReplicas":"0",   "replicationFactor":"2",   "shards":{"shard1":{       "range":"80000000-7fffffff",       "state":"active",       "replicas":{         "core_node3":{           "core":"MissingSegmentRecoveryTest_shard1_replica_n1",           "base_url":"http://127.0.0.1:53912/solr",           "node_name":"127.0.0.1:53912_solr",           "state":"active",           "type":"NRT",           "force_set_state":"false",           "leader":"true"},         "core_node4":{           "core":"MissingSegmentRecoveryTest_shard1_replica_n2",           "base_url":"http://127.0.0.1:53909/solr",           "node_name":"127.0.0.1:53909_solr",           "state":"down",           "type":"NRT",           "force_set_state":"false"}}}},   "router":{"name":"compositeId"},   "maxShardsPerNode":"1",   "autoAddReplicas":"false",   "nrtReplicas":"2",   "tlogReplicas":"0"} Live Nodes: [127.0.0.1:53909_solr, 127.0.0.1:53912_solr] Last available state: DocCollection(MissingSegmentRecoveryTest//collections/MissingSegmentRecoveryTest/state.json/7)={   "pullReplicas":"0",   "replicationFactor":"2",   "shards":{"shard1":{       "range":"80000000-7fffffff",       "state":"active",       "replicas":{         "core_node3":{           "core":"MissingSegmentRecoveryTest_shard1_replica_n1",           "base_url":"http://127.0.0.1:53912/solr",           "node_name":"127.0.0.1:53912_solr",           "state":"active",           "type":"NRT",           "force_set_state":"false",           "leader":"true"},         "core_node4":{           "core":"MissingSegmentRecoveryTest_shard1_replica_n2",           "base_url":"http://127.0.0.1:53909/solr",           "node_name":"127.0.0.1:53909_solr",           "state":"down",           "type":"NRT",           "force_set_state":"false"}}}},   "router":{"name":"compositeId"},   "maxShardsPerNode":"1",   "autoAddReplicas":"false",   "nrtReplicas":"2",   "tlogReplicas":"0"}

Stack Trace:
java.lang.AssertionError: Expected a collection with one shard and two replicas
Timeout waiting to see state for collection=MissingSegmentRecoveryTest :DocCollection(MissingSegmentRecoveryTest//collections/MissingSegmentRecoveryTest/state.json/7)={
  "pullReplicas":"0",
  "replicationFactor":"2",
  "shards":{"shard1":{
      "range":"80000000-7fffffff",
      "state":"active",
      "replicas":{
        "core_node3":{
          "core":"MissingSegmentRecoveryTest_shard1_replica_n1",
          "base_url":"http://127.0.0.1:53912/solr",
          "node_name":"127.0.0.1:53912_solr",
          "state":"active",
          "type":"NRT",
          "force_set_state":"false",
          "leader":"true"},
        "core_node4":{
          "core":"MissingSegmentRecoveryTest_shard1_replica_n2",
          "base_url":"http://127.0.0.1:53909/solr",
          "node_name":"127.0.0.1:53909_solr",
          "state":"down",
          "type":"NRT",
          "force_set_state":"false"}}}},
  "router":{"name":"compositeId"},
  "maxShardsPerNode":"1",
  "autoAddReplicas":"false",
  "nrtReplicas":"2",
  "tlogReplicas":"0"}
Live Nodes: [127.0.0.1:53909_solr, 127.0.0.1:53912_solr]
Last available state: DocCollection(MissingSegmentRecoveryTest//collections/MissingSegmentRecoveryTest/state.json/7)={
  "pullReplicas":"0",
  "replicationFactor":"2",
  "shards":{"shard1":{
      "range":"80000000-7fffffff",
      "state":"active",
      "replicas":{
        "core_node3":{
          "core":"MissingSegmentRecoveryTest_shard1_replica_n1",
          "base_url":"http://127.0.0.1:53912/solr",
          "node_name":"127.0.0.1:53912_solr",
          "state":"active",
          "type":"NRT",
          "force_set_state":"false",
          "leader":"true"},
        "core_node4":{
          "core":"MissingSegmentRecoveryTest_shard1_replica_n2",
          "base_url":"http://127.0.0.1:53909/solr",
          "node_name":"127.0.0.1:53909_solr",
          "state":"down",
          "type":"NRT",
          "force_set_state":"false"}}}},
  "router":{"name":"compositeId"},
  "maxShardsPerNode":"1",
  "autoAddReplicas":"false",
  "nrtReplicas":"2",
  "tlogReplicas":"0"}
	at __randomizedtesting.SeedInfo.seed([1FB81C6070EAFD56:4FED846329CB4B4B]:0)
	at org.junit.Assert.fail(Assert.java:88)
	at org.apache.solr.cloud.SolrCloudTestCase.waitForState(SolrCloudTestCase.java:289)
	at org.apache.solr.cloud.SolrCloudTestCase.waitForState(SolrCloudTestCase.java:267)
	at org.apache.solr.cloud.MissingSegmentRecoveryTest.testLeaderRecovery(MissingSegmentRecoveryTest.java:106)
	at java.base/jdk.internal.reflect.NativeMethodAccessorImpl.invoke0(Native Method)
	at java.base/jdk.internal.reflect.NativeMethodAccessorImpl.invoke(NativeMethodAccessorImpl.java:62)
	at java.base/jdk.internal.reflect.DelegatingMethodAccessorImpl.invoke(DelegatingMethodAccessorImpl.java:43)
	at java.base/java.lang.reflect.Method.invoke(Method.java:564)
	at com.carrotsearch.randomizedtesting.RandomizedRunner.invoke(RandomizedRunner.java:1750)
	at com.carrotsearch.randomizedtesting.RandomizedRunner$8.evaluate(RandomizedRunner.java:938)
	at com.carrotsearch.randomizedtesting.RandomizedRunner$9.evaluate(RandomizedRunner.java:974)
	at com.carrotsearch.randomizedtesting.RandomizedRunner$10.evaluate(RandomizedRunner.java:988)
	at com.carrotsearch.randomizedtesting.rules.SystemPropertiesRestoreRule$1.evaluate(SystemPropertiesRestoreRule.java:57)
	at org.apache.lucene.util.TestRuleSetupTeardownChained$1.evaluate(TestRuleSetupTeardownChained.java:49)
	at org.apache.lucene.util.AbstractBeforeAfterRule$1.evaluate(AbstractBeforeAfterRule.java:45)
	at org.apache.lucene.util.TestRuleThreadAndTestName$1.evaluate(TestRuleThreadAndTestName.java:48)
	at org.apache.lucene.util.TestRuleIgnoreAfterMaxFailures$1.evaluate(TestRuleIgnoreAfterMaxFailures.java:64)
	at org.apache.lucene.util.TestRuleMarkFailure$1.evaluate(TestRuleMarkFailure.java:47)
	at com.carrotsearch.randomizedtesting.rules.StatementAdapter.evaluate(StatementAdapter.java:36)
	at com.carrotsearch.randomizedtesting.ThreadLeakControl$StatementRunner.run(ThreadLeakControl.java:368)
	at com.carrotsearch.randomizedtesting.ThreadLeakControl.forkTimeoutingTask(ThreadLeakControl.java:817)
	at com.carrotsearch.randomizedtesting.ThreadLeakControl$3.evaluate(ThreadLeakControl.java:468)
	at com.carrotsearch.randomizedtesting.RandomizedRunner.runSingleTest(RandomizedRunner.java:947)
	at com.carrotsearch.randomizedtesting.RandomizedRunner$5.evaluate(RandomizedRunner.java:832)
	at com.carrotsearch.randomizedtesting.RandomizedRunner$6.evaluate(RandomizedRunner.java:883)
	at com.carrotsearch.randomizedtesting.RandomizedRunner$7.evaluate(RandomizedRunner.java:894)
	at com.carrotsearch.randomizedtesting.rules.StatementAdapter.evaluate(StatementAdapter.java:36)
	at com.carrotsearch.randomizedtesting.rules.SystemPropertiesRestoreRule$1.evaluate(SystemPropertiesRestoreRule.java:57)
	at org.apache.lucene.util.AbstractBeforeAfterRule$1.evaluate(AbstractBeforeAfterRule.java:45)
	at com.carrotsearch.randomizedtesting.rules.StatementAdapter.evaluate(StatementAdapter.java:36)
	at org.apache.lucene.util.TestRuleStoreClassName$1.evaluate(TestRuleStoreClassName.java:41)
	at com.carrotsearch.randomizedtesting.rules.NoShadowingOrOverridesOnMethodsRule$1.evaluate(NoShadowingOrOverridesOnMethodsRule.java:40)
	at com.carrotsearch.randomizedtesting.rules.NoShadowingOrOverridesOnMethodsRule$1.evaluate(NoShadowingOrOverridesOnMethodsRule.java:40)
	at com.carrotsearch.randomizedtesting.rules.StatementAdapter.evaluate(StatementAdapter.java:36)
	at com.carrotsearch.randomizedtesting.rules.StatementAdapter.evaluate(StatementAdapter.java:36)
	at org.apache.lucene.util.TestRuleAssertionsRequired$1.evaluate(TestRuleAssertionsRequired.java:53)
	at org.apache.lucene.util.TestRuleMarkFailure$1.evaluate(TestRuleMarkFailure.java:47)
	at org.apache.lucene.util.TestRuleIgnoreAfterMaxFailures$1.evaluate(TestRuleIgnoreAfterMaxFailures.java:64)
	at org.apache.lucene.util.TestRuleIgnoreTestSuites$1.evaluate(TestRuleIgnoreTestSuites.java:54)
	at com.carrotsearch.randomizedtesting.rules.StatementAdapter.evaluate(StatementAdapter.java:36)
	at com.carrotsearch.randomizedtesting.ThreadLeakControl$StatementRunner.run(ThreadLeakControl.java:368)
	at java.base/java.lang.Thread.run(Thread.java:844)


FAILED:  org.apache.solr.cloud.MissingSegmentRecoveryTest.testLeaderRecovery

Error Message:
Expected a collection with one shard and two replicas Timeout waiting to see state for collection=MissingSegmentRecoveryTest :DocCollection(MissingSegmentRecoveryTest//collections/MissingSegmentRecoveryTest/state.json/8)={   "pullReplicas":"0",   "replicationFactor":"2",   "shards":{"shard1":{       "range":"80000000-7fffffff",       "state":"active",       "replicas":{         "core_node3":{           "core":"MissingSegmentRecoveryTest_shard1_replica_n1",           "base_url":"http://127.0.0.1:58156/solr",           "node_name":"127.0.0.1:58156_solr",           "state":"active",           "type":"NRT",           "force_set_state":"false",           "leader":"true"},         "core_node4":{           "core":"MissingSegmentRecoveryTest_shard1_replica_n2",           "base_url":"http://127.0.0.1:58155/solr",           "node_name":"127.0.0.1:58155_solr",           "state":"down",           "type":"NRT",           "force_set_state":"false"}}}},   "router":{"name":"compositeId"},   "maxShardsPerNode":"1",   "autoAddReplicas":"false",   "nrtReplicas":"2",   "tlogReplicas":"0"} Live Nodes: [127.0.0.1:58155_solr, 127.0.0.1:58156_solr] Last available state: DocCollection(MissingSegmentRecoveryTest//collections/MissingSegmentRecoveryTest/state.json/8)={   "pullReplicas":"0",   "replicationFactor":"2",   "shards":{"shard1":{       "range":"80000000-7fffffff",       "state":"active",       "replicas":{         "core_node3":{           "core":"MissingSegmentRecoveryTest_shard1_replica_n1",           "base_url":"http://127.0.0.1:58156/solr",           "node_name":"127.0.0.1:58156_solr",           "state":"active",           "type":"NRT",           "force_set_state":"false",           "leader":"true"},         "core_node4":{           "core":"MissingSegmentRecoveryTest_shard1_replica_n2",           "base_url":"http://127.0.0.1:58155/solr",           "node_name":"127.0.0.1:58155_solr",           "state":"down",           "type":"NRT",           "force_set_state":"false"}}}},   "router":{"name":"compositeId"},   "maxShardsPerNode":"1",   "autoAddReplicas":"false",   "nrtReplicas":"2",   "tlogReplicas":"0"}

Stack Trace:
java.lang.AssertionError: Expected a collection with one shard and two replicas
Timeout waiting to see state for collection=MissingSegmentRecoveryTest :DocCollection(MissingSegmentRecoveryTest//collections/MissingSegmentRecoveryTest/state.json/8)={
  "pullReplicas":"0",
  "replicationFactor":"2",
  "shards":{"shard1":{
      "range":"80000000-7fffffff",
      "state":"active",
      "replicas":{
        "core_node3":{
          "core":"MissingSegmentRecoveryTest_shard1_replica_n1",
          "base_url":"http://127.0.0.1:58156/solr",
          "node_name":"127.0.0.1:58156_solr",
          "state":"active",
          "type":"NRT",
          "force_set_state":"false",
          "leader":"true"},
        "core_node4":{
          "core":"MissingSegmentRecoveryTest_shard1_replica_n2",
          "base_url":"http://127.0.0.1:58155/solr",
          "node_name":"127.0.0.1:58155_solr",
          "state":"down",
          "type":"NRT",
          "force_set_state":"false"}}}},
  "router":{"name":"compositeId"},
  "maxShardsPerNode":"1",
  "autoAddReplicas":"false",
  "nrtReplicas":"2",
  "tlogReplicas":"0"}
Live Nodes: [127.0.0.1:58155_solr, 127.0.0.1:58156_solr]
Last available state: DocCollection(MissingSegmentRecoveryTest//collections/MissingSegmentRecoveryTest/state.json/8)={
  "pullReplicas":"0",
  "replicationFactor":"2",
  "shards":{"shard1":{
      "range":"80000000-7fffffff",
      "state":"active",
      "replicas":{
        "core_node3":{
          "core":"MissingSegmentRecoveryTest_shard1_replica_n1",
          "base_url":"http://127.0.0.1:58156/solr",
          "node_name":"127.0.0.1:58156_solr",
          "state":"active",
          "type":"NRT",
          "force_set_state":"false",
          "leader":"true"},
        "core_node4":{
          "core":"MissingSegmentRecoveryTest_shard1_replica_n2",
          "base_url":"http://127.0.0.1:58155/solr",
          "node_name":"127.0.0.1:58155_solr",
          "state":"down",
          "type":"NRT",
          "force_set_state":"false"}}}},
  "router":{"name":"compositeId"},
  "maxShardsPerNode":"1",
  "autoAddReplicas":"false",
  "nrtReplicas":"2",
  "tlogReplicas":"0"}
	at __randomizedtesting.SeedInfo.seed([1FB81C6070EAFD56:4FED846329CB4B4B]:0)
	at org.junit.Assert.fail(Assert.java:88)
	at org.apache.solr.cloud.SolrCloudTestCase.waitForState(SolrCloudTestCase.java:289)
	at org.apache.solr.cloud.SolrCloudTestCase.waitForState(SolrCloudTestCase.java:267)
	at org.apache.solr.cloud.MissingSegmentRecoveryTest.testLeaderRecovery(MissingSegmentRecoveryTest.java:106)
	at java.base/jdk.internal.reflect.NativeMethodAccessorImpl.invoke0(Native Method)
	at java.base/jdk.internal.reflect.NativeMethodAccessorImpl.invoke(NativeMethodAccessorImpl.java:62)
	at java.base/jdk.internal.reflect.DelegatingMethodAccessorImpl.invoke(DelegatingMethodAccessorImpl.java:43)
	at java.base/java.lang.reflect.Method.invoke(Method.java:564)
	at com.carrotsearch.randomizedtesting.RandomizedRunner.invoke(RandomizedRunner.java:1750)
	at com.carrotsearch.randomizedtesting.RandomizedRunner$8.evaluate(RandomizedRunner.java:938)
	at com.carrotsearch.randomizedtesting.RandomizedRunner$9.evaluate(RandomizedRunner.java:974)
	at com.carrotsearch.randomizedtesting.RandomizedRunner$10.evaluate(RandomizedRunner.java:988)
	at com.carrotsearch.randomizedtesting.rules.SystemPropertiesRestoreRule$1.evaluate(SystemPropertiesRestoreRule.java:57)
	at org.apache.lucene.util.TestRuleSetupTeardownChained$1.evaluate(TestRuleSetupTeardownChained.java:49)
	at org.apache.lucene.util.AbstractBeforeAfterRule$1.evaluate(AbstractBeforeAfterRule.java:45)
	at org.apache.lucene.util.TestRuleThreadAndTestName$1.evaluate(TestRuleThreadAndTestName.java:48)
	at org.apache.lucene.util.TestRuleIgnoreAfterMaxFailures$1.evaluate(TestRuleIgnoreAfterMaxFailures.java:64)
	at org.apache.lucene.util.TestRuleMarkFailure$1.evaluate(TestRuleMarkFailure.java:47)
	at com.carrotsearch.randomizedtesting.rules.StatementAdapter.evaluate(StatementAdapter.java:36)
	at com.carrotsearch.randomizedtesting.ThreadLeakControl$StatementRunner.run(ThreadLeakControl.java:368)
	at com.carrotsearch.randomizedtesting.ThreadLeakControl.forkTimeoutingTask(ThreadLeakControl.java:817)
	at com.carrotsearch.randomizedtesting.ThreadLeakControl$3.evaluate(ThreadLeakControl.java:468)
	at com.carrotsearch.randomizedtesting.RandomizedRunner.runSingleTest(RandomizedRunner.java:947)
	at com.carrotsearch.randomizedtesting.RandomizedRunner$5.evaluate(RandomizedRunner.java:832)
	at com.carrotsearch.randomizedtesting.RandomizedRunner$6.evaluate(RandomizedRunner.java:883)
	at com.carrotsearch.randomizedtesting.RandomizedRunner$7.evaluate(RandomizedRunner.java:894)
	at com.carrotsearch.randomizedtesting.rules.StatementAdapter.evaluate(StatementAdapter.java:36)
	at com.carrotsearch.randomizedtesting.rules.SystemPropertiesRestoreRule$1.evaluate(SystemPropertiesRestoreRule.java:57)
	at org.apache.lucene.util.AbstractBeforeAfterRule$1.evaluate(AbstractBeforeAfterRule.java:45)
	at com.carrotsearch.randomizedtesting.rules.StatementAdapter.evaluate(StatementAdapter.java:36)
	at org.apache.lucene.util.TestRuleStoreClassName$1.evaluate(TestRuleStoreClassName.java:41)
	at com.carrotsearch.randomizedtesting.rules.NoShadowingOrOverridesOnMethodsRule$1.evaluate(NoShadowingOrOverridesOnMethodsRule.java:40)
	at com.carrotsearch.randomizedtesting.rules.NoShadowingOrOverridesOnMethodsRule$1.evaluate(NoShadowingOrOverridesOnMethodsRule.java:40)
	at com.carrotsearch.randomizedtesting.rules.StatementAdapter.evaluate(StatementAdapter.java:36)
	at com.carrotsearch.randomizedtesting.rules.StatementAdapter.evaluate(StatementAdapter.java:36)
	at org.apache.lucene.util.TestRuleAssertionsRequired$1.evaluate(TestRuleAssertionsRequired.java:53)
	at org.apache.lucene.util.TestRuleMarkFailure$1.evaluate(TestRuleMarkFailure.java:47)
	at org.apache.lucene.util.TestRuleIgnoreAfterMaxFailures$1.evaluate(TestRuleIgnoreAfterMaxFailures.java:64)
	at org.apache.lucene.util.TestRuleIgnoreTestSuites$1.evaluate(TestRuleIgnoreTestSuites.java:54)
	at com.carrotsearch.randomizedtesting.rules.StatementAdapter.evaluate(StatementAdapter.java:36)
	at com.carrotsearch.randomizedtesting.ThreadLeakControl$StatementRunner.run(ThreadLeakControl.java:368)
	at java.base/java.lang.Thread.run(Thread.java:844)




Build Log:
[...truncated 14100 lines...]
   [junit4] Suite: org.apache.solr.cloud.MissingSegmentRecoveryTest
   [junit4]   2> Creating dataDir: C:\Users\jenkins\workspace\Lucene-Solr-7.x-Windows\solr\build\solr-core\test\J1\temp\solr.cloud.MissingSegmentRecoveryTest_1FB81C6070EAFD56-001\init-core-data-001
   [junit4]   2> 1497012 WARN  (SUITE-MissingSegmentRecoveryTest-seed#[1FB81C6070EAFD56]-worker) [    ] o.a.s.SolrTestCaseJ4 startTrackingSearchers: numOpens=1 numCloses=1
   [junit4]   2> 1497013 INFO  (SUITE-MissingSegmentRecoveryTest-seed#[1FB81C6070EAFD56]-worker) [    ] o.a.s.SolrTestCaseJ4 Using PointFields (NUMERIC_POINTS_SYSPROP=true) w/NUMERIC_DOCVALUES_SYSPROP=true
   [junit4]   2> 1497013 INFO  (SUITE-MissingSegmentRecoveryTest-seed#[1FB81C6070EAFD56]-worker) [    ] o.a.s.SolrTestCaseJ4 Randomized ssl (false) and clientAuth (false) via: @org.apache.solr.util.RandomizeSSL(reason="", value=0.0/0.0, ssl=0.0/0.0, clientAuth=0.0/0.0)
   [junit4]   2> 1497013 INFO  (SUITE-MissingSegmentRecoveryTest-seed#[1FB81C6070EAFD56]-worker) [    ] o.a.s.SolrTestCaseJ4 SecureRandom sanity checks: test.solr.allowed.securerandom=null & java.security.egd=file:/dev/./urandom
   [junit4]   2> 1497015 INFO  (SUITE-MissingSegmentRecoveryTest-seed#[1FB81C6070EAFD56]-worker) [    ] o.a.s.c.MiniSolrCloudCluster Starting cluster of 2 servers in C:\Users\jenkins\workspace\Lucene-Solr-7.x-Windows\solr\build\solr-core\test\J1\temp\solr.cloud.MissingSegmentRecoveryTest_1FB81C6070EAFD56-001\tempDir-001
   [junit4]   2> 1497016 INFO  (SUITE-MissingSegmentRecoveryTest-seed#[1FB81C6070EAFD56]-worker) [    ] o.a.s.c.ZkTestServer STARTING ZK TEST SERVER
   [junit4]   2> 1497016 INFO  (ZkTestServer Run Thread) [    ] o.a.s.c.ZkTestServer client port:0.0.0.0/0.0.0.0:0
   [junit4]   2> 1497016 INFO  (ZkTestServer Run Thread) [    ] o.a.s.c.ZkTestServer Starting server
   [junit4]   2> 1497138 INFO  (SUITE-MissingSegmentRecoveryTest-seed#[1FB81C6070EAFD56]-worker) [    ] o.a.s.c.ZkTestServer start zk server on port:58144
   [junit4]   2> 1497138 INFO  (SUITE-MissingSegmentRecoveryTest-seed#[1FB81C6070EAFD56]-worker) [    ] o.a.s.c.ZkTestServer parse host and port list: 127.0.0.1:58144
   [junit4]   2> 1497138 INFO  (SUITE-MissingSegmentRecoveryTest-seed#[1FB81C6070EAFD56]-worker) [    ] o.a.s.c.ZkTestServer connecting to 127.0.0.1 58144
   [junit4]   2> 1497143 INFO  (zkConnectionManagerCallback-10459-thread-1) [    ] o.a.s.c.c.ConnectionManager zkClient has connected
   [junit4]   2> 1497149 INFO  (zkConnectionManagerCallback-10461-thread-1) [    ] o.a.s.c.c.ConnectionManager zkClient has connected
   [junit4]   2> 1497152 INFO  (zkConnectionManagerCallback-10463-thread-1) [    ] o.a.s.c.c.ConnectionManager zkClient has connected
   [junit4]   2> 1497154 WARN  (NIOServerCxn.Factory:0.0.0.0/0.0.0.0:0) [    ] o.a.z.s.NIOServerCnxn Unable to read additional data from client sessionid 0x1001a710d590002, likely client has closed socket
   [junit4]   2> 1497155 WARN  (jetty-launcher-10464-thread-1) [    ] o.e.j.s.AbstractConnector Ignoring deprecated socket close linger time
   [junit4]   2> 1497156 INFO  (jetty-launcher-10464-thread-1) [    ] o.a.s.c.s.e.JettySolrRunner Start Jetty (original configured port=0)
   [junit4]   2> 1497156 WARN  (jetty-launcher-10464-thread-2) [    ] o.e.j.s.AbstractConnector Ignoring deprecated socket close linger time
   [junit4]   2> 1497156 INFO  (jetty-launcher-10464-thread-1) [    ] o.a.s.c.s.e.JettySolrRunner Trying to start Jetty on port 0 try number 1 ...
   [junit4]   2> 1497156 INFO  (jetty-launcher-10464-thread-1) [    ] o.e.j.s.Server jetty-9.4.14.v20181114; built: 2018-11-14T21:20:31.478Z; git: c4550056e785fb5665914545889f21dc136ad9e6; jvm 9.0.4+11
   [junit4]   2> 1497156 INFO  (jetty-launcher-10464-thread-2) [    ] o.a.s.c.s.e.JettySolrRunner Start Jetty (original configured port=0)
   [junit4]   2> 1497156 INFO  (jetty-launcher-10464-thread-2) [    ] o.a.s.c.s.e.JettySolrRunner Trying to start Jetty on port 0 try number 1 ...
   [junit4]   2> 1497156 INFO  (jetty-launcher-10464-thread-2) [    ] o.e.j.s.Server jetty-9.4.14.v20181114; built: 2018-11-14T21:20:31.478Z; git: c4550056e785fb5665914545889f21dc136ad9e6; jvm 9.0.4+11
   [junit4]   2> 1497156 INFO  (jetty-launcher-10464-thread-2) [    ] o.e.j.s.session DefaultSessionIdManager workerName=node0
   [junit4]   2> 1497156 INFO  (jetty-launcher-10464-thread-2) [    ] o.e.j.s.session No SessionScavenger set, using defaults
   [junit4]   2> 1497156 INFO  (jetty-launcher-10464-thread-2) [    ] o.e.j.s.session node0 Scavenging every 600000ms
   [junit4]   2> 1497157 INFO  (jetty-launcher-10464-thread-1) [    ] o.e.j.s.session DefaultSessionIdManager workerName=node0
   [junit4]   2> 1497157 INFO  (jetty-launcher-10464-thread-1) [    ] o.e.j.s.session No SessionScavenger set, using defaults
   [junit4]   2> 1497157 INFO  (jetty-launcher-10464-thread-1) [    ] o.e.j.s.session node0 Scavenging every 660000ms
   [junit4]   2> 1497157 INFO  (jetty-launcher-10464-thread-2) [    ] o.e.j.s.h.ContextHandler Started o.e.j.s.ServletContextHandler@42cf8a13{/solr,null,AVAILABLE}
   [junit4]   2> 1497157 INFO  (jetty-launcher-10464-thread-1) [    ] o.e.j.s.h.ContextHandler Started o.e.j.s.ServletContextHandler@3f2884bb{/solr,null,AVAILABLE}
   [junit4]   2> 1497162 INFO  (jetty-launcher-10464-thread-2) [    ] o.e.j.s.AbstractConnector Started ServerConnector@7e9df290{HTTP/1.1,[http/1.1]}{127.0.0.1:58155}
   [junit4]   2> 1497162 INFO  (jetty-launcher-10464-thread-1) [    ] o.e.j.s.AbstractConnector Started ServerConnector@3f982319{HTTP/1.1,[http/1.1]}{127.0.0.1:58156}
   [junit4]   2> 1497162 INFO  (jetty-launcher-10464-thread-2) [    ] o.e.j.s.Server Started @1482762ms
   [junit4]   2> 1497162 INFO  (jetty-launcher-10464-thread-1) [    ] o.e.j.s.Server Started @1482762ms
   [junit4]   2> 1497162 INFO  (jetty-launcher-10464-thread-1) [    ] o.a.s.c.s.e.JettySolrRunner Jetty properties: {hostContext=/solr, hostPort=58156}
   [junit4]   2> 1497162 INFO  (jetty-launcher-10464-thread-2) [    ] o.a.s.c.s.e.JettySolrRunner Jetty properties: {hostContext=/solr, hostPort=58155}
   [junit4]   2> 1497163 ERROR (jetty-launcher-10464-thread-1) [    ] o.a.s.u.StartupLoggingUtils Missing Java Option solr.log.dir. Logging may be missing or incomplete.
   [junit4]   2> 1497163 ERROR (jetty-launcher-10464-thread-2) [    ] o.a.s.u.StartupLoggingUtils Missing Java Option solr.log.dir. Logging may be missing or incomplete.
   [junit4]   2> 1497163 INFO  (jetty-launcher-10464-thread-1) [    ] o.a.s.s.SolrDispatchFilter Using logger factory org.apache.logging.slf4j.Log4jLoggerFactory
   [junit4]   2> 1497163 INFO  (jetty-launcher-10464-thread-2) [    ] o.a.s.s.SolrDispatchFilter Using logger factory org.apache.logging.slf4j.Log4jLoggerFactory
   [junit4]   2> 1497163 INFO  (jetty-launcher-10464-thread-2) [    ] o.a.s.s.SolrDispatchFilter  ___      _       Welcome to Apache Solr? version 7.7.0
   [junit4]   2> 1497163 INFO  (jetty-launcher-10464-thread-1) [    ] o.a.s.s.SolrDispatchFilter  ___      _       Welcome to Apache Solr? version 7.7.0
   [junit4]   2> 1497163 INFO  (jetty-launcher-10464-thread-2) [    ] o.a.s.s.SolrDispatchFilter / __| ___| |_ _   Starting in cloud mode on port null
   [junit4]   2> 1497163 INFO  (jetty-launcher-10464-thread-2) [    ] o.a.s.s.SolrDispatchFilter \__ \/ _ \ | '_|  Install dir: null
   [junit4]   2> 1497163 INFO  (jetty-launcher-10464-thread-1) [    ] o.a.s.s.SolrDispatchFilter / __| ___| |_ _   Starting in cloud mode on port null
   [junit4]   2> 1497163 INFO  (jetty-launcher-10464-thread-2) [    ] o.a.s.s.SolrDispatchFilter |___/\___/_|_|    Start time: 2019-01-15T04:37:49.118440400Z
   [junit4]   2> 1497164 INFO  (jetty-launcher-10464-thread-1) [    ] o.a.s.s.SolrDispatchFilter \__ \/ _ \ | '_|  Install dir: null
   [junit4]   2> 1497164 INFO  (jetty-launcher-10464-thread-1) [    ] o.a.s.s.SolrDispatchFilter |___/\___/_|_|    Start time: 2019-01-15T04:37:49.119065200Z
   [junit4]   2> 1497167 INFO  (zkConnectionManagerCallback-10468-thread-1) [    ] o.a.s.c.c.ConnectionManager zkClient has connected
   [junit4]   2> 1497167 INFO  (zkConnectionManagerCallback-10466-thread-1) [    ] o.a.s.c.c.ConnectionManager zkClient has connected
   [junit4]   2> 1497168 INFO  (jetty-launcher-10464-thread-1) [    ] o.a.s.s.SolrDispatchFilter solr.xml found in ZooKeeper. Loading...
   [junit4]   2> 1497168 INFO  (jetty-launcher-10464-thread-2) [    ] o.a.s.s.SolrDispatchFilter solr.xml found in ZooKeeper. Loading...
   [junit4]   2> 1497173 WARN  (NIOServerCxn.Factory:0.0.0.0/0.0.0.0:0) [    ] o.a.z.s.NIOServerCnxn Unable to read additional data from client sessionid 0x1001a710d590004, likely client has closed socket
   [junit4]   2> 1497174 WARN  (NIOServerCxn.Factory:0.0.0.0/0.0.0.0:0) [    ] o.a.z.s.NIOServerCnxn Unable to read additional data from client sessionid 0x1001a710d590003, likely client has closed socket
   [junit4]   2> 1497355 INFO  (jetty-launcher-10464-thread-2) [    ] o.a.s.c.ZkContainer Zookeeper client=127.0.0.1:58144/solr
   [junit4]   2> 1497367 INFO  (zkConnectionManagerCallback-10472-thread-1) [    ] o.a.s.c.c.ConnectionManager zkClient has connected
   [junit4]   2> 1497369 WARN  (NIOServerCxn.Factory:0.0.0.0/0.0.0.0:0) [    ] o.a.z.s.NIOServerCnxn Unable to read additional data from client sessionid 0x1001a710d590005, likely client has closed socket
   [junit4]   2> 1497372 INFO  (zkConnectionManagerCallback-10474-thread-1) [    ] o.a.s.c.c.ConnectionManager zkClient has connected
   [junit4]   2> 1497459 INFO  (jetty-launcher-10464-thread-2) [n:127.0.0.1:58155_solr    ] o.a.s.c.OverseerElectionContext I am going to be the leader 127.0.0.1:58155_solr
   [junit4]   2> 1497459 INFO  (jetty-launcher-10464-thread-2) [n:127.0.0.1:58155_solr    ] o.a.s.c.Overseer Overseer (id=72086666895491078-127.0.0.1:58155_solr-n_0000000000) starting
   [junit4]   2> 1497479 INFO  (zkConnectionManagerCallback-10481-thread-1) [    ] o.a.s.c.c.ConnectionManager zkClient has connected
   [junit4]   2> 1497483 INFO  (jetty-launcher-10464-thread-2) [n:127.0.0.1:58155_solr    ] o.a.s.c.s.i.ZkClientClusterStateProvider Cluster at 127.0.0.1:58144/solr ready
   [junit4]   2> 1497483 INFO  (jetty-launcher-10464-thread-2) [n:127.0.0.1:58155_solr    ] o.a.s.c.ZkController Register node as live in ZooKeeper:/live_nodes/127.0.0.1:58155_solr
   [junit4]   2> 1497514 INFO  (jetty-launcher-10464-thread-2) [n:127.0.0.1:58155_solr    ] o.a.s.h.a.MetricsHistoryHandler No .system collection, keeping metrics history in memory.
   [junit4]   2> 1497571 INFO  (jetty-launcher-10464-thread-2) [n:127.0.0.1:58155_solr    ] o.a.s.m.r.SolrJmxReporter JMX monitoring for 'solr_58155.solr.node' (registry 'solr.node') enabled at server: com.sun.jmx.mbeanserver.JmxMBeanServer@3143f639
   [junit4]   2> 1497580 INFO  (jetty-launcher-10464-thread-2) [n:127.0.0.1:58155_solr    ] o.a.s.m.r.SolrJmxReporter JMX monitoring for 'solr_58155.solr.jvm' (registry 'solr.jvm') enabled at server: com.sun.jmx.mbeanserver.JmxMBeanServer@3143f639
   [junit4]   2> 1497584 INFO  (jetty-launcher-10464-thread-2) [n:127.0.0.1:58155_solr    ] o.a.s.m.r.SolrJmxReporter JMX monitoring for 'solr_58155.solr.jetty' (registry 'solr.jetty') enabled at server: com.sun.jmx.mbeanserver.JmxMBeanServer@3143f639
   [junit4]   2> 1497586 INFO  (jetty-launcher-10464-thread-2) [n:127.0.0.1:58155_solr    ] o.a.s.c.CorePropertiesLocator Found 0 core definitions underneath C:\Users\jenkins\workspace\Lucene-Solr-7.x-Windows\solr\build\solr-core\test\J1\temp\solr.cloud.MissingSegmentRecoveryTest_1FB81C6070EAFD56-001\tempDir-001\node2\.
   [junit4]   2> 1497591 INFO  (OverseerStateUpdate-72086666895491078-127.0.0.1:58155_solr-n_0000000000) [n:127.0.0.1:58155_solr    ] o.a.s.c.Overseer Starting to work on the main queue : 127.0.0.1:58155_solr
   [junit4]   2> 1497593 INFO  (OverseerStateUpdate-72086666895491078-127.0.0.1:58155_solr-n_0000000000) [n:127.0.0.1:58155_solr    ] o.a.s.c.c.ZkStateReader Updated live nodes from ZooKeeper... (0) -> (1)
   [junit4]   2> 1497598 INFO  (zkCallback-10480-thread-1) [    ] o.a.s.c.c.ZkStateReader Updated live nodes from ZooKeeper... (0) -> (1)
   [junit4]   2> 1497698 INFO  (jetty-launcher-10464-thread-1) [    ] o.a.s.c.ZkContainer Zookeeper client=127.0.0.1:58144/solr
   [junit4]   2> 1497705 INFO  (zkConnectionManagerCallback-10486-thread-1) [    ] o.a.s.c.c.ConnectionManager zkClient has connected
   [junit4]   2> 1497714 INFO  (zkConnectionManagerCallback-10488-thread-1) [    ] o.a.s.c.c.ConnectionManager zkClient has connected
   [junit4]   2> 1497718 INFO  (jetty-launcher-10464-thread-1) [n:127.0.0.1:58156_solr    ] o.a.s.c.c.ZkStateReader Updated live nodes from ZooKeeper... (0) -> (1)
   [junit4]   2> 1497723 INFO  (jetty-launcher-10464-thread-1) [n:127.0.0.1:58156_solr    ] o.a.s.c.ZkController Publish node=127.0.0.1:58156_solr as DOWN
   [junit4]   2> 1497724 INFO  (jetty-launcher-10464-thread-1) [n:127.0.0.1:58156_solr    ] o.a.s.c.TransientSolrCoreCacheDefault Allocating transient cache for 2147483647 transient cores
   [junit4]   2> 1497724 INFO  (jetty-launcher-10464-thread-1) [n:127.0.0.1:58156_solr    ] o.a.s.c.ZkController Register node as live in ZooKeeper:/live_nodes/127.0.0.1:58156_solr
   [junit4]   2> 1497725 INFO  (zkCallback-10480-thread-1) [    ] o.a.s.c.c.ZkStateReader Updated live nodes from ZooKeeper... (1) -> (2)
   [junit4]   2> 1497725 INFO  (zkCallback-10473-thread-1) [    ] o.a.s.c.c.ZkStateReader Updated live nodes from ZooKeeper... (1) -> (2)
   [junit4]   2> 1497726 INFO  (zkCallback-10487-thread-1) [    ] o.a.s.c.c.ZkStateReader Updated live nodes from ZooKeeper... (1) -> (2)
   [junit4]   2> 1497765 INFO  (zkConnectionManagerCallback-10495-thread-1) [    ] o.a.s.c.c.ConnectionManager zkClient has connected
   [junit4]   2> 1497766 INFO  (jetty-launcher-10464-thread-1) [n:127.0.0.1:58156_solr    ] o.a.s.c.c.ZkStateReader Updated live nodes from ZooKeeper... (0) -> (2)
   [junit4]   2> 1497767 INFO  (jetty-launcher-10464-thread-1) [n:127.0.0.1:58156_solr    ] o.a.s.c.s.i.ZkClientClusterStateProvider Cluster at 127.0.0.1:58144/solr ready
   [junit4]   2> 1497768 INFO  (jetty-launcher-10464-thread-1) [n:127.0.0.1:58156_solr    ] o.a.s.h.a.MetricsHistoryHandler No .system collection, keeping metrics history in memory.
   [junit4]   2> 1497783 INFO  (jetty-launcher-10464-thread-1) [n:127.0.0.1:58156_solr    ] o.a.s.m.r.SolrJmxReporter JMX monitoring for 'solr_58156.solr.node' (registry 'solr.node') enabled at server: com.sun.jmx.mbeanserver.JmxMBeanServer@3143f639
   [junit4]   2> 1497790 INFO  (jetty-launcher-10464-thread-1) [n:127.0.0.1:58156_solr    ] o.a.s.m.r.SolrJmxReporter JMX monitoring for 'solr_58156.solr.jvm' (registry 'solr.jvm') enabled at server: com.sun.jmx.mbeanserver.JmxMBeanServer@3143f639
   [junit4]   2> 1497790 INFO  (jetty-launcher-10464-thread-1) [n:127.0.0.1:58156_solr    ] o.a.s.m.r.SolrJmxReporter JMX monitoring for 'solr_58156.solr.jetty' (registry 'solr.jetty') enabled at server: com.sun.jmx.mbeanserver.JmxMBeanServer@3143f639
   [junit4]   2> 1497790 INFO  (jetty-launcher-10464-thread-1) [n:127.0.0.1:58156_solr    ] o.a.s.c.CorePropertiesLocator Found 0 core definitions underneath C:\Users\jenkins\workspace\Lucene-Solr-7.x-Windows\solr\build\solr-core\test\J1\temp\solr.cloud.MissingSegmentRecoveryTest_1FB81C6070EAFD56-001\tempDir-001\node1\.
   [junit4]   2> 1497827 INFO  (zkConnectionManagerCallback-10501-thread-1) [    ] o.a.s.c.c.ConnectionManager zkClient has connected
   [junit4]   2> 1497831 INFO  (SUITE-MissingSegmentRecoveryTest-seed#[1FB81C6070EAFD56]-worker) [    ] o.a.s.c.c.ZkStateReader Updated live nodes from ZooKeeper... (0) -> (2)
   [junit4]   2> 1497832 INFO  (SUITE-MissingSegmentRecoveryTest-seed#[1FB81C6070EAFD56]-worker) [    ] o.a.s.c.s.i.ZkClientClusterStateProvider Cluster at 127.0.0.1:58144/solr ready
   [junit4]   2> 1497860 INFO  (TEST-MissingSegmentRecoveryTest.testLeaderRecovery-seed#[1FB81C6070EAFD56]) [    ] o.a.s.SolrTestCaseJ4 ###Starting testLeaderRecovery
   [junit4]   2> 1497863 INFO  (qtp202240518-28705) [n:127.0.0.1:58155_solr    ] o.a.s.h.a.CollectionsHandler Invoked Collection Action :create with params collection.configName=conf&maxShardsPerNode=1&name=MissingSegmentRecoveryTest&nrtReplicas=2&action=CREATE&numShards=1&wt=javabin&version=2 and sendToOCPQueue=true
   [junit4]   2> 1497866 INFO  (OverseerThreadFactory-9693-thread-1-processing-n:127.0.0.1:58155_solr) [n:127.0.0.1:58155_solr    ] o.a.s.c.a.c.CreateCollectionCmd Create collection MissingSegmentRecoveryTest
   [junit4]   2> 1497995 INFO  (qtp202240518-28703) [n:127.0.0.1:58155_solr    ] o.a.s.s.HttpSolrCall [admin] webapp=null path=/admin/metrics params={prefix=CONTAINER.fs.usableSpace,CONTAINER.fs.totalSpace,CORE.coreName&wt=javabin&version=2&group=solr.node,solr.core} status=0 QTime=2
   [junit4]   2> 1497997 INFO  (qtp202240518-28702) [n:127.0.0.1:58155_solr    ] o.a.s.s.HttpSolrCall [admin] webapp=null path=/admin/metrics params={prefix=CONTAINER.fs.usableSpace,CONTAINER.fs.totalSpace,CORE.coreName&wt=javabin&version=2&group=solr.node,solr.core} status=0 QTime=2
   [junit4]   2> 1498002 INFO  (qtp202240518-28700) [n:127.0.0.1:58155_solr    ] o.a.s.s.HttpSolrCall [admin] webapp=null path=/admin/metrics params={prefix=CONTAINER.fs.usableSpace,CONTAINER.fs.totalSpace,CORE.coreName&wt=javabin&version=2&group=solr.node,solr.core} status=0 QTime=2
   [junit4]   2> 1498004 INFO  (qtp202240518-28714) [n:127.0.0.1:58155_solr    ] o.a.s.s.HttpSolrCall [admin] webapp=null path=/admin/metrics params={prefix=CONTAINER.fs.usableSpace,CONTAINER.fs.totalSpace,CORE.coreName&wt=javabin&version=2&group=solr.node,solr.core} status=0 QTime=2
   [junit4]   2> 1498016 INFO  (qtp202240518-28706) [n:127.0.0.1:58155_solr    ] o.a.s.s.HttpSolrCall [admin] webapp=null path=/admin/metrics params={prefix=CONTAINER.fs.usableSpace,CONTAINER.fs.totalSpace,CORE.coreName&wt=javabin&version=2&group=solr.node,solr.core} status=0 QTime=2
   [junit4]   2> 1498021 INFO  (qtp240405115-28709) [n:127.0.0.1:58156_solr    ] o.a.s.s.HttpSolrCall [admin] webapp=null path=/admin/metrics params={prefix=CONTAINER.fs.usableSpace,CONTAINER.fs.totalSpace,CORE.coreName&wt=javabin&version=2&group=solr.node,solr.core} status=0 QTime=2
   [junit4]   2> 1498024 INFO  (qtp240405115-28708) [n:127.0.0.1:58156_solr    ] o.a.s.s.HttpSolrCall [admin] webapp=null path=/admin/metrics params={prefix=CONTAINER.fs.usableSpace,CONTAINER.fs.totalSpace,CORE.coreName&wt=javabin&version=2&group=solr.node,solr.core} status=0 QTime=2
   [junit4]   2> 1498026 INFO  (qtp240405115-28707) [n:127.0.0.1:58156_solr    ] o.a.s.s.HttpSolrCall [admin] webapp=null path=/admin/metrics params={prefix=CONTAINER.fs.usableSpace,CONTAINER.fs.totalSpace,CORE.coreName&wt=javabin&version=2&group=solr.node,solr.core} status=0 QTime=1
   [junit4]   2> 1498030 INFO  (qtp240405115-28701) [n:127.0.0.1:58156_solr    ] o.a.s.s.HttpSolrCall [admin] webapp=null path=/admin/metrics params={prefix=CONTAINER.fs.usableSpace,CONTAINER.fs.totalSpace,CORE.coreName&wt=javabin&version=2&group=solr.node,solr.core} status=0 QTime=2
   [junit4]   2> 1498033 INFO  (qtp240405115-28699) [n:127.0.0.1:58156_solr    ] o.a.s.s.HttpSolrCall [admin] webapp=null path=/admin/metrics params={prefix=CONTAINER.fs.usableSpace,CONTAINER.fs.totalSpace,CORE.coreName&wt=javabin&version=2&group=solr.node,solr.core} status=0 QTime=2
   [junit4]   2> 1498040 INFO  (OverseerStateUpdate-72086666895491078-127.0.0.1:58155_solr-n_0000000000) [n:127.0.0.1:58155_solr    ] o.a.s.c.o.SliceMutator createReplica() {
   [junit4]   2>   "operation":"ADDREPLICA",
   [junit4]   2>   "collection":"MissingSegmentRecoveryTest",
   [junit4]   2>   "shard":"shard1",
   [junit4]   2>   "core":"MissingSegmentRecoveryTest_shard1_replica_n1",
   [junit4]   2>   "state":"down",
   [junit4]   2>   "base_url":"http://127.0.0.1:58156/solr",
   [junit4]   2>   "type":"NRT",
   [junit4]   2>   "waitForFinalState":"false"} 
   [junit4]   2> 1498042 INFO  (OverseerStateUpdate-72086666895491078-127.0.0.1:58155_solr-n_0000000000) [n:127.0.0.1:58155_solr    ] o.a.s.c.o.SliceMutator createReplica() {
   [junit4]   2>   "operation":"ADDREPLICA",
   [junit4]   2>   "collection":"MissingSegmentRecoveryTest",
   [junit4]   2>   "shard":"shard1",
   [junit4]   2>   "core":"MissingSegmentRecoveryTest_shard1_replica_n2",
   [junit4]   2>   "state":"down",
   [junit4]   2>   "base_url":"http://127.0.0.1:58155/solr",
   [junit4]   2>   "type":"NRT",
   [junit4]   2>   "waitForFinalState":"false"} 
   [junit4]   2> 1498290 INFO  (qtp240405115-28713) [n:127.0.0.1:58156_solr    x:MissingSegmentRecoveryTest_shard1_replica_n1] o.a.s.h.a.CoreAdminOperation core create command qt=/admin/cores&coreNodeName=core_node3&collection.configName=conf&newCollection=true&name=MissingSegmentRecoveryTest_shard1_replica_n1&action=CREATE&numShards=1&collection=MissingSegmentRecoveryTest&shard=shard1&wt=javabin&version=2&replicaType=NRT
   [junit4]   2> 1498294 INFO  (qtp202240518-28704) [n:127.0.0.1:58155_solr    x:MissingSegmentRecoveryTest_shard1_replica_n2] o.a.s.h.a.CoreAdminOperation core create command qt=/admin/cores&coreNodeName=core_node4&collection.configName=conf&newCollection=true&name=MissingSegmentRecoveryTest_shard1_replica_n2&action=CREATE&numShards=1&collection=MissingSegmentRecoveryTest&shard=shard1&wt=javabin&version=2&replicaType=NRT
   [junit4]   2> 1498294 INFO  (qtp202240518-28704) [n:127.0.0.1:58155_solr    x:MissingSegmentRecoveryTest_shard1_replica_n2] o.a.s.c.TransientSolrCoreCacheDefault Allocating transient cache for 2147483647 transient cores
   [junit4]   2> 1499465 INFO  (qtp202240518-28704) [n:127.0.0.1:58155_solr c:MissingSegmentRecoveryTest s:shard1 r:core_node4 x:MissingSegmentRecoveryTest_shard1_replica_n2] o.a.s.c.SolrConfig Using Lucene MatchVersion: 7.7.0
   [junit4]   2> 1499488 INFO  (qtp240405115-28713) [n:127.0.0.1:58156_solr c:MissingSegmentRecoveryTest s:shard1 r:core_node3 x:MissingSegmentRecoveryTest_shard1_replica_n1] o.a.s.c.SolrConfig Using Lucene MatchVersion: 7.7.0
   [junit4]   2> 1499524 INFO  (qtp202240518-28704) [n:127.0.0.1:58155_solr c:MissingSegmentRecoveryTest s:shard1 r:core_node4 x:MissingSegmentRecoveryTest_shard1_replica_n2] o.a.s.s.IndexSchema [MissingSegmentRecoveryTest_shard1_replica_n2] Schema name=minimal
   [junit4]   2> 1499530 INFO  (qtp202240518-28704) [n:127.0.0.1:58155_solr c:MissingSegmentRecoveryTest s:shard1 r:core_node4 x:MissingSegmentRecoveryTest_shard1_replica_n2] o.a.s.s.IndexSchema Loaded schema minimal/1.1 with uniqueid field id
   [junit4]   2> 1499530 INFO  (qtp202240518-28704) [n:127.0.0.1:58155_solr c:MissingSegmentRecoveryTest s:shard1 r:core_node4 x:MissingSegmentRecoveryTest_shard1_replica_n2] o.a.s.c.CoreContainer Creating SolrCore 'MissingSegmentRecoveryTest_shard1_replica_n2' using configuration from collection MissingSegmentRecoveryTest, trusted=true
   [junit4]   2> 1499530 INFO  (qtp202240518-28704) [n:127.0.0.1:58155_solr c:MissingSegmentRecoveryTest s:shard1 r:core_node4 x:MissingSegmentRecoveryTest_shard1_replica_n2] o.a.s.m.r.SolrJmxReporter JMX monitoring for 'solr_58155.solr.core.MissingSegmentRecoveryTest.shard1.replica_n2' (registry 'solr.core.MissingSegmentRecoveryTest.shard1.replica_n2') enabled at server: com.sun.jmx.mbeanserver.JmxMBeanServer@3143f639
   [junit4]   2> 1499530 INFO  (qtp202240518-28704) [n:127.0.0.1:58155_solr c:MissingSegmentRecoveryTest s:shard1 r:core_node4 x:MissingSegmentRecoveryTest_shard1_replica_n2] o.a.s.c.SolrCore [[MissingSegmentRecoveryTest_shard1_replica_n2] ] Opening new SolrCore at [C:\Users\jenkins\workspace\Lucene-Solr-7.x-Windows\solr\build\solr-core\test\J1\temp\solr.cloud.MissingSegmentRecoveryTest_1FB81C6070EAFD56-001\tempDir-001\node2\MissingSegmentRecoveryTest_shard1_replica_n2], dataDir=[C:\Users\jenkins\workspace\Lucene-Solr-7.x-Windows\solr\build\solr-core\test\J1\temp\solr.cloud.MissingSegmentRecoveryTest_1FB81C6070EAFD56-001\tempDir-001\node2\.\MissingSegmentRecoveryTest_shard1_replica_n2\data\]
   [junit4]   2> 1499543 INFO  (qtp240405115-28713) [n:127.0.0.1:58156_solr c:MissingSegmentRecoveryTest s:shard1 r:core_node3 x:MissingSegmentRecoveryTest_shard1_replica_n1] o.a.s.s.IndexSchema [MissingSegmentRecoveryTest_shard1_replica_n1] Schema name=minimal
   [junit4]   2> 1499585 INFO  (qtp240405115-28713) [n:127.0.0.1:58156_solr c:MissingSegmentRecoveryTest s:shard1 r:core_node3 x:MissingSegmentRecoveryTest_shard1_replica_n1] o.a.s.s.IndexSchema Loaded schema minimal/1.1 with uniqueid field id
   [junit4]   2> 1499585 INFO  (qtp240405115-28713) [n:127.0.0.1:58156_solr c:MissingSegmentRecoveryTest s:shard1 r:core_node3 x:MissingSegmentRecoveryTest_shard1_replica_n1] o.a.s.c.CoreContainer Creating SolrCore 'MissingSegmentRecoveryTest_shard1_replica_n1' using configuration from collection MissingSegmentRecoveryTest, trusted=true
   [junit4]   2> 1499585 INFO  (qtp240405115-28713) [n:127.0.0.1:58156_solr c:MissingSegmentRecoveryTest s:shard1 r:core_node3 x:MissingSegmentRecoveryTest_shard1_replica_n1] o.a.s.m.r.SolrJmxReporter JMX monitoring for 'solr_58156.solr.core.MissingSegmentRecoveryTest.shard1.replica_n1' (registry 'solr.core.MissingSegmentRecoveryTest.shard1.replica_n1') enabled at server: com.sun.jmx.mbeanserver.JmxMBeanServer@3143f639
   [junit4]   2> 1499586 INFO  (qtp240405115-28713) [n:127.0.0.1:58156_solr c:MissingSegmentRecoveryTest s:shard1 r:core_node3 x:MissingSegmentRecoveryTest_shard1_replica_n1] o.a.s.c.SolrCore [[MissingSegmentRecoveryTest_shard1_replica_n1] ] Opening new SolrCore at [C:\Users\jenkins\workspace\Lucene-Solr-7.x-Windows\solr\build\solr-core\test\J1\temp\solr.cloud.MissingSegmentRecoveryTest_1FB81C6070EAFD56-001\tempDir-001\node1\MissingSegmentRecoveryTest_shard1_replica_n1], dataDir=[C:\Users\jenkins\workspace\Lucene-Solr-7.x-Windows\solr\build\solr-core\test\J1\temp\solr.cloud.MissingSegmentRecoveryTest_1FB81C6070EAFD56-001\tempDir-001\node1\.\MissingSegmentRecoveryTest_shard1_replica_n1\data\]
   [junit4]   2> 1499749 INFO  (qtp240405115-28713) [n:127.0.0.1:58156_solr c:MissingSegmentRecoveryTest s:shard1 r:core_node3 x:MissingSegmentRecoveryTest_shard1_replica_n1] o.a.s.u.UpdateHandler Using UpdateLog implementation: org.apache.solr.update.UpdateLog
   [junit4]   2> 1499749 INFO  (qtp240405115-28713) [n:127.0.0.1:58156_solr c:MissingSegmentRecoveryTest s:shard1 r:core_node3 x:MissingSegmentRecoveryTest_shard1_replica_n1] o.a.s.u.UpdateLog Initializing UpdateLog: dataDir=null defaultSyncLevel=FLUSH numRecordsToKeep=100 maxNumLogsToKeep=10 numVersionBuckets=65536
   [junit4]   2> 1499750 INFO  (qtp240405115-28713) [n:127.0.0.1:58156_solr c:MissingSegmentRecoveryTest s:shard1 r:core_node3 x:MissingSegmentRecoveryTest_shard1_replica_n1] o.a.s.u.CommitTracker Hard AutoCommit: disabled
   [junit4]   2> 1499750 INFO  (qtp240405115-28713) [n:127.0.0.1:58156_solr c:MissingSegmentRecoveryTest s:shard1 r:core_node3 x:MissingSegmentRecoveryTest_shard1_replica_n1] o.a.s.u.CommitTracker Soft AutoCommit: disabled
   [junit4]   2> 1499761 INFO  (qtp202240518-28704) [n:127.0.0.1:58155_solr c:MissingSegmentRecoveryTest s:shard1 r:core_node4 x:MissingSegmentRecoveryTest_shard1_replica_n2] o.a.s.u.UpdateHandler Using UpdateLog implementation: org.apache.solr.update.UpdateLog
   [junit4]   2> 1499761 INFO  (qtp202240518-28704) [n:127.0.0.1:58155_solr c:MissingSegmentRecoveryTest s:shard1 r:core_node4 x:MissingSegmentRecoveryTest_shard1_replica_n2] o.a.s.u.UpdateLog Initializing UpdateLog: dataDir=null defaultSyncLevel=FLUSH numRecordsToKeep=100 maxNumLogsToKeep=10 numVersionBuckets=65536
   [junit4]   2> 1499765 INFO  (qtp202240518-28704) [n:127.0.0.1:58155_solr c:MissingSegmentRecoveryTest s:shard1 r:core_node4 x:MissingSegmentRecoveryTest_shard1_replica_n2] o.a.s.u.CommitTracker Hard AutoCommit: disabled
   [junit4]   2> 1499765 INFO  (qtp202240518-28704) [n:127.0.0.1:58155_solr c:MissingSegmentRecoveryTest s:shard1 r:core_node4 x:MissingSegmentRecoveryTest_shard1_replica_n2] o.a.s.u.CommitTracker Soft AutoCommit: disabled
   [junit4]   2> 1499770 INFO  (qtp240405115-28713) [n:127.0.0.1:58156_solr c:MissingSegmentRecoveryTest s:shard1 r:core_node3 x:MissingSegmentRecoveryTest_shard1_replica_n1] o.a.s.s.SolrIndexSearcher Opening [Searcher@c4a3a00[MissingSegmentRecoveryTest_shard1_replica_n1] main]
   [junit4]   2> 1499773 INFO  (qtp240405115-28713) [n:127.0.0.1:58156_solr c:MissingSegmentRecoveryTest s:shard1 r:core_node3 x:MissingSegmentRecoveryTest_shard1_replica_n1] o.a.s.r.ManagedResourceStorage Configured ZooKeeperStorageIO with znodeBase: /configs/conf
   [junit4]   2> 1499775 INFO  (qtp240405115-28713) [n:127.0.0.1:58156_solr c:MissingSegmentRecoveryTest s:shard1 r:core_node3 x:MissingSegmentRecoveryTest_shard1_replica_n1] o.a.s.r.ManagedResourceStorage Loaded null at path _rest_managed.json using ZooKeeperStorageIO:path=/configs/conf
   [junit4]   2> 1499776 INFO  (qtp240405115-28713) [n:127.0.0.1:58156_solr c:MissingSegmentRecoveryTest s:shard1 r:core_node3 x:MissingSegmentRecoveryTest_shard1_replica_n1] o.a.s.h.ReplicationHandler Commits will be reserved for 10000ms.
   [junit4]   2> 1499776 INFO  (qtp240405115-28713) [n:127.0.0.1:58156_solr c:MissingSegmentRecoveryTest s:shard1 r:core_node3 x:MissingSegmentRecoveryTest_shard1_replica_n1] o.a.s.u.UpdateLog Could not find max version in index or recent updates, using new clock 1622699746767405056
   [junit4]   2> 1499789 INFO  (qtp240405115-28713) [n:127.0.0.1:58156_solr c:MissingSegmentRecoveryTest s:shard1 r:core_node3 x:MissingSegmentRecoveryTest_shard1_replica_n1] o.a.s.c.ZkShardTerms Successful update of terms at /collections/MissingSegmentRecoveryTest/terms/shard1 to Terms{values={core_node3=0}, version=0}
   [junit4]   2> 1499789 INFO  (qtp240405115-28713) [n:127.0.0.1:58156_solr c:MissingSegmentRecoveryTest s:shard1 r:core_node3 x:MissingSegmentRecoveryTest_shard1_replica_n1] o.a.s.c.ShardLeaderElectionContextBase make sure parent is created /collections/MissingSegmentRecoveryTest/leaders/shard1
   [junit4]   2> 1499798 INFO  (qtp240405115-28713) [n:127.0.0.1:58156_solr c:MissingSegmentRecoveryTest s:shard1 r:core_node3 x:MissingSegmentRecoveryTest_shard1_replica_n1] o.a.s.c.ShardLeaderElectionContext Waiting until we see more replicas up for shard shard1: total=2 found=1 timeoutin=9999ms
   [junit4]   2> 1499803 INFO  (searcherExecutor-9702-thread-1-processing-n:127.0.0.1:58156_solr x:MissingSegmentRecoveryTest_shard1_replica_n1 c:MissingSegmentRecoveryTest s:shard1 r:core_node3) [n:127.0.0.1:58156_solr c:MissingSegmentRecoveryTest s:shard1 r:core_node3 x:MissingSegmentRecoveryTest_shard1_replica_n1] o.a.s.c.SolrCore [MissingSegmentRecoveryTest_shard1_replica_n1] Registered new searcher Searcher@c4a3a00[MissingSegmentRecoveryTest_shard1_replica_n1] main{ExitableDirectoryReader(UninvertingDirectoryReader())}
   [junit4]   2> 1499805 INFO  (qtp202240518-28704) [n:127.0.0.1:58155_solr c:MissingSegmentRecoveryTest s:shard1 r:core_node4 x:MissingSegmentRecoveryTest_shard1_replica_n2] o.a.s.s.SolrIndexSearcher Opening [Searcher@35fe99ab[MissingSegmentRecoveryTest_shard1_replica_n2] main]
   [junit4]   2> 1499807 INFO  (qtp202240518-28704) [n:127.0.0.1:58155_solr c:MissingSegmentRecoveryTest s:shard1 r:core_node4 x:MissingSegmentRecoveryTest_shard1_replica_n2] o.a.s.r.ManagedResourceStorage Configured ZooKeeperStorageIO with znodeBase: /configs/conf
   [junit4]   2> 1499809 INFO  (qtp202240518-28704) [n:127.0.0.1:58155_solr c:MissingSegmentRecoveryTest s:shard1 r:core_node4 x:MissingSegmentRecoveryTest_shard1_replica_n2] o.a.s.r.ManagedResourceStorage Loaded null at path _rest_managed.json using ZooKeeperStorageIO:path=/configs/conf
   [junit4]   2> 1499809 INFO  (qtp202240518-28704) [n:127.0.0.1:58155_solr c:MissingSegmentRecoveryTest s:shard1 r:core_node4 x:MissingSegmentRecoveryTest_shard1_replica_n2] o.a.s.h.ReplicationHandler Commits will be reserved for 10000ms.
   [junit4]   2> 1499811 INFO  (qtp202240518-28704) [n:127.0.0.1:58155_solr c:MissingSegmentRecoveryTest s:shard1 r:core_node4 x:MissingSegmentRecoveryTest_shard1_replica_n2] o.a.s.u.UpdateLog Could not find max version in index or recent updates, using new clock 1622699746804105216
   [junit4]   2> 1499822 INFO  (qtp202240518-28704) [n:127.0.0.1:58155_solr c:MissingSegmentRecoveryTest s:shard1 r:core_node4 x:MissingSegmentRecoveryTest_shard1_replica_n2] o.a.s.c.ZkShardTerms Successful update of terms at /collections/MissingSegmentRecoveryTest/terms/shard1 to Terms{values={core_node3=0, core_node4=0}, version=1}
   [junit4]   2> 1499823 INFO  (qtp202240518-28704) [n:127.0.0.1:58155_solr c:MissingSegmentRecoveryTest s:shard1 r:core_node4 x:MissingSegmentRecoveryTest_shard1_replica_n2] o.a.s.c.ShardLeaderElectionContextBase make sure parent is created /collections/MissingSegmentRecoveryTest/leaders/shard1
   [junit4]   2> 1499866 INFO  (searcherExecutor-9701-thread-1-processing-n:127.0.0.1:58155_solr x:MissingSegmentRecoveryTest_shard1_replica_n2 c:MissingSegmentRecoveryTest s:shard1 r:core_node4) [n:127.0.0.1:58155_solr c:MissingSegmentRecoveryTest s:shard1 r:core_node4 x:MissingSegmentRecoveryTest_shard1_replica_n2] o.a.s.c.SolrCore [MissingSegmentRecoveryTest_shard1_replica_n2] Registered new searcher Searcher@35fe99ab[MissingSegmentRecoveryTest_shard1_replica_n2] main{ExitableDirectoryReader(UninvertingDirectoryReader())}
   [junit4]   2> 1500335 INFO  (qtp240405115-28713) [n:127.0.0.1:58156_solr c:MissingSegmentRecoveryTest s:shard1 r:core_node3 x:MissingSegmentRecoveryTest_shard1_replica_n1] o.a.s.c.ShardLeaderElectionContext Enough replicas found to continue.
   [junit4]   2> 1500336 INFO  (qtp240405115-28713) [n:127.0.0.1:58156_solr c:MissingSegmentRecoveryTest s:shard1 r:core_node3 x:MissingSegmentRecoveryTest_shard1_replica_n1] o.a.s.c.ShardLeaderElectionContext I may be the new leader - try and sync
   [junit4]   2> 1500336 INFO  (qtp240405115-28713) [n:127.0.0.1:58156_solr c:MissingSegmentRecoveryTest s:shard1 r:core_node3 x:MissingSegmentRecoveryTest_shard1_replica_n1] o.a.s.c.SyncStrategy Sync replicas to http://127.0.0.1:58156/solr/MissingSegmentRecoveryTest_shard1_replica_n1/
   [junit4]   2> 1500336 INFO  (qtp240405115-28713) [n:127.0.0.1:58156_solr c:MissingSegmentRecoveryTest s:shard1 r:core_node3 x:MissingSegmentRecoveryTest_shard1_replica_n1] o.a.s.u.PeerSync PeerSync: core=MissingSegmentRecoveryTest_shard1_replica_n1 url=http://127.0.0.1:58156/solr START replicas=[http://127.0.0.1:58155/solr/MissingSegmentRecoveryTest_shard1_replica_n2/] nUpdates=100
   [junit4]   2> 1500336 INFO  (qtp240405115-28713) [n:127.0.0.1:58156_solr c:MissingSegmentRecoveryTest s:shard1 r:core_node3 x:MissingSegmentRecoveryTest_shard1_replica_n1] o.a.s.u.PeerSync PeerSync: core=MissingSegmentRecoveryTest_shard1_replica_n1 url=http://127.0.0.1:58156/solr DONE.  We have no versions.  sync failed.
   [junit4]   2> 1500338 INFO  (qtp202240518-28702) [n:127.0.0.1:58155_solr c:MissingSegmentRecoveryTest s:shard1 r:core_node4 x:MissingSegmentRecoveryTest_shard1_replica_n2] o.a.s.c.S.Request [MissingSegmentRecoveryTest_shard1_replica_n2]  webapp=/solr path=/get params={distrib=false&qt=/get&fingerprint=false&getVersions=100&wt=javabin&version=2} status=0 QTime=0
   [junit4]   2> 1500338 INFO  (qtp240405115-28713) [n:127.0.0.1:58156_solr c:MissingSegmentRecoveryTest s:shard1 r:core_node3 x:MissingSegmentRecoveryTest_shard1_replica_n1] o.a.s.c.SyncStrategy Leader's attempt to sync with shard failed, moving to the next candidate
   [junit4]   2> 1500338 INFO  (qtp240405115-28713) [n:127.0.0.1:58156_solr c:MissingSegmentRecoveryTest s:shard1 r:core_node3 x:MissingSegmentRecoveryTest_shard1_replica_n1] o.a.s.c.ShardLeaderElectionContext We failed sync, but we have no versions - we can't sync in that case - we were active before, so become leader anyway
   [junit4]   2> 1500338 INFO  (qtp240405115-28713) [n:127.0.0.1:58156_solr c:MissingSegmentRecoveryTest s:shard1 r:core_node3 x:MissingSegmentRecoveryTest_shard1_replica_n1] o.a.s.c.ShardLeaderElectionContext Found all replicas participating in election, clear LIR
   [junit4]   2> 1500340 INFO  (qtp240405115-28713) [n:127.0.0.1:58156_solr c:MissingSegmentRecoveryTest s:shard1 r:core_node3 x:MissingSegmentRecoveryTest_shard1_replica_n1] o.a.s.c.ShardLeaderElectionContextBase Creating leader registration node /collections/MissingSegmentRecoveryTest/leaders/shard1/leader after winning as /collections/MissingSegmentRecoveryTest/leader_elect/shard1/election/72086666895491081-core_node3-n_0000000000
   [junit4]   2> 1500342 INFO  (qtp240405115-28713) [n:127.0.0.1:58156_solr c:MissingSegmentRecoveryTest s:shard1 r:core_node3 x:MissingSegmentRecoveryTest_shard1_replica_n1] o.a.s.c.ShardLeaderElectionContext I am the new leader: http://127.0.0.1:58156/solr/MissingSegmentRecoveryTest_shard1_replica_n1/ shard1
   [junit4]   2> 1500456 INFO  (zkCallback-10487-thread-1) [    ] o.a.s.c.c.ZkStateReader A cluster state change: [WatchedEvent state:SyncConnected type:NodeDataChanged path:/collections/MissingSegmentRecoveryTest/state.json] for collection [MissingSegmentRecoveryTest] has occurred - updating... (live nodes size: [2])
   [junit4]   2> 1500458 INFO  (qtp240405115-28713) [n:127.0.0.1:58156_solr c:MissingSegmentRecoveryTest s:shard1 r:core_node3 x:MissingSegmentRecoveryTest_shard1_replica_n1] o.a.s.c.ZkController I am the leader, no recovery necessary
   [junit4]   2> 1500465 INFO  (qtp240405115-28713) [n:127.0.0.1:58156_solr c:MissingSegmentRecoveryTest s:shard1 r:core_node3 x:MissingSegmentRecoveryTest_shard1_replica_n1] o.a.s.s.HttpSolrCall [admin] webapp=null path=/admin/cores params={qt=/admin/cores&coreNodeName=core_node3&collection.configName=conf&newCollection=true&name=MissingSegmentRecoveryTest_shard1_replica_n1&action=CREATE&numShards=1&collection=MissingSegmentRecoveryTest&shard=shard1&wt=javabin&version=2&replicaType=NRT} status=0 QTime=1968
   [junit4]   2> 1500578 INFO  (zkCallback-10487-thread-1) [    ] o.a.s.c.c.ZkStateReader A cluster state change: [WatchedEvent state:SyncConnected type:NodeDataChanged path:/collections/MissingSegmentRecoveryTest/state.json] for collection [MissingSegmentRecoveryTest] has occurred - updating... (live nodes size: [2])
   [junit4]   2> 1500587 INFO  (zkCallback-10487-thread-2) [    ] o.a.s.c.c.ZkStateReader A cluster state change: [WatchedEvent state:SyncConnected type:NodeDataChanged path:/collections/MissingSegmentRecoveryTest/state.json] for collection [MissingSegmentRecoveryTest] has occurred - updating... (live nodes size: [2])
   [junit4]   2> 1500906 INFO  (qtp202240518-28704) [n:127.0.0.1:58155_solr c:MissingSegmentRecoveryTest s:shard1 r:core_node4 x:MissingSegmentRecoveryTest_shard1_replica_n2] o.a.s.s.HttpSolrCall [admin] webapp=null path=/admin/cores params={qt=/admin/cores&coreNodeName=core_node4&collection.configName=conf&newCollection=true&name=MissingSegmentRecoveryTest_shard1_replica_n2&action=CREATE&numShards=1&collection=MissingSegmentRecoveryTest&shard=shard1&wt=javabin&version=2&replicaType=NRT} status=0 QTime=2376
   [junit4]   2> 1500912 INFO  (qtp202240518-28705) [n:127.0.0.1:58155_solr    ] o.a.s.h.a.CollectionsHandler Wait for new collection to be active for at most 45 seconds. Check all shard replicas
   [junit4]   2> 1501014 INFO  (zkCallback-10473-thread-1) [    ] o.a.s.c.c.ZkStateReader A cluster state change: [WatchedEvent state:SyncConnected type:NodeDataChanged path:/collections/MissingSegmentRecoveryTest/state.json] for collection [MissingSegmentRecoveryTest] has occurred - updating... (live nodes size: [2])
   [junit4]   2> 1501014 INFO  (zkCallback-10487-thread-2) [    ] o.a.s.c.c.ZkStateReader A cluster state change: [WatchedEvent state:SyncConnected type:NodeDataChanged path:/collections/MissingSegmentRecoveryTest/state.json] for collection [MissingSegmentRecoveryTest] has occurred - updating... (live nodes size: [2])
   [junit4]   2> 1501015 INFO  (zkCallback-10487-thread-1) [    ] o.a.s.c.c.ZkStateReader A cluster state change: [WatchedEvent state:SyncConnected type:NodeDataChanged path:/collections/MissingSegmentRecoveryTest/state.json] for collection [MissingSegmentRecoveryTest] has occurred - updating... (live nodes size: [2])
   [junit4]   2> 1501017 INFO  (qtp202240518-28705) [n:127.0.0.1:58155_solr    ] o.a.s.s.HttpSolrCall [admin] webapp=null path=/admin/collections params={collection.configName=conf&maxShardsPerNode=1&name=MissingSegmentRecoveryTest&nrtReplicas=2&action=CREATE&numShards=1&wt=javabin&version=2} status=0 QTime=2843
   [junit4]   2> 1501019 INFO  (TEST-MissingSegmentRecoveryTest.testLeaderRecovery-seed#[1FB81C6070EAFD56]) [    ] o.a.s.c.SolrCloudTestCase active replica count: 2 expected replica count: 2
   [junit4]   2> 1501022 INFO  (zkCallback-10473-thread-2) [    ] o.a.s.c.c.ZkStateReader A cluster state change: [WatchedEvent state:SyncConnected type:NodeDataChanged path:/collections/MissingSegmentRecoveryTest/state.json] for collection [MissingSegmentRecoveryTest] has occurred - updating... (live nodes size: [2])
   [junit4]   2> 1501036 INFO  (qtp240405115-28710) [n:127.0.0.1:58156_solr c:MissingSegmentRecoveryTest s:shard1 r:core_node3 x:MissingSegmentRecoveryTest_shard1_replica_n1] o.a.s.c.ZkShardTerms Successful update of terms at /collections/MissingSegmentRecoveryTest/terms/shard1 to Terms{values={core_node3=1, core_node4=1}, version=2}
   [junit4]   2> 1501059 INFO  (qtp202240518-28714) [n:127.0.0.1:58155_solr c:MissingSegmentRecoveryTest s:shard1 r:core_node4 x:MissingSegmentRecoveryTest_shard1_replica_n2] o.a.s.u.p.LogUpdateProcessorFactory [MissingSegmentRecoveryTest_shard1_replica_n2]  webapp=/solr path=/update params={update.distrib=FROMLEADER&distrib.from=http://127.0.0.1:58156/solr/MissingSegmentRecoveryTest_shard1_replica_n1/&wt=javabin&version=2}{add=[0 (1622699748081270784), 1 (1622699748084416512), 2 (1622699748084416513), 3 (1622699748085465088), 4 (1622699748085465089), 5 (1622699748088610816), 6 (1622699748088610817), 7 (1622699748088610818), 8 (1622699748088610819), 9 (1622699748088610820)]} 0 18
   [junit4]   2> 1501059 INFO  (qtp240405115-28710) [n:127.0.0.1:58156_solr c:MissingSegmentRecoveryTest s:shard1 r:core_node3 x:MissingSegmentRecoveryTest_shard1_replica_n1] o.a.s.u.p.LogUpdateProcessorFactory [MissingSegmentRecoveryTest_shard1_replica_n1]  webapp=/solr path=/update params={wt=javabin&version=2}{add=[0 (1622699748081270784), 1 (1622699748084416512), 2 (1622699748084416513), 3 (1622699748085465088), 4 (1622699748085465089), 5 (1622699748088610816), 6 (1622699748088610817), 7 (1622699748088610818), 8 (1622699748088610819), 9 (1622699748088610820)]} 0 28
   [junit4]   2> 1501062 INFO  (qtp240405115-28708) [n:127.0.0.1:58156_solr c:MissingSegmentRecoveryTest s:shard1 r:core_node3 x:MissingSegmentRecoveryTest_shard1_replica_n1] o.a.s.u.DirectUpdateHandler2 start commit{_version_=1622699748115873792,optimize=false,openSearcher=true,waitSearcher=true,expungeDeletes=false,softCommit=false,prepareCommit=false}
   [junit4]   2> 1501062 INFO  (qtp240405115-28708) [n:127.0.0.1:58156_solr c:MissingSegmentRecoveryTest s:shard1 r:core_node3 x:MissingSegmentRecoveryTest_shard1_replica_n1] o.a.s.u.SolrIndexWriter Calling setCommitData with IW:org.apache.solr.update.SolrIndexWriter@71db54b0 commitCommandVersion:1622699748115873792
   [junit4]   2> 1501064 INFO  (qtp202240518-28706) [n:127.0.0.1:58155_solr c:MissingSegmentRecoveryTest s:shard1 r:core_node4 x:MissingSegmentRecoveryTest_shard1_replica_n2] o.a.s.u.DirectUpdateHandler2 start commit{_version_=1622699748117970944,optimize=false,openSearcher=true,waitSearcher=true,expungeDeletes=false,softCommit=false,prepareCommit=false}
   [junit4]   2> 1501064 INFO  (qtp202240518-28706) [n:127.0.0.1:58155_solr c:MissingSegmentRecoveryTest s:shard1 r:core_node4 x:MissingSegmentRecoveryTest_shard1_replica_n2] o.a.s.u.SolrIndexWriter Calling setCommitData with IW:org.apache.solr.update.SolrIndexWriter@16f3b commitCommandVersion:1622699748117970944
   [junit4]   2> 1501162 INFO  (qtp202240518-28706) [n:127.0.0.1:58155_solr c:MissingSegmentRecoveryTest s:shard1 r:core_node4 x:MissingSegmentRecoveryTest_shard1_replica_n2] o.a.s.s.SolrIndexSearcher Opening [Searcher@b1fbf22[MissingSegmentRecoveryTest_shard1_replica_n2] main]
   [junit4]   2> 1501163 INFO  (qtp202240518-28706) [n:127.0.0.1:58155_solr c:MissingSegmentRecoveryTest s:shard1 r:core_node4 x:MissingSegmentRecoveryTest_shard1_replica_n2] o.a.s.u.DirectUpdateHandler2 end_commit_flush
   [junit4]   2> 1501164 INFO  (searcherExecutor-9701-thread-1-processing-n:127.0.0.1:58155_solr x:MissingSegmentRecoveryTest_shard1_replica_n2 c:MissingSegmentRecoveryTest s:shard1 r:core_node4) [n:127.0.0.1:58155_solr c:MissingSegmentRecoveryTest s:shard1 r:core_node4 x:MissingSegmentRecoveryTest_shard1_replica_n2] o.a.s.c.SolrCore [MissingSegmentRecoveryTest_shard1_replica_n2] Registered new searcher Searcher@b1fbf22[MissingSegmentRecoveryTest_shard1_replica_n2] main{ExitableDirectoryReader(UninvertingDirectoryReader(Uninverting(_0(7.7.0):C10:[diagnostics={os=Windows 10, java.vendor=Oracle Corporation, java.version=9.0.4, java.vm.version=9.0.4+11, lucene.version=7.7.0, os.arch=amd64, java.runtime.version=9.0.4+11, source=flush, os.version=10.0, timestamp=1547527073027}]:[attributes={Lucene50StoredFieldsFormat.mode=BEST_SPEED}])))}
   [junit4]   2> 1501165 INFO  (qtp202240518-28706) [n:127.0.0.1:58155_solr c:MissingSegmentRecoveryTest s:shard1 r:core_node4 x:MissingSegmentRecoveryTest_shard1_replica_n2] o.a.s.u.p.LogUpdateProcessorFactory [MissingSegmentRecoveryTest_shard1_replica_n2]  webapp=/solr path=/update params={update.distrib=FROMLEADER&waitSearcher=true&openSearcher=true&commit=true&softCommit=false&distrib.from=http://127.0.0.1:58156/solr/MissingSegmentRecoveryTest_shard1_replica_n1/&commit_end_point=replicas&wt=javabin&version=2&expungeDeletes=false}{commit=} 0 95
   [junit4]   2> 1501171 INFO  (qtp240405115-28708) [n:127.0.0.1:58156_solr c:MissingSegmentRecoveryTest s:shard1 r:core_node3 x:MissingSegmentRecoveryTest_shard1_replica_n1] o.a.s.s.SolrIndexSearcher Opening [Searcher@10dfcc1b[MissingSegmentRecoveryTest_shard1_replica_n1] main]
   [junit4]   2> 1501177 INFO  (qtp240405115-28708) [n:127.0.0.1:58156_solr c:MissingSegmentRecoveryTest s:shard1 r:core_node3 x:MissingSegmentRecoveryTest_shard1_replica_n1] o.a.s.u.DirectUpdateHandler2 end_commit_flush
   [junit4]   2> 1501178 INFO  (searcherExecutor-9702-thread-1-processing-n:127.0.0.1:58156_solr x:MissingSegmentRecoveryTest_shard1_replica_n1 c:MissingSegmentRecoveryTest s:shard1 r:core_node3) [n:127.0.0.1:58156_solr c:MissingSegmentRecoveryTest s:shard1 r:core_node3 x:MissingSegmentRecoveryTest_shard1_replica_n1] o.a.s.c.SolrCore [MissingSegmentRecoveryTest_shard1_replica_n1] Registered new searcher Searcher@10dfcc1b[MissingSegmentRecoveryTest_shard1_replica_n1] main{ExitableDirectoryReader(UninvertingDirectoryReader(Uninverting(_0(7.7.0):C10:[diagnostics={os=Windows 10, java.vendor=Oracle Corporation, java.version=9.0.4, java.vm.version=9.0.4+11, lucene.version=7.7.0, os.arch=amd64, java.runtime.version=9.0.4+11, source=flush, os.version=10.0, timestamp=1547527073089}]:[attributes={Lucene50StoredFieldsFormat.mode=BEST_SPEED}])))}
   [junit4]   2> 1501178 INFO  (qtp240405115-28708) [n:127.0.0.1:58156_solr c:MissingSegmentRecoveryTest s:shard1 r:core_node3 x:MissingSegmentRecoveryTest_shard1_replica_n1] o.a.s.u.p.LogUpdateProcessorFactory [MissingSegmentRecoveryTest_shard1_replica_n1]  webapp=/solr path=/update params={_stateVer_=MissingSegmentRecoveryTest:6&waitSearcher=true&commit=true&softCommit=false&wt=javabin&version=2}{commit=} 0 110
   [junit4]   2> 1501181 INFO  (TEST-MissingSegmentRecoveryTest.testLeaderRecovery-seed#[1FB81C6070EAFD56]) [    ] o.a.s.c.CoreContainer Shutting down CoreContainer instance=1396714748
   [junit4]   2> 1501181 INFO  (TEST-MissingSegmentRecoveryTest.testLeaderRecovery-seed#[1FB81C6070EAFD56]) [    ] o.a.s.c.ZkController Remove node as live in ZooKeeper:/live_nodes/127.0.0.1:58155_solr
   [junit4]   2> 1501182 INFO  (TEST-MissingSegmentRecoveryTest.testLeaderRecovery-seed#[1FB81C6070EAFD56]) [    ] o.a.s.c.CoreContainer Publish this node as DOWN...
   [junit4]   2> 1501182 INFO  (TEST-MissingSegmentRecoveryTest.testLeaderRecovery-seed#[1FB81C6070EAFD56]) [    ] o.a.s.c.ZkController Publish node=127.0.0.1:58155_solr as DOWN
   [junit4]   2> 1501184 INFO  (coreCloseExecutor-9711-thread-1) [n:127.0.0.1:58155_solr c:MissingSegmentRecoveryTest s:shard1 r:core_node4 x:MissingSegmentRecoveryTest_shard1_replica_n2] o.a.s.c.SolrCore [MissingSegmentRecoveryTest_shard1_replica_n2]  CLOSING SolrCore org.apache.solr.core.SolrCore@589e428b
   [junit4]   2> 1501184 INFO  (coreCloseExecutor-9711-thread-1) [n:127.0.0.1:58155_solr c:MissingSegmentRecoveryTest s:shard1 r:core_node4 x:MissingSegmentRecoveryTest_shard1_replica_n2] o.a.s.m.SolrMetricManager Closing metric reporters for registry=solr.core.MissingSegmentRecoveryTest.shard1.replica_n2, tag=589e428b
   [junit4]   2> 1501185 INFO  (coreCloseExecutor-9711-thread-1) [n:127.0.0.1:58155_solr c:MissingSegmentRecoveryTest s:shard1 r:core_node4 x:MissingSegmentRecoveryTest_shard1_replica_n2] o.a.s.m.r.SolrJmxReporter Closing reporter [org.apache.solr.metrics.reporters.SolrJmxReporter@b396603: rootName = solr_58155, domain = solr.core.MissingSegmentRecoveryTest.shard1.replica_n2, service url = null, agent id = null] for registry solr.core.MissingSegmentRecoveryTest.shard1.replica_n2 / com.codahale.metrics.MetricRegistry@51edf096
   [junit4]   2> 1501194 INFO  (coreCloseExecutor-9711-thread-1) [n:127.0.0.1:58155_solr c:MissingSegmentRecoveryTest s:shard1 r:core_node4 x:MissingSegmentRecoveryTest_shard1_replica_n2] o.a.s.m.SolrMetricManager Closing metric reporters for registry=solr.collection.MissingSegmentRecoveryTest.shard1.leader, tag=589e428b
   [junit4]   2> 1501197 INFO  (TEST-MissingSegmentRecoveryTest.testLeaderRecovery-seed#[1FB81C6070EAFD56]) [    ] o.a.s.m.SolrMetricManager Closing metric reporters for registry=solr.node, tag=null
   [junit4]   2> 1501197 INFO  (TEST-MissingSegmentRecoveryTest.testLeaderRecovery-seed#[1FB81C6070EAFD56]) [    ] o.a.s.m.r.SolrJmxReporter Closing reporter [org.apache.solr.metrics.reporters.SolrJmxReporter@f34fc63: rootName = solr_58155, domain = solr.node, service url = null, agent id = null] for registry solr.node / com.codahale.metrics.MetricRegistry@41932eb8
   [junit4]   2> 1501204 INFO  (TEST-MissingSegmentRecoveryTest.testLeaderRecovery-seed#[1FB81C6070EAFD56]) [    ] o.a.s.m.SolrMetricManager Closing metric reporters for registry=solr.jvm, tag=null
   [junit4]   2> 1501204 INFO  (TEST-MissingSegmentRecoveryTest.testLeaderRecovery-seed#[1FB81C6070EAFD56]) [    ] o.a.s.m.r.SolrJmxReporter Closing reporter [org.apache.solr.metrics.reporters.SolrJmxReporter@4791a447: rootName = solr_58155, domain = solr.jvm, service url = null, agent id = null] for registry solr.jvm / com.codahale.metrics.MetricRegistry@4c49e2a9
   [junit4]   2> 1501208 INFO  (TEST-MissingSegmentRecoveryTest.testLeaderRecovery-seed#[1FB81C6070EAFD56]) [    ] o.a.s.m.SolrMetricManager Closing metric reporters for registry=solr.jetty, tag=null
   [junit4]   2> 1501208 INFO  (TEST-MissingSegmentRecoveryTest.testLeaderRecovery-seed#[1FB81C6070EAFD56]) [    ] o.a.s.m.r.SolrJmxReporter Closing reporter [org.apache.solr.metrics.reporters.SolrJmxReporter@16c0fcd5: rootName = solr_58155, domain = solr.jetty, service url = null, agent id = null] for registry solr.jetty / com.codahale.metrics.MetricRegistry@21c262bd
   [junit4]   2> 1501209 INFO  (TEST-MissingSegmentRecoveryTest.testLeaderRecovery-seed#[1FB81C6070EAFD56]) [    ] o.a.s.m.SolrMetricManager Closing metric reporters for registry=solr.cluster, tag=null
   [junit4]   2> 1501209 INFO  (TEST-MissingSegmentRecoveryTest.testLeaderRecovery-seed#[1FB81C6070EAFD56]) [    ] o.a.s.c.Overseer Overseer (id=72086666895491078-127.0.0.1:58155_solr-n_0000000000) closing
   [junit4]   2> 1501209 WARN  (NIOServerCxn.Factory:0.0.0.0/0.0.0.0:0) [    ] o.a.z.s.NIOServerCnxn Unable to read additional data from client sessionid 0x1001a710d590006, likely client has closed socket
   [junit4]   2> 1501212 INFO  (OverseerStateUpdate-72086666895491078-127.0.0.1:58155_solr-n_0000000000) [n:127.0.0.1:58155_solr    ] o.a.s.c.Overseer Overseer Loop exiting : 127.0.0.1:58155_solr
   [junit4]   2> 1501220 INFO  (OverseerAutoScalingTriggerThread-72086666895491078-127.0.0.1:58155_solr-n_0000000000) [    ] o.a.s.c.a.OverseerTriggerThread OverseerTriggerThread woken up but we are closed, exiting.
   [junit4]   2> 1501220 INFO  (closeThreadPool-10504-thread-1) [    ] o.a.s.c.Overseer Overseer (id=72086666895491078-127.0.0.1:58155_solr-n_0000000000) closing
   [junit4]   2> 1501222 INFO  (closeThreadPool-10504-thread-2) [    ] o.a.s.c.Overseer Overseer (id=72086666895491078-127.0.0.1:58155_solr-n_0000000000) closing
   [junit4]   2> 1501223 INFO  (zkCallback-10480-thread-1) [    ] o.a.s.c.c.ZkStateReader Updated live nodes from ZooKeeper... (2) -> (1)
   [junit4]   2> 1501224 INFO  (zkCallback-10500-thread-1) [    ] o.a.s.c.c.ZkStateReader Updated live nodes from ZooKeeper... (2) -> (1)
   [junit4]   2> 1501225 INFO  (zkCallback-10494-thread-1) [    ] o.a.s.c.c.ZkStateReader Updated live nodes from ZooKeeper... (2) -> (1)
   [junit4]   2> 1501225 INFO  (zkCallback-10487-thread-2) [    ] o.a.s.c.c.ZkStateReader Updated live nodes from ZooKeeper... (2) -> (1)
   [junit4]   2> 1501225 INFO  (zkCallback-10487-thread-1) [    ] o.a.s.c.OverseerElectionContext I am going to be the leader 127.0.0.1:58156_solr
   [junit4]   2> 1501229 INFO  (TEST-MissingSegmentRecoveryTest.testLeaderRecovery-seed#[1FB81C6070EAFD56]) [    ] o.e.j.s.AbstractConnector Stopped ServerConnector@7e9df290{HTTP/1.1,[http/1.1]}{127.0.0.1:0}
   [junit4]   2> 1501230 INFO  (TEST-MissingSegmentRecoveryTest.testLeaderRecovery-seed#[1FB81C6070EAFD56]) [    ] o.e.j.s.h.ContextHandler Stopped o.e.j.s.ServletContextHandler@42cf8a13{/solr,null,UNAVAILABLE}
   [junit4]   2> 1501230 INFO  (TEST-MissingSegmentRecoveryTest.testLeaderRecovery-seed#[1FB81C6070EAFD56]) [    ] o.e.j.s.session node0 Stopped scavenging
   [junit4]   2> 1501230 INFO  (zkCallback-10487-thread-1) [n:127.0.0.1:58156_solr    ] o.a.s.c.Overseer Overseer (id=72086666895491081-127.0.0.1:58156_solr-n_0000000001) starting
   [junit4]   2> 1501233 INFO  (TEST-MissingSegmentRecoveryTest.testLeaderRecovery-seed#[1FB81C6070EAFD56]) [    ] o.a.s.c.s.e.JettySolrRunner Start Jetty (original configured port=0)
   [junit4]   2> 1501233 WARN  (TEST-MissingSegmentRecoveryTest.testLeaderRecovery-seed#[1FB81C6070EAFD56]) [    ] o.e.j.s.AbstractConnector Ignoring deprecated socket close linger time
   [junit4]   2> 1501234 INFO  (TEST-MissingSegmentRecoveryTest.testLeaderRecovery-seed#[1FB81C6070EAFD56]) [    ] o.a.s.c.s.e.JettySolrRunner Trying to start Jetty on port 58155 try number 1 ...
   [junit4]   2> 1501234 INFO  (TEST-MissingSegmentRecoveryTest.testLeaderRecovery-seed#[1FB81C6070EAFD56]) [    ] o.e.j.s.Server jetty-9.4.14.v20181114; built: 2018-11-14T21:20:31.478Z; git: c4550056e785fb5665914545889f21dc136ad9e6; jvm 9.0.4+11
   [junit4]   2> 1501234 INFO  (TEST-MissingSegmentRecoveryTest.testLeaderRecovery-seed#[1FB81C6070EAFD56]) [    ] o.e.j.s.session DefaultSessionIdManager workerName=node0
   [junit4]   2> 1501234 INFO  (TEST-MissingSegmentRecoveryTest.testLeaderRecovery-seed#[1FB81C6070EAFD56]) [    ] o.e.j.s.session No SessionScavenger set, using defaults
   [junit4]   2> 1501234 INFO  (TEST-MissingSegmentRecoveryTest.testLeaderRecovery-seed#[1FB81C6070EAFD56]) [    ] o.e.j.s.session node0 Scavenging every 600000ms
   [junit4]   2> 1501234 INFO  (TEST-MissingSegmentRecoveryTest.testLeaderRecovery-seed#[1FB81C6070EAFD56]) [    ] o.e.j.s.h.ContextHandler Started o.e.j.s.ServletContextHandler@64530546{/solr,null,AVAILABLE}
   [junit4]   2> 1501242 INFO  (TEST-MissingSegmentRecoveryTest.testLeaderRecovery-seed#[1FB81C6070EAFD56]) [    ] o.e.j.s.AbstractConnector Started ServerConnector@5c13ebec{HTTP/1.1,[http/1.1]}{127.0.0.1:58155}
   [junit4]   2> 1501242 INFO  (TEST-MissingSegmentRecoveryTest.testLeaderRecovery-seed#[1FB81C6070EAFD56]) [    ] o.e.j.s.Server Started @1486408ms
   [junit4]   2> 1501242 INFO  (TEST-MissingSegmentRecoveryTest.testLeaderRecovery-seed#[1FB81C6070EAFD56]) [    ] o.a.s.c.s.e.JettySolrRunner Jetty properties: {hostContext=/solr, hostPort=58155}
   [junit4]   2> 1501244 ERROR (TEST-MissingSegmentRecoveryTest.testLeaderRecovery-seed#[1FB81C6070EAFD56]) [    ] o.a.s.u.StartupLoggingUtils Missing Java Option solr.log.dir. Logging may be missing or incomplete.
   [junit4]   2> 1501244 INFO  (TEST-MissingSegmentRecoveryTest.testLeaderRecovery-seed#[1FB81C6070EAFD56]) [    ] o.a.s.s.SolrDispatchFilter Using logger factory org.apache.logging.slf4j.Log4jLoggerFactory
   [junit4]   2> 1501244 INFO  (TEST-MissingSegmentRecoveryTest.testLeaderRecovery-seed#[1FB81C6070EAFD56]) [    ] o.a.s.s.SolrDispatchFilter  ___      _       Welcome to Apache Solr? version 7.7.0
   [junit4]   2> 1501244 INFO  (TEST-MissingSegmentRecoveryTest.testLeaderRecovery-seed#[1FB81C6070EAFD56]) [    ] o.a.s.s.SolrDispatchFilter / __| ___| |_ _   Starting in cloud mode on port null
   [junit4]   2> 1501244 INFO  (TEST-MissingSegmentRecoveryTest.testLeaderRecovery-seed#[1FB81C6070EAFD56]) [    ] o.a.s.s.SolrDispatchFilter \__ \/ _ \ | '_|  Install dir: null
   [junit4]   2> 1501244 INFO  (TEST-MissingSegmentRecoveryTest.testLeaderRecovery-seed#[1FB81C6070EAFD56]) [    ] o.a.s.s.SolrDispatchFilter |___/\___/_|_|    Start time: 2019-01-15T04:37:53.199094700Z
   [junit4]   2> 1501250 INFO  (OverseerStateUpdate-72086666895491081-127.0.0.1:58156_solr-n_0000000001) [n:127.0.0.1:58156_solr    ] o.a.s.c.Overseer Starting to work on the main queue : 127.0.0.1:58156_solr
   [junit4]   2> 1501257 INFO  (zkCallback-10487-thread-1) [    ] o.a.s.c.c.ZkStateReader A cluster state change: [WatchedEvent state:SyncConnected type:NodeDataChanged path:/collections/MissingSegmentRecoveryTest/state.json] for collection [MissingSegmentRecoveryTest] has occurred - updating... (live nodes size: [1])
   [junit4]   2> 1501257 INFO  (zkCallback-10487-thread-2) [    ] o.a.s.c.c.ZkStateReader A cluster state change: [WatchedEvent state:SyncConnected type:NodeDataChanged path:/collections/MissingSegmentRecoveryTest/state.json] for collection [MissingSegmentRecoveryTest] has occurred - updating... (live nodes size: [1])
   [junit4]   2> 1501260 INFO  (zkConnectionManagerCallback-10506-thread-1) [    ] o.a.s.c.c.ConnectionManager zkClient has connected
   [junit4]   2> 1501265 INFO  (TEST-MissingSegmentRecoveryTest.testLeaderRecovery-seed#[1FB81C6070EAFD56]) [    ] o.a.s.s.SolrDispatchFilter solr.xml found in ZooKeeper. Loading...
   [junit4]   2> 1501351 INFO  (TEST-MissingSegmentRecoveryTest.testLeaderRecovery-seed#[1FB81C6070EAFD56]) [    ] o.a.s.c.ZkContainer Zookeeper client=127.0.0.1:58144/solr
   [junit4]   2> 1501355 INFO  (zkConnectionManagerCallback-10510-thread-1) [    ] o.a.s.c.c.ConnectionManager zkClient has connected
   [junit4]   2> 1501363 INFO  (zkConnectionManagerCallback-10512-thread-1) [    ] o.a.s.c.c.ConnectionManager zkClient has connected
   [junit4]   2> 1501412 INFO  (TEST-MissingSegmentRecoveryTest.testLeaderRecovery-seed#[1FB81C6070EAFD56]) [n:127.0.0.1:58155_solr    ] o.a.s.c.c.ZkStateReader Updated live nodes from ZooKeeper... (0) -> (1)
   [junit4]   2> 1501414 INFO  (TEST-MissingSegmentRecoveryTest.testLeaderRecovery-seed#[1FB81C6070EAFD56]) [n:127.0.0.1:58155_solr    ] o.a.s.c.ZkController Publish node=127.0.0.1:58155_solr as DOWN
   [junit4]   2> 1501414 INFO  (TEST-MissingSegmentRecoveryTest.testLeaderRecovery-seed#[1FB81C6070EAFD56]) [n:127.0.0.1:58155_solr    ] o.a.s.c.TransientSolrCoreCacheDefault Allocating transient cache for 2147483647 transient cores
   [junit4]   2> 1501414 INFO  (TEST-MissingSegmentRecoveryTest.testLeaderRecovery-seed#[1FB81C6070EAFD56]) [n:127.0.0.1:58155_solr    ] o.a.s.c.ZkController Register node as live in ZooKeeper:/live_nodes/127.0.0.1:58155_solr
   [junit4]   2> 1501416 INFO  (zkCallback-10500-thread-1) [    ] o.a.s.c.c.ZkStateReader Updated live nodes from ZooKeeper... (1) -> (2)
   [junit4]   2> 1501416 INFO  (zkCallback-10494-thread-1) [    ] o.a.s.c.c.ZkStateReader Updated live nodes from ZooKeeper... (1) -> (2)
   [junit4]   2> 1501416 INFO  (zkCallback-10487-thread-3) [    ] o.a.s.c.c.ZkStateReader Updated live nodes from ZooKeeper... (1) -> (2)
   [junit4]   2> 1501440 INFO  (zkCallback-10511-thread-1) [    ] o.a.s.c.c.ZkStateReader Updated live nodes from ZooKeeper... (1) -> (2)
   [junit4]   2> 1501452 INFO  (zkConnectionManagerCallback-10519-thread-1) [    ] o.a.s.c.c.ConnectionManager zkClient has connected
   [junit4]   2> 1501452 INFO  (TEST-MissingSegmentRecoveryTest.testLeaderRecovery-seed#[1FB81C6070EAFD56]) [n:127.0.0.1:58155_solr    ] o.a.s.c.c.ZkStateReader Updated live nodes from ZooKeeper... (0) -> (2)
   [junit4]   2> 1501456 INFO  (TEST-MissingSegmentRecoveryTest.testLeaderRecovery-seed#[1FB81C6070EAFD56]) [n:127.0.0.1:58155_solr    ] o.a.s.c.s.i.ZkClientClusterStateProvider Cluster at 127.0.0.1:58144/solr ready
   [junit4]   2> 1501457 INFO  (TEST-MissingSegmentRecoveryTest.testLeaderRecovery-seed#[1FB81C6070EAFD56]) [n:127.0.0.1:58155_solr    ] o.a.s.h.a.MetricsHistoryHandler No .system collection, keeping metrics history in memory.
   [junit4]   2> 1501478 INFO  (TEST-MissingSegmentRecoveryTest.testLeaderRecovery-seed#[1FB81C6070EAFD56]) [n:127.0.0.1:58155_solr    ] o.a.s.m.r.SolrJmxReporter JMX monitoring for 'solr_58155.solr.node' (registry 'solr.node') enabled at server: com.sun.jmx.mbeanserver.JmxMBeanServer@3143f639
   [junit4]   2> 1501488 INFO  (TEST-MissingSegmentRecoveryTest.testLeaderRecovery-seed#[1FB81C6070EAFD56]) [n:127.0.0.1:58155_solr    ] o.a.s.m.r.SolrJmxReporter JMX monitoring for 'solr_58155.solr.jvm' (registry 'solr.jvm') enabled at server: com.sun.jmx.mbeanserver.JmxMBeanServer@3143f639
   [junit4]   2> 1501489 INFO  (TEST-MissingSegmentRecoveryTest.testLeaderRecovery-seed#[1FB81C6070EAFD56]) [n:127.0.0.1:58155_solr    ] o.a.s.m.r.SolrJmxReporter JMX monitoring for 'solr_58155.solr.jetty' (registry 'solr.jetty') enabled at server: com.sun.jmx.mbeanserver.JmxMBeanServer@3143f639
   [junit4]   2> 1501492 INFO  (TEST-MissingSegmentRecoveryTest.testLeaderRecovery-seed#[1FB81C6070EAFD56]) [n:127.0.0.1:58155_solr    ] o.a.s.c.CorePropertiesLocator Found 1 core definitions underneath C:\Users\jenkins\workspace\Lucene-Solr-7.x-Windows\solr\build\solr-core\test\J1\temp\solr.cloud.MissingSegmentRecoveryTest_1FB81C6070EAFD56-001\tempDir-001\node2\.
   [junit4]   2> 1501492 INFO  (TEST-MissingSegmentRecoveryTest.testLeaderRecovery-seed#[1FB81C6070EAFD56]) [n:127.0.0.1:58155_solr    ] o.a.s.c.CorePropertiesLocator Cores are: [MissingSegmentRecoveryTest_shard1_replica_n2]
   [junit4]   2> 1501562 INFO  (coreLoadExecutor-9725-thread-1-processing-n:127.0.0.1:58155_solr) [n:127.0.0.1:58155_solr    ] o.a.s.c.SolrConfig Using Lucene MatchVersion: 7.7.0
   [junit4]   2> 1501568 INFO  (coreLoadExecutor-9725-thread-1-processing-n:127.0.0.1:58155_solr) [n:127.0.0.1:58155_solr    ] o.a.s.s.IndexSchema [MissingSegmentRecoveryTest_shard1_replica_n2] Schema name=minimal
   [junit4]   2> 1501571 INFO  (coreLoadExecutor-9725-thread-1-processing-n:127.0.0.1:58155_solr) [n:127.0.0.1:58155_solr    ] o.a.s.s.IndexSchema Loaded schema minimal/1.1 with uniqueid field id
   [junit4]   2> 1501584 INFO  (coreLoadExecutor-9725-thread-1-processing-n:127.0.0.1:58155_solr) [n:127.0.0.1:58155_solr c:MissingSegmentRecoveryTest s:shard1 r:core_node4 x:MissingSegmentRecoveryTest_shard1_replica_n2] o.a.s.c.SolrConfig Using Lucene MatchVersion: 7.7.0
   [junit4]   2> 1501592 INFO  (coreLoadExecutor-9725-thread-1-processing-n:127.0.0.1:58155_solr) [n:127.0.0.1:58155_solr c:MissingSegmentRecoveryTest s:shard1 r:core_node4 x:MissingSegmentRecoveryTest_shard1_replica_n2] o.a.s.s.IndexSchema [MissingSegmentRecoveryTest_shard1_replica_n2] Schema name=minimal
   [junit4]   2> 1501593 INFO  (coreLoadExecutor-9725-thread-1-processing-n:127.0.0.1:58155_solr) [n:127.0.0.1:58155_solr c:MissingSegmentRecoveryTest s:shard1 r:core_node4 x:MissingSegmentRecoveryTest_shard1_replica_n2] o.a.s.s.IndexSchema Loaded schema minimal/1.1 with uniqueid field id
   [junit4]   2> 1501593 INFO  (coreLoadExecutor-9725-thread-1-processing-n:127.0.0.1:58155_solr) [n:127.0.0.1:58155_solr c:MissingSegmentRecoveryTest s:shard1 r:core_node4 x:MissingSegmentRecoveryTest_shard1_replica_n2] o.a.s.c.CoreContainer Creating SolrCore 'MissingSegmentRecoveryTest_shard1_replica_n2' using configuration from collection MissingSegmentRecoveryTest, trusted=true
   [junit4]   2> 1501593 INFO  (coreLoadExecutor-9725-thread-1-processing-n:127.0.0.1:58155_solr) [n:127.0.0.1:58155_solr c:MissingSegmentRecoveryTest s:shard1 r:core_node4 x:MissingSegmentRecoveryTest_shard1_replica_n2] o.a.s.m.r.SolrJmxReporter JMX monitoring for 'solr_58155.solr.core.MissingSegmentRecoveryTest.shard1.replica_n2' (registry 'solr.core.MissingSegmentRecoveryTest.shard1.replica_n2') enabled at server: com.sun.jmx.mbeanserver.JmxMBeanServer@3143f639
   [junit4]   2> 1501593 INFO  (coreLoadExecutor-9725-thread-1-processing-n:127.0.0.1:58155_solr) [n:127.0.0.1:58155_solr c:MissingSegmentRecoveryTest s:shard1 r:core_node4 x:MissingSegmentRecoveryTest_shard1_replica_n2] o.a.s.c.SolrCore [[MissingSegmentRecoveryTest_shard1_replica_n2] ] Opening new SolrCore at [C:\Users\jenkins\workspace\Lucene-Solr-7.x-Windows\solr\build\solr-core\test\J1\temp\solr.cloud.MissingSegmentRecoveryTest_1FB81C6070EAFD56-001\tempDir-001\node2\MissingSegmentRecoveryTest_shard1_replica_n2], dataDir=[C:\Users\jenkins\workspace\Lucene-Solr-7.x-Windows\solr\build\solr-core\test\J1\temp\solr.cloud.MissingSegmentRecoveryTest_1FB81C6070EAFD56-001\tempDir-001\node2\.\MissingSegmentRecoveryTest_shard1_replica_n2\data\]
   [junit4]   2> 1501616 INFO  (zkCallback-10487-thread-3) [    ] o.a.s.c.c.ZkStateReader A cluster state change: [WatchedEvent state:SyncConnected type:NodeDataChanged path:/collections/MissingSegmentRecoveryTest/state.json] for collection [MissingSegmentRecoveryTest] has occurred - updating... (live nodes size: [2])
   [junit4]   2> 1501616 INFO  (zkCallback-10487-thread-2) [    ] o.a.s.c.c.ZkStateReader A cluster state change: [WatchedEvent state:SyncConnected type:NodeDataChanged path:/collections/MissingSegmentRecoveryTest/state.json] for collection [MissingSegmentRecoveryTest] has occurred - updating... (live nodes size: [2])
   [junit4]   2> 1501695 INFO  (coreLoadExecutor-9725-thread-1-processing-n:127.0.0.1:58155_solr) [n:127.0.0.1:58155_solr c:MissingSegmentRecoveryTest s:shard1 r:core_node4 x:MissingSegmentRecoveryTest_shard1_replica_n2] o.a.s.u.UpdateHandler Using UpdateLog implementation: org.apache.solr.update.UpdateLog
   [junit4]   2> 1501695 INFO  (coreLoadExecutor-9725-thread-1-processing-n:127.0.0.1:58155_solr) [n:127.0.0.1:58155_solr c:MissingSegmentRecoveryTest s:shard1 r:core_node4 x:MissingSegmentRecoveryTest_shard1_replica_n2] o.a.s.u.UpdateLog Initializing UpdateLog: dataDir=null defaultSyncLevel=FLUSH numRecordsToKeep=100 maxNumLogsToKeep=10 numVersionBuckets=65536
   [junit4]   2> 1501699 INFO  (coreLoadExecutor-9725-thread-1-processing-n:127.0.0.1:58155_solr) [n:127.0.0.1:58155_solr c:MissingSegmentRecoveryTest s:shard1 r:core_node4 x:MissingSegmentRecoveryTest_shard1_replica_n2] o.a.s.u.CommitTracker Hard AutoCommit: disabled
   [junit4]   2> 1501699 INFO  (coreLoadExecutor-9725-thread-1-processing-n:127.0.0.1:58155_solr) [n:127.0.0.1:58155_solr c:MissingSegmentRecoveryTest s:shard1 r:core_node4 x:MissingSegmentRecoveryTest_shard1_replica_n2] o.a.s.u.CommitTracker Soft AutoCommit: disabled
   [junit4]   2> 1501721 INFO  (coreLoadExecutor-9725-thread-1-processing-n:127.0.0.1:58155_solr) [n:127.0.0.1:58155_solr c:MissingSegmentRecoveryTest s:shard1 r:core_node4 x:MissingSegmentRecoveryTest_shard1_replica_n2] o.a.s.c.SolrCore [MissingSegmentRecoveryTest_shard1_replica_n2]  CLOSING SolrCore org.apache.solr.core.SolrCore@445ae0b6
   [junit4]   2> 1501721 INFO  (coreLoadExecutor-9725-thread-1-processing-n:127.0.0.1:58155_solr) [n:127.0.0.1:58155_solr c:MissingSegmentRecoveryTest s:shard1 r:core_node4 x:MissingSegmentRecoveryTest_shard1_replica_n2] o.a.s.m.SolrMetricManager Closing metric reporters for registry=solr.core.MissingSegmentRecoveryTest.shard1.replica_n2, tag=445ae0b6
   [junit4]   2> 1501723 INFO  (coreLoadExecutor-9725-thread-1-processing-n:127.0.0.1:58155_solr) [n:127.0.0.1:58155_solr c:MissingSegmentRecoveryTest s:shard1 r:core_node4 x:MissingSegmentRecoveryTest_shard1_replica_n2] o.a.s.m.r.SolrJmxReporter Closing reporter [org.apache.solr.metrics.reporters.SolrJmxReporter@6befa97d: rootName = solr_58155, domain = solr.core.MissingSegmentRecoveryTest.shard1.replica_n2, service url = null, agent id = null] for registry solr.core.MissingSegmentRecoveryTest.shard1.replica_n2 / com.codahale.metrics.MetricRegistry@a3b1562
   [junit4]   2> 1501753 INFO  (coreLoadExecutor-9725-thread-1-processing-n:127.0.0.1:58155_solr) [n:127.0.0.1:58155_solr c:MissingSegmentRecoveryTest s:shard1 r:core_node4 x:MissingSegmentRecoveryTest_shard1_replica_n2] o.a.s.m.SolrMetricManager Closing metric reporters for registry=solr.collection.MissingSegmentRecoveryTest.shard1.leader, tag=445ae0b6
   [junit4]   2> 1501761 INFO  (coreLoadExecutor-9725-thread-1-processing-n:127.0.0.1:58155_solr) [n:127.0.0.1:58155_solr c:MissingSegmentRecoveryTest s:shard1 r:core_node4 x:MissingSegmentRecoveryTest_shard1_replica_n2] o.a.s.c.CoreContainer Found active leader, will attempt to create fresh core and recover.
   [junit4]   2> 1501762 INFO  (coreLoadExecutor-9725-thread-1-processing-n:127.0.0.1:58155_solr) [n:127.0.0.1:58155_solr c:MissingSegmentRecoveryTest s:shard1 r:core_node4 x:MissingSegmentRecoveryTest_shard1_replica_n2] o.a.s.c.SolrCore Updating index properties... index=index.20190115063753717
   [junit4]   2> 1501769 INFO  (coreLoadExecutor-9725-thread-1-processing-n:127.0.0.1:58155_solr) [n:127.0.0.1:58155_solr c:MissingSegmentRecoveryTest s:shard1 r:core_node4 x:MissingSegmentRecoveryTest_shard1_replica_n2] o.a.s.c.ZkShardTerms Successful update of terms at /collections/MissingSegmentRecoveryTest/terms/shard1 to Terms{values={core_node3=1, core_node4=0}, version=3}
   [junit4]   2> 1501784 INFO  (coreLoadExecutor-9725-thread-1-processing-n:127.0.0.1:58155_solr) [n:127.0.0.1:58155_solr c:MissingSegmentRecoveryTest s:shard1 r:core_node4 x:MissingSegmentRecoveryTest_shard1_replica_n2] o.a.s.m.r.SolrJmxReporter JMX monitoring for 'solr_58155.solr.core.MissingSegmentRecoveryTest.shard1.replica_n2' (registry 'solr.core.MissingSegmentRecoveryTest.shard1.replica_n2') enabled at server: com.sun.jmx.mbeanserver.JmxMBeanServer@3143f639
   [junit4]   2> 1501784 INFO  (coreLoadExecutor-9725-thread-1-processing-n:127.0.0.1:58155_solr) [n:127.0.0.1:58155_solr c:MissingSegmentRecoveryTest s:shard1 r:core_node4 x:MissingSegmentRecoveryTest_shard1_replica_n2] o.a.s.c.SolrCore [[MissingSegmentRecoveryTest_shard1_replica_n2] ] Opening new SolrCore at [C:\Users\jenkins\workspace\Lucene-Solr-7.x-Windows\solr\build\solr-core\test\J1\temp\solr.cloud.MissingSegmentRecoveryTest_1FB81C6070EAFD56-001\tempDir-001\node2\MissingSegmentRecoveryTest_shard1_replica_n2], dataDir=[C:\Users\jenkins\workspace\Lucene-Solr-7.x-Windows\solr\build\solr-core\test\J1\temp\solr.cloud.MissingSegmentRecoveryTest_1FB81C6070EAFD56-001\tempDir-001\node2\.\MissingSegmentRecoveryTest_shard1_replica_n2\data\]
   [junit4]   2> 1501810 INFO  (OldIndexDirectoryCleanupThreadForCore-MissingSegmentRecoveryTest_shard1_replica_n2) [    ] o.a.s.c.DirectoryFactory Found 1 old index directories to clean-up under C:\Users\jenkins\workspace\Lucene-Solr-7.x-Windows\solr\build\solr-core\test\J1\temp\solr.cloud.MissingSegmentRecoveryTest_1FB81C6070EAFD56-001\tempDir-001\node2\.\MissingSegmentRecoveryTest_shard1_replica_n2\data\ afterReload=false
   [junit4]   2> 1501810 INFO  (OldIndexDirectoryCleanupThreadForCore-MissingSegmentRecoveryTest_shard1_replica_n2) [    ] o.a.s.c.DirectoryFactory Deleted old index directory: C:\Users\jenkins\workspace\Lucene-Solr-7.x-Windows\solr\build\solr-core\test\J1\temp\solr.cloud.MissingSegmentRecoveryTest_1FB81C607

[...truncated too long message...]

loser-137-thread-1) [    ] o.a.s.c.ZkController Remove node as live in ZooKeeper:/live_nodes/127.0.0.1:53909_solr
   [junit4]   2> 80508 INFO  (jetty-closer-137-thread-1) [    ] o.a.s.c.CoreContainer Publish this node as DOWN...
   [junit4]   2> 80508 INFO  (jetty-closer-137-thread-1) [    ] o.a.s.c.ZkController Publish node=127.0.0.1:53909_solr as DOWN
   [junit4]   2> 80512 INFO  (jetty-closer-137-thread-2) [    ] o.a.s.m.SolrMetricManager Closing metric reporters for registry=solr.node, tag=null
   [junit4]   2> 80512 INFO  (jetty-closer-137-thread-2) [    ] o.a.s.m.r.SolrJmxReporter Closing reporter [org.apache.solr.metrics.reporters.SolrJmxReporter@cfec28e: rootName = solr_53912, domain = solr.node, service url = null, agent id = null] for registry solr.node / com.codahale.metrics.MetricRegistry@e591fd9
   [junit4]   2> 80513 INFO  (jetty-closer-137-thread-1) [    ] o.a.s.m.SolrMetricManager Closing metric reporters for registry=solr.node, tag=null
   [junit4]   2> 80515 INFO  (jetty-closer-137-thread-1) [    ] o.a.s.m.r.SolrJmxReporter Closing reporter [org.apache.solr.metrics.reporters.SolrJmxReporter@7f630c73: rootName = solr_53909, domain = solr.node, service url = null, agent id = null] for registry solr.node / com.codahale.metrics.MetricRegistry@526d31c2
   [junit4]   2> 80520 INFO  (jetty-closer-137-thread-2) [    ] o.a.s.m.SolrMetricManager Closing metric reporters for registry=solr.jvm, tag=null
   [junit4]   2> 80520 INFO  (jetty-closer-137-thread-2) [    ] o.a.s.m.r.SolrJmxReporter Closing reporter [org.apache.solr.metrics.reporters.SolrJmxReporter@520546a6: rootName = solr_53912, domain = solr.jvm, service url = null, agent id = null] for registry solr.jvm / com.codahale.metrics.MetricRegistry@2f5a7f99
   [junit4]   2> 80520 INFO  (jetty-closer-137-thread-1) [    ] o.a.s.m.SolrMetricManager Closing metric reporters for registry=solr.jvm, tag=null
   [junit4]   2> 80520 INFO  (jetty-closer-137-thread-1) [    ] o.a.s.m.r.SolrJmxReporter Closing reporter [org.apache.solr.metrics.reporters.SolrJmxReporter@22571963: rootName = solr_53909, domain = solr.jvm, service url = null, agent id = null] for registry solr.jvm / com.codahale.metrics.MetricRegistry@2f5a7f99
   [junit4]   2> 80524 INFO  (jetty-closer-137-thread-1) [    ] o.a.s.m.SolrMetricManager Closing metric reporters for registry=solr.jetty, tag=null
   [junit4]   2> 80524 INFO  (jetty-closer-137-thread-2) [    ] o.a.s.m.SolrMetricManager Closing metric reporters for registry=solr.jetty, tag=null
   [junit4]   2> 80524 INFO  (jetty-closer-137-thread-2) [    ] o.a.s.m.r.SolrJmxReporter Closing reporter [org.apache.solr.metrics.reporters.SolrJmxReporter@7da0f148: rootName = solr_53912, domain = solr.jetty, service url = null, agent id = null] for registry solr.jetty / com.codahale.metrics.MetricRegistry@1b6832b4
   [junit4]   2> 80524 INFO  (jetty-closer-137-thread-1) [    ] o.a.s.m.r.SolrJmxReporter Closing reporter [org.apache.solr.metrics.reporters.SolrJmxReporter@137aa7e7: rootName = solr_53909, domain = solr.jetty, service url = null, agent id = null] for registry solr.jetty / com.codahale.metrics.MetricRegistry@1b6832b4
   [junit4]   2> 80524 INFO  (jetty-closer-137-thread-2) [    ] o.a.s.m.SolrMetricManager Closing metric reporters for registry=solr.cluster, tag=null
   [junit4]   2> 80525 INFO  (jetty-closer-137-thread-1) [    ] o.a.s.m.SolrMetricManager Closing metric reporters for registry=solr.cluster, tag=null
   [junit4]   2> 80527 INFO  (closeThreadPool-142-thread-2) [    ] o.a.s.c.Overseer Overseer (id=72086853763006473-127.0.0.1:53912_solr-n_0000000001) closing
   [junit4]   2> 80531 INFO  (OverseerStateUpdate-72086853763006473-127.0.0.1:53912_solr-n_0000000001) [n:127.0.0.1:53912_solr    ] o.a.s.c.Overseer Overseer Loop exiting : 127.0.0.1:53912_solr
   [junit4]   2> 80532 INFO  (OverseerAutoScalingTriggerThread-72086853763006473-127.0.0.1:53912_solr-n_0000000001) [    ] o.a.s.c.a.OverseerTriggerThread OverseerTriggerThread woken up but we are closed, exiting.
   [junit4]   2> 80536 INFO  (closeThreadPool-142-thread-1) [    ] o.a.s.c.Overseer Overseer (id=72086853763006473-127.0.0.1:53912_solr-n_0000000001) closing
   [junit4]   2> 80536 INFO  (jetty-closer-137-thread-2) [    ] o.a.s.c.Overseer Overseer (id=72086853763006473-127.0.0.1:53912_solr-n_0000000001) closing
   [junit4]   2> 80539 INFO  (jetty-closer-137-thread-1) [    ] o.e.j.s.AbstractConnector Stopped ServerConnector@19c6e65a{HTTP/1.1,[http/1.1]}{127.0.0.1:53909}
   [junit4]   2> 80539 INFO  (jetty-closer-137-thread-2) [    ] o.e.j.s.AbstractConnector Stopped ServerConnector@3b0dc565{HTTP/1.1,[http/1.1]}{127.0.0.1:0}
   [junit4]   2> 80540 INFO  (jetty-closer-137-thread-1) [    ] o.e.j.s.h.ContextHandler Stopped o.e.j.s.ServletContextHandler@514a8eff{/solr,null,UNAVAILABLE}
   [junit4]   2> 80541 INFO  (jetty-closer-137-thread-1) [    ] o.e.j.s.session node0 Stopped scavenging
   [junit4]   2> 80541 INFO  (jetty-closer-137-thread-2) [    ] o.e.j.s.h.ContextHandler Stopped o.e.j.s.ServletContextHandler@1fd3bfec{/solr,null,UNAVAILABLE}
   [junit4]   2> 80541 INFO  (jetty-closer-137-thread-2) [    ] o.e.j.s.session node0 Stopped scavenging
   [junit4]   2> 80543 INFO  (SUITE-MissingSegmentRecoveryTest-seed#[1FB81C6070EAFD56]-worker) [    ] o.a.s.c.ZkTestServer Shutting down ZkTestServer.
   [junit4]   2> 80547 WARN  (ZkTestServer Run Thread) [    ] o.a.s.c.ZkTestServer Watch limit violations: 
   [junit4]   2> Maximum concurrent create/delete watches above limit:
   [junit4]   2> 
   [junit4]   2> 	12	/solr/collections/MissingSegmentRecoveryTest/terms/shard1
   [junit4]   2> 	7	/solr/aliases.json
   [junit4]   2> 	7	/solr/clusterprops.json
   [junit4]   2> 	3	/solr/security.json
   [junit4]   2> 	2	/solr/configs/conf
   [junit4]   2> 
   [junit4]   2> Maximum concurrent data watches above limit:
   [junit4]   2> 
   [junit4]   2> 	12	/solr/collections/MissingSegmentRecoveryTest/state.json
   [junit4]   2> 	7	/solr/clusterstate.json
   [junit4]   2> 	2	/solr/autoscaling.json
   [junit4]   2> 
   [junit4]   2> Maximum concurrent children watches above limit:
   [junit4]   2> 
   [junit4]   2> 	7	/solr/collections
   [junit4]   2> 	5	/solr/live_nodes
   [junit4]   2> 	2	/solr/overseer/queue
   [junit4]   2> 	2	/solr/autoscaling/events/.scheduled_maintenance
   [junit4]   2> 	2	/solr/autoscaling/events/.auto_add_replicas
   [junit4]   2> 	2	/solr/overseer/queue-work
   [junit4]   2> 	2	/solr/overseer/collection-queue-work
   [junit4]   2> 
   [junit4]   2> 80550 INFO  (SUITE-MissingSegmentRecoveryTest-seed#[1FB81C6070EAFD56]-worker) [    ] o.a.s.c.ZkTestServer parse host and port list: 127.0.0.1:53898
   [junit4]   2> 80550 INFO  (SUITE-MissingSegmentRecoveryTest-seed#[1FB81C6070EAFD56]-worker) [    ] o.a.s.c.ZkTestServer connecting to 127.0.0.1 53898
   [junit4]   2> NOTE: leaving temporary files on disk at: C:\Users\jenkins\workspace\Lucene-Solr-7.x-Windows\solr\build\solr-core\test\J1\temp\solr.cloud.MissingSegmentRecoveryTest_1FB81C6070EAFD56-001
   [junit4]   2> NOTE: test params are: codec=Asserting(Lucene70), sim=RandomSimilarity(queryNorm=true): {}, locale=ko-KR, timezone=Asia/Amman
   [junit4]   2> NOTE: Windows 10 10.0 amd64/Oracle Corporation 9.0.4 (64-bit)/cpus=3,threads=1,free=36578592,total=122683392
   [junit4]   2> NOTE: All tests run in this JVM: [MissingSegmentRecoveryTest, MissingSegmentRecoveryTest]
   [junit4] Completed [5/5 (1!)] on J1 in 54.41s, 1 test, 1 failure <<< FAILURES!

[...truncated 10 lines...]
BUILD FAILED
C:\Users\jenkins\workspace\Lucene-Solr-7.x-Windows\lucene\common-build.xml:1572: The following error occurred while executing this line:
C:\Users\jenkins\workspace\Lucene-Solr-7.x-Windows\lucene\common-build.xml:1099: There were test failures: 5 suites, 5 tests, 1 failure [seed: 1FB81C6070EAFD56]

Total time: 1 minute 24 seconds

[repro] Setting last failure code to 1

[repro] Failures:
[repro]   1/5 failed: org.apache.solr.cloud.MissingSegmentRecoveryTest
[repro] Exiting with code 1

C:\Users\jenkins\workspace\Lucene-Solr-7.x-Windows>IF EXIST lucene\build move /y lucene\build lucene\build.repro 
        1 dir(s) moved.

C:\Users\jenkins\workspace\Lucene-Solr-7.x-Windows>IF EXIST solr\build move /y solr\build solr\build.repro 
        1 dir(s) moved.

C:\Users\jenkins\workspace\Lucene-Solr-7.x-Windows>IF EXIST lucene\build.orig move /y lucene\build.orig lucene\build 
        1 dir(s) moved.

C:\Users\jenkins\workspace\Lucene-Solr-7.x-Windows>IF EXIST solr\build.orig move /y solr\build.orig solr\build 
        1 dir(s) moved.

C:\Users\jenkins\workspace\Lucene-Solr-7.x-Windows>exit 0 
Archiving artifacts
Setting ANT_1_8_2_HOME=C:\Users\jenkins\tools\hudson.tasks.Ant_AntInstallation\ANT_1.8.2
[WARNINGS] Parsing warnings in console log with parser Java Compiler (javac)
Setting ANT_1_8_2_HOME=C:\Users\jenkins\tools\hudson.tasks.Ant_AntInstallation\ANT_1.8.2
Setting ANT_1_8_2_HOME=C:\Users\jenkins\tools\hudson.tasks.Ant_AntInstallation\ANT_1.8.2
<Git Blamer> Using GitBlamer to create author and commit information for all warnings.
<Git Blamer> GIT_COMMIT=39d4dd6294f650777a872f0b33f6f17958bb167b, workspace=C:\Users\jenkins\workspace\Lucene-Solr-7.x-Windows
[WARNINGS] Computing warning deltas based on reference build #957
Recording test results
Setting ANT_1_8_2_HOME=C:\Users\jenkins\tools\hudson.tasks.Ant_AntInstallation\ANT_1.8.2
Build step 'Publish JUnit test result report' changed build result to UNSTABLE
Email was triggered for: Unstable (Test Failures)
Sending email for trigger: Unstable (Test Failures)
Setting ANT_1_8_2_HOME=C:\Users\jenkins\tools\hudson.tasks.Ant_AntInstallation\ANT_1.8.2
Setting ANT_1_8_2_HOME=C:\Users\jenkins\tools\hudson.tasks.Ant_AntInstallation\ANT_1.8.2
Setting ANT_1_8_2_HOME=C:\Users\jenkins\tools\hudson.tasks.Ant_AntInstallation\ANT_1.8.2
Setting ANT_1_8_2_HOME=C:\Users\jenkins\tools\hudson.tasks.Ant_AntInstallation\ANT_1.8.2

Mime
View raw message