lucene-dev mailing list archives

Site index · List index
Message view « Date » · « Thread »
Top « Date » · « Thread »
From Policeman Jenkins Server <jenk...@thetaphi.de>
Subject [JENKINS] Lucene-Solr-8.x-Windows (64bit/jdk1.8.0_172) - Build # 11 - Unstable!
Date Tue, 15 Jan 2019 23:27:58 GMT
Build: https://jenkins.thetaphi.de/job/Lucene-Solr-8.x-Windows/11/
Java: 64bit/jdk1.8.0_172 -XX:-UseCompressedOops -XX:+UseSerialGC

1 tests failed.
FAILED:  org.apache.solr.client.solrj.io.stream.MathExpressionTest.testGammaDistribution

Error Message:
0.8532264234705607 0.8742250101502959

Stack Trace:
java.lang.AssertionError: 0.8532264234705607 0.8742250101502959
	at __randomizedtesting.SeedInfo.seed([3F848262E387BCFC:2FEA9CCC0FF16EB]:0)
	at org.junit.Assert.fail(Assert.java:88)
	at org.junit.Assert.assertTrue(Assert.java:41)
	at org.apache.solr.client.solrj.io.stream.MathExpressionTest.testGammaDistribution(MathExpressionTest.java:4501)
	at sun.reflect.NativeMethodAccessorImpl.invoke0(Native Method)
	at sun.reflect.NativeMethodAccessorImpl.invoke(NativeMethodAccessorImpl.java:62)
	at sun.reflect.DelegatingMethodAccessorImpl.invoke(DelegatingMethodAccessorImpl.java:43)
	at java.lang.reflect.Method.invoke(Method.java:498)
	at com.carrotsearch.randomizedtesting.RandomizedRunner.invoke(RandomizedRunner.java:1750)
	at com.carrotsearch.randomizedtesting.RandomizedRunner$8.evaluate(RandomizedRunner.java:938)
	at com.carrotsearch.randomizedtesting.RandomizedRunner$9.evaluate(RandomizedRunner.java:974)
	at com.carrotsearch.randomizedtesting.RandomizedRunner$10.evaluate(RandomizedRunner.java:988)
	at com.carrotsearch.randomizedtesting.rules.SystemPropertiesRestoreRule$1.evaluate(SystemPropertiesRestoreRule.java:57)
	at org.apache.lucene.util.TestRuleSetupTeardownChained$1.evaluate(TestRuleSetupTeardownChained.java:49)
	at org.apache.lucene.util.AbstractBeforeAfterRule$1.evaluate(AbstractBeforeAfterRule.java:45)
	at org.apache.lucene.util.TestRuleThreadAndTestName$1.evaluate(TestRuleThreadAndTestName.java:48)
	at org.apache.lucene.util.TestRuleIgnoreAfterMaxFailures$1.evaluate(TestRuleIgnoreAfterMaxFailures.java:64)
	at org.apache.lucene.util.TestRuleMarkFailure$1.evaluate(TestRuleMarkFailure.java:47)
	at com.carrotsearch.randomizedtesting.rules.StatementAdapter.evaluate(StatementAdapter.java:36)
	at com.carrotsearch.randomizedtesting.ThreadLeakControl$StatementRunner.run(ThreadLeakControl.java:368)
	at com.carrotsearch.randomizedtesting.ThreadLeakControl.forkTimeoutingTask(ThreadLeakControl.java:817)
	at com.carrotsearch.randomizedtesting.ThreadLeakControl$3.evaluate(ThreadLeakControl.java:468)
	at com.carrotsearch.randomizedtesting.RandomizedRunner.runSingleTest(RandomizedRunner.java:947)
	at com.carrotsearch.randomizedtesting.RandomizedRunner$5.evaluate(RandomizedRunner.java:832)
	at com.carrotsearch.randomizedtesting.RandomizedRunner$6.evaluate(RandomizedRunner.java:883)
	at com.carrotsearch.randomizedtesting.RandomizedRunner$7.evaluate(RandomizedRunner.java:894)
	at com.carrotsearch.randomizedtesting.rules.StatementAdapter.evaluate(StatementAdapter.java:36)
	at com.carrotsearch.randomizedtesting.rules.SystemPropertiesRestoreRule$1.evaluate(SystemPropertiesRestoreRule.java:57)
	at org.apache.lucene.util.AbstractBeforeAfterRule$1.evaluate(AbstractBeforeAfterRule.java:45)
	at com.carrotsearch.randomizedtesting.rules.StatementAdapter.evaluate(StatementAdapter.java:36)
	at org.apache.lucene.util.TestRuleStoreClassName$1.evaluate(TestRuleStoreClassName.java:41)
	at com.carrotsearch.randomizedtesting.rules.NoShadowingOrOverridesOnMethodsRule$1.evaluate(NoShadowingOrOverridesOnMethodsRule.java:40)
	at com.carrotsearch.randomizedtesting.rules.NoShadowingOrOverridesOnMethodsRule$1.evaluate(NoShadowingOrOverridesOnMethodsRule.java:40)
	at com.carrotsearch.randomizedtesting.rules.StatementAdapter.evaluate(StatementAdapter.java:36)
	at com.carrotsearch.randomizedtesting.rules.StatementAdapter.evaluate(StatementAdapter.java:36)
	at com.carrotsearch.randomizedtesting.rules.StatementAdapter.evaluate(StatementAdapter.java:36)
	at org.apache.lucene.util.TestRuleAssertionsRequired$1.evaluate(TestRuleAssertionsRequired.java:53)
	at org.apache.lucene.util.TestRuleMarkFailure$1.evaluate(TestRuleMarkFailure.java:47)
	at org.apache.lucene.util.TestRuleIgnoreAfterMaxFailures$1.evaluate(TestRuleIgnoreAfterMaxFailures.java:64)
	at org.apache.lucene.util.TestRuleIgnoreTestSuites$1.evaluate(TestRuleIgnoreTestSuites.java:54)
	at com.carrotsearch.randomizedtesting.rules.StatementAdapter.evaluate(StatementAdapter.java:36)
	at com.carrotsearch.randomizedtesting.ThreadLeakControl$StatementRunner.run(ThreadLeakControl.java:368)
	at java.lang.Thread.run(Thread.java:748)




Build Log:
[...truncated 16305 lines...]
   [junit4] Suite: org.apache.solr.client.solrj.io.stream.MathExpressionTest
   [junit4]   2> Creating dataDir: C:\Users\jenkins\workspace\Lucene-Solr-8.x-Windows\solr\build\solr-solrj\test\J0\temp\solr.client.solrj.io.stream.MathExpressionTest_3F848262E387BCFC-001\init-core-data-001
   [junit4]   2> 212948 WARN  (SUITE-MathExpressionTest-seed#[3F848262E387BCFC]-worker) [    ] o.a.s.SolrTestCaseJ4 startTrackingSearchers: numOpens=22 numCloses=22
   [junit4]   2> 212948 INFO  (SUITE-MathExpressionTest-seed#[3F848262E387BCFC]-worker) [    ] o.a.s.SolrTestCaseJ4 Using PointFields (NUMERIC_POINTS_SYSPROP=true) w/NUMERIC_DOCVALUES_SYSPROP=true
   [junit4]   2> 212952 INFO  (SUITE-MathExpressionTest-seed#[3F848262E387BCFC]-worker) [    ] o.a.s.SolrTestCaseJ4 Randomized ssl (false) and clientAuth (true) via: @org.apache.solr.util.RandomizeSSL(reason=, value=NaN, ssl=NaN, clientAuth=NaN)
   [junit4]   2> 212952 INFO  (SUITE-MathExpressionTest-seed#[3F848262E387BCFC]-worker) [    ] o.a.s.SolrTestCaseJ4 SecureRandom sanity checks: test.solr.allowed.securerandom=null & java.security.egd=file:/dev/./urandom
   [junit4]   2> 212952 INFO  (SUITE-MathExpressionTest-seed#[3F848262E387BCFC]-worker) [    ] o.a.s.c.MiniSolrCloudCluster Starting cluster of 4 servers in C:\Users\jenkins\workspace\Lucene-Solr-8.x-Windows\solr\build\solr-solrj\test\J0\temp\solr.client.solrj.io.stream.MathExpressionTest_3F848262E387BCFC-001\tempDir-001
   [junit4]   2> 212952 INFO  (SUITE-MathExpressionTest-seed#[3F848262E387BCFC]-worker) [    ] o.a.s.c.ZkTestServer STARTING ZK TEST SERVER
   [junit4]   2> 212953 INFO  (ZkTestServer Run Thread) [    ] o.a.s.c.ZkTestServer client port:0.0.0.0/0.0.0.0:0
   [junit4]   2> 212953 INFO  (ZkTestServer Run Thread) [    ] o.a.s.c.ZkTestServer Starting server
   [junit4]   2> 213040 INFO  (SUITE-MathExpressionTest-seed#[3F848262E387BCFC]-worker) [    ] o.a.s.c.ZkTestServer start zk server on port:54311
   [junit4]   2> 213040 INFO  (SUITE-MathExpressionTest-seed#[3F848262E387BCFC]-worker) [    ] o.a.s.c.ZkTestServer parse host and port list: 127.0.0.1:54311
   [junit4]   2> 213040 INFO  (SUITE-MathExpressionTest-seed#[3F848262E387BCFC]-worker) [    ] o.a.s.c.ZkTestServer connecting to 127.0.0.1 54311
   [junit4]   2> 213046 INFO  (zkConnectionManagerCallback-1881-thread-1) [    ] o.a.s.c.c.ConnectionManager zkClient has connected
   [junit4]   2> 213049 INFO  (zkConnectionManagerCallback-1883-thread-1) [    ] o.a.s.c.c.ConnectionManager zkClient has connected
   [junit4]   2> 213052 INFO  (zkConnectionManagerCallback-1885-thread-1) [    ] o.a.s.c.c.ConnectionManager zkClient has connected
   [junit4]   2> 213053 WARN  (NIOServerCxn.Factory:0.0.0.0/0.0.0.0:0) [    ] o.a.z.s.NIOServerCnxn Unable to read additional data from client sessionid 0x1001e514d4a0002, likely client has closed socket
   [junit4]   2> 213055 WARN  (jetty-launcher-1886-thread-1) [    ] o.e.j.s.AbstractConnector Ignoring deprecated socket close linger time
   [junit4]   2> 213055 INFO  (jetty-launcher-1886-thread-1) [    ] o.a.s.c.s.e.JettySolrRunner Start Jetty (original configured port=0)
   [junit4]   2> 213055 INFO  (jetty-launcher-1886-thread-1) [    ] o.a.s.c.s.e.JettySolrRunner Trying to start Jetty on port 0 try number 1 ...
   [junit4]   2> 213055 INFO  (jetty-launcher-1886-thread-1) [    ] o.e.j.s.Server jetty-9.4.14.v20181114; built: 2018-11-14T21:20:31.478Z; git: c4550056e785fb5665914545889f21dc136ad9e6; jvm 1.8.0_172-b11
   [junit4]   2> 213055 INFO  (jetty-launcher-1886-thread-1) [    ] o.e.j.s.session DefaultSessionIdManager workerName=node0
   [junit4]   2> 213055 INFO  (jetty-launcher-1886-thread-1) [    ] o.e.j.s.session No SessionScavenger set, using defaults
   [junit4]   2> 213055 INFO  (jetty-launcher-1886-thread-1) [    ] o.e.j.s.session node0 Scavenging every 660000ms
   [junit4]   2> 213055 INFO  (jetty-launcher-1886-thread-1) [    ] o.e.j.s.h.ContextHandler Started o.e.j.s.ServletContextHandler@2e614f2d{/solr,null,AVAILABLE}
   [junit4]   2> 213056 WARN  (jetty-launcher-1886-thread-2) [    ] o.e.j.s.AbstractConnector Ignoring deprecated socket close linger time
   [junit4]   2> 213057 INFO  (jetty-launcher-1886-thread-2) [    ] o.a.s.c.s.e.JettySolrRunner Start Jetty (original configured port=0)
   [junit4]   2> 213057 INFO  (jetty-launcher-1886-thread-2) [    ] o.a.s.c.s.e.JettySolrRunner Trying to start Jetty on port 0 try number 1 ...
   [junit4]   2> 213057 INFO  (jetty-launcher-1886-thread-2) [    ] o.e.j.s.Server jetty-9.4.14.v20181114; built: 2018-11-14T21:20:31.478Z; git: c4550056e785fb5665914545889f21dc136ad9e6; jvm 1.8.0_172-b11
   [junit4]   2> 213057 INFO  (jetty-launcher-1886-thread-2) [    ] o.e.j.s.session DefaultSessionIdManager workerName=node0
   [junit4]   2> 213057 INFO  (jetty-launcher-1886-thread-2) [    ] o.e.j.s.session No SessionScavenger set, using defaults
   [junit4]   2> 213057 INFO  (jetty-launcher-1886-thread-2) [    ] o.e.j.s.session node0 Scavenging every 660000ms
   [junit4]   2> 213057 INFO  (jetty-launcher-1886-thread-2) [    ] o.e.j.s.h.ContextHandler Started o.e.j.s.ServletContextHandler@4448887b{/solr,null,AVAILABLE}
   [junit4]   2> 213059 WARN  (jetty-launcher-1886-thread-3) [    ] o.e.j.s.AbstractConnector Ignoring deprecated socket close linger time
   [junit4]   2> 213059 INFO  (jetty-launcher-1886-thread-3) [    ] o.a.s.c.s.e.JettySolrRunner Start Jetty (original configured port=0)
   [junit4]   2> 213059 INFO  (jetty-launcher-1886-thread-3) [    ] o.a.s.c.s.e.JettySolrRunner Trying to start Jetty on port 0 try number 1 ...
   [junit4]   2> 213059 INFO  (jetty-launcher-1886-thread-3) [    ] o.e.j.s.Server jetty-9.4.14.v20181114; built: 2018-11-14T21:20:31.478Z; git: c4550056e785fb5665914545889f21dc136ad9e6; jvm 1.8.0_172-b11
   [junit4]   2> 213059 INFO  (jetty-launcher-1886-thread-3) [    ] o.e.j.s.session DefaultSessionIdManager workerName=node0
   [junit4]   2> 213059 INFO  (jetty-launcher-1886-thread-3) [    ] o.e.j.s.session No SessionScavenger set, using defaults
   [junit4]   2> 213059 INFO  (jetty-launcher-1886-thread-3) [    ] o.e.j.s.session node0 Scavenging every 660000ms
   [junit4]   2> 213060 INFO  (jetty-launcher-1886-thread-3) [    ] o.e.j.s.h.ContextHandler Started o.e.j.s.ServletContextHandler@73953688{/solr,null,AVAILABLE}
   [junit4]   2> 213061 WARN  (jetty-launcher-1886-thread-4) [    ] o.e.j.s.AbstractConnector Ignoring deprecated socket close linger time
   [junit4]   2> 213061 INFO  (jetty-launcher-1886-thread-4) [    ] o.a.s.c.s.e.JettySolrRunner Start Jetty (original configured port=0)
   [junit4]   2> 213061 INFO  (jetty-launcher-1886-thread-4) [    ] o.a.s.c.s.e.JettySolrRunner Trying to start Jetty on port 0 try number 1 ...
   [junit4]   2> 213061 INFO  (jetty-launcher-1886-thread-4) [    ] o.e.j.s.Server jetty-9.4.14.v20181114; built: 2018-11-14T21:20:31.478Z; git: c4550056e785fb5665914545889f21dc136ad9e6; jvm 1.8.0_172-b11
   [junit4]   2> 213061 INFO  (jetty-launcher-1886-thread-1) [    ] o.e.j.s.AbstractConnector Started ServerConnector@33050b85{HTTP/1.1,[http/1.1, h2c]}{127.0.0.1:54322}
   [junit4]   2> 213061 INFO  (jetty-launcher-1886-thread-1) [    ] o.e.j.s.Server Started @209815ms
   [junit4]   2> 213061 INFO  (jetty-launcher-1886-thread-1) [    ] o.a.s.c.s.e.JettySolrRunner Jetty properties: {hostContext=/solr, hostPort=54322}
   [junit4]   2> 213061 INFO  (jetty-launcher-1886-thread-4) [    ] o.e.j.s.session DefaultSessionIdManager workerName=node0
   [junit4]   2> 213061 INFO  (jetty-launcher-1886-thread-4) [    ] o.e.j.s.session No SessionScavenger set, using defaults
   [junit4]   2> 213061 INFO  (jetty-launcher-1886-thread-4) [    ] o.e.j.s.session node0 Scavenging every 660000ms
   [junit4]   2> 213061 ERROR (jetty-launcher-1886-thread-1) [    ] o.a.s.u.StartupLoggingUtils Missing Java Option solr.log.dir. Logging may be missing or incomplete.
   [junit4]   2> 213061 INFO  (jetty-launcher-1886-thread-1) [    ] o.a.s.s.SolrDispatchFilter Using logger factory org.apache.logging.slf4j.Log4jLoggerFactory
   [junit4]   2> 213061 INFO  (jetty-launcher-1886-thread-1) [    ] o.a.s.s.SolrDispatchFilter  ___      _       Welcome to Apache Solr™ version 8.0.0
   [junit4]   2> 213061 INFO  (jetty-launcher-1886-thread-1) [    ] o.a.s.s.SolrDispatchFilter / __| ___| |_ _   Starting in cloud mode on port null
   [junit4]   2> 213061 INFO  (jetty-launcher-1886-thread-1) [    ] o.a.s.s.SolrDispatchFilter \__ \/ _ \ | '_|  Install dir: null
   [junit4]   2> 213061 INFO  (jetty-launcher-1886-thread-1) [    ] o.a.s.s.SolrDispatchFilter |___/\___/_|_|    Start time: 2019-01-15T22:52:42.136Z
   [junit4]   2> 213063 INFO  (jetty-launcher-1886-thread-4) [    ] o.e.j.s.h.ContextHandler Started o.e.j.s.ServletContextHandler@6f120913{/solr,null,AVAILABLE}
   [junit4]   2> 213063 INFO  (jetty-launcher-1886-thread-2) [    ] o.e.j.s.AbstractConnector Started ServerConnector@8e98cc{HTTP/1.1,[http/1.1, h2c]}{127.0.0.1:54325}
   [junit4]   2> 213063 INFO  (jetty-launcher-1886-thread-2) [    ] o.e.j.s.Server Started @209819ms
   [junit4]   2> 213063 INFO  (jetty-launcher-1886-thread-2) [    ] o.a.s.c.s.e.JettySolrRunner Jetty properties: {hostContext=/solr, hostPort=54325}
   [junit4]   2> 213063 ERROR (jetty-launcher-1886-thread-2) [    ] o.a.s.u.StartupLoggingUtils Missing Java Option solr.log.dir. Logging may be missing or incomplete.
   [junit4]   2> 213063 INFO  (jetty-launcher-1886-thread-2) [    ] o.a.s.s.SolrDispatchFilter Using logger factory org.apache.logging.slf4j.Log4jLoggerFactory
   [junit4]   2> 213066 INFO  (jetty-launcher-1886-thread-2) [    ] o.a.s.s.SolrDispatchFilter  ___      _       Welcome to Apache Solr™ version 8.0.0
   [junit4]   2> 213066 INFO  (jetty-launcher-1886-thread-2) [    ] o.a.s.s.SolrDispatchFilter / __| ___| |_ _   Starting in cloud mode on port null
   [junit4]   2> 213066 INFO  (jetty-launcher-1886-thread-2) [    ] o.a.s.s.SolrDispatchFilter \__ \/ _ \ | '_|  Install dir: null
   [junit4]   2> 213066 INFO  (jetty-launcher-1886-thread-2) [    ] o.a.s.s.SolrDispatchFilter |___/\___/_|_|    Start time: 2019-01-15T22:52:42.141Z
   [junit4]   2> 213066 INFO  (jetty-launcher-1886-thread-3) [    ] o.e.j.s.AbstractConnector Started ServerConnector@5a441050{HTTP/1.1,[http/1.1, h2c]}{127.0.0.1:54328}
   [junit4]   2> 213066 INFO  (jetty-launcher-1886-thread-3) [    ] o.e.j.s.Server Started @209820ms
   [junit4]   2> 213066 INFO  (jetty-launcher-1886-thread-3) [    ] o.a.s.c.s.e.JettySolrRunner Jetty properties: {hostContext=/solr, hostPort=54328}
   [junit4]   2> 213066 ERROR (jetty-launcher-1886-thread-3) [    ] o.a.s.u.StartupLoggingUtils Missing Java Option solr.log.dir. Logging may be missing or incomplete.
   [junit4]   2> 213066 INFO  (jetty-launcher-1886-thread-3) [    ] o.a.s.s.SolrDispatchFilter Using logger factory org.apache.logging.slf4j.Log4jLoggerFactory
   [junit4]   2> 213066 INFO  (jetty-launcher-1886-thread-3) [    ] o.a.s.s.SolrDispatchFilter  ___      _       Welcome to Apache Solr™ version 8.0.0
   [junit4]   2> 213066 INFO  (jetty-launcher-1886-thread-3) [    ] o.a.s.s.SolrDispatchFilter / __| ___| |_ _   Starting in cloud mode on port null
   [junit4]   2> 213066 INFO  (jetty-launcher-1886-thread-3) [    ] o.a.s.s.SolrDispatchFilter \__ \/ _ \ | '_|  Install dir: null
   [junit4]   2> 213066 INFO  (jetty-launcher-1886-thread-3) [    ] o.a.s.s.SolrDispatchFilter |___/\___/_|_|    Start time: 2019-01-15T22:52:42.141Z
   [junit4]   2> 213068 INFO  (jetty-launcher-1886-thread-4) [    ] o.e.j.s.AbstractConnector Started ServerConnector@1ce59a0c{HTTP/1.1,[http/1.1, h2c]}{127.0.0.1:54333}
   [junit4]   2> 213068 INFO  (jetty-launcher-1886-thread-4) [    ] o.e.j.s.Server Started @209823ms
   [junit4]   2> 213068 INFO  (jetty-launcher-1886-thread-4) [    ] o.a.s.c.s.e.JettySolrRunner Jetty properties: {hostContext=/solr, hostPort=54333}
   [junit4]   2> 213068 ERROR (jetty-launcher-1886-thread-4) [    ] o.a.s.u.StartupLoggingUtils Missing Java Option solr.log.dir. Logging may be missing or incomplete.
   [junit4]   2> 213068 INFO  (jetty-launcher-1886-thread-4) [    ] o.a.s.s.SolrDispatchFilter Using logger factory org.apache.logging.slf4j.Log4jLoggerFactory
   [junit4]   2> 213068 INFO  (jetty-launcher-1886-thread-4) [    ] o.a.s.s.SolrDispatchFilter  ___      _       Welcome to Apache Solr™ version 8.0.0
   [junit4]   2> 213068 INFO  (jetty-launcher-1886-thread-4) [    ] o.a.s.s.SolrDispatchFilter / __| ___| |_ _   Starting in cloud mode on port null
   [junit4]   2> 213068 INFO  (jetty-launcher-1886-thread-4) [    ] o.a.s.s.SolrDispatchFilter \__ \/ _ \ | '_|  Install dir: null
   [junit4]   2> 213068 INFO  (jetty-launcher-1886-thread-4) [    ] o.a.s.s.SolrDispatchFilter |___/\___/_|_|    Start time: 2019-01-15T22:52:42.143Z
   [junit4]   2> 213071 INFO  (zkConnectionManagerCallback-1888-thread-1) [    ] o.a.s.c.c.ConnectionManager zkClient has connected
   [junit4]   2> 213072 INFO  (jetty-launcher-1886-thread-1) [    ] o.a.s.s.SolrDispatchFilter solr.xml found in ZooKeeper. Loading...
   [junit4]   2> 213073 INFO  (zkConnectionManagerCallback-1892-thread-1) [    ] o.a.s.c.c.ConnectionManager zkClient has connected
   [junit4]   2> 213073 INFO  (jetty-launcher-1886-thread-3) [    ] o.a.s.s.SolrDispatchFilter solr.xml found in ZooKeeper. Loading...
   [junit4]   2> 213076 INFO  (zkConnectionManagerCallback-1890-thread-1) [    ] o.a.s.c.c.ConnectionManager zkClient has connected
   [junit4]   2> 213076 INFO  (zkConnectionManagerCallback-1894-thread-1) [    ] o.a.s.c.c.ConnectionManager zkClient has connected
   [junit4]   2> 213076 INFO  (jetty-launcher-1886-thread-4) [    ] o.a.s.s.SolrDispatchFilter solr.xml found in ZooKeeper. Loading...
   [junit4]   2> 213076 INFO  (jetty-launcher-1886-thread-2) [    ] o.a.s.s.SolrDispatchFilter solr.xml found in ZooKeeper. Loading...
   [junit4]   2> 213089 WARN  (NIOServerCxn.Factory:0.0.0.0/0.0.0.0:0) [    ] o.a.z.s.NIOServerCnxn Unable to read additional data from client sessionid 0x1001e514d4a0006, likely client has closed socket
   [junit4]   2> 213188 INFO  (jetty-launcher-1886-thread-4) [    ] o.a.s.h.c.HttpShardHandlerFactory Host whitelist initialized: WhitelistHostChecker [whitelistHosts=null, whitelistHostCheckingEnabled=true]
   [junit4]   2> 213189 WARN  (NIOServerCxn.Factory:0.0.0.0/0.0.0.0:0) [    ] o.a.z.s.NIOServerCnxn Unable to read additional data from client sessionid 0x1001e514d4a0003, likely client has closed socket
   [junit4]   2> 213241 INFO  (jetty-launcher-1886-thread-1) [    ] o.a.s.h.c.HttpShardHandlerFactory Host whitelist initialized: WhitelistHostChecker [whitelistHosts=null, whitelistHostCheckingEnabled=true]
   [junit4]   2> 213272 INFO  (jetty-launcher-1886-thread-2) [    ] o.a.s.h.c.HttpShardHandlerFactory Host whitelist initialized: WhitelistHostChecker [whitelistHosts=null, whitelistHostCheckingEnabled=true]
   [junit4]   2> 213274 WARN  (jetty-launcher-1886-thread-1) [    ] o.e.j.u.s.S.config No Client EndPointIdentificationAlgorithm configured for SslContextFactory@12b7a7a[provider=null,keyStore=null,trustStore=null]
   [junit4]   2> 213280 WARN  (jetty-launcher-1886-thread-4) [    ] o.e.j.u.s.S.config No Client EndPointIdentificationAlgorithm configured for SslContextFactory@1357e0a7[provider=null,keyStore=null,trustStore=null]
   [junit4]   2> 213383 WARN  (jetty-launcher-1886-thread-2) [    ] o.e.j.u.s.S.config No Client EndPointIdentificationAlgorithm configured for SslContextFactory@76a7be39[provider=null,keyStore=null,trustStore=null]
   [junit4]   2> 213385 WARN  (jetty-launcher-1886-thread-1) [    ] o.e.j.u.s.S.config No Client EndPointIdentificationAlgorithm configured for SslContextFactory@64f3875e[provider=null,keyStore=null,trustStore=null]
   [junit4]   2> 213387 INFO  (jetty-launcher-1886-thread-1) [    ] o.a.s.c.ZkContainer Zookeeper client=127.0.0.1:54311/solr
   [junit4]   2> 213390 WARN  (jetty-launcher-1886-thread-4) [    ] o.e.j.u.s.S.config No Client EndPointIdentificationAlgorithm configured for SslContextFactory@338c306f[provider=null,keyStore=null,trustStore=null]
   [junit4]   2> 213390 INFO  (jetty-launcher-1886-thread-4) [    ] o.a.s.c.ZkContainer Zookeeper client=127.0.0.1:54311/solr
   [junit4]   2> 213394 WARN  (jetty-launcher-1886-thread-2) [    ] o.e.j.u.s.S.config No Client EndPointIdentificationAlgorithm configured for SslContextFactory@37341fb1[provider=null,keyStore=null,trustStore=null]
   [junit4]   2> 213394 INFO  (jetty-launcher-1886-thread-2) [    ] o.a.s.c.ZkContainer Zookeeper client=127.0.0.1:54311/solr
   [junit4]   2> 213399 INFO  (zkConnectionManagerCallback-1906-thread-1) [    ] o.a.s.c.c.ConnectionManager zkClient has connected
   [junit4]   2> 213400 INFO  (zkConnectionManagerCallback-1909-thread-1) [    ] o.a.s.c.c.ConnectionManager zkClient has connected
   [junit4]   2> 213400 WARN  (NIOServerCxn.Factory:0.0.0.0/0.0.0.0:0) [    ] o.a.z.s.NIOServerCnxn Unable to read additional data from client sessionid 0x1001e514d4a0007, likely client has closed socket
   [junit4]   2> 213401 INFO  (zkConnectionManagerCallback-1912-thread-1) [    ] o.a.s.c.c.ConnectionManager zkClient has connected
   [junit4]   2> 213406 INFO  (zkConnectionManagerCallback-1914-thread-1) [    ] o.a.s.c.c.ConnectionManager zkClient has connected
   [junit4]   2> 213406 INFO  (zkConnectionManagerCallback-1916-thread-1) [    ] o.a.s.c.c.ConnectionManager zkClient has connected
   [junit4]   2> 213406 INFO  (zkConnectionManagerCallback-1918-thread-1) [    ] o.a.s.c.c.ConnectionManager zkClient has connected
   [junit4]   2> 213420 WARN  (jetty-launcher-1886-thread-4) [n:127.0.0.1:54333_solr    ] o.a.s.c.ZkController The _default configset could not be uploaded. Please provide 'solr.default.confdir' parameter that points to a configset intended to be the default. Current 'solr.default.confdir' value: null
   [junit4]   2> 213420 WARN  (jetty-launcher-1886-thread-1) [n:127.0.0.1:54322_solr    ] o.a.s.c.ZkController The _default configset could not be uploaded. Please provide 'solr.default.confdir' parameter that points to a configset intended to be the default. Current 'solr.default.confdir' value: null
   [junit4]   2> 213420 WARN  (jetty-launcher-1886-thread-2) [n:127.0.0.1:54325_solr    ] o.a.s.c.ZkController The _default configset could not be uploaded. Please provide 'solr.default.confdir' parameter that points to a configset intended to be the default. Current 'solr.default.confdir' value: null
   [junit4]   2> 213425 INFO  (jetty-launcher-1886-thread-4) [n:127.0.0.1:54333_solr    ] o.a.s.c.OverseerElectionContext I am going to be the leader 127.0.0.1:54333_solr
   [junit4]   2> 213425 INFO  (jetty-launcher-1886-thread-1) [n:127.0.0.1:54322_solr    ] o.a.s.c.ZkController Register node as live in ZooKeeper:/live_nodes/127.0.0.1:54322_solr
   [junit4]   2> 213426 INFO  (jetty-launcher-1886-thread-4) [n:127.0.0.1:54333_solr    ] o.a.s.c.Overseer Overseer (id=72090928575807499-127.0.0.1:54333_solr-n_0000000000) starting
   [junit4]   2> 213426 INFO  (jetty-launcher-1886-thread-2) [n:127.0.0.1:54325_solr    ] o.a.s.c.ZkController Publish node=127.0.0.1:54325_solr as DOWN
   [junit4]   2> 213427 INFO  (jetty-launcher-1886-thread-2) [n:127.0.0.1:54325_solr    ] o.a.s.c.TransientSolrCoreCacheDefault Allocating transient cache for 2147483647 transient cores
   [junit4]   2> 213427 INFO  (jetty-launcher-1886-thread-2) [n:127.0.0.1:54325_solr    ] o.a.s.c.ZkController Register node as live in ZooKeeper:/live_nodes/127.0.0.1:54325_solr
   [junit4]   2> 213499 INFO  (jetty-launcher-1886-thread-3) [    ] o.a.s.h.c.HttpShardHandlerFactory Host whitelist initialized: WhitelistHostChecker [whitelistHosts=null, whitelistHostCheckingEnabled=true]
   [junit4]   2> 213466 INFO  (zkCallback-1915-thread-1) [    ] o.a.s.c.c.ZkStateReader Updated live nodes from ZooKeeper... (0) -> (2)
   [junit4]   2> 213533 INFO  (zkCallback-1913-thread-1) [    ] o.a.s.c.c.ZkStateReader Updated live nodes from ZooKeeper... (0) -> (2)
   [junit4]   2> 213534 INFO  (zkCallback-1917-thread-1) [    ] o.a.s.c.c.ZkStateReader Updated live nodes from ZooKeeper... (0) -> (2)
   [junit4]   2> 213539 WARN  (jetty-launcher-1886-thread-3) [    ] o.e.j.u.s.S.config No Client EndPointIdentificationAlgorithm configured for SslContextFactory@3f1a898b[provider=null,keyStore=null,trustStore=null]
   [junit4]   2> 213567 INFO  (zkConnectionManagerCallback-1929-thread-1) [    ] o.a.s.c.c.ConnectionManager zkClient has connected
   [junit4]   2> 213571 INFO  (jetty-launcher-1886-thread-4) [n:127.0.0.1:54333_solr    ] o.a.s.c.c.ZkStateReader Updated live nodes from ZooKeeper... (0) -> (2)
   [junit4]   2> 213571 INFO  (jetty-launcher-1886-thread-4) [n:127.0.0.1:54333_solr    ] o.a.s.c.s.i.ZkClientClusterStateProvider Cluster at 127.0.0.1:54311/solr ready
   [junit4]   2> 213572 INFO  (jetty-launcher-1886-thread-4) [n:127.0.0.1:54333_solr    ] o.a.s.c.ZkController Publish node=127.0.0.1:54333_solr as DOWN
   [junit4]   2> 213573 INFO  (jetty-launcher-1886-thread-4) [n:127.0.0.1:54333_solr    ] o.a.s.c.TransientSolrCoreCacheDefault Allocating transient cache for 2147483647 transient cores
   [junit4]   2> 213573 INFO  (jetty-launcher-1886-thread-4) [n:127.0.0.1:54333_solr    ] o.a.s.c.ZkController Register node as live in ZooKeeper:/live_nodes/127.0.0.1:54333_solr
   [junit4]   2> 213574 INFO  (zkCallback-1915-thread-1) [    ] o.a.s.c.c.ZkStateReader Updated live nodes from ZooKeeper... (2) -> (3)
   [junit4]   2> 213574 INFO  (zkCallback-1913-thread-1) [    ] o.a.s.c.c.ZkStateReader Updated live nodes from ZooKeeper... (2) -> (3)
   [junit4]   2> 213574 INFO  (zkCallback-1917-thread-1) [    ] o.a.s.c.c.ZkStateReader Updated live nodes from ZooKeeper... (2) -> (3)
   [junit4]   2> 213618 INFO  (jetty-launcher-1886-thread-4) [n:127.0.0.1:54333_solr    ] o.a.s.h.a.MetricsHistoryHandler No .system collection, keeping metrics history in memory.
   [junit4]   2> 213682 INFO  (jetty-launcher-1886-thread-4) [n:127.0.0.1:54333_solr    ] o.a.s.m.r.SolrJmxReporter JMX monitoring for 'solr_54333.solr.node' (registry 'solr.node') enabled at server: com.sun.jmx.mbeanserver.JmxMBeanServer@ece00f7
   [junit4]   2> 213685 INFO  (jetty-launcher-1886-thread-4) [n:127.0.0.1:54333_solr    ] o.a.s.m.r.SolrJmxReporter JMX monitoring for 'solr_54333.solr.jvm' (registry 'solr.jvm') enabled at server: com.sun.jmx.mbeanserver.JmxMBeanServer@ece00f7
   [junit4]   2> 213685 INFO  (jetty-launcher-1886-thread-4) [n:127.0.0.1:54333_solr    ] o.a.s.m.r.SolrJmxReporter JMX monitoring for 'solr_54333.solr.jetty' (registry 'solr.jetty') enabled at server: com.sun.jmx.mbeanserver.JmxMBeanServer@ece00f7
   [junit4]   2> 213688 INFO  (jetty-launcher-1886-thread-4) [n:127.0.0.1:54333_solr    ] o.a.s.c.CorePropertiesLocator Found 0 core definitions underneath C:\Users\jenkins\workspace\Lucene-Solr-8.x-Windows\solr\build\solr-solrj\test\J0\temp\solr.client.solrj.io.stream.MathExpressionTest_3F848262E387BCFC-001\tempDir-001\node4\.
   [junit4]   2> 213718 WARN  (jetty-launcher-1886-thread-3) [    ] o.e.j.u.s.S.config No Client EndPointIdentificationAlgorithm configured for SslContextFactory@757654ad[provider=null,keyStore=null,trustStore=null]
   [junit4]   2> 213718 INFO  (jetty-launcher-1886-thread-3) [    ] o.a.s.c.ZkContainer Zookeeper client=127.0.0.1:54311/solr
   [junit4]   2> 213720 INFO  (zkConnectionManagerCallback-1934-thread-1) [    ] o.a.s.c.c.ConnectionManager zkClient has connected
   [junit4]   2> 213722 INFO  (jetty-launcher-1886-thread-1) [n:127.0.0.1:54322_solr    ] o.a.s.c.c.ZkStateReader Updated live nodes from ZooKeeper... (0) -> (3)
   [junit4]   2> 213728 INFO  (jetty-launcher-1886-thread-1) [n:127.0.0.1:54322_solr    ] o.a.s.c.s.i.ZkClientClusterStateProvider Cluster at 127.0.0.1:54311/solr ready
   [junit4]   2> 213728 INFO  (jetty-launcher-1886-thread-1) [n:127.0.0.1:54322_solr    ] o.a.s.h.a.MetricsHistoryHandler No .system collection, keeping metrics history in memory.
   [junit4]   2> 213730 INFO  (zkConnectionManagerCallback-1939-thread-1) [    ] o.a.s.c.c.ConnectionManager zkClient has connected
   [junit4]   2> 213732 INFO  (jetty-launcher-1886-thread-2) [n:127.0.0.1:54325_solr    ] o.a.s.c.c.ZkStateReader Updated live nodes from ZooKeeper... (0) -> (3)
   [junit4]   2> 213732 INFO  (jetty-launcher-1886-thread-2) [n:127.0.0.1:54325_solr    ] o.a.s.c.s.i.ZkClientClusterStateProvider Cluster at 127.0.0.1:54311/solr ready
   [junit4]   2> 213732 INFO  (jetty-launcher-1886-thread-2) [n:127.0.0.1:54325_solr    ] o.a.s.h.a.MetricsHistoryHandler No .system collection, keeping metrics history in memory.
   [junit4]   2> 213745 INFO  (zkCallback-1928-thread-1) [    ] o.a.s.c.c.ZkStateReader Updated live nodes from ZooKeeper... (2) -> (3)
   [junit4]   2> 213759 INFO  (zkConnectionManagerCallback-1946-thread-1) [    ] o.a.s.c.c.ConnectionManager zkClient has connected
   [junit4]   2> 213765 INFO  (jetty-launcher-1886-thread-1) [n:127.0.0.1:54322_solr    ] o.a.s.m.r.SolrJmxReporter JMX monitoring for 'solr_54322.solr.node' (registry 'solr.node') enabled at server: com.sun.jmx.mbeanserver.JmxMBeanServer@ece00f7
   [junit4]   2> 213770 INFO  (jetty-launcher-1886-thread-1) [n:127.0.0.1:54322_solr    ] o.a.s.m.r.SolrJmxReporter JMX monitoring for 'solr_54322.solr.jvm' (registry 'solr.jvm') enabled at server: com.sun.jmx.mbeanserver.JmxMBeanServer@ece00f7
   [junit4]   2> 213770 INFO  (jetty-launcher-1886-thread-1) [n:127.0.0.1:54322_solr    ] o.a.s.m.r.SolrJmxReporter JMX monitoring for 'solr_54322.solr.jetty' (registry 'solr.jetty') enabled at server: com.sun.jmx.mbeanserver.JmxMBeanServer@ece00f7
   [junit4]   2> 213770 INFO  (jetty-launcher-1886-thread-1) [n:127.0.0.1:54322_solr    ] o.a.s.c.CorePropertiesLocator Found 0 core definitions underneath C:\Users\jenkins\workspace\Lucene-Solr-8.x-Windows\solr\build\solr-solrj\test\J0\temp\solr.client.solrj.io.stream.MathExpressionTest_3F848262E387BCFC-001\tempDir-001\node1\.
   [junit4]   2> 213776 INFO  (jetty-launcher-1886-thread-2) [n:127.0.0.1:54325_solr    ] o.a.s.m.r.SolrJmxReporter JMX monitoring for 'solr_54325.solr.node' (registry 'solr.node') enabled at server: com.sun.jmx.mbeanserver.JmxMBeanServer@ece00f7
   [junit4]   2> 213796 INFO  (jetty-launcher-1886-thread-2) [n:127.0.0.1:54325_solr    ] o.a.s.m.r.SolrJmxReporter JMX monitoring for 'solr_54325.solr.jvm' (registry 'solr.jvm') enabled at server: com.sun.jmx.mbeanserver.JmxMBeanServer@ece00f7
   [junit4]   2> 213798 INFO  (jetty-launcher-1886-thread-2) [n:127.0.0.1:54325_solr    ] o.a.s.m.r.SolrJmxReporter JMX monitoring for 'solr_54325.solr.jetty' (registry 'solr.jetty') enabled at server: com.sun.jmx.mbeanserver.JmxMBeanServer@ece00f7
   [junit4]   2> 213798 INFO  (jetty-launcher-1886-thread-2) [n:127.0.0.1:54325_solr    ] o.a.s.c.CorePropertiesLocator Found 0 core definitions underneath C:\Users\jenkins\workspace\Lucene-Solr-8.x-Windows\solr\build\solr-solrj\test\J0\temp\solr.client.solrj.io.stream.MathExpressionTest_3F848262E387BCFC-001\tempDir-001\node2\.
   [junit4]   2> 213801 INFO  (OverseerStateUpdate-72090928575807499-127.0.0.1:54333_solr-n_0000000000) [n:127.0.0.1:54333_solr    ] o.a.s.c.Overseer Starting to work on the main queue : 127.0.0.1:54333_solr
   [junit4]   2> 213852 INFO  (zkConnectionManagerCallback-1950-thread-1) [    ] o.a.s.c.c.ConnectionManager zkClient has connected
   [junit4]   2> 213859 WARN  (jetty-launcher-1886-thread-3) [n:127.0.0.1:54328_solr    ] o.a.s.c.ZkController The _default configset could not be uploaded. Please provide 'solr.default.confdir' parameter that points to a configset intended to be the default. Current 'solr.default.confdir' value: null
   [junit4]   2> 213860 INFO  (jetty-launcher-1886-thread-3) [n:127.0.0.1:54328_solr    ] o.a.s.c.c.ZkStateReader Updated live nodes from ZooKeeper... (0) -> (3)
   [junit4]   2> 213864 INFO  (jetty-launcher-1886-thread-3) [n:127.0.0.1:54328_solr    ] o.a.s.c.ZkController Publish node=127.0.0.1:54328_solr as DOWN
   [junit4]   2> 213865 INFO  (jetty-launcher-1886-thread-3) [n:127.0.0.1:54328_solr    ] o.a.s.c.TransientSolrCoreCacheDefault Allocating transient cache for 2147483647 transient cores
   [junit4]   2> 213865 INFO  (jetty-launcher-1886-thread-3) [n:127.0.0.1:54328_solr    ] o.a.s.c.ZkController Register node as live in ZooKeeper:/live_nodes/127.0.0.1:54328_solr
   [junit4]   2> 213866 INFO  (zkCallback-1917-thread-1) [    ] o.a.s.c.c.ZkStateReader Updated live nodes from ZooKeeper... (3) -> (4)
   [junit4]   2> 213866 INFO  (zkCallback-1915-thread-1) [    ] o.a.s.c.c.ZkStateReader Updated live nodes from ZooKeeper... (3) -> (4)
   [junit4]   2> 213866 INFO  (zkCallback-1913-thread-1) [    ] o.a.s.c.c.ZkStateReader Updated live nodes from ZooKeeper... (3) -> (4)
   [junit4]   2> 213866 INFO  (zkCallback-1928-thread-1) [    ] o.a.s.c.c.ZkStateReader Updated live nodes from ZooKeeper... (3) -> (4)
   [junit4]   2> 213866 INFO  (zkCallback-1938-thread-1) [    ] o.a.s.c.c.ZkStateReader Updated live nodes from ZooKeeper... (3) -> (4)
   [junit4]   2> 213867 INFO  (zkCallback-1949-thread-1) [    ] o.a.s.c.c.ZkStateReader Updated live nodes from ZooKeeper... (3) -> (4)
   [junit4]   2> 213867 INFO  (zkCallback-1933-thread-1) [    ] o.a.s.c.c.ZkStateReader Updated live nodes from ZooKeeper... (3) -> (4)
   [junit4]   2> 213922 INFO  (zkConnectionManagerCallback-1957-thread-1) [    ] o.a.s.c.c.ConnectionManager zkClient has connected
   [junit4]   2> 213923 INFO  (jetty-launcher-1886-thread-3) [n:127.0.0.1:54328_solr    ] o.a.s.c.c.ZkStateReader Updated live nodes from ZooKeeper... (0) -> (4)
   [junit4]   2> 213925 INFO  (jetty-launcher-1886-thread-3) [n:127.0.0.1:54328_solr    ] o.a.s.c.s.i.ZkClientClusterStateProvider Cluster at 127.0.0.1:54311/solr ready
   [junit4]   2> 213925 INFO  (jetty-launcher-1886-thread-3) [n:127.0.0.1:54328_solr    ] o.a.s.h.a.MetricsHistoryHandler No .system collection, keeping metrics history in memory.
   [junit4]   2> 213946 INFO  (jetty-launcher-1886-thread-3) [n:127.0.0.1:54328_solr    ] o.a.s.m.r.SolrJmxReporter JMX monitoring for 'solr_54328.solr.node' (registry 'solr.node') enabled at server: com.sun.jmx.mbeanserver.JmxMBeanServer@ece00f7
   [junit4]   2> 213950 INFO  (jetty-launcher-1886-thread-3) [n:127.0.0.1:54328_solr    ] o.a.s.m.r.SolrJmxReporter JMX monitoring for 'solr_54328.solr.jvm' (registry 'solr.jvm') enabled at server: com.sun.jmx.mbeanserver.JmxMBeanServer@ece00f7
   [junit4]   2> 213950 INFO  (jetty-launcher-1886-thread-3) [n:127.0.0.1:54328_solr    ] o.a.s.m.r.SolrJmxReporter JMX monitoring for 'solr_54328.solr.jetty' (registry 'solr.jetty') enabled at server: com.sun.jmx.mbeanserver.JmxMBeanServer@ece00f7
   [junit4]   2> 213952 INFO  (jetty-launcher-1886-thread-3) [n:127.0.0.1:54328_solr    ] o.a.s.c.CorePropertiesLocator Found 0 core definitions underneath C:\Users\jenkins\workspace\Lucene-Solr-8.x-Windows\solr\build\solr-solrj\test\J0\temp\solr.client.solrj.io.stream.MathExpressionTest_3F848262E387BCFC-001\tempDir-001\node3\.
   [junit4]   2> 213988 INFO  (zkConnectionManagerCallback-1963-thread-1) [    ] o.a.s.c.c.ConnectionManager zkClient has connected
   [junit4]   2> 213990 INFO  (SUITE-MathExpressionTest-seed#[3F848262E387BCFC]-worker) [    ] o.a.s.c.c.ZkStateReader Updated live nodes from ZooKeeper... (0) -> (4)
   [junit4]   2> 213991 INFO  (SUITE-MathExpressionTest-seed#[3F848262E387BCFC]-worker) [    ] o.a.s.c.s.i.ZkClientClusterStateProvider Cluster at 127.0.0.1:54311/solr ready
   [junit4]   2> 214004 INFO  (qtp202682252-5611) [n:127.0.0.1:54325_solr    ] o.a.s.h.a.CollectionsHandler Invoked Collection Action :create with params collection.configName=conf&name=collection1&nrtReplicas=1&action=CREATE&numShards=2&wt=javabin&version=2 and sendToOCPQueue=true
   [junit4]   2> 214012 INFO  (OverseerThreadFactory-1759-thread-1-processing-n:127.0.0.1:54333_solr) [n:127.0.0.1:54333_solr    ] o.a.s.c.a.c.CreateCollectionCmd Create collection collection1
   [junit4]   2> 214108 INFO  (qtp202682252-5614) [n:127.0.0.1:54325_solr    ] o.a.s.s.HttpSolrCall [admin] webapp=null path=/admin/metrics params={prefix=CONTAINER.fs.usableSpace,CONTAINER.fs.totalSpace,CORE.coreName&wt=javabin&version=2&group=solr.node,solr.core} status=0 QTime=3
   [junit4]   2> 214112 INFO  (qtp202682252-5615) [n:127.0.0.1:54325_solr    ] o.a.s.s.HttpSolrCall [admin] webapp=null path=/admin/metrics params={prefix=CONTAINER.fs.usableSpace,CONTAINER.fs.totalSpace,CORE.coreName&wt=javabin&version=2&group=solr.node,solr.core} status=0 QTime=2
   [junit4]   2> 214115 INFO  (qtp202682252-5616) [n:127.0.0.1:54325_solr    ] o.a.s.s.HttpSolrCall [admin] webapp=null path=/admin/metrics params={prefix=CONTAINER.fs.usableSpace,CONTAINER.fs.totalSpace,CORE.coreName&wt=javabin&version=2&group=solr.node,solr.core} status=0 QTime=2
   [junit4]   2> 214118 INFO  (qtp202682252-5640) [n:127.0.0.1:54325_solr    ] o.a.s.s.HttpSolrCall [admin] webapp=null path=/admin/metrics params={prefix=CONTAINER.fs.usableSpace,CONTAINER.fs.totalSpace,CORE.coreName&wt=javabin&version=2&group=solr.node,solr.core} status=0 QTime=2
   [junit4]   2> 214121 INFO  (qtp202682252-5641) [n:127.0.0.1:54325_solr    ] o.a.s.s.HttpSolrCall [admin] webapp=null path=/admin/metrics params={prefix=CONTAINER.fs.usableSpace,CONTAINER.fs.totalSpace,CORE.coreName&wt=javabin&version=2&group=solr.node,solr.core} status=0 QTime=2
   [junit4]   2> 214124 INFO  (qtp57321554-5621) [n:127.0.0.1:54328_solr    ] o.a.s.s.HttpSolrCall [admin] webapp=null path=/admin/metrics params={prefix=CONTAINER.fs.usableSpace,CONTAINER.fs.totalSpace,CORE.coreName&wt=javabin&version=2&group=solr.node,solr.core} status=0 QTime=2
   [junit4]   2> 214128 INFO  (qtp57321554-5622) [n:127.0.0.1:54328_solr    ] o.a.s.s.HttpSolrCall [admin] webapp=null path=/admin/metrics params={prefix=CONTAINER.fs.usableSpace,CONTAINER.fs.totalSpace,CORE.coreName&wt=javabin&version=2&group=solr.node,solr.core} status=0 QTime=2
   [junit4]   2> 214130 INFO  (qtp57321554-5622) [n:127.0.0.1:54328_solr    ] o.a.s.s.HttpSolrCall [admin] webapp=null path=/admin/metrics params={prefix=CONTAINER.fs.usableSpace,CONTAINER.fs.totalSpace,CORE.coreName&wt=javabin&version=2&group=solr.node,solr.core} status=0 QTime=2
   [junit4]   2> 214135 INFO  (qtp57321554-5625) [n:127.0.0.1:54328_solr    ] o.a.s.s.HttpSolrCall [admin] webapp=null path=/admin/metrics params={prefix=CONTAINER.fs.usableSpace,CONTAINER.fs.totalSpace,CORE.coreName&wt=javabin&version=2&group=solr.node,solr.core} status=0 QTime=3
   [junit4]   2> 214137 INFO  (qtp57321554-5624) [n:127.0.0.1:54328_solr    ] o.a.s.s.HttpSolrCall [admin] webapp=null path=/admin/metrics params={prefix=CONTAINER.fs.usableSpace,CONTAINER.fs.totalSpace,CORE.coreName&wt=javabin&version=2&group=solr.node,solr.core} status=0 QTime=2
   [junit4]   2> 214141 INFO  (qtp1348343801-5631) [n:127.0.0.1:54333_solr    ] o.a.s.s.HttpSolrCall [admin] webapp=null path=/admin/metrics params={prefix=CONTAINER.fs.usableSpace,CONTAINER.fs.totalSpace,CORE.coreName&wt=javabin&version=2&group=solr.node,solr.core} status=0 QTime=2
   [junit4]   2> 214144 INFO  (qtp1348343801-5633) [n:127.0.0.1:54333_solr    ] o.a.s.s.HttpSolrCall [admin] webapp=null path=/admin/metrics params={prefix=CONTAINER.fs.usableSpace,CONTAINER.fs.totalSpace,CORE.coreName&wt=javabin&version=2&group=solr.node,solr.core} status=0 QTime=2
   [junit4]   2> 214147 INFO  (qtp1348343801-5632) [n:127.0.0.1:54333_solr    ] o.a.s.s.HttpSolrCall [admin] webapp=null path=/admin/metrics params={prefix=CONTAINER.fs.usableSpace,CONTAINER.fs.totalSpace,CORE.coreName&wt=javabin&version=2&group=solr.node,solr.core} status=0 QTime=2
   [junit4]   2> 214150 INFO  (qtp1348343801-5634) [n:127.0.0.1:54333_solr    ] o.a.s.s.HttpSolrCall [admin] webapp=null path=/admin/metrics params={prefix=CONTAINER.fs.usableSpace,CONTAINER.fs.totalSpace,CORE.coreName&wt=javabin&version=2&group=solr.node,solr.core} status=0 QTime=2
   [junit4]   2> 214154 INFO  (qtp1348343801-5635) [n:127.0.0.1:54333_solr    ] o.a.s.s.HttpSolrCall [admin] webapp=null path=/admin/metrics params={prefix=CONTAINER.fs.usableSpace,CONTAINER.fs.totalSpace,CORE.coreName&wt=javabin&version=2&group=solr.node,solr.core} status=0 QTime=2
   [junit4]   2> 214158 INFO  (qtp1510227481-5603) [n:127.0.0.1:54322_solr    ] o.a.s.s.HttpSolrCall [admin] webapp=null path=/admin/metrics params={prefix=CONTAINER.fs.usableSpace,CONTAINER.fs.totalSpace,CORE.coreName&wt=javabin&version=2&group=solr.node,solr.core} status=0 QTime=3
   [junit4]   2> 214161 INFO  (qtp1510227481-5604) [n:127.0.0.1:54322_solr    ] o.a.s.s.HttpSolrCall [admin] webapp=null path=/admin/metrics params={prefix=CONTAINER.fs.usableSpace,CONTAINER.fs.totalSpace,CORE.coreName&wt=javabin&version=2&group=solr.node,solr.core} status=0 QTime=2
   [junit4]   2> 214163 INFO  (qtp1510227481-5605) [n:127.0.0.1:54322_solr    ] o.a.s.s.HttpSolrCall [admin] webapp=null path=/admin/metrics params={prefix=CONTAINER.fs.usableSpace,CONTAINER.fs.totalSpace,CORE.coreName&wt=javabin&version=2&group=solr.node,solr.core} status=0 QTime=2
   [junit4]   2> 214166 INFO  (qtp1510227481-5606) [n:127.0.0.1:54322_solr    ] o.a.s.s.HttpSolrCall [admin] webapp=null path=/admin/metrics params={prefix=CONTAINER.fs.usableSpace,CONTAINER.fs.totalSpace,CORE.coreName&wt=javabin&version=2&group=solr.node,solr.core} status=0 QTime=2
   [junit4]   2> 214169 INFO  (qtp1510227481-5607) [n:127.0.0.1:54322_solr    ] o.a.s.s.HttpSolrCall [admin] webapp=null path=/admin/metrics params={prefix=CONTAINER.fs.usableSpace,CONTAINER.fs.totalSpace,CORE.coreName&wt=javabin&version=2&group=solr.node,solr.core} status=0 QTime=2
   [junit4]   2> 214174 INFO  (OverseerStateUpdate-72090928575807499-127.0.0.1:54333_solr-n_0000000000) [n:127.0.0.1:54333_solr    ] o.a.s.c.o.SliceMutator createReplica() {
   [junit4]   2>   "operation":"ADDREPLICA",
   [junit4]   2>   "collection":"collection1",
   [junit4]   2>   "shard":"shard1",
   [junit4]   2>   "core":"collection1_shard1_replica_n1",
   [junit4]   2>   "state":"down",
   [junit4]   2>   "base_url":"http://127.0.0.1:54322/solr",
   [junit4]   2>   "type":"NRT",
   [junit4]   2>   "waitForFinalState":"false"} 
   [junit4]   2> 214177 INFO  (OverseerStateUpdate-72090928575807499-127.0.0.1:54333_solr-n_0000000000) [n:127.0.0.1:54333_solr    ] o.a.s.c.o.SliceMutator createReplica() {
   [junit4]   2>   "operation":"ADDREPLICA",
   [junit4]   2>   "collection":"collection1",
   [junit4]   2>   "shard":"shard2",
   [junit4]   2>   "core":"collection1_shard2_replica_n2",
   [junit4]   2>   "state":"down",
   [junit4]   2>   "base_url":"http://127.0.0.1:54333/solr",
   [junit4]   2>   "type":"NRT",
   [junit4]   2>   "waitForFinalState":"false"} 
   [junit4]   2> 214352 INFO  (qtp1510227481-5627) [n:127.0.0.1:54322_solr    x:collection1_shard1_replica_n1] o.a.s.h.a.CoreAdminOperation core create command qt=/admin/cores&coreNodeName=core_node3&collection.configName=conf&newCollection=true&name=collection1_shard1_replica_n1&action=CREATE&numShards=2&collection=collection1&shard=shard1&wt=javabin&version=2&replicaType=NRT
   [junit4]   2> 214352 INFO  (qtp1348343801-5648) [n:127.0.0.1:54333_solr    x:collection1_shard2_replica_n2] o.a.s.h.a.CoreAdminOperation core create command qt=/admin/cores&coreNodeName=core_node4&collection.configName=conf&newCollection=true&name=collection1_shard2_replica_n2&action=CREATE&numShards=2&collection=collection1&shard=shard2&wt=javabin&version=2&replicaType=NRT
   [junit4]   2> 214352 INFO  (qtp1510227481-5627) [n:127.0.0.1:54322_solr    x:collection1_shard1_replica_n1] o.a.s.c.TransientSolrCoreCacheDefault Allocating transient cache for 2147483647 transient cores
   [junit4]   2> 215274 INFO  (qtp1510227481-5627) [n:127.0.0.1:54322_solr c:collection1 s:shard1 r:core_node3 x:collection1_shard1_replica_n1] o.a.s.c.SolrConfig Using Lucene MatchVersion: 8.0.0
   [junit4]   2> 215274 INFO  (qtp1348343801-5648) [n:127.0.0.1:54333_solr c:collection1 s:shard2 r:core_node4 x:collection1_shard2_replica_n2] o.a.s.c.SolrConfig Using Lucene MatchVersion: 8.0.0
   [junit4]   2> 215281 INFO  (qtp1348343801-5648) [n:127.0.0.1:54333_solr c:collection1 s:shard2 r:core_node4 x:collection1_shard2_replica_n2] o.a.s.s.IndexSchema [collection1_shard2_replica_n2] Schema name=test
   [junit4]   2> 215282 INFO  (qtp1510227481-5627) [n:127.0.0.1:54322_solr c:collection1 s:shard1 r:core_node3 x:collection1_shard1_replica_n1] o.a.s.s.IndexSchema [collection1_shard1_replica_n1] Schema name=test
   [junit4]   2> 215353 WARN  (qtp1510227481-5627) [n:127.0.0.1:54322_solr c:collection1 s:shard1 r:core_node3 x:collection1_shard1_replica_n1] o.a.s.s.IndexSchema Field lowerfilt1and2 is not multivalued and destination for multiple copyFields (2)
   [junit4]   2> 215353 WARN  (qtp1510227481-5627) [n:127.0.0.1:54322_solr c:collection1 s:shard1 r:core_node3 x:collection1_shard1_replica_n1] o.a.s.s.IndexSchema Field text is not multivalued and destination for multiple copyFields (3)
   [junit4]   2> 215356 INFO  (qtp1510227481-5627) [n:127.0.0.1:54322_solr c:collection1 s:shard1 r:core_node3 x:collection1_shard1_replica_n1] o.a.s.s.IndexSchema Loaded schema test/1.6 with uniqueid field id
   [junit4]   2> 215356 INFO  (qtp1510227481-5627) [n:127.0.0.1:54322_solr c:collection1 s:shard1 r:core_node3 x:collection1_shard1_replica_n1] o.a.s.c.CoreContainer Creating SolrCore 'collection1_shard1_replica_n1' using configuration from collection collection1, trusted=true
   [junit4]   2> 215356 INFO  (qtp1510227481-5627) [n:127.0.0.1:54322_solr c:collection1 s:shard1 r:core_node3 x:collection1_shard1_replica_n1] o.a.s.m.r.SolrJmxReporter JMX monitoring for 'solr_54322.solr.core.collection1.shard1.replica_n1' (registry 'solr.core.collection1.shard1.replica_n1') enabled at server: com.sun.jmx.mbeanserver.JmxMBeanServer@ece00f7
   [junit4]   2> 215356 INFO  (qtp1510227481-5627) [n:127.0.0.1:54322_solr c:collection1 s:shard1 r:core_node3 x:collection1_shard1_replica_n1] o.a.s.c.SolrCore [[collection1_shard1_replica_n1] ] Opening new SolrCore at [C:\Users\jenkins\workspace\Lucene-Solr-8.x-Windows\solr\build\solr-solrj\test\J0\temp\solr.client.solrj.io.stream.MathExpressionTest_3F848262E387BCFC-001\tempDir-001\node1\collection1_shard1_replica_n1], dataDir=[C:\Users\jenkins\workspace\Lucene-Solr-8.x-Windows\solr\build\solr-solrj\test\J0\temp\solr.client.solrj.io.stream.MathExpressionTest_3F848262E387BCFC-001\tempDir-001\node1\.\collection1_shard1_replica_n1\data\]
   [junit4]   2> 215358 WARN  (qtp1348343801-5648) [n:127.0.0.1:54333_solr c:collection1 s:shard2 r:core_node4 x:collection1_shard2_replica_n2] o.a.s.s.IndexSchema Field lowerfilt1and2 is not multivalued and destination for multiple copyFields (2)
   [junit4]   2> 215358 WARN  (qtp1348343801-5648) [n:127.0.0.1:54333_solr c:collection1 s:shard2 r:core_node4 x:collection1_shard2_replica_n2] o.a.s.s.IndexSchema Field text is not multivalued and destination for multiple copyFields (3)
   [junit4]   2> 215358 INFO  (qtp1348343801-5648) [n:127.0.0.1:54333_solr c:collection1 s:shard2 r:core_node4 x:collection1_shard2_replica_n2] o.a.s.s.IndexSchema Loaded schema test/1.6 with uniqueid field id
   [junit4]   2> 215358 INFO  (qtp1348343801-5648) [n:127.0.0.1:54333_solr c:collection1 s:shard2 r:core_node4 x:collection1_shard2_replica_n2] o.a.s.c.CoreContainer Creating SolrCore 'collection1_shard2_replica_n2' using configuration from collection collection1, trusted=true
   [junit4]   2> 215358 INFO  (qtp1348343801-5648) [n:127.0.0.1:54333_solr c:collection1 s:shard2 r:core_node4 x:collection1_shard2_replica_n2] o.a.s.m.r.SolrJmxReporter JMX monitoring for 'solr_54333.solr.core.collection1.shard2.replica_n2' (registry 'solr.core.collection1.shard2.replica_n2') enabled at server: com.sun.jmx.mbeanserver.JmxMBeanServer@ece00f7
   [junit4]   2> 215358 INFO  (qtp1348343801-5648) [n:127.0.0.1:54333_solr c:collection1 s:shard2 r:core_node4 x:collection1_shard2_replica_n2] o.a.s.c.SolrCore [[collection1_shard2_replica_n2] ] Opening new SolrCore at [C:\Users\jenkins\workspace\Lucene-Solr-8.x-Windows\solr\build\solr-solrj\test\J0\temp\solr.client.solrj.io.stream.MathExpressionTest_3F848262E387BCFC-001\tempDir-001\node4\collection1_shard2_replica_n2], dataDir=[C:\Users\jenkins\workspace\Lucene-Solr-8.x-Windows\solr\build\solr-solrj\test\J0\temp\solr.client.solrj.io.stream.MathExpressionTest_3F848262E387BCFC-001\tempDir-001\node4\.\collection1_shard2_replica_n2\data\]
   [junit4]   2> 215443 INFO  (qtp1510227481-5627) [n:127.0.0.1:54322_solr c:collection1 s:shard1 r:core_node3 x:collection1_shard1_replica_n1] o.a.s.u.UpdateHandler Using UpdateLog implementation: org.apache.solr.update.UpdateLog
   [junit4]   2> 215443 INFO  (qtp1348343801-5648) [n:127.0.0.1:54333_solr c:collection1 s:shard2 r:core_node4 x:collection1_shard2_replica_n2] o.a.s.u.UpdateHandler Using UpdateLog implementation: org.apache.solr.update.UpdateLog
   [junit4]   2> 215443 INFO  (qtp1348343801-5648) [n:127.0.0.1:54333_solr c:collection1 s:shard2 r:core_node4 x:collection1_shard2_replica_n2] o.a.s.u.UpdateLog Initializing UpdateLog: dataDir= defaultSyncLevel=FLUSH numRecordsToKeep=100 maxNumLogsToKeep=10 numVersionBuckets=65536
   [junit4]   2> 215443 INFO  (qtp1510227481-5627) [n:127.0.0.1:54322_solr c:collection1 s:shard1 r:core_node3 x:collection1_shard1_replica_n1] o.a.s.u.UpdateLog Initializing UpdateLog: dataDir= defaultSyncLevel=FLUSH numRecordsToKeep=100 maxNumLogsToKeep=10 numVersionBuckets=65536
   [junit4]   2> 215447 INFO  (qtp1510227481-5627) [n:127.0.0.1:54322_solr c:collection1 s:shard1 r:core_node3 x:collection1_shard1_replica_n1] o.a.s.u.CommitTracker Hard AutoCommit: disabled
   [junit4]   2> 215447 INFO  (qtp1348343801-5648) [n:127.0.0.1:54333_solr c:collection1 s:shard2 r:core_node4 x:collection1_shard2_replica_n2] o.a.s.u.CommitTracker Hard AutoCommit: disabled
   [junit4]   2> 215447 INFO  (qtp1510227481-5627) [n:127.0.0.1:54322_solr c:collection1 s:shard1 r:core_node3 x:collection1_shard1_replica_n1] o.a.s.u.CommitTracker Soft AutoCommit: disabled
   [junit4]   2> 215447 INFO  (qtp1348343801-5648) [n:127.0.0.1:54333_solr c:collection1 s:shard2 r:core_node4 x:collection1_shard2_replica_n2] o.a.s.u.CommitTracker Soft AutoCommit: disabled
   [junit4]   2> 215447 INFO  (qtp1348343801-5648) [n:127.0.0.1:54333_solr c:collection1 s:shard2 r:core_node4 x:collection1_shard2_replica_n2] o.a.s.s.SolrIndexSearcher Opening [Searcher@3b7d109e[collection1_shard2_replica_n2] main]
   [junit4]   2> 215447 INFO  (qtp1510227481-5627) [n:127.0.0.1:54322_solr c:collection1 s:shard1 r:core_node3 x:collection1_shard1_replica_n1] o.a.s.s.SolrIndexSearcher Opening [Searcher@3284e667[collection1_shard1_replica_n1] main]
   [junit4]   2> 215448 INFO  (qtp1348343801-5648) [n:127.0.0.1:54333_solr c:collection1 s:shard2 r:core_node4 x:collection1_shard2_replica_n2] o.a.s.r.ManagedResourceStorage Configured ZooKeeperStorageIO with znodeBase: /configs/conf
   [junit4]   2> 215448 INFO  (qtp1510227481-5627) [n:127.0.0.1:54322_solr c:collection1 s:shard1 r:core_node3 x:collection1_shard1_replica_n1] o.a.s.r.ManagedResourceStorage Configured ZooKeeperStorageIO with znodeBase: /configs/conf
   [junit4]   2> 215448 INFO  (qtp1348343801-5648) [n:127.0.0.1:54333_solr c:collection1 s:shard2 r:core_node4 x:collection1_shard2_replica_n2] o.a.s.r.ManagedResourceStorage Loaded null at path _rest_managed.json using ZooKeeperStorageIO:path=/configs/conf
   [junit4]   2> 215448 INFO  (qtp1510227481-5627) [n:127.0.0.1:54322_solr c:collection1 s:shard1 r:core_node3 x:collection1_shard1_replica_n1] o.a.s.r.ManagedResourceStorage Loaded null at path _rest_managed.json using ZooKeeperStorageIO:path=/configs/conf
   [junit4]   2> 215448 INFO  (qtp1348343801-5648) [n:127.0.0.1:54333_solr c:collection1 s:shard2 r:core_node4 x:collection1_shard2_replica_n2] o.a.s.h.ReplicationHandler Commits will be reserved for 10000ms.
   [junit4]   2> 215448 INFO  (qtp1348343801-5648) [n:127.0.0.1:54333_solr c:collection1 s:shard2 r:core_node4 x:collection1_shard2_replica_n2] o.a.s.u.UpdateLog Could not find max version in index or recent updates, using new clock 1622768630652469248
   [junit4]   2> 215450 INFO  (qtp1510227481-5627) [n:127.0.0.1:54322_solr c:collection1 s:shard1 r:core_node3 x:collection1_shard1_replica_n1] o.a.s.h.ReplicationHandler Commits will be reserved for 10000ms.
   [junit4]   2> 215450 INFO  (qtp1510227481-5627) [n:127.0.0.1:54322_solr c:collection1 s:shard1 r:core_node3 x:collection1_shard1_replica_n1] o.a.s.u.UpdateLog Could not find max version in index or recent updates, using new clock 1622768630654566400
   [junit4]   2> 215451 INFO  (searcherExecutor-1765-thread-1-processing-n:127.0.0.1:54333_solr x:collection1_shard2_replica_n2 c:collection1 s:shard2 r:core_node4) [n:127.0.0.1:54333_solr c:collection1 s:shard2 r:core_node4 x:collection1_shard2_replica_n2] o.a.s.c.SolrCore [collection1_shard2_replica_n2] Registered new searcher Searcher@3b7d109e[collection1_shard2_replica_n2] main{ExitableDirectoryReader(UninvertingDirectoryReader())}
   [junit4]   2> 215453 INFO  (searcherExecutor-1764-thread-1-processing-n:127.0.0.1:54322_solr x:collection1_shard1_replica_n1 c:collection1 s:shard1 r:core_node3) [n:127.0.0.1:54322_solr c:collection1 s:shard1 r:core_node3 x:collection1_shard1_replica_n1] o.a.s.c.SolrCore [collection1_shard1_replica_n1] Registered new searcher Searcher@3284e667[collection1_shard1_replica_n1] main{ExitableDirectoryReader(UninvertingDirectoryReader())}
   [junit4]   2> 215455 INFO  (qtp1348343801-5648) [n:127.0.0.1:54333_solr c:collection1 s:shard2 r:core_node4 x:collection1_shard2_replica_n2] o.a.s.c.ZkShardTerms Successful update of terms at /collections/collection1/terms/shard2 to Terms{values={core_node4=0}, version=0}
   [junit4]   2> 215455 INFO  (qtp1348343801-5648) [n:127.0.0.1:54333_solr c:collection1 s:shard2 r:core_node4 x:collection1_shard2_replica_n2] o.a.s.c.ShardLeaderElectionContextBase make sure parent is created /collections/collection1/leaders/shard2
   [junit4]   2> 215456 INFO  (qtp1510227481-5627) [n:127.0.0.1:54322_solr c:collection1 s:shard1 r:core_node3 x:collection1_shard1_replica_n1] o.a.s.c.ZkShardTerms Successful update of terms at /collections/collection1/terms/shard1 to Terms{values={core_node3=0}, version=0}
   [junit4]   2> 215456 INFO  (qtp1510227481-5627) [n:127.0.0.1:54322_solr c:collection1 s:shard1 r:core_node3 x:collection1_shard1_replica_n1] o.a.s.c.ShardLeaderElectionContextBase make sure parent is created /collections/collection1/leaders/shard1
   [junit4]   2> 215459 INFO  (qtp1348343801-5648) [n:127.0.0.1:54333_solr c:collection1 s:shard2 r:core_node4 x:collection1_shard2_replica_n2] o.a.s.c.ShardLeaderElectionContext Enough replicas found to continue.
   [junit4]   2> 215459 INFO  (qtp1348343801-5648) [n:127.0.0.1:54333_solr c:collection1 s:shard2 r:core_node4 x:collection1_shard2_replica_n2] o.a.s.c.ShardLeaderElectionContext I may be the new leader - try and sync
   [junit4]   2> 215459 INFO  (qtp1348343801-5648) [n:127.0.0.1:54333_solr c:collection1 s:shard2 r:core_node4 x:collection1_shard2_replica_n2] o.a.s.c.SyncStrategy Sync replicas to http://127.0.0.1:54333/solr/collection1_shard2_replica_n2/
   [junit4]   2> 215459 INFO  (qtp1348343801-5648) [n:127.0.0.1:54333_solr c:collection1 s:shard2 r:core_node4 x:collection1_shard2_replica_n2] o.a.s.c.SyncStrategy Sync Success - now sync replicas to me
   [junit4]   2> 215459 INFO  (qtp1348343801-5648) [n:127.0.0.1:54333_solr c:collection1 s:shard2 r:core_node4 x:collection1_shard2_replica_n2] o.a.s.c.SyncStrategy http://127.0.0.1:54333/solr/collection1_shard2_replica_n2/ has no replicas
   [junit4]   2> 215459 INFO  (qtp1510227481-5627) [n:127.0.0.1:54322_solr c:collection1 s:shard1 r:core_node3 x:collection1_shard1_replica_n1] o.a.s.c.ShardLeaderElectionContext Enough replicas found to continue.
   [junit4]   2> 215459 INFO  (qtp1348343801-5648) [n:127.0.0.1:54333_solr c:collection1 s:shard2 r:core_node4 x:collection1_shard2_replica_n2] o.a.s.c.ShardLeaderElectionContextBase Creating leader registration node /collections/collection1/leaders/shard2/leader after winning as /collections/collection1/leader_elect/shard2/election/72090928575807499-core_node4-n_0000000000
   [junit4]   2> 215459 INFO  (qtp1510227481-5627) [n:127.0.0.1:54322_solr c:collection1 s:shard1 r:core_node3 x:collection1_shard1_replica_n1] o.a.s.c.ShardLeaderElectionContext I may be the new leader - try and sync
   [junit4]   2> 215459 INFO  (qtp1510227481-5627) [n:127.0.0.1:54322_solr c:collection1 s:shard1 r:core_node3 x:collection1_shard1_replica_n1] o.a.s.c.SyncStrategy Sync replicas to http://127.0.0.1:54322/solr/collection1_shard1_replica_n1/
   [junit4]   2> 215459 INFO  (qtp1510227481-5627) [n:127.0.0.1:54322_solr c:collection1 s:shard1 r:core_node3 x:collection1_shard1_replica_n1] o.a.s.c.SyncStrategy Sync Success - now sync replicas to me
   [junit4]   2> 215459 INFO  (qtp1510227481-5627) [n:127.0.0.1:54322_solr c:collection1 s:shard1 r:core_node3 x:collection1_shard1_replica_n1] o.a.s.c.SyncStrategy http://127.0.0.1:54322/solr/collection1_shard1_replica_n1/ has no replicas
   [junit4]   2> 215459 INFO  (qtp1510227481-5627) [n:127.0.0.1:54322_solr c:collection1 s:shard1 r:core_node3 x:collection1_shard1_replica_n1] o.a.s.c.ShardLeaderElectionContextBase Creating leader registration node /collections/collection1/leaders/shard1/leader after winning as /collections/collection1/leader_elect/shard1/election/72090928575807498-core_node3-n_0000000000
   [junit4]   2> 215461 INFO  (qtp1510227481-5627) [n:127.0.0.1:54322_solr c:collection1 s:shard1 r:core_node3 x:collection1_shard1_replica_n1] o.a.s.c.ShardLeaderElectionContext I am the new leader: http://127.0.0.1:54322/solr/collection1_shard1_replica_n1/ shard1
   [junit4]   2> 215461 INFO  (qtp1348343801-5648) [n:127.0.0.1:54333_solr c:collection1 s:shard2 r:core_node4 x:collection1_shard2_replica_n2] o.a.s.c.ShardLeaderElectionContext I am the new leader: http://127.0.0.1:54333/solr/collection1_shard2_replica_n2/ shard2
   [junit4]   2> 215550 INFO  (zkCallback-1915-thread-1) [    ] o.a.s.c.c.ZkStateReader A cluster state change: [WatchedEvent state:SyncConnected type:NodeDataChanged path:/collections/collection1/state.json] for collection [collection1] has occurred - updating... (live nodes size: [4])
   [junit4]   2> 215550 INFO  (zkCallback-1913-thread-1) [    ] o.a.s.c.c.ZkStateReader A cluster state change: [WatchedEvent state:SyncConnected type:NodeDataChanged path:/collections/collection1/state.json] for collection [collection1] has occurred - updating... (live nodes size: [4])
   [junit4]   2> 215551 INFO  (qtp1510227481-5627) [n:127.0.0.1:54322_solr c:collection1 s:shard1 r:core_node3 x:collection1_shard1_replica_n1] o.a.s.c.ZkController I am the leader, no recovery necessary
   [junit4]   2> 215551 INFO  (qtp1348343801-5648) [n:127.0.0.1:54333_solr c:collection1 s:shard2 r:core_node4 x:collection1_shard2_replica_n2] o.a.s.c.ZkController I am the leader, no recovery necessary
   [junit4]   2> 215553 INFO  (qtp1510227481-5627) [n:127.0.0.1:54322_solr c:collection1 s:shard1 r:core_node3 x:collection1_shard1_replica_n1] o.a.s.s.HttpSolrCall [admin] webapp=null path=/admin/cores params={qt=/admin/cores&coreNodeName=core_node3&collection.configName=conf&newCollection=true&name=collection1_shard1_replica_n1&action=CREATE&numShards=2&collection=collection1&shard=shard1&wt=javabin&version=2&replicaType=NRT} status=0 QTime=1390
   [junit4]   2> 215554 INFO  (qtp1348343801-5648) [n:127.0.0.1:54333_solr c:collection1 s:shard2 r:core_node4 x:collection1_shard2_replica_n2] o.a.s.s.HttpSolrCall [admin] webapp=null path=/admin/cores params={qt=/admin/cores&coreNodeName=core_node4&collection.configName=conf&newCollection=true&name=collection1_shard2_replica_n2&action=CREATE&numShards=2&collection=collection1&shard=shard2&wt=javabin&version=2&replicaType=NRT} status=0 QTime=1390
   [junit4]   2> 215558 INFO  (qtp202682252-5611) [n:127.0.0.1:54325_solr    ] o.a.s.h.a.CollectionsHandler Wait for new collection to be active for at most 45 seconds. Check all shard replicas
   [junit4]   2> 215641 INFO  (zkCallback-1913-thread-1) [    ] o.a.s.c.c.ZkStateReader A cluster state change: [WatchedEvent state:SyncConnected type:NodeDataChanged path:/collections/collection1/state.json] for collection [collection1] has occurred - updating... (live nodes size: [4])
   [junit4]   2> 215641 INFO  (zkCallback-1913-thread-2) [    ] o.a.s.c.c.ZkStateReader A cluster state change: [WatchedEvent state:SyncConnected type:NodeDataChanged path:/collections/collection1/state.json] for collection [collection1] has occurred - updating... (live nodes size: [4])
   [junit4]   2> 215641 INFO  (zkCallback-1915-thread-3) [    ] o.a.s.c.c.ZkStateReader A cluster state change: [WatchedEvent state:SyncConnected type:NodeDataChanged path:/collections/collection1/state.json] for collection [collection1] has occurred - updating... (live nodes size: [4])
   [junit4]   2> 215641 INFO  (zkCallback-1915-thread-2) [    ] o.a.s.c.c.ZkStateReader A cluster state change: [WatchedEvent state:SyncConnected type:NodeDataChanged path:/collections/collection1/state.json] for collection [collection1] has occurred - updating... (live nodes size: [4])
   [junit4]   2> 215641 INFO  (zkCallback-1917-thread-1) [    ] o.a.s.c.c.ZkStateReader A cluster state change: [WatchedEvent state:SyncConnected type:NodeDataChanged path:/collections/collection1/state.json] for collection [collection1] has occurred - updating... (live nodes size: [4])
   [junit4]   2> 215641 INFO  (qtp202682252-5611) [n:127.0.0.1:54325_solr    ] o.a.s.s.HttpSolrCall [admin] webapp=null path=/admin/collections params={collection.configName=conf&name=collection1&nrtReplicas=1&action=CREATE&numShards=2&wt=javabin&version=2} status=0 QTime=1894
   [junit4]   2> 215642 INFO  (SUITE-MathExpressionTest-seed#[3F848262E387BCFC]-worker) [    ] o.a.s.c.AbstractDistribZkTestBase Wait for recoveries to finish - collection: collection1 failOnTimeout:true timeout (sec):45
   [junit4]   2> 215642 INFO  (SUITE-MathExpressionTest-seed#[3F848262E387BCFC]-worker) [    ] o.a.s.c.AbstractDistribZkTestBase Recoveries finished - collection: collection1
   [junit4]   2> 215675 INFO  (TEST-MathExpressionTest.testMatrixMath-seed#[3F848262E387BCFC]) [    ] o.a.s.SolrTestCaseJ4 ###Starting testMatrixMath
   [junit4]   2> 215686 INFO  (qtp1348343801-5633) [n:127.0.0.1:54333_solr c:collection1 s:shard2 r:core_node4 x:collection1_shard2_replica_n2] o.a.s.c.ZkShardTerms Successful update of terms at /collections/collection1/terms/shard2 to Terms{values={core_node4=1}, version=1}
   [junit4]   2> 215686 INFO  (qtp1348343801-5633) [n:127.0.0.1:54333_solr c:collection1 s:shard2 r:core_node4 x:collection1_shard2_replica_n2] o.a.s.u.p.LogUpdateProcessorFactory [collection1_shard2_replica_n2]  webapp=/solr path=/update params={update.distrib=TOLEADER&distrib.from=http://127.0.0.1:54322/solr/collection1_shard1_replica_n1/&wt=javabin&version=2}{deleteByQuery=*:* (-1622768630897836032)} 0 4
   [junit4]   2> 215689 INFO  (qtp1348343801-5632) [n:127.0.0.1:54333_solr c:collection1 s:shard2 r:core_node4 x:collection1_shard2_replica_n2] o.a.s.u.DirectUpdateHandler2 start commit{_version_=1622768630905176064,optimize=false,openSearcher=true,waitSearcher=true,expungeDeletes=false,softCommit=false,prepareCommit=false}
   [junit4]   2> 215689 INFO  (qtp1348343801-5632) [n:127.0.0.1:54333_solr c:collection1 s:shard2 r:core_node4 x:collection1_shard2_replica_n2] o.a.s.u.DirectUpdateHandler2 No uncommitted changes. Skipping IW.commit.
   [junit4]   2> 215690 INFO  (qtp1348343801-5632) [n:127.0.0.1:54333_solr c:collection1 s:shard2 r:core_node4 x:collection1_shard2_replica_n2] o.a.s.u.DirectUpdateHandler2 end_commit_flush
   [junit4]   2> 215690 INFO  (qtp1348343801-5632) [n:127.0.0.1:54333_solr c:collection1 s:shard2 r:core_node4 x:collection1_shard2_replica_n2] o.a.s.u.p.LogUpdateProcessorFactory [collection1_shard2_replica_n2]  webapp=/solr path=/update params={update.distrib=TOLEADER&waitSearcher=true&openSearcher=true&commit=true&softCommit=false&distrib.from=http://127.0.0.1:54322/solr/collection1_shard1_replica_n1/&commit_end_point=leaders&wt=javabin&version=2&expungeDeletes=false}{commit=} 0 1
   [junit4]   2> 215691 INFO  (qtp1510227481-5602) [n:127.0.0.1:54322_solr c:collection1 s:shard1 r:core_node3 x:collection1_shard1_replica_n1] o.a.s.u.DirectUpdateHandler2 start commit{_version_=1622768630907273216,optimize=false,openSearcher=true,waitSearcher=true,expungeDeletes=false,softCommit=false,prepareCommit=false}
   [junit4]   2> 215691 INFO  (qtp1510227481-5602) [n:127.0.0.1:54322_solr c:collection1 s:shard1 r:core_node3 x:collection1_shard1_replica_n1] o.a.s.u.DirectUpdateHandler2 No uncommitted changes. Skipping IW.commit.
   [junit4]   2> 215691 INFO  (qtp1510227481-5602) [n:127.0.0.1:54322_solr c:collection1 s:shard1 r:core_node3 x:collection1_shard1_replica_n1] o.a.s.u.DirectUpdateHandler2 end_commit_flush
   [junit4]   2> 215691 INFO  (qtp1510227481-5602) [n:127.0.0.1:54322_solr c:collection1 s:shard1 r:core_node3 x:collection1_shard1_replica_n1] o.a.s.c.ZkShardTerms Successful update of terms at /collections/collection1/terms/shard1 to Terms{values={core_node3=1}, version=1}
   [junit4]   2> 215691 INFO  (qtp1510227481-5602) [n:127.0.0.1:54322_solr c:collection1 s:shard1 r:core_node3 x:collection1_shard1_replica_n1] o.a.s.u.p.LogUpdateProcessorFactory [collection1_shard1_replica_n1]  webapp=/solr path=/update params={_stateVer_=collection1:4&commit=true&wt=javabin&version=2}{deleteByQuery=*:* (-1622768630893641728),commit=} 0 16
   [junit4]   2> 215715 INFO  (qtp1348343801-5635) [n:127.0.0.1:54333_solr c:collection1 s:shard2 r:core_node4 x:collection1_shard2_replica_n2] o.a.s.c.S.Request [collection1_shard2_replica_n2]  webapp=/solr path=/stream params={indent=off&expr=let(echo%3Dtrue,+a%3Dmatrix(array(1.5,+2.5,+3.5),+array(4.5,5.5,6.5)),+b%3DgrandSum(a),+c%3DsumRows(a),+d%3DsumColumns(a),+e%3DscalarAdd(1,+a),f%3DscalarSubtract(1,+a),g%3DscalarMultiply(1.5,+a),h%3DscalarDivide(1.5,+a),i%3DscalarAdd(1.5,+array(1.5,+2.5,+3.5)),j%3DscalarSubtract(1.5,+array(1.5,+2.5,+3.5)),k%3DscalarMultiply(1.5,+array(1.5,+2.5,+3.5)),l%3DscalarDivide(1.5,+array(1.5,+2.5,+3.5)))&wt=json&version=2.2} status=0 QTime=17
   [junit4]   2> 215743 INFO  (OverseerCollectionConfigSetProcessor-72090928575807499-127.0.0.1:54333_solr-n_0000000000) [n:127.0.0.1:54333_solr    ] o.a.s.c.OverseerTaskQueue Response ZK path: /overseer/collection-queue-work/qnr-0000000000 doesn't exist.  Requestor may have disconnected from ZooKeeper
   [junit4]   2> 215809 INFO  (TEST-MathExpressionTest.testMatrixMath-seed#[3F848262E387BCFC]) [    ] o.a.s.SolrTestCaseJ4 ###Ending testMatrixMath
   [junit4]   2> 215849 INFO  (TEST-MathExpressionTest.testNorms-seed#[3F848262E387BCFC]) [    ] o.a.s.SolrTestCaseJ4 ###Starting testNorms
   [junit4]   2> 215855 INFO  (qtp1510227481-5605) [n:127.0.0.1:54322_solr c:collection1 s:shard1 r:core_node3 x:collection1_shard1_replica_n1] o.a.s.u.p.LogUpdateProcessorFactory [collection1_shard1_replica_n1]  webapp=/solr path=/update params={update.distrib=TOLEADER&distrib.from=http://127.0.0.1:54333/solr/collection1_shard2_replica_n2/&wt=javabin&version=2}{deleteByQuery=*:* (-1622768631077142528)} 0 2
   [junit4]   2> 215857 INFO  (qtp1510227481-5606) [n:127.0.0.1:54322_solr c:collection1 s:shard1 r:core_node3 x:collection1_shard1_replica_n1] o.a.s.u.DirectUpdateHandler2 start commit{_version_=1622768631081336832,optimize=false,openSearcher=true,waitSearcher=true,expungeDeletes=false,softCommit=false,prepareCommit=false}
   [junit4]   2> 215857 INFO  (qtp1510227481-5606) [n:127.0.0.1:54322_solr c:collection1 s:shard1 r:core_node3 x:collection1_shard1_replica_n1] o.a.s.u.DirectUpdateHandler2 No uncommitted changes. Skipping IW.commit.
   [junit4]   2> 215858 INFO  (qtp1510227481-5606) [n:127.0.0.1:54322_solr c:collection1 s:shard1 r:core_node3 x:collection1_shard1_replica_n1] o.a.s.u.DirectUpdateHandler2 end_commit_flush
   [junit4]   2> 215858 INFO  (qtp1510227481-5606) [n:127.0.0.1:54322_solr c:collection1 s:shard1 r:core_node3 x:collection1_shard1_replica_n1] o.a.s.u.p.LogUpdateProcessorFactory [collection1_shard1_replica_n1]  webapp=/solr path=/update params={update.distrib=TOLEADER&waitSearcher=true&openSearcher=true&commit=true&softCommit=false&distrib.from=http://127.0.0.1:54333/solr/collection1_shard2_replica_n2/&commit_end_point=leaders&wt=javabin&version=2&expungeDeletes=false}{commit=} 0 1
   [junit4]   2> 215858 INFO  (qtp1348343801-5633) [n:127.0.0.1:54333_solr c:collection1 s:shard2 r:core_node4 x:collection1_shard2_replica_n2] o.a.s.u.DirectUpdateHandler2 start commit{_version_=1622768631082385408,optimize=false,openSearcher=true,waitSearcher=true,expungeDeletes=false,softCommit=false,prepareCommit=false}
   [junit4]   2> 215858 INFO  (qtp1348343801-5633) [n:127.0.0.1:54333_solr c:collection1 s:shard2 r:core_node4 x:collection1_shard2_replica_n2] o.a.s.u.DirectUpdateHandler2 No uncommitted changes. Skipping IW.commit.
   [junit4]   2> 215859 INFO  (qtp1348343801-5633) [n:127.0.0.1:54333_solr c:collection1 s:shard2 r:core_node4 x:collection1_shard2_replica_n2] o.a.s.u.DirectUpdateHandler2 end_commit_flush
   [junit4]   2> 215859 INFO  (qtp1348343801-5633) [n:127.0.0.1:54333_solr c:collection1 s:shard2 r:core_node4 x:collection1_shard2_replica_n2] o.a.s.u.p.LogUpdateProcessorFactory [collection1_shard2_replica_n2]  webapp=/solr path=/update params={_stateVer_=collection1:4&commit=true&wt=javabin&version=2}{deleteByQuery=*:* (-1622768631075045376),commit=} 0 10
   [junit4]   2> 215865 INFO  (qtp1348343801-5634) [n:127.0.0.1:54333_solr c:collection1 s:shard2 r:core_node4 x:collection1_shard2_replica_n2] o.a.s.c.S.Request [collection1_shard2_replica_n2]  webapp=/solr path=/stream params={indent=off&expr=let(echo%3Dtrue,++++++++++++++++a%3Darray(1,2,3,4,5,6),++++++++++++++++b%3Dl1norm(a),++++++++++++++++c%3Dl2norm(a),++++++++++++++++d%3Dlinfnorm(a),++++++++++++++++e%3Dsqrt(add(pow(a,+2))),+++++++++++++++f%3Dadd(abs(a)))&wt=json&version=2.2} status=0 QTime=2
   [junit4]   2> 215895 INFO  (TEST-MathExpressionTest.testNorms-seed#[3F848262E387BCFC]) [    ] o.a.s.SolrTestCaseJ4 ###Ending testNorms
   [junit4]   2> 215931 INFO  (TEST-MathExpressionTest.testFreqTable-seed#[3F848262E387BCFC]) [    ] o.a.s.SolrTestCaseJ4 ###Starting testFreqTable
   [junit4]   2> 215935 INFO  (qtp1348343801-5648) [n:127.0.0.1:54333_solr c:collection1 s:shard2 r:core_node4 x:collection1_shard2_replica_n2] o.a.s.u.p.LogUpdateProcessorFactory [collection1_shard2_replica_n2]  webapp=/solr path=/update params={update.distrib=TOLEADER&distrib.from=http://127.0.0.1:54322/solr/collection1_shard1_replica_n1/&wt=javabin&version=2}{deleteByQuery=*:* (-1622768631161028608)} 0 3
   [junit4]   2> 215938 INFO  (qtp1348343801-5629) [n:127.0.0.1:54333_solr c:collection1 s:shard2 r:core_node4 x:collection1_shard2_replica_n2] o.a.s.u.DirectUpdateHandler2 start commit{_version_=1622768631166271488,optimize=false,openSearcher=true,waitSearcher=true,expungeDeletes=false,softCommit=false,prepareCommit=false}
   [junit4]   2> 215938 INFO  (qtp1348343801-5629) [n:127.0.0.1:54333_solr c:collection1 s:shard2 r:core_node4 x:collection1_shard2_replica_n2] o.a.s.u.DirectUpdateHandler2 No uncommitted changes. Skipping IW.commit.
   [junit4]   2> 215939 INFO  (qtp1348343801-5629) [n:127.0.0.1:54333_solr c:collection1 s:shard2 r:core_node4 x:collection1_shard2_replica_n2] o.a.s.u.DirectUpdateHandler2 end_commit_flush
   [junit4]   2> 215939 INFO  (qtp1348343801-5629) [n:127.0.0.1:54333_solr c:collection1 s:shard2 r:core_node4 x:collection1_shard2_replica_n2] o.a.s.u.p.LogUpdateProcessorFactory [collection1_shard2_replica_n2]  webapp=/solr path=/update params={update.distrib=TOLEADER&waitSearcher=true&openSearcher=true&commit=true&softCommit=false&distrib.from=http://127.0.0.1:54322/solr/collection1_shard1_replica_n1/&commit_end_point=leaders&wt=javabin&version=2&expungeDeletes=false}{commit=} 0 1
   [junit4]   2> 215940 INFO  (qtp1510227481-5607) [n:127.0.0.1:54322_solr c:collection1 s:shard1 r:core_node3 x:collection1_shard1_replica_n1] o.a.s.u.DirectUpdateHandler2 start commit{_version_=1622768631168368640,optimize=false,openSearcher=true,waitSearcher=true,expungeDeletes=false,softCommit=false,prepareCommit=false}
   [junit4]   2> 215940 INFO  (qtp1510227481-5607) [n:127.0.0.1:54322_solr c:collection1 s:shard1 r:core_node3 x:collection1_shard1_replica_n1] o.a.s.u.DirectUpdateHandler2 No uncommitted changes. Skipping IW.commit.
   [junit4]   2> 215940 INFO  (qtp1510227481-5607) [n:127.0.0.1:54322_solr c:collection1 s:shard1 r:core_node3 x:collection1_shard1_replica_n1] o.a.s.u.DirectUpdateHandler2 end_commit_flush
   [junit4]   2> 215940 INFO  (qtp1510227481-5607) [n:127.0.0.1:54322_solr c:collection1 s:shard1 r:core_node3 x:collection1_shard1_replica_n1] o.a.s.u.p.LogUpdateProcessorFactory [collection1_shard1_replica_n1]  webapp=/solr path=/update params={_stateVer_=collection1:4&commit=true&wt=javabin&version=2}{deleteByQuery=*:* (-1622768631159980032),commit=} 0 9
   [junit4]   2> 215942 INFO  (qtp1348343801-5633) [n:127.0.0.1:54333_solr c:collection1 s:shard2 r:core_node4 x:collection1_shard2_replica_n2] o.a.s.c.S.Request [collection1_shard2_replica_n2]  webapp=/solr path=/stream params={indent=off&expr=freqTable(array(2,4,6,8,10,12,12,4,8,8,8,2))&wt=json&version=2.2} status=0 QTime=0
   [junit4]   2> 215950 INFO  (TEST-MathExpressionTest.testFreqTable-seed#[3F848262E387BCFC]) [    ] o.a.s.SolrTestCaseJ4 ###Ending testFreqTable
   [junit4]   2> 215982 INFO  (TEST-MathExpressionTest.testKmeans-seed#[3F848262E387BCFC]) [    ] o.a.s.SolrTestCaseJ4 ###Starting testKmeans
   [junit4]   2> 215995 INFO  (qtp1348343801-5634) [n:127.0.0.1:54333_solr c:collection1 s:shard2 r:core_node4 x:collection1_shard2_replica_n2] o.a.s.u.p.LogUpdateProcessorFactory [collection1_shard2_replica_n2]  webapp=/solr path=/update params={update.distrib=TOLEADER&distrib.from=http://127.0.0.1:54322/solr/collection1_shard1_replica_n1/&wt=javabin&version=2}{deleteByQuery=*:* (-1622768631221846016)} 0 3
   [junit4]   2> 215997 INFO  (qtp1348343801-5635) [n:127.0.0.1:54333_solr c:collection1 s:shard2 r:core_node4 x:collection1_shard2_replica_n2] o.a.s.u.DirectUpdateHandler2 start commit{_version_=1622768631228137472,optimize=false,openSearcher=true,waitSearcher=true,expungeDeletes=false,softCommit=false,prepareCommit=false}
   [junit4]   2> 215997 INFO  (qtp1348343801-5635) [n:127.0.0.1:54333_solr c:collection1 s:shard2 r:core_node4 x:collection1_shard2_replica_n2] o.a.s.u.DirectUpdateHandler2 No uncommitted changes. Skipping IW.commit.
   [junit4]   2> 215998 INFO  (qtp1348343801-5635) [n:127.0.0.1:54333_solr c:collection1 s:shard2 r:core_node4 x:collection1_shard2_replica_n2] o.a.s.u.DirectUpdateHandler2 end_commit_flush
   [junit4]   2> 215998 INFO  (qtp1348343801-5635) [n:127.0.0.1:54333_solr c:collection1 s:shard2 r:core_node4 x:collection1_shard2_replica_n2] o.a.s.u.p.LogUpdateProcessorFactory [collection1_shard2_replica_n2]  webapp=/solr path=/update params={update.distrib=TOLEADER&waitSearcher=true&openSearcher=true&commit=true&softCommit=false&distrib.from=http://127.0.0.1:54322/solr/collection1_shard1_replica_n1/&commit_end_point=leaders&wt=javabin&version=2&expungeDeletes=false}{commit=} 0 1
   [junit4]   2> 215998 INFO  (qtp1510227481-5627) [n:127.0.0.1:54322_solr c:collection1 s:shard1 r:core_node3 x:collection1_shard1_replica_n1] o.a.s.u.DirectUpdateHandler2 start commit{_version_=1622768631229186048,optimize=false,openSearcher=true,waitSearcher=true,expungeDeletes=false,softCommit=false,prepareCommit=false}
   [junit4]   2> 215998 INFO  (qtp1510227481-5627) [n:127.0.0.1:54322_solr c:collection1 s:shard1 r:core_node3 x:collection1_shard1_replica_n1] o.a.s.u.DirectUpdateHandler2 No uncommitted changes. Skipping IW.commit.
   [junit4]   2> 215999 INFO  (qtp1510227481-5627) [n:127.0.0.1:54322_solr c:collection1 s:shard1 r:core_node3 x:collection1_shard1_replica_n1] o.a.s.u.DirectUpdateHandler2 end_commit_flush
   [junit4]   2> 215999 INFO  (qtp1510227481-5627) [n:127.0.0.1:54322_solr c:collection1 s:shard1 r:core_node3 x:collection1_shard1_replica_n1] o.a.s.u.p.LogUpdateProcessorFactory [collection1_shard1_replica_n1]  webapp=/solr path=/update params={_stateVer_=collection1:4&commit=true&wt=javabin&version=2}{deleteByQuery=*:* (-1622768631220797440),commit=} 0 10
   [junit4]   2> 216003 INFO  (qtp1348343801-5629) [n:127.0.0.1:54333_solr c:collection1 s:shard2 r:core_node4 x:collection1_shard2_replica_n2] o.a.s.c.S.Request [collection1_shard2_replica_n2]  webapp=/solr path=/stream params={indent=off&expr=let(echo%3Dtrue,+++++++++++++++a%3Darray(1,1,1,0,0,0),+++++++++++++++b%3Darray(1,1,1,0,0,0),+++++++++++++++c%3Darray(0,0,0,1,1,1),+++++++++++++++d%3Darray(0,0,0,1,1,1),+++++++++++++++e%3DsetRowLabels(matrix(a,b,c,d),+++++++++++++++++++++++++++++++array(doc1,+doc2,+doc3,+doc4)),+++++++++++++++f%3Dkmeans(e,+2),+++++++++++++++g%3DgetCluster(f,+0),+++++++++++++++h%3DgetCluster(f,+1),+++++++++++++++i%3DgetCentroids(f),+++++++++++++++j%3DgetRowLabels(g),+++++++++++++++k%3DgetRowLabels(h))&wt=json&version=2.2} status=0 QTime=2
   [junit4]   2> 216043 INFO  (TEST-MathExpressionTest.testKmeans-seed#[3F848262E387BCFC]) [    ] o.a.s.SolrTestCaseJ4 ###Ending testKmeans
   [junit4]   2> 216075 INFO  (TEST-MathExpressionTest.testNestedDoubleTimeDifference-seed#[3F848262E387BCFC]) [    ] o.a.s.SolrTestCaseJ4 ###Starting testNestedDoubleTimeDifference
   [junit4]   2> 216078 INFO  (qtp1510227481-5639) [n:127.0.0.1:54322_solr c:collection1 s:shard1 r:core_node3 x:collection1_shard1_replica_n1] o.a.s.u.p.LogUpdateProcessorFactory [collection1_shard1_replica_n1]  webapp=/solr path=/update params={update.distrib=TOLEADER&distrib.from=http://127.0.0.1:54333/solr/collection1_shard2_replica_n2/&wt=javabin&version=2}{deleteByQuery=*:* (-1622768631310974976)} 0 1
   [junit4]   2> 216080 INFO  (qtp1510227481-5602) [n:127.0.0.1:54322_solr c:collection1 s:shard1 r:core_node3 x:collection1_shard1_replica_n1] o.a.s.u.DirectUpdateHandler2 start commit{_version_=1622768631315169280,optimize=false,openSearcher=true,waitSearcher=true,expungeDeletes=false,softCommit=false,prepareCommit=false}
   [junit4]   2> 216080 INFO  (qtp1510227481-5602) [n:127.0.0.1:54322_solr c:collection1 s:shard1 r:core_node3 x:collection1_shard1_replica_n1] o.a.s.u.DirectUpdateHandler2 No uncommitted changes. Skipping IW.commit.
   [junit4]   2> 216082 INFO  (qtp1510227481-5602) [n:127.0.0.1:54322_solr c:collection1 s:shard1 r:core_node3 x:collection1_shard1_replica_n1] o.a.s.u.DirectUpdateHandler2 end_commit_flush
   [junit4]   2> 216082 INFO  (qtp1510227481-5602) [n:127.0.0.1:54322_solr c:collection1 s:shard1 r:core_node3 x:collection1_shard1_replica_n1] o.a.s.u.p.LogUpdateProcessorFactory [collection1_shard1_replica_n1]  webapp=/solr path=/update params={update.distrib=TOLEADER&waitSearcher=true&openSearcher=true&commit=true&softCommit=false&distrib.from=http://127.0.0.1:54333/solr/collection1_shard2_replica_n2/&commit_end_point=leaders&wt=javabin&version=2&expungeDeletes=false}{commit=} 0 1
   [junit4]   2> 216082 INFO  (qtp1348343801-5632) [n:127.0.0.1:54333_solr c:collection1 s:shard2 r:core_node4 x:collection1_shard2_replica_n2] o.a.s.u.DirectUpdateHandler2 start commit{_version_=1622768631317266432,optimize=false,openSearcher=true,waitSearcher=true,expungeDeletes=false,softCommit=false,prepareCommit=false}
   [junit4]   2> 216082 INFO  (qtp1348343801-5632) [n:127.0.0.1:54333_solr c:collection1 s:shard2 r:core_node4 x:collection1_shard2_replica_n2] o.a.s.u.DirectUpdateHandler2 No uncommitted changes. Skipping IW.commit.
   [junit4]   2> 216082 INFO  (qtp1348343801-5632) [n:127.0.0.1:54333_solr c:collection1 s:shard2 r:core_node4 x:collection1_shard2_replica_n2] o.a.s.u.DirectUpdateHandler2 end_commit_flush
   [junit4]   2> 216082 INFO  (qtp1348343801-5632) [n:127.0.0.1:54333_solr c:collection1 s:shard2 r:core_node4 x:collection1_shard2_replica_n2] o.a.s.u.p.LogUpdateProcessorFactory [collection1_shard2_replica_n2]  webapp=/solr path=/update params={_stateVer_=collection1:4&commit=true&wt=javabin&version=2}{deleteByQuery=*:* (-1622768631309926400),commit=} 0 8
   [junit4]   2> 216085 INFO  (qtp1348343801-5635) [n:127.0.0.1:54333_solr c:collection1 s:shard2 r:core_node4 x:collection1_shard2_replica_n2] o.a.s.c.S.Request [collection1_shard2_replica_n2]  webapp=/solr path=/stream params={indent=off&expr=diff(diff(array(1709.0,+1621.0,+1973.0,+1812.0,+1975.0,+1862.0,+1940.0,+2013.0,+1596.0,+1725.0,+1676.0,+1814.0,+1615.0,+1557.0,+1891.0,+1956.0,+1885.0,+1623.0,+1903.0,+1997.0)),+12)&wt=json&version=2.2} status=0 QTime=0
   [junit4]   2> 216088 INFO  (TEST-MathExpressionTest.testNestedDoubleTimeDifference-seed#[3F848262E387BCFC]) [    ] o.a.s.SolrTestCaseJ4 ###Ending testNestedDoubleTimeDifference
   [junit4]   2> 216119 INFO  (TEST-MathExpressionTest.testMemsetSize-seed#[3F848262E387BCFC]) [    ] o.a.s.SolrTestCaseJ4 ###Starting testMemsetSize
   [junit4]   2> 216123 INFO  (qtp1348343801-5631) [n:127.0.0.1:54333_solr c:collection1 s:shard2 r:core_node4 x:collection1_shard2_replica_n2] o.a.s.u.p.LogUpdateProcessorFactory [collection1_shard2_replica_n2]  webapp=/solr path=/update params={update.distrib=TOLEADER&distrib.from=http://127.0.0.1:54322/solr/collection1_shard1_replica_n1/&wt=javabin&version=2}{deleteByQuery=*:* (-1622768631358160896)} 0 2
   [junit4]   2> 216126 INFO  (qtp1348343801-5633) [n:127.0.0.1:54333_solr c:collection1 s:shard2 r:core_node4 x:collection1_shard2_replica_n2] o.a.s.u.DirectUpdateHandler2 start commit{_version_=1622768631363403776,optimize=false,openSearcher=true,waitSearcher=true,expungeDeletes=false,softCommit=false,prepareCommit=false}
   [junit4]   2> 216126 INFO  (qtp1348343801-5633) [n:127.0.0.1:54333_solr c:collection1 s:shard2 r:core_node4 x:collection1_shard2_replica_n2] o.a.s.u.DirectUpdateHandler2 No uncommitted changes. Skipping IW.commit.
   [junit4]   2> 216126 INFO  (qtp1348343801-5633) [n:127.0.0.1:54333_solr c:collection1 s:shard2 r:core_node4 x:collection1_shard2_replica_n2] o.a.s.u.DirectUpdateHandler2 end_commit_flush
   [junit4]   2> 216126 INFO  (qtp1348343801-5633) [n:127.0.0.1:54333_solr c:collection1 s:shard2 r:core_node4 x:collection1_shard2_replica_n2] o.a.s.u.p.LogUpdateProcessorFactory [collection1_shard2_replica_n2]  webapp=/solr path=/update params={update.distrib=TOLEADER&waitSearcher=true&openSearcher=true&commit=true&softCommit=false&distrib.from=http://127.0.0.1:54322/solr/collection1_shard1_replica_n1/&commit_end_point=leaders&wt=javabin&version=2&expungeDeletes=false}{commit=} 0 1
   [junit4]   2> 216127 INFO  (qtp1510227481-5603) [n:127.0.0.1:54322_solr c:collection1 s:shard1 r:core_node3 x:collection1_shard1_replica_n1] o.a.s.u.DirectUpdateHandler2 start commit{_version_=1622768631364452352,optimize=false,openSearcher=true,waitSearcher=true,expungeDeletes=false,softCommit=false,prepareCommit=false}
   [junit4]   2> 216127 INFO  (qtp1510227481-5603) [n:127.0.0.1:54322_solr c:collection1 s:shard1 r:core_node3 x:collection1_shard1_replica_n1] o.a.s.u.DirectUpdateHandler2 No uncommitted changes. Skipping IW.commit.
   [junit4]   2> 216127 INFO  (qtp1510227481-5603) [n:127.0.0.1:54322_solr c:collection1 s:shard1 r:core_node3 x:collection1_shard1_replica_n1] o.a.s.u.DirectUpdateHandler2 end_commit_flush
   [junit4]   2> 216127 INFO  (qtp1510227481-5603) [n:127.0.0.1:54322_solr c:collection1 s:shard1 r:core_node3 x:collection1_shard1_replica_n1] o.a.s.u.p.LogUpdateProcessorFactory [collection1_shard1_replica_n1]  webapp=/solr path=/update params={_stateVer_=collection1:4&commit=true&wt=javabin&version=2}{deleteByQuery=*:* (-1622768631357112320),commit=} 0 8
   [junit4]   2> 216131 INFO  (qtp1348343801-5634) [n:127.0.0.1:54333_solr c:collection1 s:shard2 r:core_node4 x:collection1_shard2_replica_n2] o.a.s.c.S.Request [collection1_shard2_replica_n2]  webapp=/solr path=/stream params={indent=off&expr=let(echo%3D"b,+c",++++++++++++++a%3Dmemset(plist(tuple(field1%3Dval(1),+field2%3Dval(10)),+tuple(field1%3Dval(2),+field2%3Dval(20))),++++++++++++++++++++++++cols%3D"field1,+field2",++++++++++++++++++++++++vars%3D"f1,+f2",+++++++++++++++++++++++size%3D1),++++++++++++++b%3Dadd(f1),++++++++++++++c%3Dadd(f2))&wt=json&version=2.2} status=0 QTime=1
   [junit4]   2> 216136 INFO  (TEST-MathExpressionTest.testMemsetSize-seed#[3F848262E387BCFC]) [    ] o.a.s.SolrTestCaseJ4 ###Ending testMemsetSize
   [junit4]   2> 216170 INFO  (TEST-MathExpressionTest.testAnova-seed#[3F848262E387BCFC]) [    ] o.a.s.SolrTestCaseJ4 ###Starting testAnova
   [junit4]   2> 216173 INFO  (qtp1510227481-5604) [n:127.0.0.1:54322_solr c:collection1 s:shard1 r:core_node3 x:collection1_shard1_replica_n1] o.a.s.u.p.LogUpdateProcessorFactory [collection1_shard1_replica_n1]  webapp=/solr path=/update params={update.distrib=TOLEADER&distrib.from=http://127.0.0.1:54333/solr/collection1_shard2_replica_n2/&wt=javabin&version=2}{deleteByQuery=*:* (-1622768631412686848)} 0 3
   [junit4]   2> 216178 INFO  (qtp1510227481-5605) [n:127.0.0.1:54322_solr c:collection1 s:shard1 r:core_node3 x:collection1_shard1_replica_n1] o.a.s.u.DirectUpdateHandler2 start commit{_version_=1622768631417929728,optimize=false,openSearcher=true,waitSearcher=true,expungeDeletes=false,softCommit=false,prepareCommit=false}
   [junit4]   2> 216178 INFO  (qtp1510227481-5605) [n:127.0.0.1:54322_solr c:collection1 s:shard1 r:core_node3 x:collection1_shard1_replica_n1] o.a.s.u.DirectUpdateHandler2 No uncommitted changes. Skipping IW.commit.
   [junit4]   2> 216179 INFO  (qtp1510227481-5605) [n:127.0.0.1:54322_solr c:collection1 s:shard1 r:core_node3 x:collection1_shard1_replica_n1] o.a.s.u.DirectUpdateHandler2 end_commit_flush
   [junit4]   2> 216179 INFO  (qtp1510227481-5605) [n:127.0.0.1:54322_solr c:collection1 s:shard1 r:core_node3 x:collection1_shard1_replica_n1] o.a.s.u.p.LogUpdateProcessorFactory [collection1_shard1_replica_n1]  webapp=/solr path=/update params={update.distrib=TOLEADER&waitSearcher=true&openSearcher=true&commit=true&softCommit=false&distrib.from=http://127.0.0.1:54333/solr/collection1_shard2_replica_n2/&commit_end_point=leaders&wt=javabin&version=2&expungeDeletes=false}{commit=} 0 1
   [junit4]   2> 216179 INFO  (qtp1348343801-5629) [n:127.0.0.1:54333_solr c:collection1 s:shard2 r:core_node4 x:collection1_shard2_replica_n2] o.a.s.u.DirectUpdateHandler2 start commit{_version_=1622768631418978304,optimize=false,openSearcher=true,waitSearcher=true,expungeDeletes=false,softCommit=false,prepareCommit=false}
   [junit4]   2> 216179 INFO  (qtp1348343801-5629) [n:127.0.0.1:54333_solr c:collection1 s:shard2 r:core_node4 x:collection1_shard2_replica_n2] o.a.s.u.DirectUpdateHandler2 No uncommitted changes. Skipping IW.commit.
   [junit4]   2> 216180 INFO  (qtp1348343801-5629) [n:127.0.0.1:54333_solr c:collection1 s:shard2 r:core_node4 x:collection1_shard2_replica_n2] o.a.s.u.DirectUpdateHandler2 end_commit_flush
   [junit4]   2> 216180 INFO  (qtp1348343801-5629) [n:127.0.0.1:54333_solr c:collection1 s:shard2 r:core_node4 x:collection1_shard2_replica_n2] o.a.s.u.p.LogUpdateProcessorFactory [collection1_shard2_replica_n2]  webapp=/solr path=/update params={_stateVer_=collection1:4&commit=true&wt=javabin&version=2}{deleteByQuery=*:* (-1622768631410589696),commit=} 0 9
   [junit4]   2> 216183 INFO  (qtp1348343801-5633) [n:127.0.0.1:54333_solr c:collection1 s:shard2 r:core_node4 x:collection1_shard2_replica_n2] o.a.s.c.S.Request [collection1_shard2_replica_n2]  webapp=/solr path=/stream params={indent=off&expr=anova(array(1,2,3,5,4,6),+array(5,2,3,5,4,6),+array(1,2,7,5,4,6))&wt=json&version=2.2} status=0 QTime=0
   [junit4]   2> 216307 INFO  (TEST-MathExpressionTest.testAnova-seed#[3F848262E387BCFC]) [    ] o.a.s.SolrTestCaseJ4 ###Ending testAnova
   [junit4]   2> 216339 INFO  (TEST-MathExpressionTest.testUniformIntegerDistribution-seed#[3F848262E387BCFC]) [    ] o.a.s.SolrTestCaseJ4 ###Starting testUniformIntegerDistribution
   [junit4]   2> 216342 INFO  (qtp1510227481-5606) [n:127.0.0.1:54322_solr c:collection1 s:shard1 r:core_node3 x:collection1_shard1_replica_n1] o.a.s.u.p.LogUpdateProcessorFactory [collection1_shard1_replica_n1]  webapp=/solr path=/update params={update.distrib=TOLEADER&distrib.from=http://127.0.0.1:54333/solr/collection1_shard2_replica_n2/&wt=javabin&version=2}{deleteByQuery=*:* (-1622768631587799040)} 0 2
   [junit4]   2> 216344 INFO  (qtp1510227481-5607) [n:127.0.0.1:54322_solr c:collection1 s:shard1 r:core_node3 x:collection1_shard1_replica_n1] o.a.s.u.DirectUpdateHandler2 start commit{_version_=1622768631591993344,optimize=false,openSearcher=true,waitSearcher=true,expungeDeletes=false,softCommit=false,prepareCommit=false}
   [junit4]   2> 216344 INFO  (qtp1510227481-5607) [n:127.0.0.1:54322_solr c:collection1 s:shard1 r:core_node3 x:collection1_shard1_replica_n1] o.a.s.u.DirectUpdateHandler2 No uncommitted changes. Skipping IW.commit.
   [junit4]   2> 216345 INFO

[...truncated too long message...]

estBinomialDistribution
   [junit4] OK      0.57s J0 | MathExpressionTest.testBetaDistribution
   [junit4] OK      0.07s J0 | MathExpressionTest.testPolyfit
   [junit4] OK      0.10s J0 | MathExpressionTest.testGeometricDistribution
   [junit4] OK      0.08s J0 | MathExpressionTest.testPrecision
   [junit4] OK      0.08s J0 | MathExpressionTest.testZplot
   [junit4] OK      0.06s J0 | MathExpressionTest.testRepeat
   [junit4] OK      0.07s J0 | MathExpressionTest.testValueAt
   [junit4] OK      0.12s J0 | MathExpressionTest.testMultiVariateNormalDistribution
   [junit4] OK      0.11s J0 | MathExpressionTest.testReverse
   [junit4] OK      0.09s J0 | MathExpressionTest.testGaussfit
   [junit4] OK      0.07s J0 | MathExpressionTest.testEbeMultiply
   [junit4] OK      0.07s J0 | MathExpressionTest.testGtestDataSet
   [junit4] OK      0.07s J0 | MathExpressionTest.testMatrix
   [junit4] OK      0.13s J0 | MathExpressionTest.testMemsetTimeSeries
   [junit4] OK      0.09s J0 | MathExpressionTest.testSumSq
   [junit4] OK      0.09s J0 | MathExpressionTest.testZipFDistribution
   [junit4] OK      0.12s J0 | MathExpressionTest.testLength
   [junit4] OK      0.12s J0 | MathExpressionTest.testLatlonFunctions
   [junit4] OK      0.10s J0 | MathExpressionTest.testOlsRegress
   [junit4] OK      0.08s J0 | MathExpressionTest.testMatrixMult
   [junit4] OK      0.08s J0 | MathExpressionTest.testAkima
   [junit4] OK      0.10s J0 | MathExpressionTest.testOnes
   [junit4] OK      0.12s J0 | MathExpressionTest.testNatural
   [junit4] OK      0.09s J0 | MathExpressionTest.testProbabilityRange
   [junit4] OK      0.17s J0 | MathExpressionTest.testAnalyzeEvaluator
   [junit4] OK      0.11s J0 | MathExpressionTest.testIntegrate
   [junit4] OK      0.09s J0 | MathExpressionTest.testMonteCarloWithVariables
   [junit4] OK      0.08s J0 | MathExpressionTest.testLog10
   [junit4] OK      0.08s J0 | MathExpressionTest.testNormalizeSum
   [junit4] OK      0.17s J0 | MathExpressionTest.testRegressAndPredict
   [junit4] OK      0.12s J0 | MathExpressionTest.testEnclosingDisk
   [junit4] OK      0.09s J0 | MathExpressionTest.testBicubicSpline
   [junit4] OK      0.10s J0 | MathExpressionTest.testBinomialCoefficient
   [junit4] OK      0.21s J0 | MathExpressionTest.testMultiKmeans
   [junit4] OK      0.18s J0 | MathExpressionTest.testSetAndGetValue
   [junit4] OK      0.14s J0 | MathExpressionTest.testTermVectors
   [junit4] OK      0.10s J0 | MathExpressionTest.testEbeDivide
   [junit4] OK      0.10s J0 | MathExpressionTest.testLetWithNumericVariables
   [junit4] OK      0.11s J0 | MathExpressionTest.testFuzzyKmeans
   [junit4] OK      0.07s J0 | MathExpressionTest.testEbeAdd
   [junit4] OK      0.08s J0 | MathExpressionTest.testStandardize
   [junit4] OK      0.09s J0 | MathExpressionTest.testLerp
   [junit4] OK      0.14s J0 | MathExpressionTest.testCopyOfRange
   [junit4] OK      0.08s J0 | MathExpressionTest.testMonteCarlo
   [junit4] OK      0.06s J0 | MathExpressionTest.testFFT
   [junit4] OK      0.08s J0 | MathExpressionTest.testCumulativeProbability
   [junit4] OK      0.09s J0 | MathExpressionTest.testDescribe
   [junit4] OK      0.08s J0 | MathExpressionTest.testLoess
   [junit4] Completed [5/5] on J0 in 18.89s, 117 tests
   [junit4] 
   [junit4] JVM J0:     0.58 ..   100.21 =    99.63s
   [junit4] JVM J1:     0.59 ..    84.16 =    83.57s
   [junit4] Execution time total: 1 minute 40 seconds
   [junit4] Tests summary: 5 suites, 585 tests
   [junit4] Could not remove temporary path: C:\Users\jenkins\workspace\Lucene-Solr-8.x-Windows\solr\build\solr-solrj\test\J1 (java.nio.file.DirectoryNotEmptyException: Remaining files: [C:\Users\jenkins\workspace\Lucene-Solr-8.x-Windows\solr\build\solr-solrj\test\J1\temp])
   [junit4] Could not remove temporary path: C:\Users\jenkins\workspace\Lucene-Solr-8.x-Windows\solr\build\solr-solrj\test\J0 (java.nio.file.DirectoryNotEmptyException: Remaining files: [C:\Users\jenkins\workspace\Lucene-Solr-8.x-Windows\solr\build\solr-solrj\test\J0\temp])
     [echo] 5 slowest tests:
[junit4:tophints] 107.29s | org.apache.solr.client.solrj.impl.CloudSolrClientTest
[junit4:tophints]  55.61s | org.apache.solr.client.solrj.io.stream.StreamDecoratorTest
[junit4:tophints]  50.18s | org.apache.solr.common.cloud.TestCloudCollectionsListeners
[junit4:tophints]  38.74s | org.apache.solr.common.cloud.TestCollectionStateWatchers
[junit4:tophints]  32.82s | org.apache.solr.client.solrj.request.SchemaTest

-check-totals:

test-nocompile:

BUILD SUCCESSFUL
Total time: 1 minute 42 seconds
[repro] Failures:
[repro]   0/5 failed: org.apache.solr.client.solrj.io.stream.MathExpressionTest
[repro] Exiting with code 0

C:\Users\jenkins\workspace\Lucene-Solr-8.x-Windows>IF EXIST lucene\build move /y lucene\build lucene\build.repro 
        1 dir(s) moved.

C:\Users\jenkins\workspace\Lucene-Solr-8.x-Windows>IF EXIST solr\build move /y solr\build solr\build.repro 
        1 dir(s) moved.

C:\Users\jenkins\workspace\Lucene-Solr-8.x-Windows>IF EXIST lucene\build.orig move /y lucene\build.orig lucene\build 
        1 dir(s) moved.

C:\Users\jenkins\workspace\Lucene-Solr-8.x-Windows>IF EXIST solr\build.orig move /y solr\build.orig solr\build 
        1 dir(s) moved.

C:\Users\jenkins\workspace\Lucene-Solr-8.x-Windows>exit 0 
Archiving artifacts
Setting ANT_1_8_2_HOME=C:\Users\jenkins\tools\hudson.tasks.Ant_AntInstallation\ANT_1.8.2
java.lang.InterruptedException: no matches found within 10000
	at hudson.FilePath$ValidateAntFileMask.hasMatch(FilePath.java:2847)
	at hudson.FilePath$ValidateAntFileMask.invoke(FilePath.java:2726)
	at hudson.FilePath$ValidateAntFileMask.invoke(FilePath.java:2707)
	at hudson.FilePath$FileCallableWrapper.call(FilePath.java:3086)
Also:   hudson.remoting.Channel$CallSiteStackTrace: Remote call to Windows VBOX
		at hudson.remoting.Channel.attachCallSiteStackTrace(Channel.java:1743)
		at hudson.remoting.UserRequest$ExceptionResponse.retrieve(UserRequest.java:357)
		at hudson.remoting.Channel.call(Channel.java:957)
		at hudson.FilePath.act(FilePath.java:1072)
		at hudson.FilePath.act(FilePath.java:1061)
		at hudson.FilePath.validateAntFileMask(FilePath.java:2705)
		at hudson.tasks.ArtifactArchiver.perform(ArtifactArchiver.java:243)
		at hudson.tasks.BuildStepCompatibilityLayer.perform(BuildStepCompatibilityLayer.java:81)
		at hudson.tasks.BuildStepMonitor$1.perform(BuildStepMonitor.java:20)
		at hudson.model.AbstractBuild$AbstractBuildExecution.perform(AbstractBuild.java:744)
		at hudson.model.AbstractBuild$AbstractBuildExecution.performAllBuildSteps(AbstractBuild.java:690)
		at hudson.model.Build$BuildExecution.post2(Build.java:186)
		at hudson.model.AbstractBuild$AbstractBuildExecution.post(AbstractBuild.java:635)
		at hudson.model.Run.execute(Run.java:1835)
		at hudson.model.FreeStyleBuild.run(FreeStyleBuild.java:43)
		at hudson.model.ResourceController.execute(ResourceController.java:97)
		at hudson.model.Executor.run(Executor.java:429)
Caused: hudson.FilePath$TunneledInterruptedException
	at hudson.FilePath$FileCallableWrapper.call(FilePath.java:3088)
	at hudson.remoting.UserRequest.perform(UserRequest.java:212)
	at hudson.remoting.UserRequest.perform(UserRequest.java:54)
	at hudson.remoting.Request$2.run(Request.java:369)
	at hudson.remoting.InterceptingExecutorService$1.call(InterceptingExecutorService.java:72)
	at java.util.concurrent.FutureTask.run(Unknown Source)
	at java.util.concurrent.ThreadPoolExecutor.runWorker(Unknown Source)
	at java.util.concurrent.ThreadPoolExecutor$Worker.run(Unknown Source)
	at java.lang.Thread.run(Unknown Source)
Caused: java.lang.InterruptedException: java.lang.InterruptedException: no matches found within 10000
	at hudson.FilePath.act(FilePath.java:1074)
	at hudson.FilePath.act(FilePath.java:1061)
	at hudson.FilePath.validateAntFileMask(FilePath.java:2705)
	at hudson.tasks.ArtifactArchiver.perform(ArtifactArchiver.java:243)
	at hudson.tasks.BuildStepCompatibilityLayer.perform(BuildStepCompatibilityLayer.java:81)
	at hudson.tasks.BuildStepMonitor$1.perform(BuildStepMonitor.java:20)
	at hudson.model.AbstractBuild$AbstractBuildExecution.perform(AbstractBuild.java:744)
	at hudson.model.AbstractBuild$AbstractBuildExecution.performAllBuildSteps(AbstractBuild.java:690)
	at hudson.model.Build$BuildExecution.post2(Build.java:186)
	at hudson.model.AbstractBuild$AbstractBuildExecution.post(AbstractBuild.java:635)
	at hudson.model.Run.execute(Run.java:1835)
	at hudson.model.FreeStyleBuild.run(FreeStyleBuild.java:43)
	at hudson.model.ResourceController.execute(ResourceController.java:97)
	at hudson.model.Executor.run(Executor.java:429)
No artifacts found that match the file pattern "**/*.events,heapdumps/**,**/*_pid*.log". Configuration error?
[WARNINGS] Parsing warnings in console log with parser Java Compiler (javac)
Setting ANT_1_8_2_HOME=C:\Users\jenkins\tools\hudson.tasks.Ant_AntInstallation\ANT_1.8.2
Setting ANT_1_8_2_HOME=C:\Users\jenkins\tools\hudson.tasks.Ant_AntInstallation\ANT_1.8.2
<Git Blamer> Using GitBlamer to create author and commit information for all warnings.
<Git Blamer> GIT_COMMIT=e9db95831b9db69fbc0bef499b0d3f41bc6448f1, workspace=C:\Users\jenkins\workspace\Lucene-Solr-8.x-Windows
[WARNINGS] Computing warning deltas based on reference build #10
Recording test results
Setting ANT_1_8_2_HOME=C:\Users\jenkins\tools\hudson.tasks.Ant_AntInstallation\ANT_1.8.2
Build step 'Publish JUnit test result report' changed build result to UNSTABLE
Email was triggered for: Unstable (Test Failures)
Sending email for trigger: Unstable (Test Failures)
Setting ANT_1_8_2_HOME=C:\Users\jenkins\tools\hudson.tasks.Ant_AntInstallation\ANT_1.8.2
Setting ANT_1_8_2_HOME=C:\Users\jenkins\tools\hudson.tasks.Ant_AntInstallation\ANT_1.8.2
Setting ANT_1_8_2_HOME=C:\Users\jenkins\tools\hudson.tasks.Ant_AntInstallation\ANT_1.8.2
Setting ANT_1_8_2_HOME=C:\Users\jenkins\tools\hudson.tasks.Ant_AntInstallation\ANT_1.8.2

Mime
View raw message