lucene-dev mailing list archives

Site index · List index
Message view « Date » · « Thread »
Top « Date » · « Thread »
From Apache Jenkins Server <jenk...@builds.apache.org>
Subject [JENKINS] Lucene-Solr-NightlyTests-master - Build # 1739 - Still Unstable
Date Wed, 02 Jan 2019 14:54:01 GMT
Build: https://builds.apache.org/job/Lucene-Solr-NightlyTests-master/1739/

2 tests failed.
FAILED:  org.apache.solr.cloud.TestMiniSolrCloudClusterSSL.testSslAndNoClientAuth

Error Message:
Timeout occured while waiting response from server at: https://127.0.0.1:34051/solr

Stack Trace:
org.apache.solr.client.solrj.SolrServerException: Timeout occured while waiting response from server at: https://127.0.0.1:34051/solr
	at __randomizedtesting.SeedInfo.seed([7A4F02805D37A45D:86F5D6B4A5171597]:0)
	at org.apache.solr.client.solrj.impl.HttpSolrClient.executeMethod(HttpSolrClient.java:661)
	at org.apache.solr.client.solrj.impl.HttpSolrClient.request(HttpSolrClient.java:256)
	at org.apache.solr.client.solrj.impl.HttpSolrClient.request(HttpSolrClient.java:245)
	at org.apache.solr.client.solrj.impl.LBSolrClient.doRequest(LBSolrClient.java:368)
	at org.apache.solr.client.solrj.impl.LBSolrClient.request(LBSolrClient.java:296)
	at org.apache.solr.client.solrj.impl.LBHttpSolrClient.request(LBHttpSolrClient.java:213)
	at org.apache.solr.client.solrj.impl.CloudSolrClient.sendRequest(CloudSolrClient.java:1110)
	at org.apache.solr.client.solrj.impl.CloudSolrClient.requestWithRetryOnStaleState(CloudSolrClient.java:884)
	at org.apache.solr.client.solrj.impl.CloudSolrClient.request(CloudSolrClient.java:817)
	at org.apache.solr.client.solrj.SolrRequest.process(SolrRequest.java:207)
	at org.apache.solr.client.solrj.SolrRequest.process(SolrRequest.java:224)
	at org.apache.solr.cloud.TestMiniSolrCloudClusterSSL.checkCreateCollection(TestMiniSolrCloudClusterSSL.java:276)
	at org.apache.solr.cloud.TestMiniSolrCloudClusterSSL.checkClusterWithCollectionCreations(TestMiniSolrCloudClusterSSL.java:264)
	at org.apache.solr.cloud.TestMiniSolrCloudClusterSSL.checkClusterWithNodeReplacement(TestMiniSolrCloudClusterSSL.java:167)
	at org.apache.solr.cloud.TestMiniSolrCloudClusterSSL.testSslAndNoClientAuth(TestMiniSolrCloudClusterSSL.java:129)
	at sun.reflect.NativeMethodAccessorImpl.invoke0(Native Method)
	at sun.reflect.NativeMethodAccessorImpl.invoke(NativeMethodAccessorImpl.java:62)
	at sun.reflect.DelegatingMethodAccessorImpl.invoke(DelegatingMethodAccessorImpl.java:43)
	at java.lang.reflect.Method.invoke(Method.java:498)
	at com.carrotsearch.randomizedtesting.RandomizedRunner.invoke(RandomizedRunner.java:1750)
	at com.carrotsearch.randomizedtesting.RandomizedRunner$8.evaluate(RandomizedRunner.java:938)
	at com.carrotsearch.randomizedtesting.RandomizedRunner$9.evaluate(RandomizedRunner.java:974)
	at com.carrotsearch.randomizedtesting.RandomizedRunner$10.evaluate(RandomizedRunner.java:988)
	at com.carrotsearch.randomizedtesting.rules.StatementAdapter.evaluate(StatementAdapter.java:36)
	at com.carrotsearch.randomizedtesting.rules.SystemPropertiesRestoreRule$1.evaluate(SystemPropertiesRestoreRule.java:57)
	at org.apache.lucene.util.TestRuleSetupTeardownChained$1.evaluate(TestRuleSetupTeardownChained.java:49)
	at org.apache.lucene.util.AbstractBeforeAfterRule$1.evaluate(AbstractBeforeAfterRule.java:45)
	at org.apache.lucene.util.TestRuleThreadAndTestName$1.evaluate(TestRuleThreadAndTestName.java:48)
	at org.apache.lucene.util.TestRuleIgnoreAfterMaxFailures$1.evaluate(TestRuleIgnoreAfterMaxFailures.java:64)
	at org.apache.lucene.util.TestRuleMarkFailure$1.evaluate(TestRuleMarkFailure.java:47)
	at com.carrotsearch.randomizedtesting.rules.StatementAdapter.evaluate(StatementAdapter.java:36)
	at com.carrotsearch.randomizedtesting.ThreadLeakControl$StatementRunner.run(ThreadLeakControl.java:368)
	at com.carrotsearch.randomizedtesting.ThreadLeakControl.forkTimeoutingTask(ThreadLeakControl.java:817)
	at com.carrotsearch.randomizedtesting.ThreadLeakControl$3.evaluate(ThreadLeakControl.java:468)
	at com.carrotsearch.randomizedtesting.RandomizedRunner.runSingleTest(RandomizedRunner.java:947)
	at com.carrotsearch.randomizedtesting.RandomizedRunner$5.evaluate(RandomizedRunner.java:832)
	at com.carrotsearch.randomizedtesting.RandomizedRunner$6.evaluate(RandomizedRunner.java:883)
	at com.carrotsearch.randomizedtesting.RandomizedRunner$7.evaluate(RandomizedRunner.java:894)
	at com.carrotsearch.randomizedtesting.rules.StatementAdapter.evaluate(StatementAdapter.java:36)
	at com.carrotsearch.randomizedtesting.rules.SystemPropertiesRestoreRule$1.evaluate(SystemPropertiesRestoreRule.java:57)
	at org.apache.lucene.util.AbstractBeforeAfterRule$1.evaluate(AbstractBeforeAfterRule.java:45)
	at com.carrotsearch.randomizedtesting.rules.StatementAdapter.evaluate(StatementAdapter.java:36)
	at org.apache.lucene.util.TestRuleStoreClassName$1.evaluate(TestRuleStoreClassName.java:41)
	at com.carrotsearch.randomizedtesting.rules.NoShadowingOrOverridesOnMethodsRule$1.evaluate(NoShadowingOrOverridesOnMethodsRule.java:40)
	at com.carrotsearch.randomizedtesting.rules.NoShadowingOrOverridesOnMethodsRule$1.evaluate(NoShadowingOrOverridesOnMethodsRule.java:40)
	at com.carrotsearch.randomizedtesting.rules.StatementAdapter.evaluate(StatementAdapter.java:36)
	at com.carrotsearch.randomizedtesting.rules.StatementAdapter.evaluate(StatementAdapter.java:36)
	at com.carrotsearch.randomizedtesting.rules.StatementAdapter.evaluate(StatementAdapter.java:36)
	at org.apache.lucene.util.TestRuleAssertionsRequired$1.evaluate(TestRuleAssertionsRequired.java:53)
	at org.apache.lucene.util.TestRuleMarkFailure$1.evaluate(TestRuleMarkFailure.java:47)
	at org.apache.lucene.util.TestRuleIgnoreAfterMaxFailures$1.evaluate(TestRuleIgnoreAfterMaxFailures.java:64)
	at org.apache.lucene.util.TestRuleIgnoreTestSuites$1.evaluate(TestRuleIgnoreTestSuites.java:54)
	at com.carrotsearch.randomizedtesting.rules.StatementAdapter.evaluate(StatementAdapter.java:36)
	at com.carrotsearch.randomizedtesting.ThreadLeakControl$StatementRunner.run(ThreadLeakControl.java:368)
	at java.lang.Thread.run(Thread.java:748)
Caused by: java.net.SocketTimeoutException: Read timed out
	at java.net.SocketInputStream.socketRead0(Native Method)
	at java.net.SocketInputStream.socketRead(SocketInputStream.java:116)
	at java.net.SocketInputStream.read(SocketInputStream.java:171)
	at java.net.SocketInputStream.read(SocketInputStream.java:141)
	at sun.security.ssl.InputRecord.readFully(InputRecord.java:465)
	at sun.security.ssl.InputRecord.read(InputRecord.java:503)
	at sun.security.ssl.SSLSocketImpl.readRecord(SSLSocketImpl.java:975)
	at sun.security.ssl.SSLSocketImpl.readDataRecord(SSLSocketImpl.java:933)
	at sun.security.ssl.AppInputStream.read(AppInputStream.java:105)
	at org.apache.http.impl.io.SessionInputBufferImpl.streamRead(SessionInputBufferImpl.java:137)
	at org.apache.http.impl.io.SessionInputBufferImpl.fillBuffer(SessionInputBufferImpl.java:153)
	at org.apache.http.impl.io.SessionInputBufferImpl.readLine(SessionInputBufferImpl.java:282)
	at org.apache.http.impl.conn.DefaultHttpResponseParser.parseHead(DefaultHttpResponseParser.java:138)
	at org.apache.http.impl.conn.DefaultHttpResponseParser.parseHead(DefaultHttpResponseParser.java:56)
	at org.apache.http.impl.io.AbstractMessageParser.parse(AbstractMessageParser.java:259)
	at org.apache.http.impl.DefaultBHttpClientConnection.receiveResponseHeader(DefaultBHttpClientConnection.java:163)
	at org.apache.http.impl.conn.CPoolProxy.receiveResponseHeader(CPoolProxy.java:165)
	at org.apache.http.protocol.HttpRequestExecutor.doReceiveResponse(HttpRequestExecutor.java:273)
	at org.apache.http.protocol.HttpRequestExecutor.execute(HttpRequestExecutor.java:125)
	at org.apache.http.impl.execchain.MainClientExec.execute(MainClientExec.java:272)
	at org.apache.http.impl.execchain.ProtocolExec.execute(ProtocolExec.java:185)
	at org.apache.http.impl.execchain.RetryExec.execute(RetryExec.java:89)
	at org.apache.http.impl.execchain.RedirectExec.execute(RedirectExec.java:110)
	at org.apache.http.impl.client.InternalHttpClient.doExecute(InternalHttpClient.java:185)
	at org.apache.http.impl.client.CloseableHttpClient.execute(CloseableHttpClient.java:83)
	at org.apache.http.impl.client.CloseableHttpClient.execute(CloseableHttpClient.java:56)
	at org.apache.solr.client.solrj.impl.HttpSolrClient.executeMethod(HttpSolrClient.java:549)
	... 54 more


FAILED:  org.apache.solr.cloud.RollingRestartTest.test

Error Message:
Address already in use

Stack Trace:
java.net.BindException: Address already in use
	at __randomizedtesting.SeedInfo.seed([7A4F02805D37A45D:F21B3D5AF3CBC9A5]:0)
	at sun.nio.ch.Net.bind0(Native Method)
	at sun.nio.ch.Net.bind(Net.java:433)
	at sun.nio.ch.Net.bind(Net.java:425)
	at sun.nio.ch.ServerSocketChannelImpl.bind(ServerSocketChannelImpl.java:223)
	at sun.nio.ch.ServerSocketAdaptor.bind(ServerSocketAdaptor.java:74)
	at org.eclipse.jetty.server.ServerConnector.openAcceptChannel(ServerConnector.java:342)
	at org.eclipse.jetty.server.ServerConnector.open(ServerConnector.java:308)
	at org.eclipse.jetty.server.AbstractNetworkConnector.doStart(AbstractNetworkConnector.java:80)
	at org.eclipse.jetty.server.ServerConnector.doStart(ServerConnector.java:236)
	at org.eclipse.jetty.util.component.AbstractLifeCycle.start(AbstractLifeCycle.java:68)
	at org.eclipse.jetty.server.Server.doStart(Server.java:394)
	at org.eclipse.jetty.util.component.AbstractLifeCycle.start(AbstractLifeCycle.java:68)
	at org.apache.solr.client.solrj.embedded.JettySolrRunner.retryOnPortBindFailure(JettySolrRunner.java:544)
	at org.apache.solr.client.solrj.embedded.JettySolrRunner.start(JettySolrRunner.java:483)
	at org.apache.solr.client.solrj.embedded.JettySolrRunner.start(JettySolrRunner.java:451)
	at org.apache.solr.cloud.RollingRestartTest.restartWithRolesTest(RollingRestartTest.java:104)
	at org.apache.solr.cloud.RollingRestartTest.test(RollingRestartTest.java:53)
	at sun.reflect.NativeMethodAccessorImpl.invoke0(Native Method)
	at sun.reflect.NativeMethodAccessorImpl.invoke(NativeMethodAccessorImpl.java:62)
	at sun.reflect.DelegatingMethodAccessorImpl.invoke(DelegatingMethodAccessorImpl.java:43)
	at java.lang.reflect.Method.invoke(Method.java:498)
	at com.carrotsearch.randomizedtesting.RandomizedRunner.invoke(RandomizedRunner.java:1750)
	at com.carrotsearch.randomizedtesting.RandomizedRunner$8.evaluate(RandomizedRunner.java:938)
	at com.carrotsearch.randomizedtesting.RandomizedRunner$9.evaluate(RandomizedRunner.java:974)
	at com.carrotsearch.randomizedtesting.RandomizedRunner$10.evaluate(RandomizedRunner.java:988)
	at org.apache.solr.BaseDistributedSearchTestCase$ShardsRepeatRule$ShardsFixedStatement.callStatement(BaseDistributedSearchTestCase.java:1070)
	at org.apache.solr.BaseDistributedSearchTestCase$ShardsRepeatRule$ShardsStatement.evaluate(BaseDistributedSearchTestCase.java:1042)
	at com.carrotsearch.randomizedtesting.rules.SystemPropertiesRestoreRule$1.evaluate(SystemPropertiesRestoreRule.java:57)
	at org.apache.lucene.util.TestRuleSetupTeardownChained$1.evaluate(TestRuleSetupTeardownChained.java:49)
	at org.apache.lucene.util.AbstractBeforeAfterRule$1.evaluate(AbstractBeforeAfterRule.java:45)
	at org.apache.lucene.util.TestRuleThreadAndTestName$1.evaluate(TestRuleThreadAndTestName.java:48)
	at org.apache.lucene.util.TestRuleIgnoreAfterMaxFailures$1.evaluate(TestRuleIgnoreAfterMaxFailures.java:64)
	at org.apache.lucene.util.TestRuleMarkFailure$1.evaluate(TestRuleMarkFailure.java:47)
	at com.carrotsearch.randomizedtesting.rules.StatementAdapter.evaluate(StatementAdapter.java:36)
	at com.carrotsearch.randomizedtesting.ThreadLeakControl$StatementRunner.run(ThreadLeakControl.java:368)
	at com.carrotsearch.randomizedtesting.ThreadLeakControl.forkTimeoutingTask(ThreadLeakControl.java:817)
	at com.carrotsearch.randomizedtesting.ThreadLeakControl$3.evaluate(ThreadLeakControl.java:468)
	at com.carrotsearch.randomizedtesting.RandomizedRunner.runSingleTest(RandomizedRunner.java:947)
	at com.carrotsearch.randomizedtesting.RandomizedRunner$5.evaluate(RandomizedRunner.java:832)
	at com.carrotsearch.randomizedtesting.RandomizedRunner$6.evaluate(RandomizedRunner.java:883)
	at com.carrotsearch.randomizedtesting.RandomizedRunner$7.evaluate(RandomizedRunner.java:894)
	at com.carrotsearch.randomizedtesting.rules.StatementAdapter.evaluate(StatementAdapter.java:36)
	at com.carrotsearch.randomizedtesting.rules.SystemPropertiesRestoreRule$1.evaluate(SystemPropertiesRestoreRule.java:57)
	at org.apache.lucene.util.AbstractBeforeAfterRule$1.evaluate(AbstractBeforeAfterRule.java:45)
	at com.carrotsearch.randomizedtesting.rules.StatementAdapter.evaluate(StatementAdapter.java:36)
	at org.apache.lucene.util.TestRuleStoreClassName$1.evaluate(TestRuleStoreClassName.java:41)
	at com.carrotsearch.randomizedtesting.rules.NoShadowingOrOverridesOnMethodsRule$1.evaluate(NoShadowingOrOverridesOnMethodsRule.java:40)
	at com.carrotsearch.randomizedtesting.rules.NoShadowingOrOverridesOnMethodsRule$1.evaluate(NoShadowingOrOverridesOnMethodsRule.java:40)
	at com.carrotsearch.randomizedtesting.rules.StatementAdapter.evaluate(StatementAdapter.java:36)
	at com.carrotsearch.randomizedtesting.rules.StatementAdapter.evaluate(StatementAdapter.java:36)
	at com.carrotsearch.randomizedtesting.rules.StatementAdapter.evaluate(StatementAdapter.java:36)
	at org.apache.lucene.util.TestRuleAssertionsRequired$1.evaluate(TestRuleAssertionsRequired.java:53)
	at org.apache.lucene.util.TestRuleMarkFailure$1.evaluate(TestRuleMarkFailure.java:47)
	at org.apache.lucene.util.TestRuleIgnoreAfterMaxFailures$1.evaluate(TestRuleIgnoreAfterMaxFailures.java:64)
	at org.apache.lucene.util.TestRuleIgnoreTestSuites$1.evaluate(TestRuleIgnoreTestSuites.java:54)
	at com.carrotsearch.randomizedtesting.rules.StatementAdapter.evaluate(StatementAdapter.java:36)
	at com.carrotsearch.randomizedtesting.ThreadLeakControl$StatementRunner.run(ThreadLeakControl.java:368)
	at java.lang.Thread.run(Thread.java:748)




Build Log:
[...truncated 13252 lines...]
   [junit4] Suite: org.apache.solr.cloud.TestMiniSolrCloudClusterSSL
   [junit4]   2> 46529 INFO  (SUITE-TestMiniSolrCloudClusterSSL-seed#[7A4F02805D37A45D]-worker) [    ] o.a.s.SolrTestCaseJ4 SecureRandom sanity checks: test.solr.allowed.securerandom=null & java.security.egd=file:/dev/./urandom
   [junit4]   2> Creating dataDir: /x1/jenkins/jenkins-slave/workspace/Lucene-Solr-NightlyTests-master/checkout/solr/build/solr-core/test/J2/temp/solr.cloud.TestMiniSolrCloudClusterSSL_7A4F02805D37A45D-001/init-core-data-001
   [junit4]   2> 46530 WARN  (SUITE-TestMiniSolrCloudClusterSSL-seed#[7A4F02805D37A45D]-worker) [    ] o.a.s.SolrTestCaseJ4 startTrackingSearchers: numOpens=4 numCloses=4
   [junit4]   2> 46531 INFO  (SUITE-TestMiniSolrCloudClusterSSL-seed#[7A4F02805D37A45D]-worker) [    ] o.a.s.SolrTestCaseJ4 Using PointFields (NUMERIC_POINTS_SYSPROP=true) w/NUMERIC_DOCVALUES_SYSPROP=true
   [junit4]   2> 46533 INFO  (SUITE-TestMiniSolrCloudClusterSSL-seed#[7A4F02805D37A45D]-worker) [    ] o.a.s.SolrTestCaseJ4 Randomized ssl (false) and clientAuth (true) via: @org.apache.solr.util.RandomizeSSL(reason=, ssl=NaN, value=NaN, clientAuth=NaN)
   [junit4]   2> 46538 INFO  (TEST-TestMiniSolrCloudClusterSSL.testSslWithInvalidPeerName-seed#[7A4F02805D37A45D]) [    ] o.a.s.SolrTestCaseJ4 ###Starting testSslWithInvalidPeerName
   [junit4]   2> 46538 INFO  (TEST-TestMiniSolrCloudClusterSSL.testSslWithInvalidPeerName-seed#[7A4F02805D37A45D]) [    ] o.a.s.c.TestMiniSolrCloudClusterSSL NOTE: This Test ignores the randomized SSL & clientAuth settings selected by base class
   [junit4]   2> 46541 INFO  (TEST-TestMiniSolrCloudClusterSSL.testSslWithInvalidPeerName-seed#[7A4F02805D37A45D]) [    ] o.a.s.c.MiniSolrCloudCluster Starting cluster of 3 servers in /x1/jenkins/jenkins-slave/workspace/Lucene-Solr-NightlyTests-master/checkout/solr/build/solr-core/test/J2/temp/solr.cloud.TestMiniSolrCloudClusterSSL_7A4F02805D37A45D-001/tempDir-001
   [junit4]   2> 46541 INFO  (TEST-TestMiniSolrCloudClusterSSL.testSslWithInvalidPeerName-seed#[7A4F02805D37A45D]) [    ] o.a.s.c.ZkTestServer STARTING ZK TEST SERVER
   [junit4]   2> 46542 INFO  (ZkTestServer Run Thread) [    ] o.a.s.c.ZkTestServer client port:0.0.0.0/0.0.0.0:0
   [junit4]   2> 46542 INFO  (ZkTestServer Run Thread) [    ] o.a.s.c.ZkTestServer Starting server
   [junit4]   2> 46642 INFO  (TEST-TestMiniSolrCloudClusterSSL.testSslWithInvalidPeerName-seed#[7A4F02805D37A45D]) [    ] o.a.s.c.ZkTestServer start zk server on port:38210
   [junit4]   2> 46642 INFO  (TEST-TestMiniSolrCloudClusterSSL.testSslWithInvalidPeerName-seed#[7A4F02805D37A45D]) [    ] o.a.s.c.ZkTestServer parse host and port list: 127.0.0.1:38210
   [junit4]   2> 46642 INFO  (TEST-TestMiniSolrCloudClusterSSL.testSslWithInvalidPeerName-seed#[7A4F02805D37A45D]) [    ] o.a.s.c.ZkTestServer connecting to 127.0.0.1 38210
   [junit4]   2> 46647 INFO  (zkConnectionManagerCallback-216-thread-1) [    ] o.a.s.c.c.ConnectionManager zkClient has connected
   [junit4]   2> 46652 INFO  (zkConnectionManagerCallback-218-thread-1) [    ] o.a.s.c.c.ConnectionManager zkClient has connected
   [junit4]   2> 46655 INFO  (zkConnectionManagerCallback-220-thread-1) [    ] o.a.s.c.c.ConnectionManager zkClient has connected
   [junit4]   2> 46661 WARN  (jetty-launcher-221-thread-2) [    ] o.e.j.s.AbstractConnector Ignoring deprecated socket close linger time
   [junit4]   2> 46661 WARN  (jetty-launcher-221-thread-3) [    ] o.e.j.s.AbstractConnector Ignoring deprecated socket close linger time
   [junit4]   2> 46662 INFO  (jetty-launcher-221-thread-2) [    ] o.a.s.c.s.e.JettySolrRunner Start Jetty (original configured port=0)
   [junit4]   2> 46662 INFO  (jetty-launcher-221-thread-3) [    ] o.a.s.c.s.e.JettySolrRunner Start Jetty (original configured port=0)
   [junit4]   2> 46662 INFO  (jetty-launcher-221-thread-2) [    ] o.a.s.c.s.e.JettySolrRunner Trying to start Jetty on port 0 try number 1 ...
   [junit4]   2> 46662 INFO  (jetty-launcher-221-thread-3) [    ] o.a.s.c.s.e.JettySolrRunner Trying to start Jetty on port 0 try number 1 ...
   [junit4]   2> 46662 INFO  (jetty-launcher-221-thread-3) [    ] o.e.j.s.Server jetty-9.4.14.v20181114; built: 2018-11-14T21:20:31.478Z; git: c4550056e785fb5665914545889f21dc136ad9e6; jvm 1.8.0_191-b12
   [junit4]   2> 46662 INFO  (jetty-launcher-221-thread-2) [    ] o.e.j.s.Server jetty-9.4.14.v20181114; built: 2018-11-14T21:20:31.478Z; git: c4550056e785fb5665914545889f21dc136ad9e6; jvm 1.8.0_191-b12
   [junit4]   2> 46664 INFO  (jetty-launcher-221-thread-2) [    ] o.e.j.s.session DefaultSessionIdManager workerName=node0
   [junit4]   2> 46664 WARN  (jetty-launcher-221-thread-1) [    ] o.e.j.s.AbstractConnector Ignoring deprecated socket close linger time
   [junit4]   2> 46664 INFO  (jetty-launcher-221-thread-2) [    ] o.e.j.s.session No SessionScavenger set, using defaults
   [junit4]   2> 46664 INFO  (jetty-launcher-221-thread-2) [    ] o.e.j.s.session node0 Scavenging every 660000ms
   [junit4]   2> 46664 INFO  (jetty-launcher-221-thread-1) [    ] o.a.s.c.s.e.JettySolrRunner Start Jetty (original configured port=0)
   [junit4]   2> 46664 INFO  (jetty-launcher-221-thread-1) [    ] o.a.s.c.s.e.JettySolrRunner Trying to start Jetty on port 0 try number 1 ...
   [junit4]   2> 46664 INFO  (jetty-launcher-221-thread-1) [    ] o.e.j.s.Server jetty-9.4.14.v20181114; built: 2018-11-14T21:20:31.478Z; git: c4550056e785fb5665914545889f21dc136ad9e6; jvm 1.8.0_191-b12
   [junit4]   2> 46665 INFO  (jetty-launcher-221-thread-3) [    ] o.e.j.s.session DefaultSessionIdManager workerName=node0
   [junit4]   2> 46665 INFO  (jetty-launcher-221-thread-3) [    ] o.e.j.s.session No SessionScavenger set, using defaults
   [junit4]   2> 46665 INFO  (jetty-launcher-221-thread-3) [    ] o.e.j.s.session node0 Scavenging every 600000ms
   [junit4]   2> 46666 INFO  (jetty-launcher-221-thread-3) [    ] o.e.j.s.h.ContextHandler Started o.e.j.s.ServletContextHandler@5e9a179d{/solr,null,AVAILABLE}
   [junit4]   2> 46666 INFO  (jetty-launcher-221-thread-2) [    ] o.e.j.s.h.ContextHandler Started o.e.j.s.ServletContextHandler@62714d58{/solr,null,AVAILABLE}
   [junit4]   2> 46668 INFO  (jetty-launcher-221-thread-1) [    ] o.e.j.s.session DefaultSessionIdManager workerName=node0
   [junit4]   2> 46668 INFO  (jetty-launcher-221-thread-1) [    ] o.e.j.s.session No SessionScavenger set, using defaults
   [junit4]   2> 46668 INFO  (jetty-launcher-221-thread-1) [    ] o.e.j.s.session node0 Scavenging every 660000ms
   [junit4]   2> 46669 WARN  (jetty-launcher-221-thread-2) [    ] o.e.j.u.s.S.config No Client EndPointIdentificationAlgorithm configured for SslContextFactory@203f4ca1[provider=null,keyStore=null,trustStore=null]
   [junit4]   2> 46669 WARN  (jetty-launcher-221-thread-3) [    ] o.e.j.u.s.S.config No Client EndPointIdentificationAlgorithm configured for SslContextFactory@662f5a40[provider=null,keyStore=null,trustStore=null]
   [junit4]   2> 46669 INFO  (jetty-launcher-221-thread-1) [    ] o.e.j.s.h.ContextHandler Started o.e.j.s.ServletContextHandler@355037a7{/solr,null,AVAILABLE}
   [junit4]   2> 46669 INFO  (jetty-launcher-221-thread-2) [    ] o.e.j.s.AbstractConnector Started ServerConnector@239eac2{SSL,[ssl, http/1.1]}{127.0.0.1:34435}
   [junit4]   2> 46670 INFO  (jetty-launcher-221-thread-2) [    ] o.e.j.s.Server Started @46755ms
   [junit4]   2> 46670 INFO  (jetty-launcher-221-thread-2) [    ] o.a.s.c.s.e.JettySolrRunner Jetty properties: {hostContext=/solr, hostPort=34435}
   [junit4]   2> 46670 WARN  (jetty-launcher-221-thread-1) [    ] o.e.j.u.s.S.config No Client EndPointIdentificationAlgorithm configured for SslContextFactory@4dd2f9ae[provider=null,keyStore=null,trustStore=null]
   [junit4]   2> 46670 INFO  (jetty-launcher-221-thread-3) [    ] o.e.j.s.AbstractConnector Started ServerConnector@58e162f9{SSL,[ssl, http/1.1]}{127.0.0.1:37004}
   [junit4]   2> 46670 INFO  (jetty-launcher-221-thread-3) [    ] o.e.j.s.Server Started @46755ms
   [junit4]   2> 46670 INFO  (jetty-launcher-221-thread-3) [    ] o.a.s.c.s.e.JettySolrRunner Jetty properties: {hostContext=/solr, hostPort=37004}
   [junit4]   2> 46671 ERROR (jetty-launcher-221-thread-3) [    ] o.a.s.u.StartupLoggingUtils Missing Java Option solr.log.dir. Logging may be missing or incomplete.
   [junit4]   2> 46671 INFO  (jetty-launcher-221-thread-1) [    ] o.e.j.s.AbstractConnector Started ServerConnector@629d052b{SSL,[ssl, http/1.1]}{127.0.0.1:39568}
   [junit4]   2> 46671 INFO  (jetty-launcher-221-thread-3) [    ] o.a.s.s.SolrDispatchFilter Using logger factory org.apache.logging.slf4j.Log4jLoggerFactory
   [junit4]   2> 46671 INFO  (jetty-launcher-221-thread-1) [    ] o.e.j.s.Server Started @46756ms
   [junit4]   2> 46671 INFO  (jetty-launcher-221-thread-3) [    ] o.a.s.s.SolrDispatchFilter  ___      _       Welcome to Apache Solr™ version 8.0.0
   [junit4]   2> 46671 INFO  (jetty-launcher-221-thread-3) [    ] o.a.s.s.SolrDispatchFilter / __| ___| |_ _   Starting in cloud mode on port null
   [junit4]   2> 46671 INFO  (jetty-launcher-221-thread-1) [    ] o.a.s.c.s.e.JettySolrRunner Jetty properties: {hostContext=/solr, hostPort=39568}
   [junit4]   2> 46671 INFO  (jetty-launcher-221-thread-3) [    ] o.a.s.s.SolrDispatchFilter \__ \/ _ \ | '_|  Install dir: null
   [junit4]   2> 46671 INFO  (jetty-launcher-221-thread-3) [    ] o.a.s.s.SolrDispatchFilter |___/\___/_|_|    Start time: 2019-01-02T13:14:10.785Z
   [junit4]   2> 46671 ERROR (jetty-launcher-221-thread-1) [    ] o.a.s.u.StartupLoggingUtils Missing Java Option solr.log.dir. Logging may be missing or incomplete.
   [junit4]   2> 46671 INFO  (jetty-launcher-221-thread-1) [    ] o.a.s.s.SolrDispatchFilter Using logger factory org.apache.logging.slf4j.Log4jLoggerFactory
   [junit4]   2> 46671 INFO  (jetty-launcher-221-thread-1) [    ] o.a.s.s.SolrDispatchFilter  ___      _       Welcome to Apache Solr™ version 8.0.0
   [junit4]   2> 46671 INFO  (jetty-launcher-221-thread-1) [    ] o.a.s.s.SolrDispatchFilter / __| ___| |_ _   Starting in cloud mode on port null
   [junit4]   2> 46671 INFO  (jetty-launcher-221-thread-1) [    ] o.a.s.s.SolrDispatchFilter \__ \/ _ \ | '_|  Install dir: null
   [junit4]   2> 46672 INFO  (jetty-launcher-221-thread-1) [    ] o.a.s.s.SolrDispatchFilter |___/\___/_|_|    Start time: 2019-01-02T13:14:10.786Z
   [junit4]   2> 46670 ERROR (jetty-launcher-221-thread-2) [    ] o.a.s.u.StartupLoggingUtils Missing Java Option solr.log.dir. Logging may be missing or incomplete.
   [junit4]   2> 46672 INFO  (jetty-launcher-221-thread-2) [    ] o.a.s.s.SolrDispatchFilter Using logger factory org.apache.logging.slf4j.Log4jLoggerFactory
   [junit4]   2> 46672 INFO  (jetty-launcher-221-thread-2) [    ] o.a.s.s.SolrDispatchFilter  ___      _       Welcome to Apache Solr™ version 8.0.0
   [junit4]   2> 46672 INFO  (jetty-launcher-221-thread-2) [    ] o.a.s.s.SolrDispatchFilter / __| ___| |_ _   Starting in cloud mode on port null
   [junit4]   2> 46672 INFO  (jetty-launcher-221-thread-2) [    ] o.a.s.s.SolrDispatchFilter \__ \/ _ \ | '_|  Install dir: null
   [junit4]   2> 46672 INFO  (jetty-launcher-221-thread-2) [    ] o.a.s.s.SolrDispatchFilter |___/\___/_|_|    Start time: 2019-01-02T13:14:10.786Z
   [junit4]   2> 46680 INFO  (zkConnectionManagerCallback-225-thread-1) [    ] o.a.s.c.c.ConnectionManager zkClient has connected
   [junit4]   2> 46681 INFO  (zkConnectionManagerCallback-223-thread-1) [    ] o.a.s.c.c.ConnectionManager zkClient has connected
   [junit4]   2> 46687 INFO  (zkConnectionManagerCallback-227-thread-1) [    ] o.a.s.c.c.ConnectionManager zkClient has connected
   [junit4]   2> 46687 INFO  (jetty-launcher-221-thread-1) [    ] o.a.s.s.SolrDispatchFilter solr.xml found in ZooKeeper. Loading...
   [junit4]   2> 46688 INFO  (jetty-launcher-221-thread-3) [    ] o.a.s.s.SolrDispatchFilter solr.xml found in ZooKeeper. Loading...
   [junit4]   2> 46688 INFO  (jetty-launcher-221-thread-2) [    ] o.a.s.s.SolrDispatchFilter solr.xml found in ZooKeeper. Loading...
   [junit4]   2> 46846 WARN  (jetty-launcher-221-thread-1) [    ] o.a.s.c.s.i.Http2SolrClient Create Http2SolrClient with HTTP/1.1 transport since Java 8 or lower versions does not support SSL + HTTP/2
   [junit4]   2> 46848 WARN  (jetty-launcher-221-thread-1) [    ] o.e.j.u.s.S.config No Client EndPointIdentificationAlgorithm configured for SslContextFactory@206f6134[provider=null,keyStore=null,trustStore=null]
   [junit4]   2> 46853 WARN  (jetty-launcher-221-thread-1) [    ] o.a.s.c.s.i.Http2SolrClient Create Http2SolrClient with HTTP/1.1 transport since Java 8 or lower versions does not support SSL + HTTP/2
   [junit4]   2> 46854 WARN  (jetty-launcher-221-thread-1) [    ] o.e.j.u.s.S.config No Client EndPointIdentificationAlgorithm configured for SslContextFactory@28adc6d2[provider=null,keyStore=null,trustStore=null]
   [junit4]   2> 46855 INFO  (jetty-launcher-221-thread-1) [    ] o.a.s.c.ZkContainer Zookeeper client=127.0.0.1:38210/solr
   [junit4]   2> 46859 INFO  (zkConnectionManagerCallback-233-thread-1) [    ] o.a.s.c.c.ConnectionManager zkClient has connected
   [junit4]   2> 46867 INFO  (zkConnectionManagerCallback-235-thread-1) [    ] o.a.s.c.c.ConnectionManager zkClient has connected
   [junit4]   2> 46930 WARN  (jetty-launcher-221-thread-3) [    ] o.a.s.c.s.i.Http2SolrClient Create Http2SolrClient with HTTP/1.1 transport since Java 8 or lower versions does not support SSL + HTTP/2
   [junit4]   2> 46950 WARN  (jetty-launcher-221-thread-3) [    ] o.e.j.u.s.S.config No Client EndPointIdentificationAlgorithm configured for SslContextFactory@39d2ed6[provider=null,keyStore=null,trustStore=null]
   [junit4]   2> 46954 WARN  (jetty-launcher-221-thread-3) [    ] o.a.s.c.s.i.Http2SolrClient Create Http2SolrClient with HTTP/1.1 transport since Java 8 or lower versions does not support SSL + HTTP/2
   [junit4]   2> 46956 WARN  (jetty-launcher-221-thread-3) [    ] o.e.j.u.s.S.config No Client EndPointIdentificationAlgorithm configured for SslContextFactory@21edfa0c[provider=null,keyStore=null,trustStore=null]
   [junit4]   2> 46957 INFO  (jetty-launcher-221-thread-3) [    ] o.a.s.c.ZkContainer Zookeeper client=127.0.0.1:38210/solr
   [junit4]   2> 46961 INFO  (zkConnectionManagerCallback-243-thread-1) [    ] o.a.s.c.c.ConnectionManager zkClient has connected
   [junit4]   2> 46965 INFO  (zkConnectionManagerCallback-245-thread-1) [    ] o.a.s.c.c.ConnectionManager zkClient has connected
   [junit4]   2> 46980 INFO  (jetty-launcher-221-thread-3) [n:127.0.0.1:37004_solr    ] o.a.s.c.OverseerElectionContext I am going to be the leader 127.0.0.1:37004_solr
   [junit4]   2> 46982 INFO  (jetty-launcher-221-thread-3) [n:127.0.0.1:37004_solr    ] o.a.s.c.Overseer Overseer (id=72553677045956617-127.0.0.1:37004_solr-n_0000000000) starting
   [junit4]   2> 46990 WARN  (jetty-launcher-221-thread-2) [    ] o.a.s.c.s.i.Http2SolrClient Create Http2SolrClient with HTTP/1.1 transport since Java 8 or lower versions does not support SSL + HTTP/2
   [junit4]   2> 46992 WARN  (jetty-launcher-221-thread-2) [    ] o.e.j.u.s.S.config No Client EndPointIdentificationAlgorithm configured for SslContextFactory@3cc46124[provider=null,keyStore=null,trustStore=null]
   [junit4]   2> 46993 INFO  (jetty-launcher-221-thread-1) [n:127.0.0.1:39568_solr    ] o.a.s.c.ZkController Register node as live in ZooKeeper:/live_nodes/127.0.0.1:39568_solr
   [junit4]   2> 46996 WARN  (jetty-launcher-221-thread-2) [    ] o.a.s.c.s.i.Http2SolrClient Create Http2SolrClient with HTTP/1.1 transport since Java 8 or lower versions does not support SSL + HTTP/2
   [junit4]   2> 46997 INFO  (zkCallback-244-thread-1) [    ] o.a.s.c.c.ZkStateReader Updated live nodes from ZooKeeper... (0) -> (1)
   [junit4]   2> 46997 WARN  (jetty-launcher-221-thread-2) [    ] o.e.j.u.s.S.config No Client EndPointIdentificationAlgorithm configured for SslContextFactory@704f73f5[provider=null,keyStore=null,trustStore=null]
   [junit4]   2> 46998 INFO  (jetty-launcher-221-thread-2) [    ] o.a.s.c.ZkContainer Zookeeper client=127.0.0.1:38210/solr
   [junit4]   2> 46998 INFO  (zkCallback-234-thread-1) [    ] o.a.s.c.c.ZkStateReader Updated live nodes from ZooKeeper... (0) -> (1)
   [junit4]   2> 47000 INFO  (zkConnectionManagerCallback-253-thread-1) [    ] o.a.s.c.c.ConnectionManager zkClient has connected
   [junit4]   2> 47004 INFO  (zkConnectionManagerCallback-258-thread-1) [    ] o.a.s.c.c.ConnectionManager zkClient has connected
   [junit4]   2> 47008 INFO  (zkConnectionManagerCallback-260-thread-1) [    ] o.a.s.c.c.ConnectionManager zkClient has connected
   [junit4]   2> 47015 INFO  (jetty-launcher-221-thread-3) [n:127.0.0.1:37004_solr    ] o.a.s.c.c.ZkStateReader Updated live nodes from ZooKeeper... (0) -> (1)
   [junit4]   2> 47018 INFO  (jetty-launcher-221-thread-3) [n:127.0.0.1:37004_solr    ] o.a.s.c.s.i.ZkClientClusterStateProvider Cluster at 127.0.0.1:38210/solr ready
   [junit4]   2> 47019 INFO  (OverseerStateUpdate-72553677045956617-127.0.0.1:37004_solr-n_0000000000) [n:127.0.0.1:37004_solr    ] o.a.s.c.Overseer Starting to work on the main queue : 127.0.0.1:37004_solr
   [junit4]   2> 47020 INFO  (jetty-launcher-221-thread-3) [n:127.0.0.1:37004_solr    ] o.a.s.c.ZkController Publish node=127.0.0.1:37004_solr as DOWN
   [junit4]   2> 47022 INFO  (jetty-launcher-221-thread-3) [n:127.0.0.1:37004_solr    ] o.a.s.c.TransientSolrCoreCacheDefault Allocating transient cache for 2147483647 transient cores
   [junit4]   2> 47022 INFO  (jetty-launcher-221-thread-3) [n:127.0.0.1:37004_solr    ] o.a.s.c.ZkController Register node as live in ZooKeeper:/live_nodes/127.0.0.1:37004_solr
   [junit4]   2> 47024 INFO  (zkCallback-234-thread-1) [    ] o.a.s.c.c.ZkStateReader Updated live nodes from ZooKeeper... (1) -> (2)
   [junit4]   2> 47024 INFO  (zkCallback-244-thread-1) [    ] o.a.s.c.c.ZkStateReader Updated live nodes from ZooKeeper... (1) -> (2)
   [junit4]   2> 47027 INFO  (zkCallback-252-thread-1) [    ] o.a.s.c.c.ZkStateReader Updated live nodes from ZooKeeper... (1) -> (2)
   [junit4]   2> 47044 INFO  (jetty-launcher-221-thread-2) [n:127.0.0.1:34435_solr    ] o.a.s.c.c.ZkStateReader Updated live nodes from ZooKeeper... (0) -> (2)
   [junit4]   2> 47050 INFO  (jetty-launcher-221-thread-2) [n:127.0.0.1:34435_solr    ] o.a.s.c.ZkController Publish node=127.0.0.1:34435_solr as DOWN
   [junit4]   2> 47051 INFO  (jetty-launcher-221-thread-2) [n:127.0.0.1:34435_solr    ] o.a.s.c.TransientSolrCoreCacheDefault Allocating transient cache for 2147483647 transient cores
   [junit4]   2> 47051 INFO  (jetty-launcher-221-thread-2) [n:127.0.0.1:34435_solr    ] o.a.s.c.ZkController Register node as live in ZooKeeper:/live_nodes/127.0.0.1:34435_solr
   [junit4]   2> 47053 INFO  (zkCallback-234-thread-1) [    ] o.a.s.c.c.ZkStateReader Updated live nodes from ZooKeeper... (2) -> (3)
   [junit4]   2> 47063 INFO  (jetty-launcher-221-thread-3) [n:127.0.0.1:37004_solr    ] o.a.s.h.a.MetricsHistoryHandler No .system collection, keeping metrics history in memory.
   [junit4]   2> 47075 INFO  (zkCallback-259-thread-1) [    ] o.a.s.c.c.ZkStateReader Updated live nodes from ZooKeeper... (2) -> (3)
   [junit4]   2> 47076 INFO  (zkCallback-252-thread-1) [    ] o.a.s.c.c.ZkStateReader Updated live nodes from ZooKeeper... (2) -> (3)
   [junit4]   2> 47077 INFO  (zkCallback-244-thread-2) [    ] o.a.s.c.c.ZkStateReader Updated live nodes from ZooKeeper... (2) -> (3)
   [junit4]   2> 47078 INFO  (zkConnectionManagerCallback-268-thread-1) [    ] o.a.s.c.c.ConnectionManager zkClient has connected
   [junit4]   2> 47080 INFO  (jetty-launcher-221-thread-1) [n:127.0.0.1:39568_solr    ] o.a.s.c.c.ZkStateReader Updated live nodes from ZooKeeper... (0) -> (3)
   [junit4]   2> 47080 INFO  (zkConnectionManagerCallback-273-thread-1) [    ] o.a.s.c.c.ConnectionManager zkClient has connected
   [junit4]   2> 47082 INFO  (jetty-launcher-221-thread-1) [n:127.0.0.1:39568_solr    ] o.a.s.c.s.i.ZkClientClusterStateProvider Cluster at 127.0.0.1:38210/solr ready
   [junit4]   2> 47082 INFO  (jetty-launcher-221-thread-1) [n:127.0.0.1:39568_solr    ] o.a.s.h.a.MetricsHistoryHandler No .system collection, keeping metrics history in memory.
   [junit4]   2> 47083 INFO  (jetty-launcher-221-thread-2) [n:127.0.0.1:34435_solr    ] o.a.s.c.c.ZkStateReader Updated live nodes from ZooKeeper... (0) -> (3)
   [junit4]   2> 47085 INFO  (jetty-launcher-221-thread-2) [n:127.0.0.1:34435_solr    ] o.a.s.c.s.i.ZkClientClusterStateProvider Cluster at 127.0.0.1:38210/solr ready
   [junit4]   2> 47086 INFO  (jetty-launcher-221-thread-2) [n:127.0.0.1:34435_solr    ] o.a.s.h.a.MetricsHistoryHandler No .system collection, keeping metrics history in memory.
   [junit4]   2> 47136 INFO  (jetty-launcher-221-thread-2) [n:127.0.0.1:34435_solr    ] o.a.s.m.r.SolrJmxReporter JMX monitoring for 'solr_34435.solr.node' (registry 'solr.node') enabled at server: com.sun.jmx.mbeanserver.JmxMBeanServer@322ea78c
   [junit4]   2> 47144 INFO  (jetty-launcher-221-thread-1) [n:127.0.0.1:39568_solr    ] o.a.s.m.r.SolrJmxReporter JMX monitoring for 'solr_39568.solr.node' (registry 'solr.node') enabled at server: com.sun.jmx.mbeanserver.JmxMBeanServer@322ea78c
   [junit4]   2> 47192 INFO  (jetty-launcher-221-thread-2) [n:127.0.0.1:34435_solr    ] o.a.s.m.r.SolrJmxReporter JMX monitoring for 'solr_34435.solr.jvm' (registry 'solr.jvm') enabled at server: com.sun.jmx.mbeanserver.JmxMBeanServer@322ea78c
   [junit4]   2> 47193 INFO  (jetty-launcher-221-thread-1) [n:127.0.0.1:39568_solr    ] o.a.s.m.r.SolrJmxReporter JMX monitoring for 'solr_39568.solr.jvm' (registry 'solr.jvm') enabled at server: com.sun.jmx.mbeanserver.JmxMBeanServer@322ea78c
   [junit4]   2> 47193 INFO  (jetty-launcher-221-thread-1) [n:127.0.0.1:39568_solr    ] o.a.s.m.r.SolrJmxReporter JMX monitoring for 'solr_39568.solr.jetty' (registry 'solr.jetty') enabled at server: com.sun.jmx.mbeanserver.JmxMBeanServer@322ea78c
   [junit4]   2> 47195 INFO  (jetty-launcher-221-thread-1) [n:127.0.0.1:39568_solr    ] o.a.s.c.CorePropertiesLocator Found 0 core definitions underneath /x1/jenkins/jenkins-slave/workspace/Lucene-Solr-NightlyTests-master/checkout/solr/build/solr-core/test/J2/temp/solr.cloud.TestMiniSolrCloudClusterSSL_7A4F02805D37A45D-001/tempDir-001/node1/.
   [junit4]   2> 47201 INFO  (jetty-launcher-221-thread-3) [n:127.0.0.1:37004_solr    ] o.a.s.m.r.SolrJmxReporter JMX monitoring for 'solr_37004.solr.node' (registry 'solr.node') enabled at server: com.sun.jmx.mbeanserver.JmxMBeanServer@322ea78c
   [junit4]   2> 47208 INFO  (jetty-launcher-221-thread-2) [n:127.0.0.1:34435_solr    ] o.a.s.m.r.SolrJmxReporter JMX monitoring for 'solr_34435.solr.jetty' (registry 'solr.jetty') enabled at server: com.sun.jmx.mbeanserver.JmxMBeanServer@322ea78c
   [junit4]   2> 47210 INFO  (jetty-launcher-221-thread-2) [n:127.0.0.1:34435_solr    ] o.a.s.c.CorePropertiesLocator Found 0 core definitions underneath /x1/jenkins/jenkins-slave/workspace/Lucene-Solr-NightlyTests-master/checkout/solr/build/solr-core/test/J2/temp/solr.cloud.TestMiniSolrCloudClusterSSL_7A4F02805D37A45D-001/tempDir-001/node2/.
   [junit4]   2> 47224 INFO  (jetty-launcher-221-thread-3) [n:127.0.0.1:37004_solr    ] o.a.s.m.r.SolrJmxReporter JMX monitoring for 'solr_37004.solr.jvm' (registry 'solr.jvm') enabled at server: com.sun.jmx.mbeanserver.JmxMBeanServer@322ea78c
   [junit4]   2> 47226 INFO  (jetty-launcher-221-thread-3) [n:127.0.0.1:37004_solr    ] o.a.s.m.r.SolrJmxReporter JMX monitoring for 'solr_37004.solr.jetty' (registry 'solr.jetty') enabled at server: com.sun.jmx.mbeanserver.JmxMBeanServer@322ea78c
   [junit4]   2> 47228 INFO  (jetty-launcher-221-thread-3) [n:127.0.0.1:37004_solr    ] o.a.s.c.CorePropertiesLocator Found 0 core definitions underneath /x1/jenkins/jenkins-slave/workspace/Lucene-Solr-NightlyTests-master/checkout/solr/build/solr-core/test/J2/temp/solr.cloud.TestMiniSolrCloudClusterSSL_7A4F02805D37A45D-001/tempDir-001/node3/.
   [junit4]   2> 47373 INFO  (zkConnectionManagerCallback-280-thread-1) [    ] o.a.s.c.c.ConnectionManager zkClient has connected
   [junit4]   2> 47376 INFO  (TEST-TestMiniSolrCloudClusterSSL.testSslWithInvalidPeerName-seed#[7A4F02805D37A45D]) [    ] o.a.s.c.c.ZkStateReader Updated live nodes from ZooKeeper... (0) -> (3)
   [junit4]   2> 47379 INFO  (TEST-TestMiniSolrCloudClusterSSL.testSslWithInvalidPeerName-seed#[7A4F02805D37A45D]) [    ] o.a.s.c.s.i.ZkClientClusterStateProvider Cluster at 127.0.0.1:38210/solr ready
   [junit4]   2> 47385 INFO  (zkConnectionManagerCallback-282-thread-1) [    ] o.a.s.c.c.ConnectionManager zkClient has connected
   [junit4]   2> 48024 INFO  (qtp629204170-703) [n:127.0.0.1:39568_solr    ] o.a.s.h.a.CollectionsHandler Invoked Collection Action :create with params property.config=solrconfig-tlog.xml&collection.configName=org.apache.solr.cloud.TestMiniSolrCloudClusterSSL&name=first_collection&nrtReplicas=1&action=CREATE&numShards=3&wt=javabin&version=2 and sendToOCPQueue=true
   [junit4]   2> 48035 INFO  (OverseerThreadFactory-209-thread-1-processing-n:127.0.0.1:37004_solr) [n:127.0.0.1:37004_solr    ] o.a.s.c.a.c.CreateCollectionCmd Create collection first_collection
   [junit4]   2> 48165 INFO  (qtp629204170-706) [n:127.0.0.1:39568_solr    ] o.a.s.s.HttpSolrCall [admin] webapp=null path=/admin/metrics params={prefix=CONTAINER.fs.usableSpace,CONTAINER.fs.totalSpace,CORE.coreName&wt=javabin&version=2&group=solr.node,solr.core} status=0 QTime=0
   [junit4]   2> 48168 INFO  (qtp629204170-707) [n:127.0.0.1:39568_solr    ] o.a.s.s.HttpSolrCall [admin] webapp=null path=/admin/metrics params={prefix=CONTAINER.fs.usableSpace,CONTAINER.fs.totalSpace,CORE.coreName&wt=javabin&version=2&group=solr.node,solr.core} status=0 QTime=0
   [junit4]   2> 48170 INFO  (qtp629204170-704) [n:127.0.0.1:39568_solr    ] o.a.s.s.HttpSolrCall [admin] webapp=null path=/admin/metrics params={prefix=CONTAINER.fs.usableSpace,CONTAINER.fs.totalSpace,CORE.coreName&wt=javabin&version=2&group=solr.node,solr.core} status=0 QTime=0
   [junit4]   2> 48172 INFO  (qtp629204170-705) [n:127.0.0.1:39568_solr    ] o.a.s.s.HttpSolrCall [admin] webapp=null path=/admin/metrics params={prefix=CONTAINER.fs.usableSpace,CONTAINER.fs.totalSpace,CORE.coreName&wt=javabin&version=2&group=solr.node,solr.core} status=0 QTime=0
   [junit4]   2> 48175 INFO  (qtp629204170-706) [n:127.0.0.1:39568_solr    ] o.a.s.s.HttpSolrCall [admin] webapp=null path=/admin/metrics params={prefix=CONTAINER.fs.usableSpace,CONTAINER.fs.totalSpace,CORE.coreName&wt=javabin&version=2&group=solr.node,solr.core} status=0 QTime=0
   [junit4]   2> 48249 INFO  (qtp1223490685-688) [n:127.0.0.1:34435_solr    ] o.a.s.s.HttpSolrCall [admin] webapp=null path=/admin/metrics params={prefix=CONTAINER.fs.usableSpace,CONTAINER.fs.totalSpace,CORE.coreName&wt=javabin&version=2&group=solr.node,solr.core} status=0 QTime=0
   [junit4]   2> 48253 INFO  (qtp1223490685-689) [n:127.0.0.1:34435_solr    ] o.a.s.s.HttpSolrCall [admin] webapp=null path=/admin/metrics params={prefix=CONTAINER.fs.usableSpace,CONTAINER.fs.totalSpace,CORE.coreName&wt=javabin&version=2&group=solr.node,solr.core} status=0 QTime=0
   [junit4]   2> 48256 INFO  (qtp1223490685-685) [n:127.0.0.1:34435_solr    ] o.a.s.s.HttpSolrCall [admin] webapp=null path=/admin/metrics params={prefix=CONTAINER.fs.usableSpace,CONTAINER.fs.totalSpace,CORE.coreName&wt=javabin&version=2&group=solr.node,solr.core} status=0 QTime=0
   [junit4]   2> 48259 INFO  (qtp1223490685-686) [n:127.0.0.1:34435_solr    ] o.a.s.s.HttpSolrCall [admin] webapp=null path=/admin/metrics params={prefix=CONTAINER.fs.usableSpace,CONTAINER.fs.totalSpace,CORE.coreName&wt=javabin&version=2&group=solr.node,solr.core} status=0 QTime=0
   [junit4]   2> 48264 INFO  (qtp1223490685-687) [n:127.0.0.1:34435_solr    ] o.a.s.s.HttpSolrCall [admin] webapp=null path=/admin/metrics params={prefix=CONTAINER.fs.usableSpace,CONTAINER.fs.totalSpace,CORE.coreName&wt=javabin&version=2&group=solr.node,solr.core} status=0 QTime=0
   [junit4]   2> 48315 INFO  (qtp833413504-696) [n:127.0.0.1:37004_solr    ] o.a.s.s.HttpSolrCall [admin] webapp=null path=/admin/metrics params={prefix=CONTAINER.fs.usableSpace,CONTAINER.fs.totalSpace,CORE.coreName&wt=javabin&version=2&group=solr.node,solr.core} status=0 QTime=0
   [junit4]   2> 48329 INFO  (qtp833413504-697) [n:127.0.0.1:37004_solr    ] o.a.s.s.HttpSolrCall [admin] webapp=null path=/admin/metrics params={prefix=CONTAINER.fs.usableSpace,CONTAINER.fs.totalSpace,CORE.coreName&wt=javabin&version=2&group=solr.node,solr.core} status=0 QTime=0
   [junit4]   2> 48331 INFO  (qtp833413504-693) [n:127.0.0.1:37004_solr    ] o.a.s.s.HttpSolrCall [admin] webapp=null path=/admin/metrics params={prefix=CONTAINER.fs.usableSpace,CONTAINER.fs.totalSpace,CORE.coreName&wt=javabin&version=2&group=solr.node,solr.core} status=0 QTime=0
   [junit4]   2> 48335 INFO  (qtp833413504-694) [n:127.0.0.1:37004_solr    ] o.a.s.s.HttpSolrCall [admin] webapp=null path=/admin/metrics params={prefix=CONTAINER.fs.usableSpace,CONTAINER.fs.totalSpace,CORE.coreName&wt=javabin&version=2&group=solr.node,solr.core} status=0 QTime=0
   [junit4]   2> 48337 INFO  (qtp833413504-695) [n:127.0.0.1:37004_solr    ] o.a.s.s.HttpSolrCall [admin] webapp=null path=/admin/metrics params={prefix=CONTAINER.fs.usableSpace,CONTAINER.fs.totalSpace,CORE.coreName&wt=javabin&version=2&group=solr.node,solr.core} status=0 QTime=0
   [junit4]   2> 48355 INFO  (OverseerStateUpdate-72553677045956617-127.0.0.1:37004_solr-n_0000000000) [n:127.0.0.1:37004_solr    ] o.a.s.c.o.SliceMutator createReplica() {
   [junit4]   2>   "operation":"ADDREPLICA",
   [junit4]   2>   "collection":"first_collection",
   [junit4]   2>   "shard":"shard1",
   [junit4]   2>   "core":"first_collection_shard1_replica_n1",
   [junit4]   2>   "state":"down",
   [junit4]   2>   "base_url":"https://127.0.0.1:37004/solr",
   [junit4]   2>   "type":"NRT",
   [junit4]   2>   "waitForFinalState":"false"} 
   [junit4]   2> 48363 INFO  (OverseerStateUpdate-72553677045956617-127.0.0.1:37004_solr-n_0000000000) [n:127.0.0.1:37004_solr    ] o.a.s.c.o.SliceMutator createReplica() {
   [junit4]   2>   "operation":"ADDREPLICA",
   [junit4]   2>   "collection":"first_collection",
   [junit4]   2>   "shard":"shard2",
   [junit4]   2>   "core":"first_collection_shard2_replica_n2",
   [junit4]   2>   "state":"down",
   [junit4]   2>   "base_url":"https://127.0.0.1:34435/solr",
   [junit4]   2>   "type":"NRT",
   [junit4]   2>   "waitForFinalState":"false"} 
   [junit4]   2> 48371 INFO  (OverseerStateUpdate-72553677045956617-127.0.0.1:37004_solr-n_0000000000) [n:127.0.0.1:37004_solr    ] o.a.s.c.o.SliceMutator createReplica() {
   [junit4]   2>   "operation":"ADDREPLICA",
   [junit4]   2>   "collection":"first_collection",
   [junit4]   2>   "shard":"shard3",
   [junit4]   2>   "core":"first_collection_shard3_replica_n4",
   [junit4]   2>   "state":"down",
   [junit4]   2>   "base_url":"https://127.0.0.1:39568/solr",
   [junit4]   2>   "type":"NRT",
   [junit4]   2>   "waitForFinalState":"false"} 
   [junit4]   2> 48584 INFO  (qtp1223490685-688) [n:127.0.0.1:34435_solr    x:first_collection_shard2_replica_n2] o.a.s.h.a.CoreAdminOperation core create command qt=/admin/cores&collection.configName=org.apache.solr.cloud.TestMiniSolrCloudClusterSSL&newCollection=true&collection=first_collection&version=2&replicaType=NRT&property.config=solrconfig-tlog.xml&coreNodeName=core_node5&name=first_collection_shard2_replica_n2&action=CREATE&numShards=3&shard=shard2&wt=javabin
   [junit4]   2> 48586 INFO  (qtp629204170-707) [n:127.0.0.1:39568_solr    x:first_collection_shard3_replica_n4] o.a.s.h.a.CoreAdminOperation core create command qt=/admin/cores&collection.configName=org.apache.solr.cloud.TestMiniSolrCloudClusterSSL&newCollection=true&collection=first_collection&version=2&replicaType=NRT&property.config=solrconfig-tlog.xml&coreNodeName=core_node6&name=first_collection_shard3_replica_n4&action=CREATE&numShards=3&shard=shard3&wt=javabin
   [junit4]   2> 48587 INFO  (qtp629204170-707) [n:127.0.0.1:39568_solr    x:first_collection_shard3_replica_n4] o.a.s.c.TransientSolrCoreCacheDefault Allocating transient cache for 2147483647 transient cores
   [junit4]   2> 48592 INFO  (qtp833413504-696) [n:127.0.0.1:37004_solr    x:first_collection_shard1_replica_n1] o.a.s.h.a.CoreAdminOperation core create command qt=/admin/cores&collection.configName=org.apache.solr.cloud.TestMiniSolrCloudClusterSSL&newCollection=true&collection=first_collection&version=2&replicaType=NRT&property.config=solrconfig-tlog.xml&coreNodeName=core_node3&name=first_collection_shard1_replica_n1&action=CREATE&numShards=3&shard=shard1&wt=javabin
   [junit4]   2> 49655 INFO  (qtp833413504-696) [n:127.0.0.1:37004_solr c:first_collection s:shard1 r:core_node3 x:first_collection_shard1_replica_n1] o.a.s.c.SolrConfig Using Lucene MatchVersion: 8.0.0
   [junit4]   2> 49661 INFO  (qtp629204170-707) [n:127.0.0.1:39568_solr c:first_collection s:shard3 r:core_node6 x:first_collection_shard3_replica_n4] o.a.s.c.SolrConfig Using Lucene MatchVersion: 8.0.0
   [junit4]   2> 49668 INFO  (qtp1223490685-688) [n:127.0.0.1:34435_solr c:first_collection s:shard2 r:core_node5 x:first_collection_shard2_replica_n2] o.a.s.c.SolrConfig Using Lucene MatchVersion: 8.0.0
   [junit4]   2> 49757 INFO  (qtp629204170-707) [n:127.0.0.1:39568_solr c:first_collection s:shard3 r:core_node6 x:first_collection_shard3_replica_n4] o.a.s.s.IndexSchema [first_collection_shard3_replica_n4] Schema name=test
   [junit4]   2> 49758 INFO  (qtp833413504-696) [n:127.0.0.1:37004_solr c:first_collection s:shard1 r:core_node3 x:first_collection_shard1_replica_n1] o.a.s.s.IndexSchema [first_collection_shard1_replica_n1] Schema name=test
   [junit4]   2> 49778 INFO  (qtp1223490685-688) [n:127.0.0.1:34435_solr c:first_collection s:shard2 r:core_node5 x:first_collection_shard2_replica_n2] o.a.s.s.IndexSchema [first_collection_shard2_replica_n2] Schema name=test
   [junit4]   2> 49953 INFO  (qtp1223490685-688) [n:127.0.0.1:34435_solr c:first_collection s:shard2 r:core_node5 x:first_collection_shard2_replica_n2] o.a.s.s.IndexSchema Loaded schema test/1.0 with uniqueid field id
   [junit4]   2> 49988 INFO  (qtp833413504-696) [n:127.0.0.1:37004_solr c:first_collection s:shard1 r:core_node3 x:first_collection_shard1_replica_n1] o.a.s.s.IndexSchema Loaded schema test/1.0 with uniqueid field id
   [junit4]   2> 49994 INFO  (qtp629204170-707) [n:127.0.0.1:39568_solr c:first_collection s:shard3 r:core_node6 x:first_collection_shard3_replica_n4] o.a.s.s.IndexSchema Loaded schema test/1.0 with uniqueid field id
   [junit4]   2> 50021 INFO  (qtp1223490685-688) [n:127.0.0.1:34435_solr c:first_collection s:shard2 r:core_node5 x:first_collection_shard2_replica_n2] o.a.s.c.CoreContainer Creating SolrCore 'first_collection_shard2_replica_n2' using configuration from collection first_collection, trusted=true
   [junit4]   2> 50022 INFO  (qtp1223490685-688) [n:127.0.0.1:34435_solr c:first_collection s:shard2 r:core_node5 x:first_collection_shard2_replica_n2] o.a.s.m.r.SolrJmxReporter JMX monitoring for 'solr_34435.solr.core.first_collection.shard2.replica_n2' (registry 'solr.core.first_collection.shard2.replica_n2') enabled at server: com.sun.jmx.mbeanserver.JmxMBeanServer@322ea78c
   [junit4]   2> 50022 INFO  (qtp1223490685-688) [n:127.0.0.1:34435_solr c:first_collection s:shard2 r:core_node5 x:first_collection_shard2_replica_n2] o.a.s.c.SolrCore [[first_collection_shard2_replica_n2] ] Opening new SolrCore at [/x1/jenkins/jenkins-slave/workspace/Lucene-Solr-NightlyTests-master/checkout/solr/build/solr-core/test/J2/temp/solr.cloud.TestMiniSolrCloudClusterSSL_7A4F02805D37A45D-001/tempDir-001/node2/first_collection_shard2_replica_n2], dataDir=[/x1/jenkins/jenkins-slave/workspace/Lucene-Solr-NightlyTests-master/checkout/solr/build/solr-core/test/J2/temp/solr.cloud.TestMiniSolrCloudClusterSSL_7A4F02805D37A45D-001/tempDir-001/node2/./first_collection_shard2_replica_n2/data/]
   [junit4]   2> 50028 INFO  (qtp1223490685-688) [n:127.0.0.1:34435_solr c:first_collection s:shard2 r:core_node5 x:first_collection_shard2_replica_n2] o.a.s.u.RandomMergePolicy RandomMergePolicy wrapping class org.apache.lucene.index.MockRandomMergePolicy: org.apache.lucene.index.MockRandomMergePolicy@5ba99ca4
   [junit4]   2> 50042 INFO  (qtp833413504-696) [n:127.0.0.1:37004_solr c:first_collection s:shard1 r:core_node3 x:first_collection_shard1_replica_n1] o.a.s.c.CoreContainer Creating SolrCore 'first_collection_shard1_replica_n1' using configuration from collection first_collection, trusted=true
   [junit4]   2> 50043 INFO  (qtp833413504-696) [n:127.0.0.1:37004_solr c:first_collection s:shard1 r:core_node3 x:first_collection_shard1_replica_n1] o.a.s.m.r.SolrJmxReporter JMX monitoring for 'solr_37004.solr.core.first_collection.shard1.replica_n1' (registry 'solr.core.first_collection.shard1.replica_n1') enabled at server: com.sun.jmx.mbeanserver.JmxMBeanServer@322ea78c
   [junit4]   2> 50043 INFO  (qtp833413504-696) [n:127.0.0.1:37004_solr c:first_collection s:shard1 r:core_node3 x:first_collection_shard1_replica_n1] o.a.s.c.SolrCore [[first_collection_shard1_replica_n1] ] Opening new SolrCore at [/x1/jenkins/jenkins-slave/workspace/Lucene-Solr-NightlyTests-master/checkout/solr/build/solr-core/test/J2/temp/solr.cloud.TestMiniSolrCloudClusterSSL_7A4F02805D37A45D-001/tempDir-001/node3/first_collection_shard1_replica_n1], dataDir=[/x1/jenkins/jenkins-slave/workspace/Lucene-Solr-NightlyTests-master/checkout/solr/build/solr-core/test/J2/temp/solr.cloud.TestMiniSolrCloudClusterSSL_7A4F02805D37A45D-001/tempDir-001/node3/./first_collection_shard1_replica_n1/data/]
   [junit4]   2> 50051 INFO  (qtp833413504-696) [n:127.0.0.1:37004_solr c:first_collection s:shard1 r:core_node3 x:first_collection_shard1_replica_n1] o.a.s.u.RandomMergePolicy RandomMergePolicy wrapping class org.apache.lucene.index.MockRandomMergePolicy: org.apache.lucene.index.MockRandomMergePolicy@50c87fdb
   [junit4]   2> 50055 INFO  (qtp629204170-707) [n:127.0.0.1:39568_solr c:first_collection s:shard3 r:core_node6 x:first_collection_shard3_replica_n4] o.a.s.c.CoreContainer Creating SolrCore 'first_collection_shard3_replica_n4' using configuration from collection first_collection, trusted=true
   [junit4]   2> 50056 INFO  (qtp629204170-707) [n:127.0.0.1:39568_solr c:first_collection s:shard3 r:core_node6 x:first_collection_shard3_replica_n4] o.a.s.m.r.SolrJmxReporter JMX monitoring for 'solr_39568.solr.core.first_collection.shard3.replica_n4' (registry 'solr.core.first_collection.shard3.replica_n4') enabled at server: com.sun.jmx.mbeanserver.JmxMBeanServer@322ea78c
   [junit4]   2> 50057 INFO  (qtp629204170-707) [n:127.0.0.1:39568_solr c:first_collection s:shard3 r:core_node6 x:first_collection_shard3_replica_n4] o.a.s.c.SolrCore [[first_collection_shard3_replica_n4] ] Opening new SolrCore at [/x1/jenkins/jenkins-slave/workspace/Lucene-Solr-NightlyTests-master/checkout/solr/build/solr-core/test/J2/temp/solr.cloud.TestMiniSolrCloudClusterSSL_7A4F02805D37A45D-001/tempDir-001/node1/first_collection_shard3_replica_n4], dataDir=[/x1/jenkins/jenkins-slave/workspace/Lucene-Solr-NightlyTests-master/checkout/solr/build/solr-core/test/J2/temp/solr.cloud.TestMiniSolrCloudClusterSSL_7A4F02805D37A45D-001/tempDir-001/node1/./first_collection_shard3_replica_n4/data/]
   [junit4]   2> 50060 INFO  (qtp629204170-707) [n:127.0.0.1:39568_solr c:first_collection s:shard3 r:core_node6 x:first_collection_shard3_replica_n4] o.a.s.u.RandomMergePolicy RandomMergePolicy wrapping class org.apache.lucene.index.MockRandomMergePolicy: org.apache.lucene.index.MockRandomMergePolicy@382ef036
   [junit4]   2> 50063 WARN  (qtp1223490685-688) [n:127.0.0.1:34435_solr c:first_collection s:shard2 r:core_node5 x:first_collection_shard2_replica_n2] o.a.s.c.RequestHandlers INVALID paramSet a in requestHandler {type = requestHandler,name = /dump,class = DumpRequestHandler,attributes = {initParams=a, name=/dump, class=DumpRequestHandler},args = {defaults={a=A,b=B}}}
   [junit4]   2> 50065 WARN  (qtp833413504-696) [n:127.0.0.1:37004_solr c:first_collection s:shard1 r:core_node3 x:first_collection_shard1_replica_n1] o.a.s.c.RequestHandlers INVALID paramSet a in requestHandler {type = requestHandler,name = /dump,class = DumpRequestHandler,attributes = {initParams=a, name=/dump, class=DumpRequestHandler},args = {defaults={a=A,b=B}}}
   [junit4]   2> 50070 WARN  (qtp629204170-707) [n:127.0.0.1:39568_solr c:first_collection s:shard3 r:core_node6 x:first_collection_shard3_replica_n4] o.a.s.c.RequestHandlers INVALID paramSet a in requestHandler {type = requestHandler,name = /dump,class = DumpRequestHandler,attributes = {initParams=a, name=/dump, class=DumpRequestHandler},args = {defaults={a=A,b=B}}}
   [junit4]   2> 50144 INFO  (qtp1223490685-688) [n:127.0.0.1:34435_solr c:first_collection s:shard2 r:core_node5 x:first_collection_shard2_replica_n2] o.a.s.u.UpdateHandler Using UpdateLog implementation: org.apache.solr.update.UpdateLog
   [junit4]   2> 50144 INFO  (qtp1223490685-688) [n:127.0.0.1:34435_solr c:first_collection s:shard2 r:core_node5 x:first_collection_shard2_replica_n2] o.a.s.u.UpdateLog Initializing UpdateLog: dataDir= defaultSyncLevel=FLUSH numRecordsToKeep=100 maxNumLogsToKeep=10 numVersionBuckets=65536
   [junit4]   2> 50147 INFO  (qtp833413504-696) [n:127.0.0.1:37004_solr c:first_collection s:shard1 r:core_node3 x:first_collection_shard1_replica_n1] o.a.s.u.UpdateHandler Using UpdateLog implementation: org.apache.solr.update.UpdateLog
   [junit4]   2> 50147 INFO  (qtp833413504-696) [n:127.0.0.1:37004_solr c:first_collection s:shard1 r:core_node3 x:first_collection_shard1_replica_n1] o.a.s.u.UpdateLog Initializing UpdateLog: dataDir= defaultSyncLevel=FLUSH numRecordsToKeep=100 maxNumLogsToKeep=10 numVersionBuckets=65536
   [junit4]   2> 50148 INFO  (qtp1223490685-688) [n:127.0.0.1:34435_solr c:first_collection s:shard2 r:core_node5 x:first_collection_shard2_replica_n2] o.a.s.u.CommitTracker Hard AutoCommit: disabled
   [junit4]   2> 50148 INFO  (qtp1223490685-688) [n:127.0.0.1:34435_solr c:first_collection s:shard2 r:core_node5 x:first_collection_shard2_replica_n2] o.a.s.u.CommitTracker Soft AutoCommit: disabled
   [junit4]   2> 50149 INFO  (qtp1223490685-688) [n:127.0.0.1:34435_solr c:first_collection s:shard2 r:core_node5 x:first_collection_shard2_replica_n2] o.a.s.u.RandomMergePolicy RandomMergePolicy wrapping class org.apache.lucene.index.LogByteSizeMergePolicy: [LogByteSizeMergePolicy: minMergeSize=1677721, mergeFactor=7, maxMergeSize=2147483648, maxMergeSizeForForcedMerge=9223372036854775807, calibrateSizeByDeletes=true, maxMergeDocs=2147483647, maxCFSSegmentSizeMB=8.796093022207999E12, noCFSRatio=1.0]
   [junit4]   2> 50150 INFO  (qtp833413504-696) [n:127.0.0.1:37004_solr c:first_collection s:shard1 r:core_node3 x:first_collection_shard1_replica_n1] o.a.s.u.CommitTracker Hard AutoCommit: disabled
   [junit4]   2> 50150 INFO  (qtp833413504-696) [n:127.0.0.1:37004_solr c:first_collection s:shard1 r:core_node3 x:first_collection_shard1_replica_n1] o.a.s.u.CommitTracker Soft AutoCommit: disabled
   [junit4]   2> 50150 INFO  (qtp1223490685-688) [n:127.0.0.1:34435_solr c:first_collection s:shard2 r:core_node5 x:first_collection_shard2_replica_n2] o.a.s.s.SolrIndexSearcher Opening [Searcher@23a56a3b[first_collection_shard2_replica_n2] main]
   [junit4]   2> 50151 INFO  (qtp833413504-696) [n:127.0.0.1:37004_solr c:first_collection s:shard1 r:core_node3 x:first_collection_shard1_replica_n1] o.a.s.u.RandomMergePolicy RandomMergePolicy wrapping class org.apache.lucene.index.LogByteSizeMergePolicy: [LogByteSizeMergePolicy: minMergeSize=1677721, mergeFactor=7, maxMergeSize=2147483648, maxMergeSizeForForcedMerge=9223372036854775807, calibrateSizeByDeletes=true, maxMergeDocs=2147483647, maxCFSSegmentSizeMB=8.796093022207999E12, noCFSRatio=1.0]
   [junit4]   2> 50160 INFO  (qtp833413504-696) [n:127.0.0.1:37004_solr c:first_collection s:shard1 r:core_node3 x:first_collection_shard1_replica_n1] o.a.s.s.SolrIndexSearcher Opening [Searcher@5f477dd2[first_collection_shard1_replica_n1] main]
   [junit4]   2> 50160 INFO  (qtp1223490685-688) [n:127.0.0.1:34435_solr c:first_collection s:shard2 r:core_node5 x:first_collection_shard2_replica_n2] o.a.s.r.ManagedResourceStorage Configured ZooKeeperStorageIO with znodeBase: /configs/org.apache.solr.cloud.TestMiniSolrCloudClusterSSL
   [junit4]   2> 50161 INFO  (qtp1223490685-688) [n:127.0.0.1:34435_solr c:first_collection s:shard2 r:core_node5 x:first_collection_shard2_replica_n2] o.a.s.r.ManagedResourceStorage Loaded null at path _rest_managed.json using ZooKeeperStorageIO:path=/configs/org.apache.solr.cloud.TestMiniSolrCloudClusterSSL
   [junit4]   2> 50162 INFO  (qtp1223490685-688) [n:127.0.0.1:34435_solr c:first_collection s:shard2 r:core_node5 x:first_collection_shard2_replica_n2] o.a.s.h.ReplicationHandler Commits will be reserved for 10000ms.
   [junit4]   2> 50164 INFO  (qtp833413504-696) [n:127.0.0.1:37004_solr c:first_collection s:shard1 r:core_node3 x:first_collection_shard1_replica_n1] o.a.s.r.ManagedResourceStorage Configured ZooKeeperStorageIO with znodeBase: /configs/org.apache.solr.cloud.TestMiniSolrCloudClusterSSL
   [junit4]   2> 50165 INFO  (qtp833413504-696) [n:127.0.0.1:37004_solr c:first_collection s:shard1 r:core_node3 x:first_collection_shard1_replica_n1] o.a.s.r.ManagedResourceStorage Loaded null at path _rest_managed.json using ZooKeeperStorageIO:path=/configs/org.apache.solr.cloud.TestMiniSolrCloudClusterSSL
   [junit4]   2> 50166 INFO  (qtp833413504-696) [n:127.0.0.1:37004_solr c:first_collection s:shard1 r:core_node3 x:first_collection_shard1_replica_n1] o.a.s.h.ReplicationHandler Commits will be reserved for 10000ms.
   [junit4]   2> 50175 INFO  (qtp833413504-696) [n:127.0.0.1:37004_solr c:first_collection s:shard1 r:core_node3 x:first_collection_shard1_replica_n1] o.a.s.u.UpdateLog Could not find max version in index or recent updates, using new clock 1621554473770942464
   [junit4]   2> 50176 INFO  (qtp1223490685-688) [n:127.0.0.1:34435_solr c:first_collection s:shard2 r:core_node5 x:first_collection_shard2_replica_n2] o.a.s.u.UpdateLog Could not find max version in index or recent updates, using new clock 1621554473771991040
   [junit4]   2> 50179 INFO  (qtp629204170-707) [n:127.0.0.1:39568_solr c:first_collection s:shard3 r:core_node6 x:first_collection_shard3_replica_n4] o.a.s.u.UpdateHandler Using UpdateLog implementation: org.apache.solr.update.UpdateLog
   [junit4]   2> 50179 INFO  (qtp629204170-707) [n:127.0.0.1:39568_solr c:first_collection s:shard3 r:core_node6 x:first_collection_shard3_replica_n4] o.a.s.u.UpdateLog Initializing UpdateLog: dataDir= defaultSyncLevel=FLUSH numRecordsToKeep=100 maxNumLogsToKeep=10 numVersionBuckets=65536
   [junit4]   2> 50184 INFO  (searcherExecutor-222-thread-1-processing-n:127.0.0.1:34435_solr x:first_collection_shard2_replica_n2 c:first_collection s:shard2 r:core_node5) [n:127.0.0.1:34435_solr c:first_collection s:shard2 r:core_node5 x:first_collection_shard2_replica_n2] o.a.s.c.SolrCore [first_collection_shard2_replica_n2] Registered new searcher Searcher@23a56a3b[first_collection_shard2_replica_n2] main{ExitableDirectoryReader(UninvertingDirectoryReader())}
   [junit4]   2> 50187 INFO  (searcherExecutor-223-thread-1-processing-n:127.0.0.1:37004_solr x:first_collection_shard1_replica_n1 c:first_collection s:shard1 r:core_node3) [n:127.0.0.1:37004_solr c:first_collection s:shard1 r:core_node3 x:first_collection_shard1_replica_n1] o.a.s.c.SolrCore [first_collection_shard1_replica_n1] Registered new searcher Searcher@5f477dd2[first_collection_shard1_replica_n1] main{ExitableDirectoryReader(UninvertingDirectoryReader())}
   [junit4]   2> 50187 INFO  (qtp629204170-707) [n:127.0.0.1:39568_solr c:first_collection s:shard3 r:core_node6 x:first_collection_shard3_replica_n4] o.a.s.u.CommitTracker Hard AutoCommit: disabled
   [junit4]   2> 50187 INFO  (qtp629204170-707) [n:127.0.0.1:39568_solr c:first_collection s:shard3 r:core_node6 x:first_collection_shard3_replica_n4] o.a.s.u.CommitTracker Soft AutoCommit: disabled
   [junit4]   2> 50189 INFO  (qtp629204170-707) [n:127.0.0.1:39568_solr c:first_collection s:shard3 r:core_node6 x:first_collection_shard3_replica_n4] o.a.s.u.RandomMergePolicy RandomMergePolicy wrapping class org.apache.lucene.index.LogByteSizeMergePolicy: [LogByteSizeMergePolicy: minMergeSize=1677721, mergeFactor=7, maxMergeSize=2147483648, maxMergeSizeForForcedMerge=9223372036854775807, calibrateSizeByDeletes=true, maxMergeDocs=2147483647, maxCFSSegmentSizeMB=8.796093022207999E12, noCFSRatio=1.0]
   [junit4]   2> 50190 INFO  (qtp629204170-707) [n:127.0.0.1:39568_solr c:first_collection s:shard3 r:core_node6 x:first_collection_shard3_replica_n4] o.a.s.s.SolrIndexSearcher Opening [Searcher@422ac2cc[first_collection_shard3_replica_n4] main]
   [junit4]   2> 50192 INFO  (qtp629204170-707) [n:127.0.0.1:39568_solr c:first_collection s:shard3 r:core_node6 x:first_collection_shard3_replica_n4] o.a.s.r.ManagedResourceStorage Configured ZooKeeperStorageIO with znodeBase: /configs/org.apache.solr.cloud.TestMiniSolrCloudClusterSSL
   [junit4]   2> 50194 INFO  (qtp629204170-707) [n:127.0.0.1:39568_solr c:first_collection s:shard3 r:core_node6 x:first_collection_shard3_replica_n4] o.a.s.r.ManagedResourceStorage Loaded null at path _rest_managed.json using ZooKeeperStorageIO:path=/configs/org.apache.solr.cloud.TestMiniSolrCloudClusterSSL
   [junit4]   2> 50194 INFO  (qtp1223490685-688) [n:127.0.0.1:34435_solr c:first_collection s:shard2 r:core_node5 x:first_collection_shard2_replica_n2] o.a.s.c.ZkShardTerms Successful update of terms at /collections/first_collection/terms/shard2 to Terms{values={core_node5=0}, version=0}
   [junit4]   2> 50195 INFO  (qtp833413504-696) [n:127.0.0.1:37004_solr c:first_collection s:shard1 r:core_node3 x:first_collection_shard1_replica_n1] o.a.s.c.ZkShardTerms Successful update of terms at /collections/first_collection/terms/shard1 to Terms{values={core_node3=0}, version=0}
   [junit4]   2> 50195 INFO  (qtp833413504-696) [n:127.0.0.1:37004_solr c:first_collection s:shard1 r:core_node3 x:first_collection_shard1_replica_n1] o.a.s.c.ShardLeaderElectionContextBase make sure parent is created /collections/first_collection/leaders/shard1
   [junit4]   2> 50195 INFO  (qtp1223490685-688) [n:127.0.0.1:34435_solr c:first_collection s:shard2 r:core_node5 x:first_collection_shard2_replica_n2] o.a.s.c.ShardLeaderElectionContextBase make sure parent is created /collections/first_collection/leaders/shard2
   [junit4]   2> 50196 INFO  (qtp629204170-707) [n:127.0.0.1:39568_solr c:first_collection s:shard3 r:core_node6 x:first_collection_shard3_replica_n4] o.a.s.h.ReplicationHandler Commits will be reserved for 10000ms.
   [junit4]   2> 50196 INFO  (qtp629204170-707) [n:127.0.0.1:39568_solr c:first_collection s:shard3 r:core_node6 x:first_collection_shard3_replica_n4] o.a.s.u.UpdateLog Could not find max version in index or recent updates, using new clock 1621554473792962560
   [junit4]   2> 50202 INFO  (qtp833413504-696) [n:127.0.0.1:37004_solr c:first_collection s:shard1 r:core_node3 x:first_collection_shard1_replica_n1] o.a.s.c.ShardLeaderElectionContext Enough replicas found to continue.
   [junit4]   2> 50202 INFO  (qtp833413504-696) [n:127.0.0.1:37004_solr c:first_collection s:shard1 r:core_node3 x:first_collection_shard1_replica_n1] o.a.s.c.ShardLeaderElectionContext I may be the new leader - try and sync
   [junit4]   2> 50202 INFO  (qtp1223490685-688) [n:127.0.0.1:34435_solr c:first_collection s:shard2 r:core_node5 x:first_collection_shard2_replica_n2] o.a.s.c.ShardLeaderElectionContext Enough replicas found to continue.
   [junit4]   2> 50202 INFO  (qtp1223490685-688) [n:127.0.0.1:34435_solr c:first_collection s:shard2 r:core_node5 x:first_collection_shard2_replica_n2] o.a.s.c.ShardLeaderElectionContext I may be the new leader - try and sync
   [junit4]   2> 50202 INFO  (qtp1223490685-688) [n:127.0.0.1:34435_solr c:first_collection s:shard2 r:core_node5 x:first_collection_shard2_replica_n2] o.a.s.c.SyncStrategy Sync replicas to https://127.0.0.1:34435/solr/first_collection_shard2_replica_n2/
   [junit4]   2> 50202 INFO  (qtp833413504-696) [n:127.0.0.1:37004_solr c:first_collection s:shard1 r:core_node3 x:first_collection_shard1_replica_n1] o.a.s.c.SyncStrategy Sync replicas to https://127.0.0.1:37004/solr/first_collection_shard1_replica_n1/
   [junit4]   2> 50203 INFO  (qtp833413504-696) [n:127.0.0.1:37004_solr c:first_collection s:shard1 r:core_node3 x:first_collection_shard1_replica_n1] o.a.s.c.SyncStrategy Sync Success - now sync replicas to me
   [junit4]   2> 50203 INFO  (qtp1223490685-688) [n:127.0.0.1:34435_solr c:first_collection s:shard2 r:core_node5 x:first_collection_shard2_replica_n2] o.a.s.c.SyncStrategy Sync Success - now sync replicas to me
   [junit4]   2> 50204 INFO  (qtp1223490685-688) [n:127.0.0.1:34435_solr c:first_collection s:shard2 r:core_node5 x:first_collection_shard2_replica_n2] o.a.s.c.SyncStrategy https://127.0.0.1:34435/solr/first_collection_shard2_replica_n2/ has no replicas
   [junit4]   2> 50204 INFO  (qtp833413504-696) [n:127.0.0.1:37004_solr c:first_collection s:shard1 r:core_node3 x:first_collection_shard1_replica_n1] o.a.s.c.SyncStrategy https://127.0.0.1:37004/solr/first_collection_shard1_replica_n1/ has no replicas
   [junit4]   2> 50204 INFO  (qtp1223490685-688) [n:127.0.0.1:34435_solr c:first_collection s:shard2 r:core_node5 x:first_collection_shard2_replica_n2] o.a.s.c.ShardLeaderElectionContextBase Creating leader registration node /collections/first_collection/leaders/shard2/leader after winning as /collections/first_collection/leader_elect/shard2/election/72553677045956620-core_node5-n_0000000000
   [junit4]   2> 50204 INFO  (qtp833413504-696) [n:127.0.0.1:37004_solr c:first_collection s:shard1 r:core_node3 x:first_collection_shard1_replica_n1] o.a.s.c.ShardLeaderElectionContextBase Creating leader registration node /collections/first_collection/leaders/shard1/leader after winning as /collections/first_collection/leader_elect/shard1/election/72553677045956617-core_node3-n_0000000000
   [junit4]   2> 50209 INFO  (qtp833413504-696) [n:127.0.0.1:37004_solr c:first_collection s:shard1 r:core_node3 x:first_collection_shard1_replica_n1] o.a.s.c.ShardLeaderElectionContext I am the new leader: https://127.0.0.1:37004/solr/first_collection_shard1_replica_n1/ shard1
   [junit4]   2> 50211 INFO  (qtp1223490685-688) [n:127.0.0.1:34435_solr c:first_collection s:shard2 r:core_node5 x:first_collection_shard2_replica_n2] o.a.s.c.ShardLeaderElectionContext I am the new leader: https://127.0.0.1:34435/solr/first_collection_shard2_replica_n2/ shard2
   [junit4]   2> 50212 INFO  (searcherExecutor-224-thread-1-processing-n:127.0.0.1:39568_solr x:first_collection_shard3_replica_n4 c:first_collection s:shard3 r:core_node6) [n:127.0.0.1:39568_solr c:first_collection s:shard3 r:core_node6 x:first_collection_shard3_replica_n4] o.a.s.c.SolrCore [first_collection_shard3_replica_n4] Registered new searcher Searcher@422ac2cc[first_collection_shard3_replica_n4] main{ExitableDirectoryReader(UninvertingDirectoryReader())}
   [junit4]   2> 50214 INFO  (qtp629204170-707) [n:127.0.0.1:39568_solr c:first_collection s:shard3 r:core_node6 x:first_collection_shard3_replica_n4] o.a.s.c.ZkShardTerms Successful update of terms at /collections/first_collection/terms/shard3 to Terms{values={core_node6=0}, version=0}
   [junit4]   2> 50215 INFO  (qtp629204170-707) [n:127.0.0.1:39568_solr c:first_collection s:shard3 r:core_node6 x:first_collection_shard3_replica_n4] o.a.s.c.ShardLeaderElectionContextBase make sure parent is created /collections/first_collection/leaders/shard3
   [junit4]   2> 50220 INFO  (qtp629204170-707) [n:127.0.0.1:39568_solr c:first_collection s:shard3 r:core_node6 x:first_collection_shard3_replica_n4] o.a.s.c.ShardLeaderElectionContext Enough replicas found to continue.
   [junit4]   2> 50220 INFO  (qtp629204170-707) [n:127.0.0.1:39568_solr c:first_collection s:shard3 r:core_node6 x:first_collection_shard3_replica_n4] o.a.s.c.ShardLeaderElectionContext I may be the new leader - try and sync
   [junit4]   2> 50220 INFO  (qtp629204170-707) [n:127.0.0.1:39568_solr c:first_collection s:shard3 r:core_node6 x:first_collection_shard3_replica_n4] o.a.s.c.SyncStrategy Sync replicas to https://127.0.0.1:39568/solr/first_collection_shard3_replica_n4/
   [junit4]   2> 50220 INFO  (qtp629204170-707) [n:127.0.0.1:39568_solr c:first_collection s:shard3 r:core_node6 x:first_collection_shard3_replica_n4] o.a.s.c.SyncStrategy Sync Success - now sync replicas to me
   [junit4]   2> 50221 INFO  (qtp629204170-707) [n:127.0.0.1:39568_solr c:first_collection s:shard3 r:core_node6 x:first_collection_shard3_replica_n4] o.a.s.c.SyncStrategy https://127.0.0.1:39568/solr/first_collection_shard3_replica_n4/ has no replicas
   [junit4]   2> 50221 INFO  (qtp629204170-707) [n:127.0.0.1:39568_solr c:first_collection s:shard3 r:core_node6 x:first_collection_shard3_replica_n4] o.a.s.c.ShardLeaderElectionContextBase Creating leader registration node /collections/first_collection/leaders/shard3/leader after winning as /collections/first_collection/leader_elect/shard3/election/72553677045956615-core_node6-n_0000000000
   [junit4]   2> 50226 INFO  (qtp629204170-707) [n:127.0.0.1:39568_solr c:first_collection s:shard3 r:core_node6 x:first_collection_shard3_replica_n4] o.a.s.c.ShardLeaderElectionContext I am the new leader: https://127.0.0.1:39568/solr/first_collection_shard3_replica_n4/ shard3
   [junit4]   2> 50328 INFO  (zkCallback-234-thread-1) [    ] o.a.s.c.c.ZkStateReader A cluster state change: [WatchedEvent state:SyncConnected type:NodeDataChanged path:/collections/first_collection/state.json] for collection [first_collection] has occurred - updating... (live nodes size: [3])
   [junit4]   2> 50328 INFO  (zkCallback-259-thread-1) [    ] o.a.s.c.c.ZkStateReader A cluster state change: [WatchedEvent state:SyncConnected type:NodeDataChanged path:/collections/first_collection/state.json] for collection [first_collection] has occurred - updating... (live nodes size: [3])
   [junit4]   2> 50328 INFO  (zkCallback-244-thread-1) [    ] o.a.s.c.c.ZkStateReader A cluster state change: [WatchedEvent state:SyncConnected type:NodeDataChanged path:/collections/first_collection/state.json] for collection [first_collection] has occurred - updating... (live nodes size: [3])
   [junit4]   2> 50328 INFO  (zkCallback-244-thread-2) [    ] o.a.s.c.c.ZkStateReader A cluster state change: [WatchedEvent state:SyncConnected type:NodeDataChanged path:/collections/first_collection/state.json] for collection [first_collection] has occurred - updating... (live nodes size: [3])
   [junit4]   2> 50329 INFO  (zkCallback-259-thread-2) [    ] o.a.s.c.c.ZkStateReader A cluster state change: [WatchedEvent state:SyncConnected type:NodeDataChanged path:/collections/first_collection/state.json] for collection [first_collection] has occurred - updating... (live nodes size: [3])
   [junit4]   2> 50329 INFO  (zkCallback-234-thread-2) [    ] o.a.s.c.c.ZkStateReader A cluster state change: [WatchedEvent state:SyncConnected type:NodeDataChanged path:/collections/first_collection/state.json] for collection [first_collection] has occurred - updating... (live nodes size: [3])
   [junit4]   2> 50330 INFO  (qtp1223490685-688) [n:127.0.0.1:34435_solr c:first_collection s:shard2 r:core_node5 x:first_collection_shard2_replica_n2] o.a.s.c.ZkController I am the leader, no recovery necessary
   [junit4]   2> 50336 INFO  (qtp833413504-696) [n:127.0.0.1:37004_solr c:first_collection s:shard1 r:core_node3 x:first_collection_shard1_replica_n1] o.a.s.c.ZkController I am the leader, no recovery necessary
   [junit4]   2> 50336 INFO  (qtp629204170-707) [n:127.0.0.1:39568_solr c:first_collection s:shard3 r:core_node6 x:first_collection_shard3_replica_n4] o.a.s.c.ZkController I am the leader, no recovery necessary
   [junit4]   2> 50341 INFO  (qtp1223490685-688) [n:127.0.0.1:34435_solr c:first_collection s:shard2 r:core_node5 x:first_collection_shard2_replica_n2] o.a.s.s.HttpSolrCall [admin] webapp=null path=/admin/cores params={qt=/admin/cores&collection.configName=org.apache.solr.cloud.TestMiniSolrCloudClusterSSL&newCollection=true&collection=first_collection&version=2&replicaType=NRT&property.config=solrconfig-tlog.xml&coreNodeName=core_node5&name=first_collection_shard2_replica_n2&action=CREATE&numShards=3&shard=shard2&wt=javabin} status=0 QTime=1756
   [junit4]   2> 50343 INFO  (qtp833413504-696) [n:127.0.0.1:37004_solr c:first_collection s:shard1 r:core_node3 x:first_collection_shard1_replica_n1] o.a.s.s.HttpSolrCall [admin] webapp=null path=/admin/cores params={qt=/admin/cores&collection.configName=org.apache.solr.cloud.TestMiniSolrCloudClusterSSL&newCollection=true&collection=first_collection&version=2&replicaType=NRT&property.config=solrconfig-tlog.xml&coreNodeName=core_node3&name=first_collection_shard1_replica_n1&action=CREATE&numShards=3&shard=shard1&wt=javabin} status=0 QTime=1750
   [junit4]   2> 50346 INFO  (qtp629204170-707) [n:127.0.0.1:39568_solr c:first_collection s:shard3 r:core_node6 x:first_collection_shard3_replica_n4] o.a.s.s.HttpSolrCall [admin] webapp=null path=/admin/cores params={qt=/admin/cores&collection.configName=org.apache.solr.cloud.TestMiniSolrCloudClusterSSL&newCollection=true&collection=first_collection&version=2&replicaType=NRT&property.config=solrconfig-tlog.xml&coreNodeName=core_node6&name=first_collection_shard3_replica_n4&action=CREATE&numShards=3&shard=shard3&wt=javabin} status=0 QTime=1759
   [junit4]   2> 50353 INFO  (qtp629204170-703) [n:127.0.0.1:39568_solr    ] o.a.s.h.a.CollectionsHandler Wait for new collection to be active for at most 45 seconds. Check all shard replicas
   [junit4]   2> 50443 INFO  (zkCallback-259-thread-2) [    ] o.a.s.c.c.ZkStateReader A cluster state change: [WatchedEvent state:SyncConnected type:NodeDataChanged path:/collections/first_collection/state.json] for collection [first_collection] has occurred - updating... (live nodes size: [3])
   [junit4]   2> 50443 INFO  (zkCallback-234-thread-1) [    ] o.a.s.c.c.ZkStateReader A cluster state change: [WatchedEvent state:SyncConnected type:NodeDataChanged path:/collections/first_collection/state.json] for collection [first_collection] has occurred - updating... (live nodes size: [3])
   [junit4]   2> 50443 INFO  (zkCallback-234-thread-2) [    ] o.a.s.c.c.ZkStateReader A cluster state change: [WatchedEvent state:SyncConnected type:NodeDataChanged path:/collections/first_collection/state.json] for collection [first_collection] has occurred - updating... (live nodes size: [3])
   [junit4]   2> 50443 INFO  (zkCallback-259-thread-1) [    ] o.a.s.c.c.ZkStateReader A cluster state change: [WatchedEvent state:SyncConnected type:NodeDataChanged path:/collections/first_collection/state.json] for collection [first_collection] has occurred - updating... (live nodes size: [3])
   [junit4]   2> 50443 INFO  (zkCallback-244-thread-2) [    ] o.a.s.c.c.ZkStateReader A cluster state change: [WatchedEvent state:SyncConnected type:NodeDataChanged path:/collections/first_collection/state.json] for collection [first_collection] has occurred - updating... (live nodes size: [3])
   [junit4]   2> 50443 INFO  (zkCallback-244-thread-1) [    ] o.a.s.c.c.ZkStateReader A cluster state change: [WatchedEvent state:SyncConnected type:NodeDataChanged path:/collections/first_collection/state.json] for collection [first_collection] has occurred - updating... (live nodes size: [3])
   [junit4]   2> 50443 INFO  (zkCallback-259-thread-3) [    ] o.a.s.c.c.ZkStateReader A cluster state change: [WatchedEvent state:SyncConnected type:NodeDataChanged path:/collections/first_collection/state.json] for collection [first_collection] has occurred - updating... (live nodes size: [3])
   [junit4]   2> 50444 INFO  (zkCallback-234-thread-3) [    ] o.a.s.c.c.ZkStateReader A cluster state change: [WatchedEvent state:SyncConnected type:NodeDataChanged path:/collections/first_collection/state.json] for collection [first_collection] has occurred - updating... (live nodes size: [3])
   [junit4]   2> 50444 INFO  (qtp629204170-703) [n:127.0.0.1:39568_solr    ] o.a.s.s.HttpSolrCall [admin] webapp=null path=/admin/collections params={property.config=solrconfig-tlog.xml&collection.configName=org.apache.solr.cloud.TestMiniSolrCloudClusterSSL&name=first_collection&nrtReplicas=1&action=CREATE&numShards=3&wt=javabin&version=2} status=0 QTime=2420
   [junit4]   2> 50445 INFO  (zkCallback-244-thread-3) [    ] o.a.s.c.c.ZkStateReader A cluster state change: [WatchedEvent state:SyncConnected type:NodeDataChanged path:/collections/first_collection/state.json] for collection [first_collection] has occurred - updating... (live nodes size: [3])
   [junit4]   2> 50522 INFO  (qtp629204170-707) [n:127.0.0.1:39568_solr c:first_collection s:shard3 r:core_node6 x:first_collection_shard3_replica_n4] o.a.s.c.S.Request [first_collection_shard3_replica_n4]  webapp=/solr path=/select params={df=text&distrib=false&_stateVer_=first_collection:4&fl=id&fl=score&shards.purpose=4&start=0&fsv=true&shard.url=https://127.0.0.1:39568/solr/first_collection_shard3_replica_n4/&rows=10&version=2&q=*:*&NOW=1546434854571&isShard=true&wt=javabin} hits=0 status=0 QTime=3
   [junit4]   2> 50558 INFO  (qtp1223490685-687) [n:127.0.0.1:34435_solr c:first_collection s:shard2 r:core_node5 x:first_collection_shard2_replica_n2] o.a.s.c.S.Request [first_collection_shard2_replica_n2]  webapp=/solr path=/select params={df=text&distrib=false&_stateVer_=first_collection:4&fl=id&fl=score&shards.purpose=4&start=0&fsv=true&shard.url=https://127.0.0.1:34435/solr/first_collection_shard2_replica_n2/&rows=10&version=2&q=*:*&NOW=1546434854571&isShard=true&wt=javabin} hits=0 status=0 QTime=2
   [junit4]   2> 50565 INFO  (qtp833413504-693) [n:127.0.0.1:37004_solr c:first_collection s:shard1 r:core_node3 x:first_collection_shard1_replica_n1] o.a.s.c.S.Request [first_collection_shard1_replica_n1]  webapp=/solr path=/select params={df=text&distrib=false&_stateVer_=first_collection:4&fl=id&fl=score&shards.purpose=4&start=0&fsv=true&shard.url=https://127.0.0.1:37004/solr/first_collection_shard1_replica_n1/&rows=10&version=2&q=*:*&NOW=1546434854571&isShard=true&wt=javabin} hits=0 status=0 QTime=1
   [junit4]   2> 50575 INFO  (qtp833413504-694) [n:127.0.0.1:37004_solr c:first_collection s:shard1 r:core_node3 x:first_collection_shard1_replica_n1] o.a.s.c.S.Request [first_collection_shard1_replica_n1]  webapp=/solr path=/select params={q=*:*&_stateVer_=first_collection:4&wt=javabin&version=2} hits=0 status=0 QTime=119
   [junit4]   2> 50592 INFO  (qtp629204170-707) [n:127.0.0.1:39568_solr    ] o.a.s.s.HttpSolrCall [admin] webapp=null path=/admin/cores params={action=STATUS&indexInfo=true&wt=javabin&version=2} status=0 QTime=2
   [junit4]   2> 50602 INFO  (qtp629204170-703) [n:127.0.0.1:39568_solr    ] o.a.s.s.HttpSolrCall [admin] webapp=null path=/admin/cores params={action=STATUS&indexInfo=true&wt=javabin&version=2} status=0 QTime=1
   [junit4]   2> 50607 INFO  (TEST-TestMiniSolrCloudClusterSSL.testSslWithInvalidPeerName-seed#[7A4F02805D37A45D]) [    ] o.a.h.i.e.RetryExec I/O exception (org.apache.http.conn.UnsupportedSchemeException) caught when processing request to {}->http://127.0.0.1:39568: http protocol is not supported
   [junit4]   2> 50607 INFO  (TEST-TestMiniSolrCloudClusterSSL.testSslWithInvalidPeerName-seed#[7A4F02805D37A45D]) [    ] o.a.h.i.e.RetryExec Retrying request to {}->http://127.0.0.1:39568
   [junit4]   2> 50644 INFO  (qtp629204170-703) [n:127.0.0.1:39568_solr    ] o.a.s.s.HttpSolrCall [admin] webapp=null path=/admin/cores params={} status=0 QTime=0
   [junit4]   2> 50655 INFO  (qtp1223490685-685) [n:127.0.0.1:34435_solr    ] o.a.s.s.HttpSolrCall [admin] webapp=null path=/admin/cores params={action=STATUS&indexInfo=true&wt=javabin&version=2} status=0 QTime=1
   [junit4]   2> 50669 INFO  (qtp1223490685-685) [n:127.0.0.1:34435_solr    ] o.a.s.s.HttpSolrCall [admin] webapp=null path=/admin/cores params={action=STATUS&indexInfo=true&wt=javabin&version=2} status=0 QTime=0
   [junit4]   2> 50675 INFO  (TEST-TestMiniSolrCloudClusterSSL.testSslWithInvalidPeerName-seed#[7A4F02805D37A45D]) [    ] o.a.h.i.e.RetryExec I/O exception (org.apache.http.conn.UnsupportedSchemeException) caught when processing request to {}->http://127.0.0.1:34435: http protocol is not supported
   [junit4]   2> 50675 INFO  (TEST-TestMiniSolrCloudClusterSSL.testSslWithInvalidPeerName-seed#[7A4F02805D37A45D]) [    ] o.a.h.i.e.RetryExec Retrying request to {}->http://127.0.0.1:34435
   [junit4]   2> 50698 INFO  (qtp1223490685-685) [n:127.0.0.1:34435_solr    ] o.a.s.s.HttpSolrCall [admin] webapp=null path=/admin/cores params={} status=0 QTime=0
   [junit4]   2> 50707 INFO  (qtp833413504-697) [n:127.0.0.1:37004_solr    ] o.a.s.s.HttpSolrCall [admin] webapp=null path=/admin/cores params={action=STATUS&indexInfo=true&wt=javabin&version=2} status=0 QTime=1
   [junit4]   2> 50714 INFO  (qtp833413504-697) [n:127.0.0.1:37004_solr    ] o.a.s.s.HttpSolrCall [admin] webapp=null path=/admin/cores params={action=STATUS&indexInfo=true&wt=javabin&version=2} status=0 QTime=0
   [junit4]   2> 50717 INFO  (TEST-TestMiniSolrCloudClusterSSL.testSslWithInvalidPeerName-seed#[7A4F02805D37A45D]) [    ] o.a.h.i.e.RetryExec I/O exception (org.apache.http.conn.UnsupportedSchemeException) caught when processing request to {}->http://127.0.0.1:37004: http protocol is not supported
   [junit4]   2> 50717 INFO  (TEST-TestMiniSolrCloudClusterSSL.testSslWithInvalidPeerName-seed#[7A4F02805D37A45D]) [    ] o.a.h.i.e.RetryExec Retrying request to {}->http://127.0.0.1:37004
   [junit4]   2> 50746 INFO  (qtp833413504-697) [n:127.0.0.1:37004_solr    ] o.a.s.s.HttpSolrCall [admin] webapp=null path=/admin/cores params={} status=0 QTime=0
   [junit4]   2> 50747 INFO  (TEST-TestMiniSolrCloudClusterSSL.testSslWithInvalidPeerName-seed#[7A4F02805D37A45D]) [    ] o.a.s.c.CoreContainer Shutting down CoreContainer instance=948272610
   [junit4]   2> 50747 INFO  (TEST-TestMiniSolrCloudClusterSSL.testSslWithInvalidPeerName-seed#[7A4F02805D37A45D]) [    ] o.a.s.c.ZkController Remove node as live in ZooKeeper:/live_nodes/127.0.0.1:39568_solr
   [junit4]   2> 50748 INFO  (TEST-TestMiniSolrCloudClusterSSL.testSslWithInvalidPeerName-seed#[7A4F02805D37A45D]) [    ] o.a.s.c.CoreContainer Publish this node as DOWN...
   [junit4]   2> 50748 INFO  (TEST-TestMiniSolrCloudClusterSSL.testSslWithInvalidPeerName-seed#[7A4F02805D37A45D]) [    ] o.a.s.c.ZkController Publish node=127.0.0.1:39568_solr as DOWN
   [junit4]   2> 50752 INFO  (coreCloseExecutor-237-thread-1) [n:127.0.0.1:39568_solr c:first_collection s:shard3 r:core_node6 x:first_collection_shard3_replica_n4] o.a.s.c.SolrCore [first_collection_shard3_replica_n4]  CLOSING SolrCore org.apache.solr.core.SolrCore@6fed67cf
   [junit4]   2> 50752 INFO  (coreCloseExecutor-237-thread-1) [n:127.0.0.1:39568_solr c:first_collection s:shard3 r:core_node6 x:first_collection_shard3_replica_n4] o.a.s.m.SolrMetricManager Closing metric reporters for registry=solr.core.first_collection.shard3.replica_n4, tag=6fed67cf
   [junit4]   2> 50752 INFO  (coreCloseExecutor-237-thread-1) [n:127.0.0.1:39568_solr c:first_collection s:shard3 r:core_node6 x:first_collection_shard3_replica_n4] o.a.s.m.r.SolrJmxReporter Closing reporter [org.apache.solr.metrics.reporters.SolrJmxReporter@51c1bb6d: rootName = solr_39568, domain = solr.core.first_collection.shard3.replica_n4, service url = null, agent id = null] for registry solr.core.first_collection.shard3.replica_n4 / com.codahale.metrics.MetricRegistry@4dca28d6
   [junit4]   2> 50773 INFO  (coreCloseExecutor-237-thread-1) [n:127.0.0.1:39568_solr c:first_collection s:shard3 r:core_node6 x:first_collection_shard3_replica_n4] o.a.s.m.SolrMetricManager Closing metric reporters for registry=solr.collection.first_collection.shard3.leader, tag=6fed67cf
   [junit4]   2> 50779 INFO  (TEST-TestMiniSolrCloudClusterSSL.testSslWithInvalidPeerName-seed#[7A4F02805D37A45D]) [    ] o.a.s.m.SolrMetricManager Closing metric reporters for registry=solr.node, tag=null
   [junit4]   2> 50779 INFO  (TEST-TestMiniSolrCloudClusterSSL.testSslWithInvalidPeerName-seed#[7A4F02805D37A45D]) [    ] o.a.s.m.r.SolrJmxReporter Closing reporter [org.apache.solr.metrics.reporters.SolrJmxReporter@72cc6025: rootName = solr_39568, domain = solr.node, service url = null, agent id = null] for registry solr.node / com.codahale.metrics.MetricRegistry@3b19b24b
   [junit4]   2> 50792 INFO  (TEST-TestMiniSolrCloudClusterSSL.testSslWithInvalidPeerName-seed#[7A4F02805D37A45D]) [    ] o.a.s.m.SolrMetricManager Closing metric reporters for registry=solr.jvm, tag=null
   [junit4]   2> 50792 INFO  (TEST-TestMiniSolrCloudClusterSSL.testSslWithInvalidPeerName-seed#[7A4F02805D37A45D]) [    ] o.a.s.m.r.SolrJmxReporter Closing reporter [org.apache.solr.metrics.reporters.SolrJmxReporter@1c63411d: rootName = solr_39568, domain = solr.jvm, service url = null, agent id = null] for registry solr.jvm / com.codahale.metrics.MetricRegistry@19d0569b
   [junit4]   2> 50799 INFO  (TEST-TestMiniSolrCloudClusterSSL.testSslWithInvalidPeerName-seed#[7A4F02805D37A45D]) [    ] o.a.s.m.SolrMetricManager Closing metric reporters for registry=solr.jetty, tag=null
   [junit4]   2> 50799 INFO  (TEST-TestMiniSolrCloudClusterSSL.testSslWithInvalidPeerName-seed#[7A4F02805D37A45D]) [    ] o.a.s.m.r.SolrJmxReporter Closing reporter [org.apache.solr.metrics.reporters.SolrJmxReporter@6b72c170: rootName = solr_39568, domain = solr.jetty, service url = null, agent id = null] for registry solr.jetty / com.codahale.metrics.MetricRegistry@17b738df
   [junit4]   2> 50800 INFO  (TEST-TestMiniSolrCloudClusterSSL.testSslWithInvalidPeerName-seed#[7A4F02805D37A45D]) [    ] o.a.s.m.SolrMetricManager Closing metric reporters for registry=solr.cluster, tag=null
   [junit4]   1> Done close org.apache.solr.common.util.ExecutorUtil$MDCAwareThreadPoolExecutor@291a0d4a[Terminated, pool size = 0, active threads = 0, queued tasks = 0, completed tasks = 2]
   [junit4]   1> Done close org.apache.solr.common.util.ExecutorUtil$MDCAwareThreadPoolExecutor@48ca5a5a[Terminated, pool size = 0, active threads = 0, queued tasks = 0, completed tasks = 2]
   [junit4]   2> 50811 INFO  (zkCallback-244-thread-3) [    ] o.a.s.c.c.ZkStateReader Updated live nodes from ZooKeeper... (3) -> (2)
   [junit4]   2> 50811 INFO  (zkCallback-252-thread-1) [    ] o.a.s.c.c.ZkStateReader Updated live nodes from ZooKeeper... (3) -> (2)
   [junit4]   2> 50811 INFO  (zkCallback-279-thread-1) [    ] o.a.s.c.c.ZkStateReader Updated live nodes from ZooKeeper... (3) -> (2)
   [junit4]   2> 50811 INFO  (zkCallback-272-thread-1) [    ] o.a.s.c.c.ZkStateReader Updated live nodes from ZooKeeper... (3) -> (2)
   [junit4]   2> 50811 INFO  (zkCallback-259-thread-1) [    ] o.a.s.c.c.ZkStateReader Updated live nodes from ZooKeeper... (3) -> (2)
   [junit4]   2> 50815 INFO  (TEST-TestMiniSolrCloudClusterSSL.testSslWithInvalidPeerName-seed#[7A4F02805D37A45D]) [    ] o.e.j.s.AbstractConnector Stopped ServerConnector@629d052b{SSL,[ssl, http/1.1]}{127.0.0.1:0}
   [junit4]   2> 50816 INFO  (TEST-TestMiniSolrCloudClusterSSL.testSslWithInvalidPeerName-seed#[7A4F02805D37A45D]) [    ] o.e.j.s.h.ContextHandler Stopped o.e.j.s.ServletContextHandler@355037a7{/solr,null,UNAVAILABLE}
   [junit4]   2> 50816 INFO  (TEST-TestMiniSolrCloudClusterSSL.testSslWithInvalidPeerName-seed#[7A4F02805D37A45D]) [    ] o.e.j.s.session node0 Stopped scavenging
   [junit4]   2> 50819 WARN  (TEST-TestMiniSolrCloudClusterSSL.testSslWithInvalidPeerName-seed#[7A4F02805D37A45D]) [    ] o.e.j.s.AbstractConnector Ignoring deprecated socket close linger time
   [junit4]   2> 50820 INFO  (TEST-TestMiniSolrCloudClusterSSL.testSslWithInvalidPeerName-seed#[7A4F02805D37A45D]) [    ] o.a.s.c.s.e.JettySolrRunner Start Jetty (original configured port=0)
   [junit4]   2> 50820 INFO  (TEST-TestMiniSolrCloudClusterSSL.testSslWithInvalidPeerName-seed#[7A4F02805D37A45D]) [    ] o.a.s.c.s.e.JettySolrRunner Trying to start Jetty on port 0 try number 1 ...
   [junit4]   2> 50820 INFO  (TEST-TestMi

[...truncated too long message...]

 property disallowed.ivy.jars.list as its length is 0.

-ivy-fail-disallowed-ivy-version:

ivy-fail:

ivy-configure:
[ivy:configure] :: loading settings :: file = /x1/jenkins/jenkins-slave/workspace/Lucene-Solr-NightlyTests-master/checkout/lucene/top-level-ivy-settings.xml

resolve:

ivy-availability-check:
[loadresource] Do not set property disallowed.ivy.jars.list as its length is 0.

-ivy-fail-disallowed-ivy-version:

ivy-fail:

ivy-fail:

ivy-configure:
[ivy:configure] :: loading settings :: file = /x1/jenkins/jenkins-slave/workspace/Lucene-Solr-NightlyTests-master/checkout/lucene/top-level-ivy-settings.xml

resolve:

ivy-availability-check:
[loadresource] Do not set property disallowed.ivy.jars.list as its length is 0.

-ivy-fail-disallowed-ivy-version:

ivy-fail:

ivy-configure:
[ivy:configure] :: loading settings :: file = /x1/jenkins/jenkins-slave/workspace/Lucene-Solr-NightlyTests-master/checkout/lucene/top-level-ivy-settings.xml

resolve:

ivy-availability-check:
[loadresource] Do not set property disallowed.ivy.jars.list as its length is 0.

-ivy-fail-disallowed-ivy-version:

ivy-fail:

ivy-fail:

ivy-configure:
[ivy:configure] :: loading settings :: file = /x1/jenkins/jenkins-slave/workspace/Lucene-Solr-NightlyTests-master/checkout/lucene/top-level-ivy-settings.xml

resolve:

ivy-availability-check:
[loadresource] Do not set property disallowed.ivy.jars.list as its length is 0.

-ivy-fail-disallowed-ivy-version:

ivy-fail:

ivy-fail:

ivy-configure:
[ivy:configure] :: loading settings :: file = /x1/jenkins/jenkins-slave/workspace/Lucene-Solr-NightlyTests-master/checkout/lucene/top-level-ivy-settings.xml

resolve:

ivy-availability-check:
[loadresource] Do not set property disallowed.ivy.jars.list as its length is 0.

-ivy-fail-disallowed-ivy-version:

ivy-fail:

ivy-fail:

ivy-configure:
[ivy:configure] :: loading settings :: file = /x1/jenkins/jenkins-slave/workspace/Lucene-Solr-NightlyTests-master/checkout/lucene/top-level-ivy-settings.xml

resolve:

ivy-availability-check:
[loadresource] Do not set property disallowed.ivy.jars.list as its length is 0.

-ivy-fail-disallowed-ivy-version:

ivy-fail:

ivy-fail:

ivy-configure:
[ivy:configure] :: loading settings :: file = /x1/jenkins/jenkins-slave/workspace/Lucene-Solr-NightlyTests-master/checkout/lucene/top-level-ivy-settings.xml

resolve:

ivy-availability-check:
[loadresource] Do not set property disallowed.ivy.jars.list as its length is 0.

-ivy-fail-disallowed-ivy-version:

ivy-fail:

ivy-fail:

ivy-configure:
[ivy:configure] :: loading settings :: file = /x1/jenkins/jenkins-slave/workspace/Lucene-Solr-NightlyTests-master/checkout/lucene/top-level-ivy-settings.xml

resolve:

ivy-availability-check:
[loadresource] Do not set property disallowed.ivy.jars.list as its length is 0.

-ivy-fail-disallowed-ivy-version:

ivy-fail:

ivy-fail:

ivy-configure:
[ivy:configure] :: loading settings :: file = /x1/jenkins/jenkins-slave/workspace/Lucene-Solr-NightlyTests-master/checkout/lucene/top-level-ivy-settings.xml

resolve:

ivy-availability-check:
[loadresource] Do not set property disallowed.ivy.jars.list as its length is 0.

-ivy-fail-disallowed-ivy-version:

ivy-fail:

ivy-fail:

ivy-configure:
[ivy:configure] :: loading settings :: file = /x1/jenkins/jenkins-slave/workspace/Lucene-Solr-NightlyTests-master/checkout/lucene/top-level-ivy-settings.xml

resolve:

ivy-availability-check:
[loadresource] Do not set property disallowed.ivy.jars.list as its length is 0.

-ivy-fail-disallowed-ivy-version:

ivy-fail:

ivy-fail:

ivy-configure:
[ivy:configure] :: loading settings :: file = /x1/jenkins/jenkins-slave/workspace/Lucene-Solr-NightlyTests-master/checkout/lucene/top-level-ivy-settings.xml

resolve:

ivy-availability-check:
[loadresource] Do not set property disallowed.ivy.jars.list as its length is 0.

-ivy-fail-disallowed-ivy-version:

ivy-fail:

ivy-fail:

ivy-configure:
[ivy:configure] :: loading settings :: file = /x1/jenkins/jenkins-slave/workspace/Lucene-Solr-NightlyTests-master/checkout/lucene/top-level-ivy-settings.xml

resolve:

ivy-availability-check:
[loadresource] Do not set property disallowed.ivy.jars.list as its length is 0.

-ivy-fail-disallowed-ivy-version:

ivy-fail:

ivy-fail:

ivy-configure:
[ivy:configure] :: loading settings :: file = /x1/jenkins/jenkins-slave/workspace/Lucene-Solr-NightlyTests-master/checkout/lucene/top-level-ivy-settings.xml

resolve:

jar-checksums:
    [mkdir] Created dir: /x1/jenkins/jenkins-slave/workspace/Lucene-Solr-NightlyTests-master/checkout/solr/null1593150357
     [copy] Copying 256 files to /x1/jenkins/jenkins-slave/workspace/Lucene-Solr-NightlyTests-master/checkout/solr/null1593150357
   [delete] Deleting directory /x1/jenkins/jenkins-slave/workspace/Lucene-Solr-NightlyTests-master/checkout/solr/null1593150357

check-working-copy:
[ivy:cachepath] :: resolving dependencies :: org.eclipse.jgit#org.eclipse.jgit-caller;working
[ivy:cachepath] 	confs: [default]
[ivy:cachepath] 	found org.eclipse.jgit#org.eclipse.jgit;4.6.0.201612231935-r in public
[ivy:cachepath] 	found com.jcraft#jsch;0.1.53 in public
[ivy:cachepath] 	found com.googlecode.javaewah#JavaEWAH;1.1.6 in public
[ivy:cachepath] 	found org.apache.httpcomponents#httpclient;4.3.6 in public
[ivy:cachepath] 	found org.apache.httpcomponents#httpcore;4.3.3 in public
[ivy:cachepath] 	found commons-logging#commons-logging;1.1.3 in public
[ivy:cachepath] 	found commons-codec#commons-codec;1.6 in public
[ivy:cachepath] 	found org.slf4j#slf4j-api;1.7.2 in public
[ivy:cachepath] :: resolution report :: resolve 57ms :: artifacts dl 7ms
	---------------------------------------------------------------------
	|                  |            modules            ||   artifacts   |
	|       conf       | number| search|dwnlded|evicted|| number|dwnlded|
	---------------------------------------------------------------------
	|      default     |   8   |   0   |   0   |   0   ||   8   |   0   |
	---------------------------------------------------------------------
[wc-checker] Initializing working copy...
[wc-checker] SLF4J: Failed to load class "org.slf4j.impl.StaticLoggerBinder".
[wc-checker] SLF4J: Defaulting to no-operation (NOP) logger implementation
[wc-checker] SLF4J: See http://www.slf4j.org/codes.html#StaticLoggerBinder for further details.
[wc-checker] Checking working copy status...

-jenkins-base:

BUILD SUCCESSFUL
Total time: 311 minutes 34 seconds
Archiving artifacts
java.lang.InterruptedException: no matches found within 10000
	at hudson.FilePath$ValidateAntFileMask.hasMatch(FilePath.java:2847)
	at hudson.FilePath$ValidateAntFileMask.invoke(FilePath.java:2726)
	at hudson.FilePath$ValidateAntFileMask.invoke(FilePath.java:2707)
	at hudson.FilePath$FileCallableWrapper.call(FilePath.java:3086)
Also:   hudson.remoting.Channel$CallSiteStackTrace: Remote call to lucene
		at hudson.remoting.Channel.attachCallSiteStackTrace(Channel.java:1741)
		at hudson.remoting.UserRequest$ExceptionResponse.retrieve(UserRequest.java:357)
		at hudson.remoting.Channel.call(Channel.java:955)
		at hudson.FilePath.act(FilePath.java:1072)
		at hudson.FilePath.act(FilePath.java:1061)
		at hudson.FilePath.validateAntFileMask(FilePath.java:2705)
		at hudson.tasks.ArtifactArchiver.perform(ArtifactArchiver.java:243)
		at hudson.tasks.BuildStepCompatibilityLayer.perform(BuildStepCompatibilityLayer.java:81)
		at hudson.tasks.BuildStepMonitor$1.perform(BuildStepMonitor.java:20)
		at hudson.model.AbstractBuild$AbstractBuildExecution.perform(AbstractBuild.java:744)
		at hudson.model.AbstractBuild$AbstractBuildExecution.performAllBuildSteps(AbstractBuild.java:690)
		at hudson.model.Build$BuildExecution.post2(Build.java:186)
		at hudson.model.AbstractBuild$AbstractBuildExecution.post(AbstractBuild.java:635)
		at hudson.model.Run.execute(Run.java:1835)
		at hudson.model.FreeStyleBuild.run(FreeStyleBuild.java:43)
		at hudson.model.ResourceController.execute(ResourceController.java:97)
		at hudson.model.Executor.run(Executor.java:429)
Caused: hudson.FilePath$TunneledInterruptedException
	at hudson.FilePath$FileCallableWrapper.call(FilePath.java:3088)
	at hudson.remoting.UserRequest.perform(UserRequest.java:212)
	at hudson.remoting.UserRequest.perform(UserRequest.java:54)
	at hudson.remoting.Request$2.run(Request.java:369)
	at hudson.remoting.InterceptingExecutorService$1.call(InterceptingExecutorService.java:72)
	at java.util.concurrent.FutureTask.run(FutureTask.java:266)
	at java.util.concurrent.ThreadPoolExecutor.runWorker(ThreadPoolExecutor.java:1142)
	at java.util.concurrent.ThreadPoolExecutor$Worker.run(ThreadPoolExecutor.java:617)
	at java.lang.Thread.run(Thread.java:748)
Caused: java.lang.InterruptedException: java.lang.InterruptedException: no matches found within 10000
	at hudson.FilePath.act(FilePath.java:1074)
	at hudson.FilePath.act(FilePath.java:1061)
	at hudson.FilePath.validateAntFileMask(FilePath.java:2705)
	at hudson.tasks.ArtifactArchiver.perform(ArtifactArchiver.java:243)
	at hudson.tasks.BuildStepCompatibilityLayer.perform(BuildStepCompatibilityLayer.java:81)
	at hudson.tasks.BuildStepMonitor$1.perform(BuildStepMonitor.java:20)
	at hudson.model.AbstractBuild$AbstractBuildExecution.perform(AbstractBuild.java:744)
	at hudson.model.AbstractBuild$AbstractBuildExecution.performAllBuildSteps(AbstractBuild.java:690)
	at hudson.model.Build$BuildExecution.post2(Build.java:186)
	at hudson.model.AbstractBuild$AbstractBuildExecution.post(AbstractBuild.java:635)
	at hudson.model.Run.execute(Run.java:1835)
	at hudson.model.FreeStyleBuild.run(FreeStyleBuild.java:43)
	at hudson.model.ResourceController.execute(ResourceController.java:97)
	at hudson.model.Executor.run(Executor.java:429)
No artifacts found that match the file pattern "**/*.events,heapdumps/**,**/hs_err_pid*". Configuration error?
Recording test results
Build step 'Publish JUnit test result report' changed build result to UNSTABLE
Email was triggered for: Unstable (Test Failures)
Sending email for trigger: Unstable (Test Failures)

Mime
View raw message