lucene-dev mailing list archives

Site index · List index
Message view « Date » · « Thread »
Top « Date » · « Thread »
From Apache Jenkins Server <jenk...@builds.apache.org>
Subject [JENKINS] Lucene-Solr-Tests-master - Build # 3109 - Unstable
Date Tue, 01 Jan 2019 09:53:22 GMT
Build: https://builds.apache.org/job/Lucene-Solr-Tests-master/3109/

1 tests failed.
FAILED:  org.apache.solr.cloud.autoscaling.sim.TestSimTriggerIntegration.testNodeLostTriggerRestoreState

Error Message:
The trigger did not fire at all

Stack Trace:
java.lang.AssertionError: The trigger did not fire at all
	at __randomizedtesting.SeedInfo.seed([FA80E598EE37EC8C:D17F30C3744FF95C]:0)
	at org.junit.Assert.fail(Assert.java:88)
	at org.junit.Assert.assertTrue(Assert.java:41)
	at org.apache.solr.cloud.autoscaling.sim.TestSimTriggerIntegration.testNodeLostTriggerRestoreState(TestSimTriggerIntegration.java:332)
	at sun.reflect.NativeMethodAccessorImpl.invoke0(Native Method)
	at sun.reflect.NativeMethodAccessorImpl.invoke(NativeMethodAccessorImpl.java:62)
	at sun.reflect.DelegatingMethodAccessorImpl.invoke(DelegatingMethodAccessorImpl.java:43)
	at java.lang.reflect.Method.invoke(Method.java:498)
	at com.carrotsearch.randomizedtesting.RandomizedRunner.invoke(RandomizedRunner.java:1750)
	at com.carrotsearch.randomizedtesting.RandomizedRunner$8.evaluate(RandomizedRunner.java:938)
	at com.carrotsearch.randomizedtesting.RandomizedRunner$9.evaluate(RandomizedRunner.java:974)
	at com.carrotsearch.randomizedtesting.RandomizedRunner$10.evaluate(RandomizedRunner.java:988)
	at com.carrotsearch.randomizedtesting.rules.SystemPropertiesRestoreRule$1.evaluate(SystemPropertiesRestoreRule.java:57)
	at org.apache.lucene.util.TestRuleSetupTeardownChained$1.evaluate(TestRuleSetupTeardownChained.java:49)
	at org.apache.lucene.util.AbstractBeforeAfterRule$1.evaluate(AbstractBeforeAfterRule.java:45)
	at org.apache.lucene.util.TestRuleThreadAndTestName$1.evaluate(TestRuleThreadAndTestName.java:48)
	at org.apache.lucene.util.TestRuleIgnoreAfterMaxFailures$1.evaluate(TestRuleIgnoreAfterMaxFailures.java:64)
	at org.apache.lucene.util.TestRuleMarkFailure$1.evaluate(TestRuleMarkFailure.java:47)
	at com.carrotsearch.randomizedtesting.rules.StatementAdapter.evaluate(StatementAdapter.java:36)
	at com.carrotsearch.randomizedtesting.ThreadLeakControl$StatementRunner.run(ThreadLeakControl.java:368)
	at com.carrotsearch.randomizedtesting.ThreadLeakControl.forkTimeoutingTask(ThreadLeakControl.java:817)
	at com.carrotsearch.randomizedtesting.ThreadLeakControl$3.evaluate(ThreadLeakControl.java:468)
	at com.carrotsearch.randomizedtesting.RandomizedRunner.runSingleTest(RandomizedRunner.java:947)
	at com.carrotsearch.randomizedtesting.RandomizedRunner$5.evaluate(RandomizedRunner.java:832)
	at com.carrotsearch.randomizedtesting.RandomizedRunner$6.evaluate(RandomizedRunner.java:883)
	at com.carrotsearch.randomizedtesting.RandomizedRunner$7.evaluate(RandomizedRunner.java:894)
	at com.carrotsearch.randomizedtesting.rules.StatementAdapter.evaluate(StatementAdapter.java:36)
	at com.carrotsearch.randomizedtesting.rules.SystemPropertiesRestoreRule$1.evaluate(SystemPropertiesRestoreRule.java:57)
	at org.apache.lucene.util.AbstractBeforeAfterRule$1.evaluate(AbstractBeforeAfterRule.java:45)
	at com.carrotsearch.randomizedtesting.rules.StatementAdapter.evaluate(StatementAdapter.java:36)
	at org.apache.lucene.util.TestRuleStoreClassName$1.evaluate(TestRuleStoreClassName.java:41)
	at com.carrotsearch.randomizedtesting.rules.NoShadowingOrOverridesOnMethodsRule$1.evaluate(NoShadowingOrOverridesOnMethodsRule.java:40)
	at com.carrotsearch.randomizedtesting.rules.NoShadowingOrOverridesOnMethodsRule$1.evaluate(NoShadowingOrOverridesOnMethodsRule.java:40)
	at com.carrotsearch.randomizedtesting.rules.StatementAdapter.evaluate(StatementAdapter.java:36)
	at com.carrotsearch.randomizedtesting.rules.StatementAdapter.evaluate(StatementAdapter.java:36)
	at com.carrotsearch.randomizedtesting.rules.StatementAdapter.evaluate(StatementAdapter.java:36)
	at org.apache.lucene.util.TestRuleAssertionsRequired$1.evaluate(TestRuleAssertionsRequired.java:53)
	at org.apache.lucene.util.TestRuleMarkFailure$1.evaluate(TestRuleMarkFailure.java:47)
	at org.apache.lucene.util.TestRuleIgnoreAfterMaxFailures$1.evaluate(TestRuleIgnoreAfterMaxFailures.java:64)
	at org.apache.lucene.util.TestRuleIgnoreTestSuites$1.evaluate(TestRuleIgnoreTestSuites.java:54)
	at com.carrotsearch.randomizedtesting.rules.StatementAdapter.evaluate(StatementAdapter.java:36)
	at com.carrotsearch.randomizedtesting.ThreadLeakControl$StatementRunner.run(ThreadLeakControl.java:368)
	at java.lang.Thread.run(Thread.java:748)




Build Log:
[...truncated 13341 lines...]
   [junit4] Suite: org.apache.solr.cloud.autoscaling.sim.TestSimTriggerIntegration
   [junit4]   2> 1280771 INFO  (SUITE-TestSimTriggerIntegration-seed#[FA80E598EE37EC8C]-worker) [    ] o.a.s.SolrTestCaseJ4 SecureRandom sanity checks: test.solr.allowed.securerandom=null & java.security.egd=file:/dev/./urandom
   [junit4]   2> Creating dataDir: /home/jenkins/jenkins-slave/workspace/Lucene-Solr-Tests-master/solr/build/solr-core/test/J2/temp/solr.cloud.autoscaling.sim.TestSimTriggerIntegration_FA80E598EE37EC8C-001/init-core-data-001
   [junit4]   2> 1280807 WARN  (SUITE-TestSimTriggerIntegration-seed#[FA80E598EE37EC8C]-worker) [    ] o.a.s.SolrTestCaseJ4 startTrackingSearchers: numOpens=1 numCloses=1
   [junit4]   2> 1280807 INFO  (SUITE-TestSimTriggerIntegration-seed#[FA80E598EE37EC8C]-worker) [    ] o.a.s.SolrTestCaseJ4 Using TrieFields (NUMERIC_POINTS_SYSPROP=false) w/NUMERIC_DOCVALUES_SYSPROP=false
   [junit4]   2> 1280825 INFO  (SUITE-TestSimTriggerIntegration-seed#[FA80E598EE37EC8C]-worker) [    ] o.a.s.SolrTestCaseJ4 Randomized ssl (false) and clientAuth (true) via: @org.apache.solr.util.RandomizeSSL(reason=, ssl=NaN, value=NaN, clientAuth=NaN)
   [junit4] IGNOR/A 0.00s J2 | TestSimTriggerIntegration.testCooldown
   [junit4]    > Assumption #1: 'badapple' test group is disabled (@BadApple(bugUrl=https://issues.apache.org/jira/browse/SOLR-12028))
   [junit4] IGNOR/A 0.00s J2 | TestSimTriggerIntegration.testEventFromRestoredState
   [junit4]    > Assumption #1: 'badapple' test group is disabled (@BadApple(bugUrl=https://issues.apache.org/jira/browse/SOLR-12028))
   [junit4] IGNOR/A 0.00s J2 | TestSimTriggerIntegration.testSearchRate
   [junit4]    > Assumption #1: 'awaitsfix' test group is disabled (@AwaitsFix(bugUrl=https://issues.apache.org/jira/browse/SOLR-12028))
   [junit4] IGNOR/A 0.00s J2 | TestSimTriggerIntegration.testTriggerThrottling
   [junit4]    > Assumption #1: 'badapple' test group is disabled (@BadApple(bugUrl=https://issues.apache.org/jira/browse/SOLR-12028))
   [junit4] IGNOR/A 0.00s J2 | TestSimTriggerIntegration.testNodeMarkersRegistration
   [junit4]    > Assumption #1: 'badapple' test group is disabled (@BadApple(bugUrl=https://issues.apache.org/jira/browse/SOLR-12028))
   [junit4] IGNOR/A 0.00s J2 | TestSimTriggerIntegration.testNodeLostTrigger
   [junit4]    > Assumption #1: 'awaitsfix' test group is disabled (@AwaitsFix(bugUrl=https://issues.apache.org/jira/browse/SOLR-12028))
   [junit4]   2> 1280843 INFO  (TEST-TestSimTriggerIntegration.testListeners-seed#[FA80E598EE37EC8C]) [    ] o.a.s.SolrTestCaseJ4 ###Starting testListeners
   [junit4]   2> 1280913 DEBUG (TEST-TestSimTriggerIntegration.testListeners-seed#[FA80E598EE37EC8C]) [    ] o.a.s.c.a.s.SimClusterStateProvider --- new Overseer leader: 127.0.0.1:10009_solr
   [junit4]   2> 1280914 DEBUG (Simulated OverseerAutoScalingTriggerThread) [    ] o.a.s.c.a.OverseerTriggerThread Adding .auto_add_replicas and .scheduled_maintenance triggers
   [junit4]   2> 1280914 DEBUG (Simulated OverseerAutoScalingTriggerThread) [    ] o.a.s.c.a.OverseerTriggerThread Refreshing /autoscaling.json with znode version 1
   [junit4]   2> 1280914 DEBUG (Simulated OverseerAutoScalingTriggerThread) [    ] o.a.s.c.a.OverseerTriggerThread Current znodeVersion 1, lastZnodeVersion 0
   [junit4]   2> 1280914 DEBUG (Simulated OverseerAutoScalingTriggerThread) [    ] o.a.s.c.a.OverseerTriggerThread Processed trigger updates upto znodeVersion 1
   [junit4]   2> 1280946 DEBUG (TEST-TestSimTriggerIntegration.testListeners-seed#[FA80E598EE37EC8C]) [    ] o.a.s.c.a.s.SimClusterStateProvider ** creating new collection states, currentVersion=0
   [junit4]   2> 1280946 DEBUG (TEST-TestSimTriggerIntegration.testListeners-seed#[FA80E598EE37EC8C]) [    ] o.a.s.c.a.s.SimClusterStateProvider ** saved cluster state version 0
   [junit4]   2> 1280946 INFO  (TEST-TestSimTriggerIntegration.testListeners-seed#[FA80E598EE37EC8C]) [    ] o.a.s.h.a.MetricsHistoryHandler No .system collection, keeping metrics history in memory.
   [junit4]   2> 1280948 DEBUG (Simulated OverseerAutoScalingTriggerThread) [    ] o.a.s.c.a.NodeLostTrigger NodeLostTrigger .auto_add_replicas - Initial livenodes: [127.0.0.1:10010_solr, 127.0.0.1:10009_solr]
   [junit4]   2> 1280949 DEBUG (Simulated OverseerAutoScalingTriggerThread) [    ] o.a.s.c.a.OverseerTriggerThread -- cleaning old nodeLost / nodeAdded markers
   [junit4]   2> 1280949 DEBUG (Simulated OverseerAutoScalingTriggerThread) [    ] o.a.s.c.a.OverseerTriggerThread Current znodeVersion 1, lastZnodeVersion 1
   [junit4]   2> 1280949 DEBUG (ScheduledTrigger-2620-thread-2) [    ] o.a.s.c.a.NodeLostTrigger Running NodeLostTrigger: .auto_add_replicas with currently live nodes: 2 and last live nodes: 2
   [junit4]   2> 1280969 DEBUG (simCloudManagerPool-2619-thread-2) [    ] o.a.s.c.a.AutoScalingHandler Verified autoscaling configuration
   [junit4]   2> 1280969 DEBUG (simCloudManagerPool-2619-thread-2) [    ] o.a.s.c.a.OverseerTriggerThread Refreshing /autoscaling.json with znode version 2
   [junit4]   2> 1280969 DEBUG (ScheduledTrigger-2620-thread-1) [    ] o.a.s.c.a.NodeLostTrigger Running NodeLostTrigger: .auto_add_replicas with currently live nodes: 2 and last live nodes: 2
   [junit4]   2> 1280970 DEBUG (Simulated OverseerAutoScalingTriggerThread) [    ] o.a.s.c.a.OverseerTriggerThread Processed trigger updates upto znodeVersion 2
   [junit4]   2> 1280983 DEBUG (Simulated OverseerAutoScalingTriggerThread) [    ] o.a.s.c.a.OverseerTriggerThread -- cleaning old nodeLost / nodeAdded markers
   [junit4]   2> 1280983 DEBUG (Simulated OverseerAutoScalingTriggerThread) [    ] o.a.s.c.a.OverseerTriggerThread Current znodeVersion 2, lastZnodeVersion 2
   [junit4]   2> 1280988 DEBUG (simCloudManagerPool-2619-thread-3) [    ] o.a.s.c.a.AutoScalingHandler Verified autoscaling configuration
   [junit4]   2> 1280988 DEBUG (simCloudManagerPool-2619-thread-3) [    ] o.a.s.c.a.OverseerTriggerThread Refreshing /autoscaling.json with znode version 3
   [junit4]   2> 1280988 DEBUG (Simulated OverseerAutoScalingTriggerThread) [    ] o.a.s.c.a.OverseerTriggerThread Processed trigger updates upto znodeVersion 3
   [junit4]   2> 1280988 INFO  (Simulated OverseerAutoScalingTriggerThread) [    ] o.a.s.c.a.s.TestSimTriggerIntegration TestTriggerAction init
   [junit4]   2> 1280988 DEBUG (Simulated OverseerAutoScalingTriggerThread) [    ] o.a.s.c.a.NodeAddedTrigger NodeAddedTrigger node_added_trigger - Initial livenodes: [127.0.0.1:10010_solr, 127.0.0.1:10009_solr]
   [junit4]   2> 1280988 DEBUG (Simulated OverseerAutoScalingTriggerThread) [    ] o.a.s.c.a.NodeAddedTrigger NodeAddedTrigger node_added_trigger instantiated with properties: {event=nodeAdded, waitFor=2, actions=[{name=test, class=org.apache.solr.cloud.autoscaling.sim.TestSimTriggerIntegration$TestTriggerAction}, {name=test1, class=org.apache.solr.cloud.autoscaling.sim.TestSimTriggerIntegration$TestDummyAction}], enabled=true}
   [junit4]   2> 1280989 DEBUG (Simulated OverseerAutoScalingTriggerThread) [    ] o.a.s.c.a.OverseerTriggerThread -- cleaning old nodeLost / nodeAdded markers
   [junit4]   2> 1280989 DEBUG (Simulated OverseerAutoScalingTriggerThread) [    ] o.a.s.c.a.OverseerTriggerThread Current znodeVersion 3, lastZnodeVersion 3
   [junit4]   2> 1280989 DEBUG (ScheduledTrigger-2620-thread-4) [    ] o.a.s.c.a.NodeAddedTrigger Running NodeAddedTrigger node_added_trigger
   [junit4]   2> 1280989 DEBUG (ScheduledTrigger-2620-thread-4) [    ] o.a.s.c.a.NodeAddedTrigger Found livenodes: 2
   [junit4]   2> 1281006 DEBUG (ScheduledTrigger-2620-thread-4) [    ] o.a.s.c.a.NodeLostTrigger Running NodeLostTrigger: .auto_add_replicas with currently live nodes: 2 and last live nodes: 2
   [junit4]   2> 1281009 DEBUG (simCloudManagerPool-2619-thread-4) [    ] o.a.s.c.a.AutoScalingHandler Verified autoscaling configuration
   [junit4]   2> 1281009 DEBUG (simCloudManagerPool-2619-thread-4) [    ] o.a.s.c.a.OverseerTriggerThread Refreshing /autoscaling.json with znode version 4
   [junit4]   2> 1281009 DEBUG (Simulated OverseerAutoScalingTriggerThread) [    ] o.a.s.c.a.OverseerTriggerThread Processed trigger updates upto znodeVersion 4
   [junit4]   2> 1281009 DEBUG (Simulated OverseerAutoScalingTriggerThread) [    ] o.a.s.c.a.OverseerTriggerThread -- cleaning old nodeLost / nodeAdded markers
   [junit4]   2> 1281009 DEBUG (Simulated OverseerAutoScalingTriggerThread) [    ] o.a.s.c.a.OverseerTriggerThread Current znodeVersion 4, lastZnodeVersion 4
   [junit4]   2> 1281010 DEBUG (simCloudManagerPool-2619-thread-5) [    ] o.a.s.c.a.AutoScalingHandler Verified autoscaling configuration
   [junit4]   2> 1281010 DEBUG (simCloudManagerPool-2619-thread-5) [    ] o.a.s.c.a.OverseerTriggerThread Refreshing /autoscaling.json with znode version 5
   [junit4]   2> 1281084 DEBUG (ScheduledTrigger-2620-thread-4) [    ] o.a.s.c.a.NodeLostTrigger Running NodeLostTrigger: .auto_add_replicas with currently live nodes: 2 and last live nodes: 2
   [junit4]   2> 1281084 DEBUG (Simulated OverseerAutoScalingTriggerThread) [    ] o.a.s.c.a.OverseerTriggerThread Processed trigger updates upto znodeVersion 5
   [junit4]   2> 1281084 DEBUG (Simulated OverseerAutoScalingTriggerThread) [    ] o.a.s.c.a.OverseerTriggerThread -- cleaning old nodeLost / nodeAdded markers
   [junit4]   2> 1281084 DEBUG (Simulated OverseerAutoScalingTriggerThread) [    ] o.a.s.c.a.OverseerTriggerThread Current znodeVersion 5, lastZnodeVersion 5
   [junit4]   2> 1281085 DEBUG (TEST-TestSimTriggerIntegration.testListeners-seed#[FA80E598EE37EC8C]) [    ] o.a.s.c.a.s.SimClusterStateProvider -- creating marker: /autoscaling/nodeAdded/127.0.0.1:10011_solr
   [junit4]   2> 1281087 DEBUG (ScheduledTrigger-2620-thread-1) [    ] o.a.s.c.a.NodeAddedTrigger Running NodeAddedTrigger node_added_trigger
   [junit4]   2> 1281087 DEBUG (ScheduledTrigger-2620-thread-1) [    ] o.a.s.c.a.NodeAddedTrigger Found livenodes: 3
   [junit4]   2> 1281087 DEBUG (ScheduledTrigger-2620-thread-1) [    ] o.a.s.c.a.NodeAddedTrigger Tracking new node: 127.0.0.1:10011_solr at time 28678205201387574
   [junit4]   2> 1281120 DEBUG (ScheduledTrigger-2620-thread-4) [    ] o.a.s.c.a.NodeLostTrigger Running NodeLostTrigger: .auto_add_replicas with currently live nodes: 3 and last live nodes: 2
   [junit4]   2> 1281120 DEBUG (ScheduledTrigger-2620-thread-4) [    ] o.a.s.c.a.NodeAddedTrigger Running NodeAddedTrigger node_added_trigger
   [junit4]   2> 1281120 DEBUG (ScheduledTrigger-2620-thread-4) [    ] o.a.s.c.a.NodeAddedTrigger Found livenodes: 3
   [junit4]   2> 1281156 DEBUG (ScheduledTrigger-2620-thread-4) [    ] o.a.s.c.a.NodeLostTrigger Running NodeLostTrigger: .auto_add_replicas with currently live nodes: 3 and last live nodes: 3
   [junit4]   2> 1281156 DEBUG (ScheduledTrigger-2620-thread-4) [    ] o.a.s.c.a.NodeAddedTrigger Running NodeAddedTrigger node_added_trigger
   [junit4]   2> 1281156 DEBUG (ScheduledTrigger-2620-thread-4) [    ] o.a.s.c.a.NodeAddedTrigger Found livenodes: 3
   [junit4]   2> 1281156 DEBUG (ScheduledTrigger-2620-thread-4) [    ] o.a.s.c.a.NodeAddedTrigger NodeAddedTrigger node_added_trigger firing registered processor for nodes: [127.0.0.1:10011_solr] added at times [28678205201387574], now=28678208678597624
   [junit4]   2> 1281157 DEBUG (ScheduledTrigger-2620-thread-4) [    ] o.a.s.c.a.ScheduledTriggers ++++++++ Cooldown inactive - processing event: {
   [junit4]   2>   "id":"65e2acf9d31036T52cp7waixsyzod7awi7hmtmmp",
   [junit4]   2>   "source":"node_added_trigger",
   [junit4]   2>   "eventTime":28678205201387574,
   [junit4]   2>   "eventType":"NODEADDED",
   [junit4]   2>   "properties":{
   [junit4]   2>     "eventTimes":[28678205201387574],
   [junit4]   2>     "preferredOperation":"movereplica",
   [junit4]   2>     "nodeNames":["127.0.0.1:10011_solr"]}}
   [junit4]   2> 1281157 DEBUG (ScheduledTrigger-2620-thread-4) [    ] o.a.s.c.a.ScheduledTriggers Pausing all triggers: [.auto_add_replicas, node_added_trigger]
   [junit4]   2> 1281205 DEBUG (simCloudManagerPool-2619-thread-6) [    ] o.a.s.c.a.s.SimClusterStateProvider -- simCreateCollection .system, currentVersion=1
   [junit4]   2> 1281205 DEBUG (simCloudManagerPool-2619-thread-6) [    ] o.a.s.c.a.s.SimClusterStateProvider ** creating new collection states, currentVersion=1
   [junit4]   2> 1281205 DEBUG (simCloudManagerPool-2619-thread-6) [    ] o.a.s.c.a.s.SimClusterStateProvider ** saved cluster state version 1
   [junit4]   2> 1281229 DEBUG (simCloudManagerPool-2619-thread-6) [    ] o.a.s.c.a.s.SimClusterStateProvider ** creating new collection states, currentVersion=2
   [junit4]   2> 1281232 DEBUG (simCloudManagerPool-2619-thread-6) [    ] o.a.s.c.a.s.SimClusterStateProvider ** saved cluster state version 2
   [junit4]   2> 1281267 DEBUG (simCloudManagerPool-2619-thread-7) [    ] o.a.s.c.a.s.SimClusterStateProvider ** creating new collection states, currentVersion=3
   [junit4]   2> 1281268 DEBUG (simCloudManagerPool-2619-thread-7) [    ] o.a.s.c.a.s.SimClusterStateProvider ** saved cluster state version 3
   [junit4]   2> 1281316 DEBUG (simCloudManagerPool-2619-thread-10) [    ] o.a.s.c.a.s.SimClusterStateProvider -- elected new leader for .system / shard1 (currentVersion=4): {"core_node1":{
   [junit4]   2>     "core":".system_shard1_replica_n1",
   [junit4]   2>     "shard":"shard1",
   [junit4]   2>     "collection":".system",
   [junit4]   2>     "node_name":"127.0.0.1:10011_solr",
   [junit4]   2>     "type":"NRT",
   [junit4]   2>     "leader":"true",
   [junit4]   2>     "SEARCHER.searcher.maxDoc":0,
   [junit4]   2>     "SEARCHER.searcher.deletedDocs":0,
   [junit4]   2>     "INDEX.sizeInBytes":10240,
   [junit4]   2>     "state":"active",
   [junit4]   2>     "INDEX.sizeInGB":9.5367431640625E-6,
   [junit4]   2>     "SEARCHER.searcher.numDocs":0}}
   [junit4]   2> 1281339 DEBUG (simCloudManagerPool-2619-thread-8) [    ] o.a.s.c.a.s.SimClusterStateProvider ** creating new collection states, currentVersion=4
   [junit4]   2> 1281339 DEBUG (simCloudManagerPool-2619-thread-8) [    ] o.a.s.c.a.s.SimClusterStateProvider ** saved cluster state version 4
   [junit4]   2> 1281376 DEBUG (simCloudManagerPool-2619-thread-9) [    ] o.a.s.c.a.s.SimClusterStateProvider ** creating new collection states, currentVersion=5
   [junit4]   2> 1281408 DEBUG (simCloudManagerPool-2619-thread-9) [    ] o.a.s.c.a.s.SimClusterStateProvider ** saved cluster state version 5
   [junit4]   2> 1281408 DEBUG (simCloudManagerPool-2619-thread-6) [    ] o.a.s.c.a.s.SimClusterStateProvider -- finished createCollection .system, currentVersion=6
   [junit4]   2> 1281467 DEBUG (ScheduledTrigger-2620-thread-4) [    ] o.a.s.c.a.NodeAddedTrigger Removing new node from tracking: 127.0.0.1:10011_solr
   [junit4]   2> 1281467 DEBUG (AutoscalingActionExecutor-2621-thread-1) [    ] o.a.s.c.a.ScheduledTriggers -- processing actions for {
   [junit4]   2>   "id":"65e2acf9d31036T52cp7waixsyzod7awi7hmtmmp",
   [junit4]   2>   "source":"node_added_trigger",
   [junit4]   2>   "eventTime":28678205201387574,
   [junit4]   2>   "eventType":"NODEADDED",
   [junit4]   2>   "properties":{
   [junit4]   2>     "eventTimes":[28678205201387574],
   [junit4]   2>     "preferredOperation":"movereplica",
   [junit4]   2>     "_enqueue_time_":28678208704875624,
   [junit4]   2>     "nodeNames":["127.0.0.1:10011_solr"]}}
   [junit4]   2> 1281509 DEBUG (AutoscalingActionExecutor-2621-thread-1) [    ] o.a.s.c.a.ScheduledTriggers Resuming trigger: .auto_add_replicas after 100ms
   [junit4]   2> 1281509 DEBUG (AutoscalingActionExecutor-2621-thread-1) [    ] o.a.s.c.a.ScheduledTriggers Resuming trigger: node_added_trigger after 100ms
   [junit4]   2> 1281509 DEBUG (AutoscalingActionExecutor-2621-thread-1) [    ] o.a.s.c.a.ScheduledTriggers -- processing took 2098 ms for event id=65e2acf9d31036T52cp7waixsyzod7awi7hmtmmp
   [junit4]   2> 1281585 DEBUG (TEST-TestSimTriggerIntegration.testListeners-seed#[FA80E598EE37EC8C]) [    ] o.a.s.c.a.s.SimClusterStateProvider -- creating marker: /autoscaling/nodeAdded/127.0.0.1:10012_solr
   [junit4]   2> 1281618 DEBUG (ScheduledTrigger-2620-thread-3) [    ] o.a.s.c.a.NodeLostTrigger Running NodeLostTrigger: .auto_add_replicas with currently live nodes: 4 and last live nodes: 3
   [junit4]   2> 1281618 DEBUG (ScheduledTrigger-2620-thread-3) [    ] o.a.s.c.a.NodeAddedTrigger Running NodeAddedTrigger node_added_trigger
   [junit4]   2> 1281618 DEBUG (ScheduledTrigger-2620-thread-3) [    ] o.a.s.c.a.NodeAddedTrigger Found livenodes: 4
   [junit4]   2> 1281618 DEBUG (ScheduledTrigger-2620-thread-3) [    ] o.a.s.c.a.NodeAddedTrigger Tracking new node: 127.0.0.1:10012_solr at time 28678231779188124
   [junit4]   2> 1281638 DEBUG (ScheduledTrigger-2620-thread-3) [    ] o.a.s.c.a.NodeLostTrigger Running NodeLostTrigger: .auto_add_replicas with currently live nodes: 4 and last live nodes: 4
   [junit4]   2> 1281639 DEBUG (ScheduledTrigger-2620-thread-3) [    ] o.a.s.c.a.NodeAddedTrigger Running NodeAddedTrigger node_added_trigger
   [junit4]   2> 1281639 DEBUG (ScheduledTrigger-2620-thread-3) [    ] o.a.s.c.a.NodeAddedTrigger Found livenodes: 4
   [junit4]   2> 1281671 DEBUG (ScheduledTrigger-2620-thread-3) [    ] o.a.s.c.a.NodeLostTrigger Running NodeLostTrigger: .auto_add_replicas with currently live nodes: 4 and last live nodes: 4
   [junit4]   2> 1281671 DEBUG (ScheduledTrigger-2620-thread-3) [    ] o.a.s.c.a.NodeAddedTrigger Running NodeAddedTrigger node_added_trigger
   [junit4]   2> 1281671 DEBUG (ScheduledTrigger-2620-thread-3) [    ] o.a.s.c.a.NodeAddedTrigger Found livenodes: 4
   [junit4]   2> 1281671 DEBUG (ScheduledTrigger-2620-thread-3) [    ] o.a.s.c.a.NodeAddedTrigger NodeAddedTrigger node_added_trigger firing registered processor for nodes: [127.0.0.1:10012_solr] added at times [28678231779188124], now=28678234410655324
   [junit4]   2> 1281671 DEBUG (ScheduledTrigger-2620-thread-3) [    ] o.a.s.c.a.ScheduledTriggers ++++++++ Cooldown inactive - processing event: {
   [junit4]   2>   "id":"65e2b329fc1d9cT52cp7waixsyzod7awi7hmtmms",
   [junit4]   2>   "source":"node_added_trigger",
   [junit4]   2>   "eventTime":28678231779188124,
   [junit4]   2>   "eventType":"NODEADDED",
   [junit4]   2>   "properties":{
   [junit4]   2>     "eventTimes":[28678231779188124],
   [junit4]   2>     "preferredOperation":"movereplica",
   [junit4]   2>     "nodeNames":["127.0.0.1:10012_solr"]}}
   [junit4]   2> 1281671 DEBUG (ScheduledTrigger-2620-thread-3) [    ] o.a.s.c.a.ScheduledTriggers Pausing all triggers: [.auto_add_replicas, node_added_trigger]
   [junit4]   2> 1281695 DEBUG (ScheduledTrigger-2620-thread-3) [    ] o.a.s.c.a.NodeAddedTrigger Removing new node from tracking: 127.0.0.1:10012_solr
   [junit4]   2> 1281707 DEBUG (AutoscalingActionExecutor-2621-thread-1) [    ] o.a.s.c.a.ScheduledTriggers -- processing actions for {
   [junit4]   2>   "id":"65e2b329fc1d9cT52cp7waixsyzod7awi7hmtmms",
   [junit4]   2>   "source":"node_added_trigger",
   [junit4]   2>   "eventTime":28678231779188124,
   [junit4]   2>   "eventType":"NODEADDED",
   [junit4]   2>   "properties":{
   [junit4]   2>     "eventTimes":[28678231779188124],
   [junit4]   2>     "preferredOperation":"movereplica",
   [junit4]   2>     "_enqueue_time_":28678234425178174,
   [junit4]   2>     "nodeNames":["127.0.0.1:10012_solr"]}}
   [junit4]   2> 1281744 WARN  (AutoscalingActionExecutor-2621-thread-1) [    ] o.a.s.c.a.ScheduledTriggers Exception executing actions
   [junit4]   2> org.apache.solr.cloud.autoscaling.TriggerActionException: Error processing action for trigger event: {
   [junit4]   2>   "id":"65e2b329fc1d9cT52cp7waixsyzod7awi7hmtmms",
   [junit4]   2>   "source":"node_added_trigger",
   [junit4]   2>   "eventTime":28678231779188124,
   [junit4]   2>   "eventType":"NODEADDED",
   [junit4]   2>   "properties":{
   [junit4]   2>     "eventTimes":[28678231779188124],
   [junit4]   2>     "preferredOperation":"movereplica",
   [junit4]   2>     "_enqueue_time_":28678234425178174,
   [junit4]   2>     "nodeNames":["127.0.0.1:10012_solr"]}}
   [junit4]   2> 	at org.apache.solr.cloud.autoscaling.ScheduledTriggers.lambda$null$3(ScheduledTriggers.java:314) ~[java/:?]
   [junit4]   2> 	at java.util.concurrent.Executors$RunnableAdapter.call(Executors.java:511) ~[?:1.8.0_191]
   [junit4]   2> 	at java.util.concurrent.FutureTask.run(FutureTask.java:266) ~[?:1.8.0_191]
   [junit4]   2> 	at org.apache.solr.common.util.ExecutorUtil$MDCAwareThreadPoolExecutor.lambda$execute$0(ExecutorUtil.java:209) ~[java/:?]
   [junit4]   2> 	at java.util.concurrent.ThreadPoolExecutor.runWorker(ThreadPoolExecutor.java:1149) [?:1.8.0_191]
   [junit4]   2> 	at java.util.concurrent.ThreadPoolExecutor$Worker.run(ThreadPoolExecutor.java:624) [?:1.8.0_191]
   [junit4]   2> 	at java.lang.Thread.run(Thread.java:748) [?:1.8.0_191]
   [junit4]   2> Caused by: java.lang.RuntimeException: failure
   [junit4]   2> 	at org.apache.solr.cloud.autoscaling.sim.TestSimTriggerIntegration$TestDummyAction.process(TestSimTriggerIntegration.java:943) ~[test/:?]
   [junit4]   2> 	at org.apache.solr.cloud.autoscaling.ScheduledTriggers.lambda$null$3(ScheduledTriggers.java:311) ~[java/:?]
   [junit4]   2> 	... 6 more
   [junit4]   2> 1281744 DEBUG (AutoscalingActionExecutor-2621-thread-1) [    ] o.a.s.c.a.ScheduledTriggers Resuming trigger: .auto_add_replicas after 100ms
   [junit4]   2> 1281744 DEBUG (AutoscalingActionExecutor-2621-thread-1) [    ] o.a.s.c.a.ScheduledTriggers Resuming trigger: node_added_trigger after 100ms
   [junit4]   2> 1281745 DEBUG (AutoscalingActionExecutor-2621-thread-1) [    ] o.a.s.c.a.ScheduledTriggers -- processing took 1864 ms for event id=65e2b329fc1d9cT52cp7waixsyzod7awi7hmtmms
   [junit4]   2> 1281781 DEBUG (TEST-TestSimTriggerIntegration.testListeners-seed#[FA80E598EE37EC8C]) [    ] o.a.s.c.a.ScheduledTriggers Shutting down scheduled thread pool executor now
   [junit4]   2> 1281781 DEBUG (TEST-TestSimTriggerIntegration.testListeners-seed#[FA80E598EE37EC8C]) [    ] o.a.s.c.a.ScheduledTriggers Shutting down action executor now
   [junit4]   2> 1281781 DEBUG (TEST-TestSimTriggerIntegration.testListeners-seed#[FA80E598EE37EC8C]) [    ] o.a.s.c.a.ScheduledTriggers Awaiting termination for action executor
   [junit4]   2> 1281781 INFO  (Simulated OverseerAutoScalingTriggerThread) [    ] o.a.s.c.a.OverseerTriggerThread OverseerTriggerThread woken up but we are closed, exiting.
   [junit4]   2> 1281782 DEBUG (TEST-TestSimTriggerIntegration.testListeners-seed#[FA80E598EE37EC8C]) [    ] o.a.s.c.a.ScheduledTriggers Awaiting termination for scheduled thread pool executor
   [junit4]   2> 1281784 DEBUG (TEST-TestSimTriggerIntegration.testListeners-seed#[FA80E598EE37EC8C]) [    ] o.a.s.c.a.ScheduledTriggers ScheduledTriggers closed completely
   [junit4]   2> 1281784 DEBUG (TEST-TestSimTriggerIntegration.testListeners-seed#[FA80E598EE37EC8C]) [    ] o.a.s.c.a.OverseerTriggerThread OverseerTriggerThread has been closed explicitly
   [junit4]   2> 1281785 INFO  (TEST-TestSimTriggerIntegration.testListeners-seed#[FA80E598EE37EC8C]) [    ] o.a.s.SolrTestCaseJ4 ###Ending testListeners
   [junit4]   2> 1281788 INFO  (TEST-TestSimTriggerIntegration.testNodeLostTriggerRestoreState-seed#[FA80E598EE37EC8C]) [    ] o.a.s.SolrTestCaseJ4 ###Starting testNodeLostTriggerRestoreState
   [junit4]   2> 1281843 DEBUG (TEST-TestSimTriggerIntegration.testNodeLostTriggerRestoreState-seed#[FA80E598EE37EC8C]) [    ] o.a.s.c.a.s.SimClusterStateProvider --- new Overseer leader: 127.0.0.1:10013_solr
   [junit4]   2> 1281857 DEBUG (Simulated OverseerAutoScalingTriggerThread) [    ] o.a.s.c.a.OverseerTriggerThread Adding .auto_add_replicas and .scheduled_maintenance triggers
   [junit4]   2> 1281858 DEBUG (Simulated OverseerAutoScalingTriggerThread) [    ] o.a.s.c.a.OverseerTriggerThread Refreshing /autoscaling.json with znode version 1
   [junit4]   2> 1281858 DEBUG (Simulated OverseerAutoScalingTriggerThread) [    ] o.a.s.c.a.OverseerTriggerThread Current znodeVersion 1, lastZnodeVersion 0
   [junit4]   2> 1281858 DEBUG (Simulated OverseerAutoScalingTriggerThread) [    ] o.a.s.c.a.OverseerTriggerThread Processed trigger updates upto znodeVersion 1
   [junit4]   2> 1281858 DEBUG (TEST-TestSimTriggerIntegration.testNodeLostTriggerRestoreState-seed#[FA80E598EE37EC8C]) [    ] o.a.s.c.a.s.SimClusterStateProvider ** creating new collection states, currentVersion=0
   [junit4]   2> 1281859 DEBUG (TEST-TestSimTriggerIntegration.testNodeLostTriggerRestoreState-seed#[FA80E598EE37EC8C]) [    ] o.a.s.c.a.s.SimClusterStateProvider ** saved cluster state version 0
   [junit4]   2> 1281859 INFO  (TEST-TestSimTriggerIntegration.testNodeLostTriggerRestoreState-seed#[FA80E598EE37EC8C]) [    ] o.a.s.h.a.MetricsHistoryHandler No .system collection, keeping metrics history in memory.
   [junit4]   2> 1281878 DEBUG (Simulated OverseerAutoScalingTriggerThread) [    ] o.a.s.c.a.NodeLostTrigger NodeLostTrigger .auto_add_replicas - Initial livenodes: [127.0.0.1:10013_solr, 127.0.0.1:10014_solr]
   [junit4]   2> 1281878 DEBUG (Simulated OverseerAutoScalingTriggerThread) [    ] o.a.s.c.a.OverseerTriggerThread -- cleaning old nodeLost / nodeAdded markers
   [junit4]   2> 1281878 DEBUG (Simulated OverseerAutoScalingTriggerThread) [    ] o.a.s.c.a.OverseerTriggerThread Current znodeVersion 1, lastZnodeVersion 1
   [junit4]   2> 1281878 DEBUG (ScheduledTrigger-2626-thread-2) [    ] o.a.s.c.a.NodeLostTrigger Running NodeLostTrigger: .auto_add_replicas with currently live nodes: 2 and last live nodes: 2
   [junit4]   2> 1281895 DEBUG (simCloudManagerPool-2625-thread-2) [    ] o.a.s.c.a.AutoScalingHandler Verified autoscaling configuration
   [junit4]   2> 1281895 DEBUG (simCloudManagerPool-2625-thread-2) [    ] o.a.s.c.a.OverseerTriggerThread Refreshing /autoscaling.json with znode version 2
   [junit4]   2> 1282040 DEBUG (Simulated OverseerAutoScalingTriggerThread) [    ] o.a.s.c.a.OverseerTriggerThread Processed trigger updates upto znodeVersion 2
   [junit4]   2> 1282040 DEBUG (Simulated OverseerAutoScalingTriggerThread) [    ] o.a.s.c.a.OverseerTriggerThread -- cleaning old nodeLost / nodeAdded markers
   [junit4]   2> 1282040 DEBUG (Simulated OverseerAutoScalingTriggerThread) [    ] o.a.s.c.a.OverseerTriggerThread Current znodeVersion 2, lastZnodeVersion 2
   [junit4]   2> 1282048 DEBUG (ScheduledTrigger-2626-thread-2) [    ] o.a.s.c.a.ScheduledTrigger ScheduledTrigger ran but was already closed
   [junit4]   2> 1282057 DEBUG (simCloudManagerPool-2625-thread-3) [    ] o.a.s.c.a.AutoScalingHandler Verified autoscaling configuration
   [junit4]   2> 1282057 DEBUG (simCloudManagerPool-2625-thread-3) [    ] o.a.s.c.a.OverseerTriggerThread Refreshing /autoscaling.json with znode version 3
   [junit4]   2> 1282057 DEBUG (Simulated OverseerAutoScalingTriggerThread) [    ] o.a.s.c.a.OverseerTriggerThread Processed trigger updates upto znodeVersion 3
   [junit4]   2> 1282057 INFO  (Simulated OverseerAutoScalingTriggerThread) [    ] o.a.s.c.a.s.TestSimTriggerIntegration TestTriggerAction init
   [junit4]   2> 1282057 DEBUG (Simulated OverseerAutoScalingTriggerThread) [    ] o.a.s.c.a.NodeLostTrigger NodeLostTrigger node_lost_restore_trigger - Initial livenodes: [127.0.0.1:10013_solr, 127.0.0.1:10014_solr, 127.0.0.1:10015_solr]
   [junit4]   2> 1282057 DEBUG (Simulated OverseerAutoScalingTriggerThread) [    ] o.a.s.c.a.OverseerTriggerThread -- cleaning old nodeLost / nodeAdded markers
   [junit4]   2> 1282057 DEBUG (Simulated OverseerAutoScalingTriggerThread) [    ] o.a.s.c.a.OverseerTriggerThread Current znodeVersion 3, lastZnodeVersion 3
   [junit4]   2> 1282057 DEBUG (TEST-TestSimTriggerIntegration.testNodeLostTriggerRestoreState-seed#[FA80E598EE37EC8C]) [    ] o.a.s.c.a.s.SimClusterStateProvider  -- created marker: /autoscaling/nodeLost/127.0.0.1:10015_solr
   [junit4]   2> 1282060 DEBUG (ScheduledTrigger-2626-thread-1) [    ] o.a.s.c.a.NodeLostTrigger Running NodeLostTrigger: node_lost_restore_trigger with currently live nodes: 2 and last live nodes: 3
   [junit4]   2> 1282060 DEBUG (ScheduledTrigger-2626-thread-1) [    ] o.a.s.c.a.NodeLostTrigger Tracking lost node: 127.0.0.1:10015_solr
   [junit4]   2> 1282060 DEBUG (ScheduledTrigger-2626-thread-4) [    ] o.a.s.c.a.NodeLostTrigger Running NodeLostTrigger: .auto_add_replicas with currently live nodes: 2 and last live nodes: 2
   [junit4]   2> 1282149 DEBUG (ScheduledTrigger-2626-thread-1) [    ] o.a.s.c.a.NodeLostTrigger Running NodeLostTrigger: node_lost_restore_trigger with currently live nodes: 2 and last live nodes: 2
   [junit4]   2> 1282149 DEBUG (ScheduledTrigger-2626-thread-1) [    ] o.a.s.c.a.NodeLostTrigger Running NodeLostTrigger: .auto_add_replicas with currently live nodes: 2 and last live nodes: 2
   [junit4]   2> 1282185 DEBUG (ScheduledTrigger-2626-thread-1) [    ] o.a.s.c.a.NodeLostTrigger Running NodeLostTrigger: .auto_add_replicas with currently live nodes: 2 and last live nodes: 2
   [junit4]   2> 1282185 DEBUG (simCloudManagerPool-2625-thread-4) [    ] o.a.s.c.a.AutoScalingHandler Verified autoscaling configuration
   [junit4]   2> 1282186 DEBUG (simCloudManagerPool-2625-thread-4) [    ] o.a.s.c.a.OverseerTriggerThread Refreshing /autoscaling.json with znode version 4
   [junit4]   2> 1282186 DEBUG (Simulated OverseerAutoScalingTriggerThread) [    ] o.a.s.c.a.OverseerTriggerThread Processed trigger updates upto znodeVersion 4
   [junit4]   2> 1282186 DEBUG (ScheduledTrigger-2626-thread-4) [    ] o.a.s.c.a.NodeLostTrigger Running NodeLostTrigger: node_lost_restore_trigger with currently live nodes: 2 and last live nodes: 2
   [junit4]   2> 1282186 DEBUG (ScheduledTrigger-2626-thread-4) [    ] o.a.s.c.a.NodeLostTrigger NodeLostTrigger firing registered processor for lost nodes: [127.0.0.1:10015_solr]
   [junit4]   2> 1282187 INFO  (Simulated OverseerAutoScalingTriggerThread) [    ] o.a.s.c.a.s.TestSimTriggerIntegration TestTriggerAction init
   [junit4]   2> 1282187 DEBUG (Simulated OverseerAutoScalingTriggerThread) [    ] o.a.s.c.a.NodeLostTrigger NodeLostTrigger node_lost_restore_trigger - Initial livenodes: [127.0.0.1:10013_solr, 127.0.0.1:10014_solr]
   [junit4]   2> 1282187 DEBUG (Simulated OverseerAutoScalingTriggerThread) [    ] o.a.s.c.a.OverseerTriggerThread -- cleaning old nodeLost / nodeAdded markers
   [junit4]   2> 1282187 DEBUG (Simulated OverseerAutoScalingTriggerThread) [    ] o.a.s.c.a.OverseerTriggerThread Current znodeVersion 4, lastZnodeVersion 4
   [junit4]   2> 1282187 DEBUG (ScheduledTrigger-2626-thread-4) [    ] o.a.s.c.a.ScheduledTriggers ++++++++ Cooldown inactive - processing event: {
   [junit4]   2>   "id":"65e2b84eaa0e4cT52cp7waixsyzod7awi7hmtmmw",
   [junit4]   2>   "source":"node_lost_restore_trigger",
   [junit4]   2>   "eventTime":28678253869403724,
   [junit4]   2>   "eventType":"NODELOST",
   [junit4]   2>   "properties":{
   [junit4]   2>     "eventTimes":[28678253869403724],
   [junit4]   2>     "preferredOperation":"movereplica",
   [junit4]   2>     "nodeNames":["127.0.0.1:10015_solr"]}}
   [junit4]   2> 1282187 DEBUG (ScheduledTrigger-2626-thread-2) [    ] o.a.s.c.a.NodeLostTrigger Running NodeLostTrigger: node_lost_restore_trigger with currently live nodes: 2 and last live nodes: 2
   [junit4]   2> 1282187 DEBUG (ScheduledTrigger-2626-thread-4) [    ] o.a.s.c.a.ScheduledTriggers Pausing all triggers: [.auto_add_replicas, node_lost_restore_trigger]
   [junit4]   2> 1282187 DEBUG (ScheduledTrigger-2626-thread-2) [    ] o.a.s.c.a.NodeLostTrigger NodeLostTrigger firing registered processor for lost nodes: [127.0.0.1:10015_solr]
   [junit4]   2> 1282187 DEBUG (ScheduledTrigger-2626-thread-2) [    ] o.a.s.c.a.ScheduledTriggers -------- Cooldown period - rejecting event: {
   [junit4]   2>   "id":"65e2b84eaa0e4cT52cp7waixsyzod7awi7hmtmmx",
   [junit4]   2>   "source":"node_lost_restore_trigger",
   [junit4]   2>   "eventTime":28678253869403724,
   [junit4]   2>   "eventType":"NODELOST",
   [junit4]   2>   "properties":{
   [junit4]   2>     "eventTimes":[28678253869403724],
   [junit4]   2>     "preferredOperation":"movereplica",
   [junit4]   2>     "nodeNames":["127.0.0.1:10015_solr"]}}
   [junit4]   2> 1282295 DEBUG (simCloudManagerPool-2625-thread-5) [    ] o.a.s.c.a.s.SimClusterStateProvider -- simCreateCollection .system, currentVersion=1
   [junit4]   2> 1282315 DEBUG (simCloudManagerPool-2625-thread-5) [    ] o.a.s.c.a.s.SimClusterStateProvider ** creating new collection states, currentVersion=1
   [junit4]   2> 1282315 DEBUG (simCloudManagerPool-2625-thread-5) [    ] o.a.s.c.a.s.SimClusterStateProvider ** saved cluster state version 1
   [junit4]   2> 1282331 DEBUG (simCloudManagerPool-2625-thread-5) [    ] o.a.s.c.a.s.SimClusterStateProvider ** creating new collection states, currentVersion=2
   [junit4]   2> 1282331 DEBUG (simCloudManagerPool-2625-thread-5) [    ] o.a.s.c.a.s.SimClusterStateProvider ** saved cluster state version 2
   [junit4]   2> 1282376 DEBUG (simCloudManagerPool-2625-thread-6) [    ] o.a.s.c.a.s.SimClusterStateProvider ** creating new collection states, currentVersion=3
   [junit4]   2> 1282441 DEBUG (simCloudManagerPool-2625-thread-6) [    ] o.a.s.c.a.s.SimClusterStateProvider ** saved cluster state version 3
   [junit4]   2> 1282461 DEBUG (simCloudManagerPool-2625-thread-7) [    ] o.a.s.c.a.s.SimClusterStateProvider ** creating new collection states, currentVersion=4
   [junit4]   2> 1282473 DEBUG (simCloudManagerPool-2625-thread-7) [    ] o.a.s.c.a.s.SimClusterStateProvider ** saved cluster state version 4
   [junit4]   2> 1282474 DEBUG (simCloudManagerPool-2625-thread-5) [    ] o.a.s.c.a.s.SimClusterStateProvider -- finished createCollection .system, currentVersion=5
   [junit4]   2> 1282474 INFO  (simCloudManagerPool-2625-thread-5) [    ] o.a.s.c.CloudTestUtils -- shards without leaders: [shard1]
   [junit4]   2> 1282474 DEBUG (simCloudManagerPool-2625-thread-9) [    ] o.a.s.c.a.s.SimClusterStateProvider -- elected new leader for .system / shard1 (currentVersion=5): {"core_node1":{
   [junit4]   2>     "core":".system_shard1_replica_n1",
   [junit4]   2>     "shard":"shard1",
   [junit4]   2>     "collection":".system",
   [junit4]   2>     "node_name":"127.0.0.1:10014_solr",
   [junit4]   2>     "type":"NRT",
   [junit4]   2>     "leader":"true",
   [junit4]   2>     "SEARCHER.searcher.maxDoc":0,
   [junit4]   2>     "SEARCHER.searcher.deletedDocs":0,
   [junit4]   2>     "INDEX.sizeInBytes":10240,
   [junit4]   2>     "state":"active",
   [junit4]   2>     "INDEX.sizeInGB":9.5367431640625E-6,
   [junit4]   2>     "SEARCHER.searcher.numDocs":0}}
   [junit4]   2> 1282476 DEBUG (simCloudManagerPool-2625-thread-5) [    ] o.a.s.c.a.s.SimClusterStateProvider ** creating new collection states, currentVersion=5
   [junit4]   2> 1282476 DEBUG (simCloudManagerPool-2625-thread-5) [    ] o.a.s.c.a.s.SimClusterStateProvider ** saved cluster state version 5
   [junit4]   2> 1282476 DEBUG (ScheduledTrigger-2626-thread-2) [    ] o.a.s.c.a.NodeLostTrigger NodeLostTrigger processor for lost nodes: [127.0.0.1:10015_solr] is not ready, will try later
   [junit4]   2> 1283059 DEBUG (MetricsHistoryHandler-2629-thread-1) [    ] o.a.s.c.a.s.SimClusterStateProvider ** creating new collection states, currentVersion=6
   [junit4]   2> 1283059 DEBUG (MetricsHistoryHandler-2629-thread-1) [    ] o.a.s.c.a.s.SimClusterStateProvider ** saved cluster state version 6
   [junit4]   2> 1283989 DEBUG (TEST-TestSimTriggerIntegration.testNodeLostTriggerRestoreState-seed#[FA80E598EE37EC8C]) [    ] o.a.s.c.a.ScheduledTriggers Shutting down scheduled thread pool executor now
   [junit4]   2> 1283989 DEBUG (TEST-TestSimTriggerIntegration.testNodeLostTriggerRestoreState-seed#[FA80E598EE37EC8C]) [    ] o.a.s.c.a.ScheduledTriggers Shutting down action executor now
   [junit4]   2> 1283989 DEBUG (TEST-TestSimTriggerIntegration.testNodeLostTriggerRestoreState-seed#[FA80E598EE37EC8C]) [    ] o.a.s.c.a.ScheduledTriggers Awaiting termination for action executor
   [junit4]   2> 1283989 DEBUG (TEST-TestSimTriggerIntegration.testNodeLostTriggerRestoreState-seed#[FA80E598EE37EC8C]) [    ] o.a.s.c.a.ScheduledTriggers Awaiting termination for scheduled thread pool executor
   [junit4]   2> 1283989 INFO  (Simulated OverseerAutoScalingTriggerThread) [    ] o.a.s.c.a.OverseerTriggerThread OverseerTriggerThread woken up but we are closed, exiting.
   [junit4]   2> 1283989 DEBUG (TEST-TestSimTriggerIntegration.testNodeLostTriggerRestoreState-seed#[FA80E598EE37EC8C]) [    ] o.a.s.c.a.ScheduledTriggers ScheduledTriggers closed completely
   [junit4]   2> 1283990 DEBUG (TEST-TestSimTriggerIntegration.testNodeLostTriggerRestoreState-seed#[FA80E598EE37EC8C]) [    ] o.a.s.c.a.OverseerTriggerThread OverseerTriggerThread has been closed explicitly
   [junit4]   2> 1283990 INFO  (TEST-TestSimTriggerIntegration.testNodeLostTriggerRestoreState-seed#[FA80E598EE37EC8C]) [    ] o.a.s.SolrTestCaseJ4 ###Ending testNodeLostTriggerRestoreState
   [junit4]   2> NOTE: reproduce with: ant test  -Dtestcase=TestSimTriggerIntegration -Dtests.method=testNodeLostTriggerRestoreState -Dtests.seed=FA80E598EE37EC8C -Dtests.multiplier=2 -Dtests.slow=true -Dtests.locale=ar-QA -Dtests.timezone=Asia/Ujung_Pandang -Dtests.asserts=true -Dtests.file.encoding=ISO-8859-1
   [junit4] FAILURE 2.21s J2 | TestSimTriggerIntegration.testNodeLostTriggerRestoreState <<<
   [junit4]    > Throwable #1: java.lang.AssertionError: The trigger did not fire at all
   [junit4]    > 	at __randomizedtesting.SeedInfo.seed([FA80E598EE37EC8C:D17F30C3744FF95C]:0)
   [junit4]    > 	at org.apache.solr.cloud.autoscaling.sim.TestSimTriggerIntegration.testNodeLostTriggerRestoreState(TestSimTriggerIntegration.java:332)
   [junit4]    > 	at java.lang.Thread.run(Thread.java:748)
   [junit4] IGNOR/A 0.00s J2 | TestSimTriggerIntegration.testEventQueue
   [junit4]    > Assumption #1: 'awaitsfix' test group is disabled (@AwaitsFix(bugUrl=https://issues.apache.org/jira/browse/SOLR-12028))
   [junit4] IGNOR/A 0.00s J2 | TestSimTriggerIntegration.testNodeAddedTriggerRestoreState
   [junit4]    > Assumption #1: 'badapple' test group is disabled (@BadApple(bugUrl=https://issues.apache.org/jira/browse/SOLR-12028))
   [junit4] IGNOR/A 0.00s J2 | TestSimTriggerIntegration.testNodeAddedTrigger
   [junit4]    > Assumption #1: 'badapple' test group is disabled (@BadApple(bugUrl=https://issues.apache.org/jira/browse/SOLR-12028))
   [junit4]   2> NOTE: leaving temporary files on disk at: /home/jenkins/jenkins-slave/workspace/Lucene-Solr-Tests-master/solr/build/solr-core/test/J2/temp/solr.cloud.autoscaling.sim.TestSimTriggerIntegration_FA80E598EE37EC8C-001
   [junit4]   2> NOTE: test params are: codec=Lucene80, sim=Asserting(org.apache.lucene.search.similarities.AssertingSimilarity@4e98ba00), locale=ar-QA, timezone=Asia/Ujung_Pandang
   [junit4]   2> NOTE: Linux 4.4.0-112-generic amd64/Oracle Corporation 1.8.0_191 (64-bit)/cpus=4,threads=1,free=283633720,total=515375104
   [junit4]   2> NOTE: All tests run in this JVM: [TestRandomRequestDistribution, TestBlendedInfixSuggestions, AddSchemaFieldsUpdateProcessorFactoryTest, DOMUtilTest, TestOmitPositions, RegexBytesRefFilterTest, TestAuthorizationFramework, TaggingAttributeTest, TestSolrCloudWithHadoopAuthPlugin, TestPayloadCheckQParserPlugin, DistributedFacetSimpleRefinementLongTailTest, TestDFRSimilarityFactory, DirectSolrSpellCheckerTest, TestSSLRandomization, SpellCheckComponentTest, TestSimpleTextCodec, TestRestManager, SchemaApiFailureTest, TestSort, TestEmbeddedSolrServerSchemaAPI, TestConfigSetsAPIExclusivity, TestRealTimeGet, TestDynamicFieldCollectionResource, TestLFUCache, SolrMetricsIntegrationTest, PeerSyncTest, TestCSVResponseWriter, CreateRoutedAliasTest, DeleteStatusTest, TestWriterPerf, TestDocumentBuilder, TestTrie, TestBM25SimilarityFactory, TestSizeLimitedDistributedMap, DocExpirationUpdateProcessorFactoryTest, AutoScalingHandlerTest, TestSha256AuthenticationProvider, SecurityConfHandlerTest, ActionThrottleTest, TestDocBasedVersionConstraints, TestNestedDocsSort, DateFieldTest, TestCoreContainer, TestConfigReload, MetricTriggerIntegrationTest, AlternateDirectoryTest, TestHdfsCloudBackupRestore, UninvertDocValuesMergePolicyTest, CoreAdminCreateDiscoverTest, MetricUtilsTest, MigrateRouteKeyTest, NodeMarkersRegistrationTest, QueryParsingTest, TestFiltering, TestSubQueryTransformerDistrib, TestCollectionAPIs, TestNumericRangeQuery32, TestSimNodeAddedTrigger, TestFieldCacheWithThreads, TestSystemIdResolver, ByteBuffersDirectoryFactoryTest, TestFieldResource, BasicDistributedZkTest, HighlighterConfigTest, UniqFieldsUpdateProcessorFactoryTest, TestSolrCloudWithKerberosAlt, BlockJoinFacetSimpleTest, SortByFunctionTest, TestSolr4Spatial, SignificantTermsQParserPluginTest, LeaderElectionContextKeyTest, TestValueSourceCache, MetricsHandlerTest, TestReversedWildcardFilterFactory, DeleteNodeTest, TestSolrDeletionPolicy2, TestMergePolicyConfig, TestCloudSearcherWarming, UpdateLogTest, OpenExchangeRatesOrgProviderTest, MoveReplicaHDFSTest, CoreSorterTest, TestRequestStatusCollectionAPI, TestPostingsSolrHighlighter, PrimUtilsTest, TestFuzzyAnalyzedSuggestions, TestStressRecovery, TestSimTriggerIntegration]
   [junit4] Completed [198/837 (1!)] on J2 in 3.39s, 11 tests, 1 failure, 9 skipped <<< FAILURES!

[...truncated 51184 lines...]
[asciidoctor:convert] asciidoctor: ERROR: about-this-guide.adoc: line 1: invalid part, must have at least one section (e.g., chapter, appendix, etc.)
[asciidoctor:convert] asciidoctor: ERROR: solr-glossary.adoc: line 1: invalid part, must have at least one section (e.g., chapter, appendix, etc.)
     [java] Processed 2464 links (2015 relative) to 3226 anchors in 248 files
     [echo] Validated Links & Anchors via: /home/jenkins/jenkins-slave/workspace/Lucene-Solr-Tests-master/solr/build/solr-ref-guide/bare-bones-html/

-documentation-lint:
    [jtidy] Checking for broken html (such as invalid tags)...
   [delete] Deleting directory /home/jenkins/jenkins-slave/workspace/Lucene-Solr-Tests-master/lucene/build/jtidy_tmp
     [echo] Checking for broken links...
     [exec] 
     [exec] Crawl/parse...
     [exec] 
     [exec] Verify...
     [echo] Checking for malformed docs...

jar-checksums:

resolve:

ivy-availability-check:
[loadresource] Do not set property disallowed.ivy.jars.list as its length is 0.

-ivy-fail-disallowed-ivy-version:

ivy-fail:

ivy-configure:
[ivy:configure] :: loading settings :: file = /home/jenkins/jenkins-slave/workspace/Lucene-Solr-Tests-master/lucene/top-level-ivy-settings.xml

resolve:

ivy-availability-check:
[loadresource] Do not set property disallowed.ivy.jars.list as its length is 0.

-ivy-fail-disallowed-ivy-version:

ivy-fail:

ivy-configure:
[ivy:configure] :: loading settings :: file = /home/jenkins/jenkins-slave/workspace/Lucene-Solr-Tests-master/lucene/top-level-ivy-settings.xml

resolve:

resolve:

ivy-availability-check:
[loadresource] Do not set property disallowed.ivy.jars.list as its length is 0.

-ivy-fail-disallowed-ivy-version:

ivy-fail:

ivy-configure:
[ivy:configure] :: loading settings :: file = /home/jenkins/jenkins-slave/workspace/Lucene-Solr-Tests-master/lucene/top-level-ivy-settings.xml

resolve:

ivy-availability-check:
[loadresource] Do not set property disallowed.ivy.jars.list as its length is 0.

-ivy-fail-disallowed-ivy-version:

ivy-fail:

ivy-configure:
[ivy:configure] :: loading settings :: file = /home/jenkins/jenkins-slave/workspace/Lucene-Solr-Tests-master/lucene/top-level-ivy-settings.xml

resolve:

ivy-availability-check:
[loadresource] Do not set property disallowed.ivy.jars.list as its length is 0.

-ivy-fail-disallowed-ivy-version:

ivy-fail:

ivy-configure:
[ivy:configure] :: loading settings :: file = /home/jenkins/jenkins-slave/workspace/Lucene-Solr-Tests-master/lucene/top-level-ivy-settings.xml

resolve:

ivy-availability-check:
[loadresource] Do not set property disallowed.ivy.jars.list as its length is 0.

-ivy-fail-disallowed-ivy-version:

ivy-fail:

ivy-configure:
[ivy:configure] :: loading settings :: file = /home/jenkins/jenkins-slave/workspace/Lucene-Solr-Tests-master/lucene/top-level-ivy-settings.xml

resolve:

ivy-availability-check:
[loadresource] Do not set property disallowed.ivy.jars.list as its length is 0.

-ivy-fail-disallowed-ivy-version:

ivy-fail:

ivy-configure:
[ivy:configure] :: loading settings :: file = /home/jenkins/jenkins-slave/workspace/Lucene-Solr-Tests-master/lucene/top-level-ivy-settings.xml

resolve:

ivy-availability-check:
[loadresource] Do not set property disallowed.ivy.jars.list as its length is 0.

-ivy-fail-disallowed-ivy-version:

ivy-fail:

ivy-configure:
[ivy:configure] :: loading settings :: file = /home/jenkins/jenkins-slave/workspace/Lucene-Solr-Tests-master/lucene/top-level-ivy-settings.xml

resolve:

ivy-availability-check:
[loadresource] Do not set property disallowed.ivy.jars.list as its length is 0.

-ivy-fail-disallowed-ivy-version:

ivy-fail:

ivy-configure:
[ivy:configure] :: loading settings :: file = /home/jenkins/jenkins-slave/workspace/Lucene-Solr-Tests-master/lucene/top-level-ivy-settings.xml

resolve:

ivy-availability-check:
[loadresource] Do not set property disallowed.ivy.jars.list as its length is 0.

-ivy-fail-disallowed-ivy-version:

ivy-fail:

ivy-configure:
[ivy:configure] :: loading settings :: file = /home/jenkins/jenkins-slave/workspace/Lucene-Solr-Tests-master/lucene/top-level-ivy-settings.xml

resolve:

ivy-availability-check:
[loadresource] Do not set property disallowed.ivy.jars.list as its length is 0.

-ivy-fail-disallowed-ivy-version:

ivy-fail:

ivy-configure:
[ivy:configure] :: loading settings :: file = /home/jenkins/jenkins-slave/workspace/Lucene-Solr-Tests-master/lucene/top-level-ivy-settings.xml

resolve:

ivy-availability-check:
[loadresource] Do not set property disallowed.ivy.jars.list as its length is 0.

-ivy-fail-disallowed-ivy-version:

ivy-fail:

ivy-configure:
[ivy:configure] :: loading settings :: file = /home/jenkins/jenkins-slave/workspace/Lucene-Solr-Tests-master/lucene/top-level-ivy-settings.xml

resolve:

ivy-availability-check:
[loadresource] Do not set property disallowed.ivy.jars.list as its length is 0.

-ivy-fail-disallowed-ivy-version:

ivy-fail:

ivy-configure:
[ivy:configure] :: loading settings :: file = /home/jenkins/jenkins-slave/workspace/Lucene-Solr-Tests-master/lucene/top-level-ivy-settings.xml

resolve:

ivy-availability-check:
[loadresource] Do not set property disallowed.ivy.jars.list as its length is 0.

-ivy-fail-disallowed-ivy-version:

ivy-fail:

ivy-configure:
[ivy:configure] :: loading settings :: file = /home/jenkins/jenkins-slave/workspace/Lucene-Solr-Tests-master/lucene/top-level-ivy-settings.xml

resolve:

ivy-availability-check:
[loadresource] Do not set property disallowed.ivy.jars.list as its length is 0.

-ivy-fail-disallowed-ivy-version:

ivy-fail:

ivy-configure:
[ivy:configure] :: loading settings :: file = /home/jenkins/jenkins-slave/workspace/Lucene-Solr-Tests-master/lucene/top-level-ivy-settings.xml

resolve:

ivy-availability-check:
[loadresource] Do not set property disallowed.ivy.jars.list as its length is 0.

-ivy-fail-disallowed-ivy-version:

ivy-fail:

ivy-configure:
[ivy:configure] :: loading settings :: file = /home/jenkins/jenkins-slave/workspace/Lucene-Solr-Tests-master/lucene/top-level-ivy-settings.xml

resolve:

ivy-availability-check:
[loadresource] Do not set property disallowed.ivy.jars.list as its length is 0.

-ivy-fail-disallowed-ivy-version:

ivy-fail:

ivy-configure:
[ivy:configure] :: loading settings :: file = /home/jenkins/jenkins-slave/workspace/Lucene-Solr-Tests-master/lucene/top-level-ivy-settings.xml

resolve:

ivy-availability-check:
[loadresource] Do not set property disallowed.ivy.jars.list as its length is 0.

-ivy-fail-disallowed-ivy-version:

ivy-fail:

ivy-configure:
[ivy:configure] :: loading settings :: file = /home/jenkins/jenkins-slave/workspace/Lucene-Solr-Tests-master/lucene/top-level-ivy-settings.xml

resolve:

ivy-availability-check:
[loadresource] Do not set property disallowed.ivy.jars.list as its length is 0.

-ivy-fail-disallowed-ivy-version:

ivy-fail:

ivy-configure:
[ivy:configure] :: loading settings :: file = /home/jenkins/jenkins-slave/workspace/Lucene-Solr-Tests-master/lucene/top-level-ivy-settings.xml

resolve:

ivy-availability-check:
[loadresource] Do not set property disallowed.ivy.jars.list as its length is 0.

-ivy-fail-disallowed-ivy-version:

ivy-fail:

ivy-configure:
[ivy:configure] :: loading settings :: file = /home/jenkins/jenkins-slave/workspace/Lucene-Solr-Tests-master/lucene/top-level-ivy-settings.xml

resolve:

ivy-availability-check:
[loadresource] Do not set property disallowed.ivy.jars.list as its length is 0.

-ivy-fail-disallowed-ivy-version:

ivy-fail:

ivy-configure:
[ivy:configure] :: loading settings :: file = /home/jenkins/jenkins-slave/workspace/Lucene-Solr-Tests-master/lucene/top-level-ivy-settings.xml

resolve:

ivy-availability-check:
[loadresource] Do not set property disallowed.ivy.jars.list as its length is 0.

-ivy-fail-disallowed-ivy-version:

ivy-fail:

ivy-configure:
[ivy:configure] :: loading settings :: file = /home/jenkins/jenkins-slave/workspace/Lucene-Solr-Tests-master/lucene/top-level-ivy-settings.xml

resolve:

ivy-availability-check:
[loadresource] Do not set property disallowed.ivy.jars.list as its length is 0.

-ivy-fail-disallowed-ivy-version:

ivy-fail:

ivy-configure:
[ivy:configure] :: loading settings :: file = /home/jenkins/jenkins-slave/workspace/Lucene-Solr-Tests-master/lucene/top-level-ivy-settings.xml

resolve:

ivy-availability-check:
[loadresource] Do not set property disallowed.ivy.jars.list as its length is 0.

-ivy-fail-disallowed-ivy-version:

ivy-fail:

ivy-configure:
[ivy:configure] :: loading settings :: file = /home/jenkins/jenkins-slave/workspace/Lucene-Solr-Tests-master/lucene/top-level-ivy-settings.xml

resolve:

ivy-availability-check:
[loadresource] Do not set property disallowed.ivy.jars.list as its length is 0.

-ivy-fail-disallowed-ivy-version:

ivy-fail:

ivy-configure:
[ivy:configure] :: loading settings :: file = /home/jenkins/jenkins-slave/workspace/Lucene-Solr-Tests-master/lucene/top-level-ivy-settings.xml

resolve:

ivy-availability-check:
[loadresource] Do not set property disallowed.ivy.jars.list as its length is 0.

-ivy-fail-disallowed-ivy-version:

ivy-fail:

ivy-configure:
[ivy:configure] :: loading settings :: file = /home/jenkins/jenkins-slave/workspace/Lucene-Solr-Tests-master/lucene/top-level-ivy-settings.xml

common.resolve:

resolve:

ivy-availability-check:
[loadresource] Do not set property disallowed.ivy.jars.list as its length is 0.

-ivy-fail-disallowed-ivy-version:

ivy-fail:

ivy-configure:
[ivy:configure] :: loading settings :: file = /home/jenkins/jenkins-slave/workspace/Lucene-Solr-Tests-master/lucene/top-level-ivy-settings.xml

resolve:

ivy-availability-check:
[loadresource] Do not set property disallowed.ivy.jars.list as its length is 0.

-ivy-fail-disallowed-ivy-version:

ivy-fail:

ivy-configure:
[ivy:configure] :: loading settings :: file = /home/jenkins/jenkins-slave/workspace/Lucene-Solr-Tests-master/lucene/top-level-ivy-settings.xml

resolve:

ivy-availability-check:
[loadresource] Do not set property disallowed.ivy.jars.list as its length is 0.

-ivy-fail-disallowed-ivy-version:

ivy-fail:

ivy-configure:
[ivy:configure] :: loading settings :: file = /home/jenkins/jenkins-slave/workspace/Lucene-Solr-Tests-master/lucene/top-level-ivy-settings.xml

resolve:

ivy-availability-check:
[loadresource] Do not set property disallowed.ivy.jars.list as its length is 0.

-ivy-fail-disallowed-ivy-version:

ivy-fail:

ivy-configure:
[ivy:configure] :: loading settings :: file = /home/jenkins/jenkins-slave/workspace/Lucene-Solr-Tests-master/lucene/top-level-ivy-settings.xml

resolve:

ivy-availability-check:
[loadresource] Do not set property disallowed.ivy.jars.list as its length is 0.

-ivy-fail-disallowed-ivy-version:

ivy-fail:

ivy-configure:
[ivy:configure] :: loading settings :: file = /home/jenkins/jenkins-slave/workspace/Lucene-Solr-Tests-master/lucene/top-level-ivy-settings.xml

resolve:

jar-checksums:
    [mkdir] Created dir: /home/jenkins/jenkins-slave/workspace/Lucene-Solr-Tests-master/lucene/null1840241320
     [copy] Copying 36 files to /home/jenkins/jenkins-slave/workspace/Lucene-Solr-Tests-master/lucene/null1840241320
   [delete] Deleting directory /home/jenkins/jenkins-slave/workspace/Lucene-Solr-Tests-master/lucene/null1840241320

resolve-example:

ivy-availability-check:
[loadresource] Do not set property disallowed.ivy.jars.list as its length is 0.

-ivy-fail-disallowed-ivy-version:

ivy-fail:

ivy-configure:
[ivy:configure] :: loading settings :: file = /home/jenkins/jenkins-slave/workspace/Lucene-Solr-Tests-master/lucene/top-level-ivy-settings.xml

resolve:

resolve-server:

ivy-availability-check:
[loadresource] Do not set property disallowed.ivy.jars.list as its length is 0.

-ivy-fail-disallowed-ivy-version:

ivy-fail:

ivy-fail:

ivy-configure:
[ivy:configure] :: loading settings :: file = /home/jenkins/jenkins-slave/workspace/Lucene-Solr-Tests-master/lucene/top-level-ivy-settings.xml

resolve:

resolve:

ivy-availability-check:
[loadresource] Do not set property disallowed.ivy.jars.list as its length is 0.

-ivy-fail-disallowed-ivy-version:

ivy-fail:

ivy-fail:

ivy-configure:
[ivy:configure] :: loading settings :: file = /home/jenkins/jenkins-slave/workspace/Lucene-Solr-Tests-master/lucene/top-level-ivy-settings.xml

resolve:

ivy-availability-check:
[loadresource] Do not set property disallowed.ivy.jars.list as its length is 0.

-ivy-fail-disallowed-ivy-version:

ivy-fail:

ivy-fail:

ivy-configure:
[ivy:configure] :: loading settings :: file = /home/jenkins/jenkins-slave/workspace/Lucene-Solr-Tests-master/lucene/top-level-ivy-settings.xml

resolve:

ivy-availability-check:
[loadresource] Do not set property disallowed.ivy.jars.list as its length is 0.

-ivy-fail-disallowed-ivy-version:

ivy-fail:

ivy-configure:
[ivy:configure] :: loading settings :: file = /home/jenkins/jenkins-slave/workspace/Lucene-Solr-Tests-master/lucene/top-level-ivy-settings.xml

resolve:

ivy-availability-check:
[loadresource] Do not set property disallowed.ivy.jars.list as its length is 0.

-ivy-fail-disallowed-ivy-version:

ivy-fail:

ivy-fail:

ivy-configure:
[ivy:configure] :: loading settings :: file = /home/jenkins/jenkins-slave/workspace/Lucene-Solr-Tests-master/lucene/top-level-ivy-settings.xml

resolve:

ivy-availability-check:
[loadresource] Do not set property disallowed.ivy.jars.list as its length is 0.

-ivy-fail-disallowed-ivy-version:

ivy-fail:

ivy-configure:
[ivy:configure] :: loading settings :: file = /home/jenkins/jenkins-slave/workspace/Lucene-Solr-Tests-master/lucene/top-level-ivy-settings.xml

resolve:

ivy-availability-check:
[loadresource] Do not set property disallowed.ivy.jars.list as its length is 0.

-ivy-fail-disallowed-ivy-version:

ivy-fail:

ivy-fail:

ivy-configure:
[ivy:configure] :: loading settings :: file = /home/jenkins/jenkins-slave/workspace/Lucene-Solr-Tests-master/lucene/top-level-ivy-settings.xml

resolve:

ivy-availability-check:
[loadresource] Do not set property disallowed.ivy.jars.list as its length is 0.

-ivy-fail-disallowed-ivy-version:

ivy-fail:

ivy-fail:

ivy-configure:
[ivy:configure] :: loading settings :: file = /home/jenkins/jenkins-slave/workspace/Lucene-Solr-Tests-master/lucene/top-level-ivy-settings.xml

resolve:

ivy-availability-check:
[loadresource] Do not set property disallowed.ivy.jars.list as its length is 0.

-ivy-fail-disallowed-ivy-version:

ivy-fail:

ivy-fail:

ivy-configure:
[ivy:configure] :: loading settings :: file = /home/jenkins/jenkins-slave/workspace/Lucene-Solr-Tests-master/lucene/top-level-ivy-settings.xml

resolve:

ivy-availability-check:
[loadresource] Do not set property disallowed.ivy.jars.list as its length is 0.

-ivy-fail-disallowed-ivy-version:

ivy-fail:

ivy-fail:

ivy-configure:
[ivy:configure] :: loading settings :: file = /home/jenkins/jenkins-slave/workspace/Lucene-Solr-Tests-master/lucene/top-level-ivy-settings.xml

resolve:

ivy-availability-check:
[loadresource] Do not set property disallowed.ivy.jars.list as its length is 0.

-ivy-fail-disallowed-ivy-version:

ivy-fail:

ivy-fail:

ivy-configure:
[ivy:configure] :: loading settings :: file = /home/jenkins/jenkins-slave/workspace/Lucene-Solr-Tests-master/lucene/top-level-ivy-settings.xml

resolve:

ivy-availability-check:
[loadresource] Do not set property disallowed.ivy.jars.list as its length is 0.

-ivy-fail-disallowed-ivy-version:

ivy-fail:

ivy-fail:

ivy-configure:
[ivy:configure] :: loading settings :: file = /home/jenkins/jenkins-slave/workspace/Lucene-Solr-Tests-master/lucene/top-level-ivy-settings.xml

resolve:

ivy-availability-check:
[loadresource] Do not set property disallowed.ivy.jars.list as its length is 0.

-ivy-fail-disallowed-ivy-version:

ivy-fail:

ivy-fail:

ivy-configure:
[ivy:configure] :: loading settings :: file = /home/jenkins/jenkins-slave/workspace/Lucene-Solr-Tests-master/lucene/top-level-ivy-settings.xml

resolve:

ivy-availability-check:
[loadresource] Do not set property disallowed.ivy.jars.list as its length is 0.

-ivy-fail-disallowed-ivy-version:

ivy-fail:

ivy-fail:

ivy-configure:
[ivy:configure] :: loading settings :: file = /home/jenkins/jenkins-slave/workspace/Lucene-Solr-Tests-master/lucene/top-level-ivy-settings.xml

resolve:

ivy-availability-check:
[loadresource] Do not set property disallowed.ivy.jars.list as its length is 0.

-ivy-fail-disallowed-ivy-version:

ivy-fail:

ivy-fail:

ivy-configure:
[ivy:configure] :: loading settings :: file = /home/jenkins/jenkins-slave/workspace/Lucene-Solr-Tests-master/lucene/top-level-ivy-settings.xml

resolve:

ivy-availability-check:
[loadresource] Do not set property disallowed.ivy.jars.list as its length is 0.

-ivy-fail-disallowed-ivy-version:

ivy-fail:

ivy-fail:

ivy-configure:
[ivy:configure] :: loading settings :: file = /home/jenkins/jenkins-slave/workspace/Lucene-Solr-Tests-master/lucene/top-level-ivy-settings.xml

resolve:

jar-checksums:
    [mkdir] Created dir: /home/jenkins/jenkins-slave/workspace/Lucene-Solr-Tests-master/solr/null1197394195
     [copy] Copying 256 files to /home/jenkins/jenkins-slave/workspace/Lucene-Solr-Tests-master/solr/null1197394195
   [delete] Deleting directory /home/jenkins/jenkins-slave/workspace/Lucene-Solr-Tests-master/solr/null1197394195

check-working-copy:
[ivy:cachepath] :: resolving dependencies :: org.eclipse.jgit#org.eclipse.jgit-caller;working
[ivy:cachepath] 	confs: [default]
[ivy:cachepath] 	found org.eclipse.jgit#org.eclipse.jgit;4.6.0.201612231935-r in public
[ivy:cachepath] 	found com.jcraft#jsch;0.1.53 in public
[ivy:cachepath] 	found com.googlecode.javaewah#JavaEWAH;1.1.6 in public
[ivy:cachepath] 	found org.apache.httpcomponents#httpclient;4.3.6 in public
[ivy:cachepath] 	found org.apache.httpcomponents#httpcore;4.3.3 in public
[ivy:cachepath] 	found commons-logging#commons-logging;1.1.3 in public
[ivy:cachepath] 	found commons-codec#commons-codec;1.6 in public
[ivy:cachepath] 	found org.slf4j#slf4j-api;1.7.2 in public
[ivy:cachepath] :: resolution report :: resolve 61ms :: artifacts dl 4ms
	---------------------------------------------------------------------
	|                  |            modules            ||   artifacts   |
	|       conf       | number| search|dwnlded|evicted|| number|dwnlded|
	---------------------------------------------------------------------
	|      default     |   8   |   0   |   0   |   0   ||   8   |   0   |
	---------------------------------------------------------------------
[wc-checker] Initializing working copy...
[wc-checker] SLF4J: Failed to load class "org.slf4j.impl.StaticLoggerBinder".
[wc-checker] SLF4J: Defaulting to no-operation (NOP) logger implementation
[wc-checker] SLF4J: See http://www.slf4j.org/codes.html#StaticLoggerBinder for further details.
[wc-checker] Checking working copy status...

-jenkins-base:

BUILD SUCCESSFUL
Total time: 217 minutes 58 seconds
Archiving artifacts
java.lang.InterruptedException: no matches found within 10000
	at hudson.FilePath$ValidateAntFileMask.hasMatch(FilePath.java:2847)
	at hudson.FilePath$ValidateAntFileMask.invoke(FilePath.java:2726)
	at hudson.FilePath$ValidateAntFileMask.invoke(FilePath.java:2707)
	at hudson.FilePath$FileCallableWrapper.call(FilePath.java:3086)
Also:   hudson.remoting.Channel$CallSiteStackTrace: Remote call to lucene2
		at hudson.remoting.Channel.attachCallSiteStackTrace(Channel.java:1741)
		at hudson.remoting.UserRequest$ExceptionResponse.retrieve(UserRequest.java:357)
		at hudson.remoting.Channel.call(Channel.java:955)
		at hudson.FilePath.act(FilePath.java:1072)
		at hudson.FilePath.act(FilePath.java:1061)
		at hudson.FilePath.validateAntFileMask(FilePath.java:2705)
		at hudson.tasks.ArtifactArchiver.perform(ArtifactArchiver.java:243)
		at hudson.tasks.BuildStepCompatibilityLayer.perform(BuildStepCompatibilityLayer.java:81)
		at hudson.tasks.BuildStepMonitor$1.perform(BuildStepMonitor.java:20)
		at hudson.model.AbstractBuild$AbstractBuildExecution.perform(AbstractBuild.java:744)
		at hudson.model.AbstractBuild$AbstractBuildExecution.performAllBuildSteps(AbstractBuild.java:690)
		at hudson.model.Build$BuildExecution.post2(Build.java:186)
		at hudson.model.AbstractBuild$AbstractBuildExecution.post(AbstractBuild.java:635)
		at hudson.model.Run.execute(Run.java:1835)
		at hudson.model.FreeStyleBuild.run(FreeStyleBuild.java:43)
		at hudson.model.ResourceController.execute(ResourceController.java:97)
		at hudson.model.Executor.run(Executor.java:429)
Caused: hudson.FilePath$TunneledInterruptedException
	at hudson.FilePath$FileCallableWrapper.call(FilePath.java:3088)
	at hudson.remoting.UserRequest.perform(UserRequest.java:212)
	at hudson.remoting.UserRequest.perform(UserRequest.java:54)
	at hudson.remoting.Request$2.run(Request.java:369)
	at hudson.remoting.InterceptingExecutorService$1.call(InterceptingExecutorService.java:72)
	at java.util.concurrent.FutureTask.run(FutureTask.java:266)
	at java.util.concurrent.ThreadPoolExecutor.runWorker(ThreadPoolExecutor.java:1142)
	at java.util.concurrent.ThreadPoolExecutor$Worker.run(ThreadPoolExecutor.java:617)
	at java.lang.Thread.run(Thread.java:748)
Caused: java.lang.InterruptedException: java.lang.InterruptedException: no matches found within 10000
	at hudson.FilePath.act(FilePath.java:1074)
	at hudson.FilePath.act(FilePath.java:1061)
	at hudson.FilePath.validateAntFileMask(FilePath.java:2705)
	at hudson.tasks.ArtifactArchiver.perform(ArtifactArchiver.java:243)
	at hudson.tasks.BuildStepCompatibilityLayer.perform(BuildStepCompatibilityLayer.java:81)
	at hudson.tasks.BuildStepMonitor$1.perform(BuildStepMonitor.java:20)
	at hudson.model.AbstractBuild$AbstractBuildExecution.perform(AbstractBuild.java:744)
	at hudson.model.AbstractBuild$AbstractBuildExecution.performAllBuildSteps(AbstractBuild.java:690)
	at hudson.model.Build$BuildExecution.post2(Build.java:186)
	at hudson.model.AbstractBuild$AbstractBuildExecution.post(AbstractBuild.java:635)
	at hudson.model.Run.execute(Run.java:1835)
	at hudson.model.FreeStyleBuild.run(FreeStyleBuild.java:43)
	at hudson.model.ResourceController.execute(ResourceController.java:97)
	at hudson.model.Executor.run(Executor.java:429)
No artifacts found that match the file pattern "**/*.events,heapdumps/**,**/hs_err_pid*". Configuration error?
Recording test results
Build step 'Publish JUnit test result report' changed build result to UNSTABLE
Email was triggered for: Unstable (Test Failures)
Sending email for trigger: Unstable (Test Failures)

Mime
View raw message