lucene-dev mailing list archives

Site index · List index
Message view « Date » · « Thread »
Top « Date » · « Thread »
From Apache Jenkins Server <jenk...@builds.apache.org>
Subject [JENKINS] Lucene-Solr-NightlyTests-7.7 - Build # 1 - Failure
Date Thu, 31 Jan 2019 14:45:42 GMT
Build: https://builds.apache.org/job/Lucene-Solr-NightlyTests-7.7/1/

5 tests failed.
FAILED:  org.apache.lucene.analysis.ko.TestKoreanTokenizer.testRandomHugeStrings

Error Message:


Stack Trace:
java.lang.AssertionError
	at __randomizedtesting.SeedInfo.seed([8C5E2BE10F581CB:90E6857D4E833D83]:0)
	at org.apache.lucene.analysis.ko.KoreanTokenizer.add(KoreanTokenizer.java:334)
	at org.apache.lucene.analysis.ko.KoreanTokenizer.parse(KoreanTokenizer.java:707)
	at org.apache.lucene.analysis.ko.KoreanTokenizer.incrementToken(KoreanTokenizer.java:377)
	at org.apache.lucene.analysis.BaseTokenStreamTestCase.checkAnalysisConsistency(BaseTokenStreamTestCase.java:748)
	at org.apache.lucene.analysis.BaseTokenStreamTestCase.checkRandomData(BaseTokenStreamTestCase.java:659)
	at org.apache.lucene.analysis.BaseTokenStreamTestCase.checkRandomData(BaseTokenStreamTestCase.java:561)
	at org.apache.lucene.analysis.BaseTokenStreamTestCase.checkRandomData(BaseTokenStreamTestCase.java:474)
	at org.apache.lucene.analysis.ko.TestKoreanTokenizer.testRandomHugeStrings(TestKoreanTokenizer.java:313)
	at sun.reflect.NativeMethodAccessorImpl.invoke0(Native Method)
	at sun.reflect.NativeMethodAccessorImpl.invoke(NativeMethodAccessorImpl.java:62)
	at sun.reflect.DelegatingMethodAccessorImpl.invoke(DelegatingMethodAccessorImpl.java:43)
	at java.lang.reflect.Method.invoke(Method.java:498)
	at com.carrotsearch.randomizedtesting.RandomizedRunner.invoke(RandomizedRunner.java:1750)
	at com.carrotsearch.randomizedtesting.RandomizedRunner$8.evaluate(RandomizedRunner.java:938)
	at com.carrotsearch.randomizedtesting.RandomizedRunner$9.evaluate(RandomizedRunner.java:974)
	at com.carrotsearch.randomizedtesting.RandomizedRunner$10.evaluate(RandomizedRunner.java:988)
	at org.apache.lucene.util.TestRuleSetupTeardownChained$1.evaluate(TestRuleSetupTeardownChained.java:49)
	at org.apache.lucene.util.AbstractBeforeAfterRule$1.evaluate(AbstractBeforeAfterRule.java:45)
	at org.apache.lucene.util.TestRuleThreadAndTestName$1.evaluate(TestRuleThreadAndTestName.java:48)
	at org.apache.lucene.util.TestRuleIgnoreAfterMaxFailures$1.evaluate(TestRuleIgnoreAfterMaxFailures.java:64)
	at org.apache.lucene.util.TestRuleMarkFailure$1.evaluate(TestRuleMarkFailure.java:47)
	at com.carrotsearch.randomizedtesting.rules.StatementAdapter.evaluate(StatementAdapter.java:36)
	at com.carrotsearch.randomizedtesting.ThreadLeakControl$StatementRunner.run(ThreadLeakControl.java:368)
	at com.carrotsearch.randomizedtesting.ThreadLeakControl.forkTimeoutingTask(ThreadLeakControl.java:817)
	at com.carrotsearch.randomizedtesting.ThreadLeakControl$3.evaluate(ThreadLeakControl.java:468)
	at com.carrotsearch.randomizedtesting.RandomizedRunner.runSingleTest(RandomizedRunner.java:947)
	at com.carrotsearch.randomizedtesting.RandomizedRunner$5.evaluate(RandomizedRunner.java:832)
	at com.carrotsearch.randomizedtesting.RandomizedRunner$6.evaluate(RandomizedRunner.java:883)
	at com.carrotsearch.randomizedtesting.RandomizedRunner$7.evaluate(RandomizedRunner.java:894)
	at org.apache.lucene.util.AbstractBeforeAfterRule$1.evaluate(AbstractBeforeAfterRule.java:45)
	at com.carrotsearch.randomizedtesting.rules.StatementAdapter.evaluate(StatementAdapter.java:36)
	at org.apache.lucene.util.TestRuleStoreClassName$1.evaluate(TestRuleStoreClassName.java:41)
	at com.carrotsearch.randomizedtesting.rules.NoShadowingOrOverridesOnMethodsRule$1.evaluate(NoShadowingOrOverridesOnMethodsRule.java:40)
	at com.carrotsearch.randomizedtesting.rules.NoShadowingOrOverridesOnMethodsRule$1.evaluate(NoShadowingOrOverridesOnMethodsRule.java:40)
	at com.carrotsearch.randomizedtesting.rules.StatementAdapter.evaluate(StatementAdapter.java:36)
	at com.carrotsearch.randomizedtesting.rules.StatementAdapter.evaluate(StatementAdapter.java:36)
	at com.carrotsearch.randomizedtesting.rules.StatementAdapter.evaluate(StatementAdapter.java:36)
	at org.apache.lucene.util.TestRuleAssertionsRequired$1.evaluate(TestRuleAssertionsRequired.java:53)
	at org.apache.lucene.util.TestRuleMarkFailure$1.evaluate(TestRuleMarkFailure.java:47)
	at org.apache.lucene.util.TestRuleIgnoreAfterMaxFailures$1.evaluate(TestRuleIgnoreAfterMaxFailures.java:64)
	at org.apache.lucene.util.TestRuleIgnoreTestSuites$1.evaluate(TestRuleIgnoreTestSuites.java:54)
	at com.carrotsearch.randomizedtesting.rules.StatementAdapter.evaluate(StatementAdapter.java:36)
	at com.carrotsearch.randomizedtesting.ThreadLeakControl$StatementRunner.run(ThreadLeakControl.java:368)
	at java.lang.Thread.run(Thread.java:748)


FAILED:  junit.framework.TestSuite.org.apache.solr.cloud.hdfs.HdfsChaosMonkeySafeLeaderTest

Error Message:
ObjectTracker found 2 object(s) that were not released!!! [HdfsTransactionLog, HdfsTransactionLog] org.apache.solr.common.util.ObjectReleaseTracker$ObjectTrackerException: org.apache.solr.update.HdfsTransactionLog  at org.apache.solr.common.util.ObjectReleaseTracker.track(ObjectReleaseTracker.java:42)  at org.apache.solr.update.HdfsTransactionLog.<init>(HdfsTransactionLog.java:132)  at org.apache.solr.update.HdfsTransactionLog.<init>(HdfsTransactionLog.java:76)  at org.apache.solr.update.HdfsUpdateLog.ensureLog(HdfsUpdateLog.java:335)  at org.apache.solr.update.UpdateLog.add(UpdateLog.java:572)  at org.apache.solr.update.UpdateLog.add(UpdateLog.java:552)  at org.apache.solr.update.DirectUpdateHandler2.doNormalUpdate(DirectUpdateHandler2.java:350)  at org.apache.solr.update.DirectUpdateHandler2.addDoc0(DirectUpdateHandler2.java:288)  at org.apache.solr.update.DirectUpdateHandler2.addDoc(DirectUpdateHandler2.java:235)  at org.apache.solr.update.processor.RunUpdateProcessor.processAdd(RunUpdateProcessorFactory.java:67)  at org.apache.solr.update.processor.UpdateRequestProcessor.processAdd(UpdateRequestProcessor.java:55)  at org.apache.solr.update.processor.DistributedUpdateProcessor.doLocalAdd(DistributedUpdateProcessor.java:1001)  at org.apache.solr.update.processor.DistributedUpdateProcessor.versionAdd(DistributedUpdateProcessor.java:1222)  at org.apache.solr.update.processor.DistributedUpdateProcessor.processAdd(DistributedUpdateProcessor.java:693)  at org.apache.solr.update.processor.LogUpdateProcessorFactory$LogUpdateProcessor.processAdd(LogUpdateProcessorFactory.java:103)  at org.apache.solr.handler.loader.JavabinLoader$1.update(JavabinLoader.java:110)  at org.apache.solr.client.solrj.request.JavaBinUpdateRequestCodec$StreamingCodec.readOuterMostDocIterator(JavaBinUpdateRequestCodec.java:327)  at org.apache.solr.client.solrj.request.JavaBinUpdateRequestCodec$StreamingCodec.readIterator(JavaBinUpdateRequestCodec.java:280)  at org.apache.solr.common.util.JavaBinCodec.readObject(JavaBinCodec.java:333)  at org.apache.solr.common.util.JavaBinCodec.readVal(JavaBinCodec.java:278)  at org.apache.solr.client.solrj.request.JavaBinUpdateRequestCodec$StreamingCodec.readNamedList(JavaBinUpdateRequestCodec.java:235)  at org.apache.solr.common.util.JavaBinCodec.readObject(JavaBinCodec.java:298)  at org.apache.solr.common.util.JavaBinCodec.readVal(JavaBinCodec.java:278)  at org.apache.solr.common.util.JavaBinCodec.unmarshal(JavaBinCodec.java:191)  at org.apache.solr.client.solrj.request.JavaBinUpdateRequestCodec.unmarshal(JavaBinUpdateRequestCodec.java:126)  at org.apache.solr.handler.loader.JavabinLoader.parseAndLoadDocs(JavabinLoader.java:123)  at org.apache.solr.handler.loader.JavabinLoader.load(JavabinLoader.java:70)  at org.apache.solr.handler.UpdateRequestHandler$1.load(UpdateRequestHandler.java:97)  at org.apache.solr.handler.ContentStreamHandlerBase.handleRequestBody(ContentStreamHandlerBase.java:68)  at org.apache.solr.handler.RequestHandlerBase.handleRequest(RequestHandlerBase.java:199)  at org.apache.solr.core.SolrCore.execute(SolrCore.java:2551)  at org.apache.solr.servlet.HttpSolrCall.execute(HttpSolrCall.java:710)  at org.apache.solr.servlet.HttpSolrCall.call(HttpSolrCall.java:516)  at org.apache.solr.servlet.SolrDispatchFilter.doFilter(SolrDispatchFilter.java:395)  at org.apache.solr.servlet.SolrDispatchFilter.doFilter(SolrDispatchFilter.java:341)  at org.eclipse.jetty.servlet.ServletHandler$CachedChain.doFilter(ServletHandler.java:1610)  at org.apache.solr.client.solrj.embedded.JettySolrRunner$DebugFilter.doFilter(JettySolrRunner.java:158)  at org.eclipse.jetty.servlet.ServletHandler$CachedChain.doFilter(ServletHandler.java:1610)  at org.eclipse.jetty.servlet.ServletHandler.doHandle(ServletHandler.java:540)  at org.eclipse.jetty.server.handler.ScopedHandler.nextHandle(ScopedHandler.java:255)  at org.eclipse.jetty.server.session.SessionHandler.doHandle(SessionHandler.java:1588)  at org.eclipse.jetty.server.handler.ScopedHandler.nextHandle(ScopedHandler.java:255)  at org.eclipse.jetty.server.handler.ContextHandler.doHandle(ContextHandler.java:1345)  at org.eclipse.jetty.server.handler.ScopedHandler.nextScope(ScopedHandler.java:203)  at org.eclipse.jetty.servlet.ServletHandler.doScope(ServletHandler.java:480)  at org.eclipse.jetty.server.session.SessionHandler.doScope(SessionHandler.java:1557)  at org.eclipse.jetty.server.handler.ScopedHandler.nextScope(ScopedHandler.java:201)  at org.eclipse.jetty.server.handler.ContextHandler.doScope(ContextHandler.java:1247)  at org.eclipse.jetty.server.handler.ScopedHandler.handle(ScopedHandler.java:144)  at org.eclipse.jetty.server.handler.gzip.GzipHandler.handle(GzipHandler.java:703)  at org.eclipse.jetty.server.handler.HandlerWrapper.handle(HandlerWrapper.java:132)  at org.eclipse.jetty.server.Server.handle(Server.java:502)  at org.eclipse.jetty.server.HttpChannel.handle(HttpChannel.java:364)  at org.eclipse.jetty.server.HttpConnection.onFillable(HttpConnection.java:260)  at org.eclipse.jetty.io.AbstractConnection$ReadCallback.succeeded(AbstractConnection.java:305)  at org.eclipse.jetty.io.FillInterest.fillable(FillInterest.java:103)  at org.eclipse.jetty.io.ssl.SslConnection$DecryptedEndPoint.onFillable(SslConnection.java:411)  at org.eclipse.jetty.io.ssl.SslConnection.onFillable(SslConnection.java:305)  at org.eclipse.jetty.io.ssl.SslConnection$2.succeeded(SslConnection.java:159)  at org.eclipse.jetty.io.FillInterest.fillable(FillInterest.java:103)  at org.eclipse.jetty.io.ChannelEndPoint$2.run(ChannelEndPoint.java:118)  at org.eclipse.jetty.util.thread.QueuedThreadPool.runJob(QueuedThreadPool.java:765)  at org.eclipse.jetty.util.thread.QueuedThreadPool$2.run(QueuedThreadPool.java:683)  at java.lang.Thread.run(Thread.java:748)  org.apache.solr.common.util.ObjectReleaseTracker$ObjectTrackerException: org.apache.solr.update.HdfsTransactionLog  at org.apache.solr.common.util.ObjectReleaseTracker.track(ObjectReleaseTracker.java:42)  at org.apache.solr.update.HdfsTransactionLog.<init>(HdfsTransactionLog.java:132)  at org.apache.solr.update.HdfsTransactionLog.<init>(HdfsTransactionLog.java:76)  at org.apache.solr.update.HdfsUpdateLog.ensureLog(HdfsUpdateLog.java:335)  at org.apache.solr.update.UpdateLog.add(UpdateLog.java:572)  at org.apache.solr.update.UpdateLog.add(UpdateLog.java:552)  at org.apache.solr.update.DirectUpdateHandler2.doNormalUpdate(DirectUpdateHandler2.java:350)  at org.apache.solr.update.DirectUpdateHandler2.addDoc0(DirectUpdateHandler2.java:288)  at org.apache.solr.update.DirectUpdateHandler2.addDoc(DirectUpdateHandler2.java:235)  at org.apache.solr.update.processor.RunUpdateProcessor.processAdd(RunUpdateProcessorFactory.java:67)  at org.apache.solr.update.processor.UpdateRequestProcessor.processAdd(UpdateRequestProcessor.java:55)  at org.apache.solr.update.processor.DistributedUpdateProcessor.doLocalAdd(DistributedUpdateProcessor.java:1001)  at org.apache.solr.update.processor.DistributedUpdateProcessor.versionAdd(DistributedUpdateProcessor.java:1222)  at org.apache.solr.update.processor.DistributedUpdateProcessor.processAdd(DistributedUpdateProcessor.java:693)  at org.apache.solr.update.processor.LogUpdateProcessorFactory$LogUpdateProcessor.processAdd(LogUpdateProcessorFactory.java:103)  at org.apache.solr.handler.loader.JavabinLoader$1.update(JavabinLoader.java:110)  at org.apache.solr.client.solrj.request.JavaBinUpdateRequestCodec$StreamingCodec.readOuterMostDocIterator(JavaBinUpdateRequestCodec.java:327)  at org.apache.solr.client.solrj.request.JavaBinUpdateRequestCodec$StreamingCodec.readIterator(JavaBinUpdateRequestCodec.java:280)  at org.apache.solr.common.util.JavaBinCodec.readObject(JavaBinCodec.java:333)  at org.apache.solr.common.util.JavaBinCodec.readVal(JavaBinCodec.java:278)  at org.apache.solr.client.solrj.request.JavaBinUpdateRequestCodec$StreamingCodec.readNamedList(JavaBinUpdateRequestCodec.java:235)  at org.apache.solr.common.util.JavaBinCodec.readObject(JavaBinCodec.java:298)  at org.apache.solr.common.util.JavaBinCodec.readVal(JavaBinCodec.java:278)  at org.apache.solr.common.util.JavaBinCodec.unmarshal(JavaBinCodec.java:191)  at org.apache.solr.client.solrj.request.JavaBinUpdateRequestCodec.unmarshal(JavaBinUpdateRequestCodec.java:126)  at org.apache.solr.handler.loader.JavabinLoader.parseAndLoadDocs(JavabinLoader.java:123)  at org.apache.solr.handler.loader.JavabinLoader.load(JavabinLoader.java:70)  at org.apache.solr.handler.UpdateRequestHandler$1.load(UpdateRequestHandler.java:97)  at org.apache.solr.handler.ContentStreamHandlerBase.handleRequestBody(ContentStreamHandlerBase.java:68)  at org.apache.solr.handler.RequestHandlerBase.handleRequest(RequestHandlerBase.java:199)  at org.apache.solr.core.SolrCore.execute(SolrCore.java:2551)  at org.apache.solr.servlet.HttpSolrCall.execute(HttpSolrCall.java:710)  at org.apache.solr.servlet.HttpSolrCall.call(HttpSolrCall.java:516)  at org.apache.solr.servlet.SolrDispatchFilter.doFilter(SolrDispatchFilter.java:395)  at org.apache.solr.servlet.SolrDispatchFilter.doFilter(SolrDispatchFilter.java:341)  at org.eclipse.jetty.servlet.ServletHandler$CachedChain.doFilter(ServletHandler.java:1610)  at org.apache.solr.client.solrj.embedded.JettySolrRunner$DebugFilter.doFilter(JettySolrRunner.java:158)  at org.eclipse.jetty.servlet.ServletHandler$CachedChain.doFilter(ServletHandler.java:1610)  at org.eclipse.jetty.servlet.ServletHandler.doHandle(ServletHandler.java:540)  at org.eclipse.jetty.server.handler.ScopedHandler.nextHandle(ScopedHandler.java:255)  at org.eclipse.jetty.server.session.SessionHandler.doHandle(SessionHandler.java:1588)  at org.eclipse.jetty.server.handler.ScopedHandler.nextHandle(ScopedHandler.java:255)  at org.eclipse.jetty.server.handler.ContextHandler.doHandle(ContextHandler.java:1345)  at org.eclipse.jetty.server.handler.ScopedHandler.nextScope(ScopedHandler.java:203)  at org.eclipse.jetty.servlet.ServletHandler.doScope(ServletHandler.java:480)  at org.eclipse.jetty.server.session.SessionHandler.doScope(SessionHandler.java:1557)  at org.eclipse.jetty.server.handler.ScopedHandler.nextScope(ScopedHandler.java:201)  at org.eclipse.jetty.server.handler.ContextHandler.doScope(ContextHandler.java:1247)  at org.eclipse.jetty.server.handler.ScopedHandler.handle(ScopedHandler.java:144)  at org.eclipse.jetty.server.handler.gzip.GzipHandler.handle(GzipHandler.java:703)  at org.eclipse.jetty.server.handler.HandlerWrapper.handle(HandlerWrapper.java:132)  at org.eclipse.jetty.server.Server.handle(Server.java:502)  at org.eclipse.jetty.server.HttpChannel.handle(HttpChannel.java:364)  at org.eclipse.jetty.server.HttpConnection.onFillable(HttpConnection.java:260)  at org.eclipse.jetty.io.AbstractConnection$ReadCallback.succeeded(AbstractConnection.java:305)  at org.eclipse.jetty.io.FillInterest.fillable(FillInterest.java:103)  at org.eclipse.jetty.io.ssl.SslConnection$DecryptedEndPoint.onFillable(SslConnection.java:411)  at org.eclipse.jetty.io.ssl.SslConnection.onFillable(SslConnection.java:305)  at org.eclipse.jetty.io.ssl.SslConnection$2.succeeded(SslConnection.java:159)  at org.eclipse.jetty.io.FillInterest.fillable(FillInterest.java:103)  at org.eclipse.jetty.io.ChannelEndPoint$2.run(ChannelEndPoint.java:118)  at org.eclipse.jetty.util.thread.QueuedThreadPool.runJob(QueuedThreadPool.java:765)  at org.eclipse.jetty.util.thread.QueuedThreadPool$2.run(QueuedThreadPool.java:683)  at java.lang.Thread.run(Thread.java:748)   expected null, but was:<ObjectTracker found 2 object(s) that were not released!!! [HdfsTransactionLog, HdfsTransactionLog] org.apache.solr.common.util.ObjectReleaseTracker$ObjectTrackerException: org.apache.solr.update.HdfsTransactionLog  at org.apache.solr.common.util.ObjectReleaseTracker.track(ObjectReleaseTracker.java:42)  at org.apache.solr.update.HdfsTransactionLog.<init>(HdfsTransactionLog.java:132)  at org.apache.solr.update.HdfsTransactionLog.<init>(HdfsTransactionLog.java:76)  at org.apache.solr.update.HdfsUpdateLog.ensureLog(HdfsUpdateLog.java:335)  at org.apache.solr.update.UpdateLog.add(UpdateLog.java:572)  at org.apache.solr.update.UpdateLog.add(UpdateLog.java:552)  at org.apache.solr.update.DirectUpdateHandler2.doNormalUpdate(DirectUpdateHandler2.java:350)  at org.apache.solr.update.DirectUpdateHandler2.addDoc0(DirectUpdateHandler2.java:288)  at org.apache.solr.update.DirectUpdateHandler2.addDoc(DirectUpdateHandler2.java:235)  at org.apache.solr.update.processor.RunUpdateProcessor.processAdd(RunUpdateProcessorFactory.java:67)  at org.apache.solr.update.processor.UpdateRequestProcessor.processAdd(UpdateRequestProcessor.java:55)  at org.apache.solr.update.processor.DistributedUpdateProcessor.doLocalAdd(DistributedUpdateProcessor.java:1001)  at org.apache.solr.update.processor.DistributedUpdateProcessor.versionAdd(DistributedUpdateProcessor.java:1222)  at org.apache.solr.update.processor.DistributedUpdateProcessor.processAdd(DistributedUpdateProcessor.java:693)  at org.apache.solr.update.processor.LogUpdateProcessorFactory$LogUpdateProcessor.processAdd(LogUpdateProcessorFactory.java:103)  at org.apache.solr.handler.loader.JavabinLoader$1.update(JavabinLoader.java:110)  at org.apache.solr.client.solrj.request.JavaBinUpdateRequestCodec$StreamingCodec.readOuterMostDocIterator(JavaBinUpdateRequestCodec.java:327)  at org.apache.solr.client.solrj.request.JavaBinUpdateRequestCodec$StreamingCodec.readIterator(JavaBinUpdateRequestCodec.java:280)  at org.apache.solr.common.util.JavaBinCodec.readObject(JavaBinCodec.java:333)  at org.apache.solr.common.util.JavaBinCodec.readVal(JavaBinCodec.java:278)  at org.apache.solr.client.solrj.request.JavaBinUpdateRequestCodec$StreamingCodec.readNamedList(JavaBinUpdateRequestCodec.java:235)  at org.apache.solr.common.util.JavaBinCodec.readObject(JavaBinCodec.java:298)  at org.apache.solr.common.util.JavaBinCodec.readVal(JavaBinCodec.java:278)  at org.apache.solr.common.util.JavaBinCodec.unmarshal(JavaBinCodec.java:191)  at org.apache.solr.client.solrj.request.JavaBinUpdateRequestCodec.unmarshal(JavaBinUpdateRequestCodec.java:126)  at org.apache.solr.handler.loader.JavabinLoader.parseAndLoadDocs(JavabinLoader.java:123)  at org.apache.solr.handler.loader.JavabinLoader.load(JavabinLoader.java:70)  at org.apache.solr.handler.UpdateRequestHandler$1.load(UpdateRequestHandler.java:97)  at org.apache.solr.handler.ContentStreamHandlerBase.handleRequestBody(ContentStreamHandlerBase.java:68)  at org.apache.solr.handler.RequestHandlerBase.handleRequest(RequestHandlerBase.java:199)  at org.apache.solr.core.SolrCore.execute(SolrCore.java:2551)  at org.apache.solr.servlet.HttpSolrCall.execute(HttpSolrCall.java:710)  at org.apache.solr.servlet.HttpSolrCall.call(HttpSolrCall.java:516)  at org.apache.solr.servlet.SolrDispatchFilter.doFilter(SolrDispatchFilter.java:395)  at org.apache.solr.servlet.SolrDispatchFilter.doFilter(SolrDispatchFilter.java:341)  at org.eclipse.jetty.servlet.ServletHandler$CachedChain.doFilter(ServletHandler.java:1610)  at org.apache.solr.client.solrj.embedded.JettySolrRunner$DebugFilter.doFilter(JettySolrRunner.java:158)  at org.eclipse.jetty.servlet.ServletHandler$CachedChain.doFilter(ServletHandler.java:1610)  at org.eclipse.jetty.servlet.ServletHandler.doHandle(ServletHandler.java:540)  at org.eclipse.jetty.server.handler.ScopedHandler.nextHandle(ScopedHandler.java:255)  at org.eclipse.jetty.server.session.SessionHandler.doHandle(SessionHandler.java:1588)  at org.eclipse.jetty.server.handler.ScopedHandler.nextHandle(ScopedHandler.java:255)  at org.eclipse.jetty.server.handler.ContextHandler.doHandle(ContextHandler.java:1345)  at org.eclipse.jetty.server.handler.ScopedHandler.nextScope(ScopedHandler.java:203)  at org.eclipse.jetty.servlet.ServletHandler.doScope(ServletHandler.java:480)  at org.eclipse.jetty.server.session.SessionHandler.doScope(SessionHandler.java:1557)  at org.eclipse.jetty.server.handler.ScopedHandler.nextScope(ScopedHandler.java:201)  at org.eclipse.jetty.server.handler.ContextHandler.doScope(ContextHandler.java:1247)  at org.eclipse.jetty.server.handler.ScopedHandler.handle(ScopedHandler.java:144)  at org.eclipse.jetty.server.handler.gzip.GzipHandler.handle(GzipHandler.java:703)  at org.eclipse.jetty.server.handler.HandlerWrapper.handle(HandlerWrapper.java:132)  at org.eclipse.jetty.server.Server.handle(Server.java:502)  at org.eclipse.jetty.server.HttpChannel.handle(HttpChannel.java:364)  at org.eclipse.jetty.server.HttpConnection.onFillable(HttpConnection.java:260)  at org.eclipse.jetty.io.AbstractConnection$ReadCallback.succeeded(AbstractConnection.java:305)  at org.eclipse.jetty.io.FillInterest.fillable(FillInterest.java:103)  at org.eclipse.jetty.io.ssl.SslConnection$DecryptedEndPoint.onFillable(SslConnection.java:411)  at org.eclipse.jetty.io.ssl.SslConnection.onFillable(SslConnection.java:305)  at org.eclipse.jetty.io.ssl.SslConnection$2.succeeded(SslConnection.java:159)  at org.eclipse.jetty.io.FillInterest.fillable(FillInterest.java:103)  at org.eclipse.jetty.io.ChannelEndPoint$2.run(ChannelEndPoint.java:118)  at org.eclipse.jetty.util.thread.QueuedThreadPool.runJob(QueuedThreadPool.java:765)  at org.eclipse.jetty.util.thread.QueuedThreadPool$2.run(QueuedThreadPool.java:683)  at java.lang.Thread.run(Thread.java:748)  org.apache.solr.common.util.ObjectReleaseTracker$ObjectTrackerException: org.apache.solr.update.HdfsTransactionLog  at org.apache.solr.common.util.ObjectReleaseTracker.track(ObjectReleaseTracker.java:42)  at org.apache.solr.update.HdfsTransactionLog.<init>(HdfsTransactionLog.java:132)  at org.apache.solr.update.HdfsTransactionLog.<init>(HdfsTransactionLog.java:76)  at org.apache.solr.update.HdfsUpdateLog.ensureLog(HdfsUpdateLog.java:335)  at org.apache.solr.update.UpdateLog.add(UpdateLog.java:572)  at org.apache.solr.update.UpdateLog.add(UpdateLog.java:552)  at org.apache.solr.update.DirectUpdateHandler2.doNormalUpdate(DirectUpdateHandler2.java:350)  at org.apache.solr.update.DirectUpdateHandler2.addDoc0(DirectUpdateHandler2.java:288)  at org.apache.solr.update.DirectUpdateHandler2.addDoc(DirectUpdateHandler2.java:235)  at org.apache.solr.update.processor.RunUpdateProcessor.processAdd(RunUpdateProcessorFactory.java:67)  at org.apache.solr.update.processor.UpdateRequestProcessor.processAdd(UpdateRequestProcessor.java:55)  at org.apache.solr.update.processor.DistributedUpdateProcessor.doLocalAdd(DistributedUpdateProcessor.java:1001)  at org.apache.solr.update.processor.DistributedUpdateProcessor.versionAdd(DistributedUpdateProcessor.java:1222)  at org.apache.solr.update.processor.DistributedUpdateProcessor.processAdd(DistributedUpdateProcessor.java:693)  at org.apache.solr.update.processor.LogUpdateProcessorFactory$LogUpdateProcessor.processAdd(LogUpdateProcessorFactory.java:103)  at org.apache.solr.handler.loader.JavabinLoader$1.update(JavabinLoader.java:110)  at org.apache.solr.client.solrj.request.JavaBinUpdateRequestCodec$StreamingCodec.readOuterMostDocIterator(JavaBinUpdateRequestCodec.java:327)  at org.apache.solr.client.solrj.request.JavaBinUpdateRequestCodec$StreamingCodec.readIterator(JavaBinUpdateRequestCodec.java:280)  at org.apache.solr.common.util.JavaBinCodec.readObject(JavaBinCodec.java:333)  at org.apache.solr.common.util.JavaBinCodec.readVal(JavaBinCodec.java:278)  at org.apache.solr.client.solrj.request.JavaBinUpdateRequestCodec$StreamingCodec.readNamedList(JavaBinUpdateRequestCodec.java:235)  at org.apache.solr.common.util.JavaBinCodec.readObject(JavaBinCodec.java:298)  at org.apache.solr.common.util.JavaBinCodec.readVal(JavaBinCodec.java:278)  at org.apache.solr.common.util.JavaBinCodec.unmarshal(JavaBinCodec.java:191)  at org.apache.solr.client.solrj.request.JavaBinUpdateRequestCodec.unmarshal(JavaBinUpdateRequestCodec.java:126)  at org.apache.solr.handler.loader.JavabinLoader.parseAndLoadDocs(JavabinLoader.java:123)  at org.apache.solr.handler.loader.JavabinLoader.load(JavabinLoader.java:70)  at org.apache.solr.handler.UpdateRequestHandler$1.load(UpdateRequestHandler.java:97)  at org.apache.solr.handler.ContentStreamHandlerBase.handleRequestBody(ContentStreamHandlerBase.java:68)  at org.apache.solr.handler.RequestHandlerBase.handleRequest(RequestHandlerBase.java:199)  at org.apache.solr.core.SolrCore.execute(SolrCore.java:2551)  at org.apache.solr.servlet.HttpSolrCall.execute(HttpSolrCall.java:710)  at org.apache.solr.servlet.HttpSolrCall.call(HttpSolrCall.java:516)  at org.apache.solr.servlet.SolrDispatchFilter.doFilter(SolrDispatchFilter.java:395)  at org.apache.solr.servlet.SolrDispatchFilter.doFilter(SolrDispatchFilter.java:341)  at org.eclipse.jetty.servlet.ServletHandler$CachedChain.doFilter(ServletHandler.java:1610)  at org.apache.solr.client.solrj.embedded.JettySolrRunner$DebugFilter.doFilter(JettySolrRunner.java:158)  at org.eclipse.jetty.servlet.ServletHandler$CachedChain.doFilter(ServletHandler.java:1610)  at org.eclipse.jetty.servlet.ServletHandler.doHandle(ServletHandler.java:540)  at org.eclipse.jetty.server.handler.ScopedHandler.nextHandle(ScopedHandler.java:255)  at org.eclipse.jetty.server.session.SessionHandler.doHandle(SessionHandler.java:1588)  at org.eclipse.jetty.server.handler.ScopedHandler.nextHandle(ScopedHandler.java:255)  at org.eclipse.jetty.server.handler.ContextHandler.doHandle(ContextHandler.java:1345)  at org.eclipse.jetty.server.handler.ScopedHandler.nextScope(ScopedHandler.java:203)  at org.eclipse.jetty.servlet.ServletHandler.doScope(ServletHandler.java:480)  at org.eclipse.jetty.server.session.SessionHandler.doScope(SessionHandler.java:1557)  at org.eclipse.jetty.server.handler.ScopedHandler.nextScope(ScopedHandler.java:201)  at org.eclipse.jetty.server.handler.ContextHandler.doScope(ContextHandler.java:1247)  at org.eclipse.jetty.server.handler.ScopedHandler.handle(ScopedHandler.java:144)  at org.eclipse.jetty.server.handler.gzip.GzipHandler.handle(GzipHandler.java:703)  at org.eclipse.jetty.server.handler.HandlerWrapper.handle(HandlerWrapper.java:132)  at org.eclipse.jetty.server.Server.handle(Server.java:502)  at org.eclipse.jetty.server.HttpChannel.handle(HttpChannel.java:364)  at org.eclipse.jetty.server.HttpConnection.onFillable(HttpConnection.java:260)  at org.eclipse.jetty.io.AbstractConnection$ReadCallback.succeeded(AbstractConnection.java:305)  at org.eclipse.jetty.io.FillInterest.fillable(FillInterest.java:103)  at org.eclipse.jetty.io.ssl.SslConnection$DecryptedEndPoint.onFillable(SslConnection.java:411)  at org.eclipse.jetty.io.ssl.SslConnection.onFillable(SslConnection.java:305)  at org.eclipse.jetty.io.ssl.SslConnection$2.succeeded(SslConnection.java:159)  at org.eclipse.jetty.io.FillInterest.fillable(FillInterest.java:103)  at org.eclipse.jetty.io.ChannelEndPoint$2.run(ChannelEndPoint.java:118)  at org.eclipse.jetty.util.thread.QueuedThreadPool.runJob(QueuedThreadPool.java:765)  at org.eclipse.jetty.util.thread.QueuedThreadPool$2.run(QueuedThreadPool.java:683)  at java.lang.Thread.run(Thread.java:748)  >

Stack Trace:
java.lang.AssertionError: ObjectTracker found 2 object(s) that were not released!!! [HdfsTransactionLog, HdfsTransactionLog]
org.apache.solr.common.util.ObjectReleaseTracker$ObjectTrackerException: org.apache.solr.update.HdfsTransactionLog
	at org.apache.solr.common.util.ObjectReleaseTracker.track(ObjectReleaseTracker.java:42)
	at org.apache.solr.update.HdfsTransactionLog.<init>(HdfsTransactionLog.java:132)
	at org.apache.solr.update.HdfsTransactionLog.<init>(HdfsTransactionLog.java:76)
	at org.apache.solr.update.HdfsUpdateLog.ensureLog(HdfsUpdateLog.java:335)
	at org.apache.solr.update.UpdateLog.add(UpdateLog.java:572)
	at org.apache.solr.update.UpdateLog.add(UpdateLog.java:552)
	at org.apache.solr.update.DirectUpdateHandler2.doNormalUpdate(DirectUpdateHandler2.java:350)
	at org.apache.solr.update.DirectUpdateHandler2.addDoc0(DirectUpdateHandler2.java:288)
	at org.apache.solr.update.DirectUpdateHandler2.addDoc(DirectUpdateHandler2.java:235)
	at org.apache.solr.update.processor.RunUpdateProcessor.processAdd(RunUpdateProcessorFactory.java:67)
	at org.apache.solr.update.processor.UpdateRequestProcessor.processAdd(UpdateRequestProcessor.java:55)
	at org.apache.solr.update.processor.DistributedUpdateProcessor.doLocalAdd(DistributedUpdateProcessor.java:1001)
	at org.apache.solr.update.processor.DistributedUpdateProcessor.versionAdd(DistributedUpdateProcessor.java:1222)
	at org.apache.solr.update.processor.DistributedUpdateProcessor.processAdd(DistributedUpdateProcessor.java:693)
	at org.apache.solr.update.processor.LogUpdateProcessorFactory$LogUpdateProcessor.processAdd(LogUpdateProcessorFactory.java:103)
	at org.apache.solr.handler.loader.JavabinLoader$1.update(JavabinLoader.java:110)
	at org.apache.solr.client.solrj.request.JavaBinUpdateRequestCodec$StreamingCodec.readOuterMostDocIterator(JavaBinUpdateRequestCodec.java:327)
	at org.apache.solr.client.solrj.request.JavaBinUpdateRequestCodec$StreamingCodec.readIterator(JavaBinUpdateRequestCodec.java:280)
	at org.apache.solr.common.util.JavaBinCodec.readObject(JavaBinCodec.java:333)
	at org.apache.solr.common.util.JavaBinCodec.readVal(JavaBinCodec.java:278)
	at org.apache.solr.client.solrj.request.JavaBinUpdateRequestCodec$StreamingCodec.readNamedList(JavaBinUpdateRequestCodec.java:235)
	at org.apache.solr.common.util.JavaBinCodec.readObject(JavaBinCodec.java:298)
	at org.apache.solr.common.util.JavaBinCodec.readVal(JavaBinCodec.java:278)
	at org.apache.solr.common.util.JavaBinCodec.unmarshal(JavaBinCodec.java:191)
	at org.apache.solr.client.solrj.request.JavaBinUpdateRequestCodec.unmarshal(JavaBinUpdateRequestCodec.java:126)
	at org.apache.solr.handler.loader.JavabinLoader.parseAndLoadDocs(JavabinLoader.java:123)
	at org.apache.solr.handler.loader.JavabinLoader.load(JavabinLoader.java:70)
	at org.apache.solr.handler.UpdateRequestHandler$1.load(UpdateRequestHandler.java:97)
	at org.apache.solr.handler.ContentStreamHandlerBase.handleRequestBody(ContentStreamHandlerBase.java:68)
	at org.apache.solr.handler.RequestHandlerBase.handleRequest(RequestHandlerBase.java:199)
	at org.apache.solr.core.SolrCore.execute(SolrCore.java:2551)
	at org.apache.solr.servlet.HttpSolrCall.execute(HttpSolrCall.java:710)
	at org.apache.solr.servlet.HttpSolrCall.call(HttpSolrCall.java:516)
	at org.apache.solr.servlet.SolrDispatchFilter.doFilter(SolrDispatchFilter.java:395)
	at org.apache.solr.servlet.SolrDispatchFilter.doFilter(SolrDispatchFilter.java:341)
	at org.eclipse.jetty.servlet.ServletHandler$CachedChain.doFilter(ServletHandler.java:1610)
	at org.apache.solr.client.solrj.embedded.JettySolrRunner$DebugFilter.doFilter(JettySolrRunner.java:158)
	at org.eclipse.jetty.servlet.ServletHandler$CachedChain.doFilter(ServletHandler.java:1610)
	at org.eclipse.jetty.servlet.ServletHandler.doHandle(ServletHandler.java:540)
	at org.eclipse.jetty.server.handler.ScopedHandler.nextHandle(ScopedHandler.java:255)
	at org.eclipse.jetty.server.session.SessionHandler.doHandle(SessionHandler.java:1588)
	at org.eclipse.jetty.server.handler.ScopedHandler.nextHandle(ScopedHandler.java:255)
	at org.eclipse.jetty.server.handler.ContextHandler.doHandle(ContextHandler.java:1345)
	at org.eclipse.jetty.server.handler.ScopedHandler.nextScope(ScopedHandler.java:203)
	at org.eclipse.jetty.servlet.ServletHandler.doScope(ServletHandler.java:480)
	at org.eclipse.jetty.server.session.SessionHandler.doScope(SessionHandler.java:1557)
	at org.eclipse.jetty.server.handler.ScopedHandler.nextScope(ScopedHandler.java:201)
	at org.eclipse.jetty.server.handler.ContextHandler.doScope(ContextHandler.java:1247)
	at org.eclipse.jetty.server.handler.ScopedHandler.handle(ScopedHandler.java:144)
	at org.eclipse.jetty.server.handler.gzip.GzipHandler.handle(GzipHandler.java:703)
	at org.eclipse.jetty.server.handler.HandlerWrapper.handle(HandlerWrapper.java:132)
	at org.eclipse.jetty.server.Server.handle(Server.java:502)
	at org.eclipse.jetty.server.HttpChannel.handle(HttpChannel.java:364)
	at org.eclipse.jetty.server.HttpConnection.onFillable(HttpConnection.java:260)
	at org.eclipse.jetty.io.AbstractConnection$ReadCallback.succeeded(AbstractConnection.java:305)
	at org.eclipse.jetty.io.FillInterest.fillable(FillInterest.java:103)
	at org.eclipse.jetty.io.ssl.SslConnection$DecryptedEndPoint.onFillable(SslConnection.java:411)
	at org.eclipse.jetty.io.ssl.SslConnection.onFillable(SslConnection.java:305)
	at org.eclipse.jetty.io.ssl.SslConnection$2.succeeded(SslConnection.java:159)
	at org.eclipse.jetty.io.FillInterest.fillable(FillInterest.java:103)
	at org.eclipse.jetty.io.ChannelEndPoint$2.run(ChannelEndPoint.java:118)
	at org.eclipse.jetty.util.thread.QueuedThreadPool.runJob(QueuedThreadPool.java:765)
	at org.eclipse.jetty.util.thread.QueuedThreadPool$2.run(QueuedThreadPool.java:683)
	at java.lang.Thread.run(Thread.java:748)

org.apache.solr.common.util.ObjectReleaseTracker$ObjectTrackerException: org.apache.solr.update.HdfsTransactionLog
	at org.apache.solr.common.util.ObjectReleaseTracker.track(ObjectReleaseTracker.java:42)
	at org.apache.solr.update.HdfsTransactionLog.<init>(HdfsTransactionLog.java:132)
	at org.apache.solr.update.HdfsTransactionLog.<init>(HdfsTransactionLog.java:76)
	at org.apache.solr.update.HdfsUpdateLog.ensureLog(HdfsUpdateLog.java:335)
	at org.apache.solr.update.UpdateLog.add(UpdateLog.java:572)
	at org.apache.solr.update.UpdateLog.add(UpdateLog.java:552)
	at org.apache.solr.update.DirectUpdateHandler2.doNormalUpdate(DirectUpdateHandler2.java:350)
	at org.apache.solr.update.DirectUpdateHandler2.addDoc0(DirectUpdateHandler2.java:288)
	at org.apache.solr.update.DirectUpdateHandler2.addDoc(DirectUpdateHandler2.java:235)
	at org.apache.solr.update.processor.RunUpdateProcessor.processAdd(RunUpdateProcessorFactory.java:67)
	at org.apache.solr.update.processor.UpdateRequestProcessor.processAdd(UpdateRequestProcessor.java:55)
	at org.apache.solr.update.processor.DistributedUpdateProcessor.doLocalAdd(DistributedUpdateProcessor.java:1001)
	at org.apache.solr.update.processor.DistributedUpdateProcessor.versionAdd(DistributedUpdateProcessor.java:1222)
	at org.apache.solr.update.processor.DistributedUpdateProcessor.processAdd(DistributedUpdateProcessor.java:693)
	at org.apache.solr.update.processor.LogUpdateProcessorFactory$LogUpdateProcessor.processAdd(LogUpdateProcessorFactory.java:103)
	at org.apache.solr.handler.loader.JavabinLoader$1.update(JavabinLoader.java:110)
	at org.apache.solr.client.solrj.request.JavaBinUpdateRequestCodec$StreamingCodec.readOuterMostDocIterator(JavaBinUpdateRequestCodec.java:327)
	at org.apache.solr.client.solrj.request.JavaBinUpdateRequestCodec$StreamingCodec.readIterator(JavaBinUpdateRequestCodec.java:280)
	at org.apache.solr.common.util.JavaBinCodec.readObject(JavaBinCodec.java:333)
	at org.apache.solr.common.util.JavaBinCodec.readVal(JavaBinCodec.java:278)
	at org.apache.solr.client.solrj.request.JavaBinUpdateRequestCodec$StreamingCodec.readNamedList(JavaBinUpdateRequestCodec.java:235)
	at org.apache.solr.common.util.JavaBinCodec.readObject(JavaBinCodec.java:298)
	at org.apache.solr.common.util.JavaBinCodec.readVal(JavaBinCodec.java:278)
	at org.apache.solr.common.util.JavaBinCodec.unmarshal(JavaBinCodec.java:191)
	at org.apache.solr.client.solrj.request.JavaBinUpdateRequestCodec.unmarshal(JavaBinUpdateRequestCodec.java:126)
	at org.apache.solr.handler.loader.JavabinLoader.parseAndLoadDocs(JavabinLoader.java:123)
	at org.apache.solr.handler.loader.JavabinLoader.load(JavabinLoader.java:70)
	at org.apache.solr.handler.UpdateRequestHandler$1.load(UpdateRequestHandler.java:97)
	at org.apache.solr.handler.ContentStreamHandlerBase.handleRequestBody(ContentStreamHandlerBase.java:68)
	at org.apache.solr.handler.RequestHandlerBase.handleRequest(RequestHandlerBase.java:199)
	at org.apache.solr.core.SolrCore.execute(SolrCore.java:2551)
	at org.apache.solr.servlet.HttpSolrCall.execute(HttpSolrCall.java:710)
	at org.apache.solr.servlet.HttpSolrCall.call(HttpSolrCall.java:516)
	at org.apache.solr.servlet.SolrDispatchFilter.doFilter(SolrDispatchFilter.java:395)
	at org.apache.solr.servlet.SolrDispatchFilter.doFilter(SolrDispatchFilter.java:341)
	at org.eclipse.jetty.servlet.ServletHandler$CachedChain.doFilter(ServletHandler.java:1610)
	at org.apache.solr.client.solrj.embedded.JettySolrRunner$DebugFilter.doFilter(JettySolrRunner.java:158)
	at org.eclipse.jetty.servlet.ServletHandler$CachedChain.doFilter(ServletHandler.java:1610)
	at org.eclipse.jetty.servlet.ServletHandler.doHandle(ServletHandler.java:540)
	at org.eclipse.jetty.server.handler.ScopedHandler.nextHandle(ScopedHandler.java:255)
	at org.eclipse.jetty.server.session.SessionHandler.doHandle(SessionHandler.java:1588)
	at org.eclipse.jetty.server.handler.ScopedHandler.nextHandle(ScopedHandler.java:255)
	at org.eclipse.jetty.server.handler.ContextHandler.doHandle(ContextHandler.java:1345)
	at org.eclipse.jetty.server.handler.ScopedHandler.nextScope(ScopedHandler.java:203)
	at org.eclipse.jetty.servlet.ServletHandler.doScope(ServletHandler.java:480)
	at org.eclipse.jetty.server.session.SessionHandler.doScope(SessionHandler.java:1557)
	at org.eclipse.jetty.server.handler.ScopedHandler.nextScope(ScopedHandler.java:201)
	at org.eclipse.jetty.server.handler.ContextHandler.doScope(ContextHandler.java:1247)
	at org.eclipse.jetty.server.handler.ScopedHandler.handle(ScopedHandler.java:144)
	at org.eclipse.jetty.server.handler.gzip.GzipHandler.handle(GzipHandler.java:703)
	at org.eclipse.jetty.server.handler.HandlerWrapper.handle(HandlerWrapper.java:132)
	at org.eclipse.jetty.server.Server.handle(Server.java:502)
	at org.eclipse.jetty.server.HttpChannel.handle(HttpChannel.java:364)
	at org.eclipse.jetty.server.HttpConnection.onFillable(HttpConnection.java:260)
	at org.eclipse.jetty.io.AbstractConnection$ReadCallback.succeeded(AbstractConnection.java:305)
	at org.eclipse.jetty.io.FillInterest.fillable(FillInterest.java:103)
	at org.eclipse.jetty.io.ssl.SslConnection$DecryptedEndPoint.onFillable(SslConnection.java:411)
	at org.eclipse.jetty.io.ssl.SslConnection.onFillable(SslConnection.java:305)
	at org.eclipse.jetty.io.ssl.SslConnection$2.succeeded(SslConnection.java:159)
	at org.eclipse.jetty.io.FillInterest.fillable(FillInterest.java:103)
	at org.eclipse.jetty.io.ChannelEndPoint$2.run(ChannelEndPoint.java:118)
	at org.eclipse.jetty.util.thread.QueuedThreadPool.runJob(QueuedThreadPool.java:765)
	at org.eclipse.jetty.util.thread.QueuedThreadPool$2.run(QueuedThreadPool.java:683)
	at java.lang.Thread.run(Thread.java:748)

 expected null, but was:<ObjectTracker found 2 object(s) that were not released!!! [HdfsTransactionLog, HdfsTransactionLog]
org.apache.solr.common.util.ObjectReleaseTracker$ObjectTrackerException: org.apache.solr.update.HdfsTransactionLog
	at org.apache.solr.common.util.ObjectReleaseTracker.track(ObjectReleaseTracker.java:42)
	at org.apache.solr.update.HdfsTransactionLog.<init>(HdfsTransactionLog.java:132)
	at org.apache.solr.update.HdfsTransactionLog.<init>(HdfsTransactionLog.java:76)
	at org.apache.solr.update.HdfsUpdateLog.ensureLog(HdfsUpdateLog.java:335)
	at org.apache.solr.update.UpdateLog.add(UpdateLog.java:572)
	at org.apache.solr.update.UpdateLog.add(UpdateLog.java:552)
	at org.apache.solr.update.DirectUpdateHandler2.doNormalUpdate(DirectUpdateHandler2.java:350)
	at org.apache.solr.update.DirectUpdateHandler2.addDoc0(DirectUpdateHandler2.java:288)
	at org.apache.solr.update.DirectUpdateHandler2.addDoc(DirectUpdateHandler2.java:235)
	at org.apache.solr.update.processor.RunUpdateProcessor.processAdd(RunUpdateProcessorFactory.java:67)
	at org.apache.solr.update.processor.UpdateRequestProcessor.processAdd(UpdateRequestProcessor.java:55)
	at org.apache.solr.update.processor.DistributedUpdateProcessor.doLocalAdd(DistributedUpdateProcessor.java:1001)
	at org.apache.solr.update.processor.DistributedUpdateProcessor.versionAdd(DistributedUpdateProcessor.java:1222)
	at org.apache.solr.update.processor.DistributedUpdateProcessor.processAdd(DistributedUpdateProcessor.java:693)
	at org.apache.solr.update.processor.LogUpdateProcessorFactory$LogUpdateProcessor.processAdd(LogUpdateProcessorFactory.java:103)
	at org.apache.solr.handler.loader.JavabinLoader$1.update(JavabinLoader.java:110)
	at org.apache.solr.client.solrj.request.JavaBinUpdateRequestCodec$StreamingCodec.readOuterMostDocIterator(JavaBinUpdateRequestCodec.java:327)
	at org.apache.solr.client.solrj.request.JavaBinUpdateRequestCodec$StreamingCodec.readIterator(JavaBinUpdateRequestCodec.java:280)
	at org.apache.solr.common.util.JavaBinCodec.readObject(JavaBinCodec.java:333)
	at org.apache.solr.common.util.JavaBinCodec.readVal(JavaBinCodec.java:278)
	at org.apache.solr.client.solrj.request.JavaBinUpdateRequestCodec$StreamingCodec.readNamedList(JavaBinUpdateRequestCodec.java:235)
	at org.apache.solr.common.util.JavaBinCodec.readObject(JavaBinCodec.java:298)
	at org.apache.solr.common.util.JavaBinCodec.readVal(JavaBinCodec.java:278)
	at org.apache.solr.common.util.JavaBinCodec.unmarshal(JavaBinCodec.java:191)
	at org.apache.solr.client.solrj.request.JavaBinUpdateRequestCodec.unmarshal(JavaBinUpdateRequestCodec.java:126)
	at org.apache.solr.handler.loader.JavabinLoader.parseAndLoadDocs(JavabinLoader.java:123)
	at org.apache.solr.handler.loader.JavabinLoader.load(JavabinLoader.java:70)
	at org.apache.solr.handler.UpdateRequestHandler$1.load(UpdateRequestHandler.java:97)
	at org.apache.solr.handler.ContentStreamHandlerBase.handleRequestBody(ContentStreamHandlerBase.java:68)
	at org.apache.solr.handler.RequestHandlerBase.handleRequest(RequestHandlerBase.java:199)
	at org.apache.solr.core.SolrCore.execute(SolrCore.java:2551)
	at org.apache.solr.servlet.HttpSolrCall.execute(HttpSolrCall.java:710)
	at org.apache.solr.servlet.HttpSolrCall.call(HttpSolrCall.java:516)
	at org.apache.solr.servlet.SolrDispatchFilter.doFilter(SolrDispatchFilter.java:395)
	at org.apache.solr.servlet.SolrDispatchFilter.doFilter(SolrDispatchFilter.java:341)
	at org.eclipse.jetty.servlet.ServletHandler$CachedChain.doFilter(ServletHandler.java:1610)
	at org.apache.solr.client.solrj.embedded.JettySolrRunner$DebugFilter.doFilter(JettySolrRunner.java:158)
	at org.eclipse.jetty.servlet.ServletHandler$CachedChain.doFilter(ServletHandler.java:1610)
	at org.eclipse.jetty.servlet.ServletHandler.doHandle(ServletHandler.java:540)
	at org.eclipse.jetty.server.handler.ScopedHandler.nextHandle(ScopedHandler.java:255)
	at org.eclipse.jetty.server.session.SessionHandler.doHandle(SessionHandler.java:1588)
	at org.eclipse.jetty.server.handler.ScopedHandler.nextHandle(ScopedHandler.java:255)
	at org.eclipse.jetty.server.handler.ContextHandler.doHandle(ContextHandler.java:1345)
	at org.eclipse.jetty.server.handler.ScopedHandler.nextScope(ScopedHandler.java:203)
	at org.eclipse.jetty.servlet.ServletHandler.doScope(ServletHandler.java:480)
	at org.eclipse.jetty.server.session.SessionHandler.doScope(SessionHandler.java:1557)
	at org.eclipse.jetty.server.handler.ScopedHandler.nextScope(ScopedHandler.java:201)
	at org.eclipse.jetty.server.handler.ContextHandler.doScope(ContextHandler.java:1247)
	at org.eclipse.jetty.server.handler.ScopedHandler.handle(ScopedHandler.java:144)
	at org.eclipse.jetty.server.handler.gzip.GzipHandler.handle(GzipHandler.java:703)
	at org.eclipse.jetty.server.handler.HandlerWrapper.handle(HandlerWrapper.java:132)
	at org.eclipse.jetty.server.Server.handle(Server.java:502)
	at org.eclipse.jetty.server.HttpChannel.handle(HttpChannel.java:364)
	at org.eclipse.jetty.server.HttpConnection.onFillable(HttpConnection.java:260)
	at org.eclipse.jetty.io.AbstractConnection$ReadCallback.succeeded(AbstractConnection.java:305)
	at org.eclipse.jetty.io.FillInterest.fillable(FillInterest.java:103)
	at org.eclipse.jetty.io.ssl.SslConnection$DecryptedEndPoint.onFillable(SslConnection.java:411)
	at org.eclipse.jetty.io.ssl.SslConnection.onFillable(SslConnection.java:305)
	at org.eclipse.jetty.io.ssl.SslConnection$2.succeeded(SslConnection.java:159)
	at org.eclipse.jetty.io.FillInterest.fillable(FillInterest.java:103)
	at org.eclipse.jetty.io.ChannelEndPoint$2.run(ChannelEndPoint.java:118)
	at org.eclipse.jetty.util.thread.QueuedThreadPool.runJob(QueuedThreadPool.java:765)
	at org.eclipse.jetty.util.thread.QueuedThreadPool$2.run(QueuedThreadPool.java:683)
	at java.lang.Thread.run(Thread.java:748)

org.apache.solr.common.util.ObjectReleaseTracker$ObjectTrackerException: org.apache.solr.update.HdfsTransactionLog
	at org.apache.solr.common.util.ObjectReleaseTracker.track(ObjectReleaseTracker.java:42)
	at org.apache.solr.update.HdfsTransactionLog.<init>(HdfsTransactionLog.java:132)
	at org.apache.solr.update.HdfsTransactionLog.<init>(HdfsTransactionLog.java:76)
	at org.apache.solr.update.HdfsUpdateLog.ensureLog(HdfsUpdateLog.java:335)
	at org.apache.solr.update.UpdateLog.add(UpdateLog.java:572)
	at org.apache.solr.update.UpdateLog.add(UpdateLog.java:552)
	at org.apache.solr.update.DirectUpdateHandler2.doNormalUpdate(DirectUpdateHandler2.java:350)
	at org.apache.solr.update.DirectUpdateHandler2.addDoc0(DirectUpdateHandler2.java:288)
	at org.apache.solr.update.DirectUpdateHandler2.addDoc(DirectUpdateHandler2.java:235)
	at org.apache.solr.update.processor.RunUpdateProcessor.processAdd(RunUpdateProcessorFactory.java:67)
	at org.apache.solr.update.processor.UpdateRequestProcessor.processAdd(UpdateRequestProcessor.java:55)
	at org.apache.solr.update.processor.DistributedUpdateProcessor.doLocalAdd(DistributedUpdateProcessor.java:1001)
	at org.apache.solr.update.processor.DistributedUpdateProcessor.versionAdd(DistributedUpdateProcessor.java:1222)
	at org.apache.solr.update.processor.DistributedUpdateProcessor.processAdd(DistributedUpdateProcessor.java:693)
	at org.apache.solr.update.processor.LogUpdateProcessorFactory$LogUpdateProcessor.processAdd(LogUpdateProcessorFactory.java:103)
	at org.apache.solr.handler.loader.JavabinLoader$1.update(JavabinLoader.java:110)
	at org.apache.solr.client.solrj.request.JavaBinUpdateRequestCodec$StreamingCodec.readOuterMostDocIterator(JavaBinUpdateRequestCodec.java:327)
	at org.apache.solr.client.solrj.request.JavaBinUpdateRequestCodec$StreamingCodec.readIterator(JavaBinUpdateRequestCodec.java:280)
	at org.apache.solr.common.util.JavaBinCodec.readObject(JavaBinCodec.java:333)
	at org.apache.solr.common.util.JavaBinCodec.readVal(JavaBinCodec.java:278)
	at org.apache.solr.client.solrj.request.JavaBinUpdateRequestCodec$StreamingCodec.readNamedList(JavaBinUpdateRequestCodec.java:235)
	at org.apache.solr.common.util.JavaBinCodec.readObject(JavaBinCodec.java:298)
	at org.apache.solr.common.util.JavaBinCodec.readVal(JavaBinCodec.java:278)
	at org.apache.solr.common.util.JavaBinCodec.unmarshal(JavaBinCodec.java:191)
	at org.apache.solr.client.solrj.request.JavaBinUpdateRequestCodec.unmarshal(JavaBinUpdateRequestCodec.java:126)
	at org.apache.solr.handler.loader.JavabinLoader.parseAndLoadDocs(JavabinLoader.java:123)
	at org.apache.solr.handler.loader.JavabinLoader.load(JavabinLoader.java:70)
	at org.apache.solr.handler.UpdateRequestHandler$1.load(UpdateRequestHandler.java:97)
	at org.apache.solr.handler.ContentStreamHandlerBase.handleRequestBody(ContentStreamHandlerBase.java:68)
	at org.apache.solr.handler.RequestHandlerBase.handleRequest(RequestHandlerBase.java:199)
	at org.apache.solr.core.SolrCore.execute(SolrCore.java:2551)
	at org.apache.solr.servlet.HttpSolrCall.execute(HttpSolrCall.java:710)
	at org.apache.solr.servlet.HttpSolrCall.call(HttpSolrCall.java:516)
	at org.apache.solr.servlet.SolrDispatchFilter.doFilter(SolrDispatchFilter.java:395)
	at org.apache.solr.servlet.SolrDispatchFilter.doFilter(SolrDispatchFilter.java:341)
	at org.eclipse.jetty.servlet.ServletHandler$CachedChain.doFilter(ServletHandler.java:1610)
	at org.apache.solr.client.solrj.embedded.JettySolrRunner$DebugFilter.doFilter(JettySolrRunner.java:158)
	at org.eclipse.jetty.servlet.ServletHandler$CachedChain.doFilter(ServletHandler.java:1610)
	at org.eclipse.jetty.servlet.ServletHandler.doHandle(ServletHandler.java:540)
	at org.eclipse.jetty.server.handler.ScopedHandler.nextHandle(ScopedHandler.java:255)
	at org.eclipse.jetty.server.session.SessionHandler.doHandle(SessionHandler.java:1588)
	at org.eclipse.jetty.server.handler.ScopedHandler.nextHandle(ScopedHandler.java:255)
	at org.eclipse.jetty.server.handler.ContextHandler.doHandle(ContextHandler.java:1345)
	at org.eclipse.jetty.server.handler.ScopedHandler.nextScope(ScopedHandler.java:203)
	at org.eclipse.jetty.servlet.ServletHandler.doScope(ServletHandler.java:480)
	at org.eclipse.jetty.server.session.SessionHandler.doScope(SessionHandler.java:1557)
	at org.eclipse.jetty.server.handler.ScopedHandler.nextScope(ScopedHandler.java:201)
	at org.eclipse.jetty.server.handler.ContextHandler.doScope(ContextHandler.java:1247)
	at org.eclipse.jetty.server.handler.ScopedHandler.handle(ScopedHandler.java:144)
	at org.eclipse.jetty.server.handler.gzip.GzipHandler.handle(GzipHandler.java:703)
	at org.eclipse.jetty.server.handler.HandlerWrapper.handle(HandlerWrapper.java:132)
	at org.eclipse.jetty.server.Server.handle(Server.java:502)
	at org.eclipse.jetty.server.HttpChannel.handle(HttpChannel.java:364)
	at org.eclipse.jetty.server.HttpConnection.onFillable(HttpConnection.java:260)
	at org.eclipse.jetty.io.AbstractConnection$ReadCallback.succeeded(AbstractConnection.java:305)
	at org.eclipse.jetty.io.FillInterest.fillable(FillInterest.java:103)
	at org.eclipse.jetty.io.ssl.SslConnection$DecryptedEndPoint.onFillable(SslConnection.java:411)
	at org.eclipse.jetty.io.ssl.SslConnection.onFillable(SslConnection.java:305)
	at org.eclipse.jetty.io.ssl.SslConnection$2.succeeded(SslConnection.java:159)
	at org.eclipse.jetty.io.FillInterest.fillable(FillInterest.java:103)
	at org.eclipse.jetty.io.ChannelEndPoint$2.run(ChannelEndPoint.java:118)
	at org.eclipse.jetty.util.thread.QueuedThreadPool.runJob(QueuedThreadPool.java:765)
	at org.eclipse.jetty.util.thread.QueuedThreadPool$2.run(QueuedThreadPool.java:683)
	at java.lang.Thread.run(Thread.java:748)

>
	at __randomizedtesting.SeedInfo.seed([B95938FF7F911E2B]:0)
	at org.junit.Assert.fail(Assert.java:88)
	at org.junit.Assert.failNotNull(Assert.java:755)
	at org.junit.Assert.assertNull(Assert.java:737)
	at org.apache.solr.SolrTestCaseJ4.teardownTestCases(SolrTestCaseJ4.java:320)
	at sun.reflect.GeneratedMethodAccessor100.invoke(Unknown Source)
	at sun.reflect.DelegatingMethodAccessorImpl.invoke(DelegatingMethodAccessorImpl.java:43)
	at java.lang.reflect.Method.invoke(Method.java:498)
	at com.carrotsearch.randomizedtesting.RandomizedRunner.invoke(RandomizedRunner.java:1750)
	at com.carrotsearch.randomizedtesting.RandomizedRunner$7.evaluate(RandomizedRunner.java:901)
	at com.carrotsearch.randomizedtesting.rules.StatementAdapter.evaluate(StatementAdapter.java:36)
	at com.carrotsearch.randomizedtesting.rules.SystemPropertiesRestoreRule$1.evaluate(SystemPropertiesRestoreRule.java:57)
	at org.apache.lucene.util.AbstractBeforeAfterRule$1.evaluate(AbstractBeforeAfterRule.java:45)
	at com.carrotsearch.randomizedtesting.rules.StatementAdapter.evaluate(StatementAdapter.java:36)
	at org.apache.lucene.util.TestRuleStoreClassName$1.evaluate(TestRuleStoreClassName.java:41)
	at com.carrotsearch.randomizedtesting.rules.NoShadowingOrOverridesOnMethodsRule$1.evaluate(NoShadowingOrOverridesOnMethodsRule.java:40)
	at com.carrotsearch.randomizedtesting.rules.NoShadowingOrOverridesOnMethodsRule$1.evaluate(NoShadowingOrOverridesOnMethodsRule.java:40)
	at com.carrotsearch.randomizedtesting.rules.StatementAdapter.evaluate(StatementAdapter.java:36)
	at com.carrotsearch.randomizedtesting.rules.StatementAdapter.evaluate(StatementAdapter.java:36)
	at com.carrotsearch.randomizedtesting.rules.StatementAdapter.evaluate(StatementAdapter.java:36)
	at org.apache.lucene.util.TestRuleAssertionsRequired$1.evaluate(TestRuleAssertionsRequired.java:53)
	at org.apache.lucene.util.TestRuleMarkFailure$1.evaluate(TestRuleMarkFailure.java:47)
	at org.apache.lucene.util.TestRuleIgnoreAfterMaxFailures$1.evaluate(TestRuleIgnoreAfterMaxFailures.java:64)
	at org.apache.lucene.util.TestRuleIgnoreTestSuites$1.evaluate(TestRuleIgnoreTestSuites.java:54)
	at com.carrotsearch.randomizedtesting.rules.StatementAdapter.evaluate(StatementAdapter.java:36)
	at com.carrotsearch.randomizedtesting.ThreadLeakControl$StatementRunner.run(ThreadLeakControl.java:368)
	at java.lang.Thread.run(Thread.java:748)


FAILED:  org.apache.solr.cloud.hdfs.HdfsUnloadDistributedZkTest.test

Error Message:
Error from server at http://127.0.0.1:39657/ztz: ADDREPLICA failed to create replica

Stack Trace:
org.apache.solr.client.solrj.impl.HttpSolrClient$RemoteSolrException: Error from server at http://127.0.0.1:39657/ztz: ADDREPLICA failed to create replica
	at __randomizedtesting.SeedInfo.seed([B95938FF7F911E2B:310D0725D16D73D3]:0)
	at org.apache.solr.client.solrj.impl.HttpSolrClient.executeMethod(HttpSolrClient.java:643)
	at org.apache.solr.client.solrj.impl.HttpSolrClient.request(HttpSolrClient.java:255)
	at org.apache.solr.client.solrj.impl.HttpSolrClient.request(HttpSolrClient.java:244)
	at org.apache.solr.client.solrj.impl.LBHttpSolrClient.doRequest(LBHttpSolrClient.java:484)
	at org.apache.solr.client.solrj.impl.LBHttpSolrClient.request(LBHttpSolrClient.java:414)
	at org.apache.solr.client.solrj.impl.CloudSolrClient.sendRequest(CloudSolrClient.java:1110)
	at org.apache.solr.client.solrj.impl.CloudSolrClient.requestWithRetryOnStaleState(CloudSolrClient.java:884)
	at org.apache.solr.client.solrj.impl.CloudSolrClient.request(CloudSolrClient.java:817)
	at org.apache.solr.client.solrj.SolrRequest.process(SolrRequest.java:194)
	at org.apache.solr.client.solrj.SolrRequest.process(SolrRequest.java:211)
	at org.apache.solr.cloud.UnloadDistributedZkTest.testUnloadShardAndCollection(UnloadDistributedZkTest.java:127)
	at org.apache.solr.cloud.UnloadDistributedZkTest.test(UnloadDistributedZkTest.java:74)
	at sun.reflect.NativeMethodAccessorImpl.invoke0(Native Method)
	at sun.reflect.NativeMethodAccessorImpl.invoke(NativeMethodAccessorImpl.java:62)
	at sun.reflect.DelegatingMethodAccessorImpl.invoke(DelegatingMethodAccessorImpl.java:43)
	at java.lang.reflect.Method.invoke(Method.java:498)
	at com.carrotsearch.randomizedtesting.RandomizedRunner.invoke(RandomizedRunner.java:1750)
	at com.carrotsearch.randomizedtesting.RandomizedRunner$8.evaluate(RandomizedRunner.java:938)
	at com.carrotsearch.randomizedtesting.RandomizedRunner$9.evaluate(RandomizedRunner.java:974)
	at com.carrotsearch.randomizedtesting.RandomizedRunner$10.evaluate(RandomizedRunner.java:988)
	at org.apache.solr.BaseDistributedSearchTestCase$ShardsRepeatRule$ShardsFixedStatement.callStatement(BaseDistributedSearchTestCase.java:1075)
	at org.apache.solr.BaseDistributedSearchTestCase$ShardsRepeatRule$ShardsStatement.evaluate(BaseDistributedSearchTestCase.java:1047)
	at com.carrotsearch.randomizedtesting.rules.SystemPropertiesRestoreRule$1.evaluate(SystemPropertiesRestoreRule.java:57)
	at org.apache.lucene.util.TestRuleSetupTeardownChained$1.evaluate(TestRuleSetupTeardownChained.java:49)
	at org.apache.lucene.util.AbstractBeforeAfterRule$1.evaluate(AbstractBeforeAfterRule.java:45)
	at org.apache.lucene.util.TestRuleThreadAndTestName$1.evaluate(TestRuleThreadAndTestName.java:48)
	at org.apache.lucene.util.TestRuleIgnoreAfterMaxFailures$1.evaluate(TestRuleIgnoreAfterMaxFailures.java:64)
	at org.apache.lucene.util.TestRuleMarkFailure$1.evaluate(TestRuleMarkFailure.java:47)
	at com.carrotsearch.randomizedtesting.rules.StatementAdapter.evaluate(StatementAdapter.java:36)
	at com.carrotsearch.randomizedtesting.ThreadLeakControl$StatementRunner.run(ThreadLeakControl.java:368)
	at com.carrotsearch.randomizedtesting.ThreadLeakControl.forkTimeoutingTask(ThreadLeakControl.java:817)
	at com.carrotsearch.randomizedtesting.ThreadLeakControl$3.evaluate(ThreadLeakControl.java:468)
	at com.carrotsearch.randomizedtesting.RandomizedRunner.runSingleTest(RandomizedRunner.java:947)
	at com.carrotsearch.randomizedtesting.RandomizedRunner$5.evaluate(RandomizedRunner.java:832)
	at com.carrotsearch.randomizedtesting.RandomizedRunner$6.evaluate(RandomizedRunner.java:883)
	at com.carrotsearch.randomizedtesting.RandomizedRunner$7.evaluate(RandomizedRunner.java:894)
	at com.carrotsearch.randomizedtesting.rules.StatementAdapter.evaluate(StatementAdapter.java:36)
	at com.carrotsearch.randomizedtesting.rules.SystemPropertiesRestoreRule$1.evaluate(SystemPropertiesRestoreRule.java:57)
	at org.apache.lucene.util.AbstractBeforeAfterRule$1.evaluate(AbstractBeforeAfterRule.java:45)
	at com.carrotsearch.randomizedtesting.rules.StatementAdapter.evaluate(StatementAdapter.java:36)
	at org.apache.lucene.util.TestRuleStoreClassName$1.evaluate(TestRuleStoreClassName.java:41)
	at com.carrotsearch.randomizedtesting.rules.NoShadowingOrOverridesOnMethodsRule$1.evaluate(NoShadowingOrOverridesOnMethodsRule.java:40)
	at com.carrotsearch.randomizedtesting.rules.NoShadowingOrOverridesOnMethodsRule$1.evaluate(NoShadowingOrOverridesOnMethodsRule.java:40)
	at com.carrotsearch.randomizedtesting.rules.StatementAdapter.evaluate(StatementAdapter.java:36)
	at com.carrotsearch.randomizedtesting.rules.StatementAdapter.evaluate(StatementAdapter.java:36)
	at com.carrotsearch.randomizedtesting.rules.StatementAdapter.evaluate(StatementAdapter.java:36)
	at org.apache.lucene.util.TestRuleAssertionsRequired$1.evaluate(TestRuleAssertionsRequired.java:53)
	at org.apache.lucene.util.TestRuleMarkFailure$1.evaluate(TestRuleMarkFailure.java:47)
	at org.apache.lucene.util.TestRuleIgnoreAfterMaxFailures$1.evaluate(TestRuleIgnoreAfterMaxFailures.java:64)
	at org.apache.lucene.util.TestRuleIgnoreTestSuites$1.evaluate(TestRuleIgnoreTestSuites.java:54)
	at com.carrotsearch.randomizedtesting.rules.StatementAdapter.evaluate(StatementAdapter.java:36)
	at com.carrotsearch.randomizedtesting.ThreadLeakControl$StatementRunner.run(ThreadLeakControl.java:368)
	at java.lang.Thread.run(Thread.java:748)


FAILED:  org.apache.solr.handler.export.TestExportWriter.testStringWithCase

Error Message:
expected:<...:"3"},       {"id":"[1"},       {"id":"4]"},       {"id":"2"}...> but was:<...:"3"},       {"id":"[4"},       {"id":"1]"},       {"id":"2"}...>

Stack Trace:
org.junit.ComparisonFailure: expected:<...:"3"},
      {"id":"[1"},
      {"id":"4]"},
      {"id":"2"}...> but was:<...:"3"},
      {"id":"[4"},
      {"id":"1]"},
      {"id":"2"}...>
	at __randomizedtesting.SeedInfo.seed([B95938FF7F911E2B:DD12C479E61C1E4E]:0)
	at org.junit.Assert.assertEquals(Assert.java:115)
	at org.junit.Assert.assertEquals(Assert.java:144)
	at org.apache.solr.handler.export.TestExportWriter.assertJsonEquals(TestExportWriter.java:497)
	at org.apache.solr.handler.export.TestExportWriter.testStringWithCase(TestExportWriter.java:349)
	at sun.reflect.NativeMethodAccessorImpl.invoke0(Native Method)
	at sun.reflect.NativeMethodAccessorImpl.invoke(NativeMethodAccessorImpl.java:62)
	at sun.reflect.DelegatingMethodAccessorImpl.invoke(DelegatingMethodAccessorImpl.java:43)
	at java.lang.reflect.Method.invoke(Method.java:498)
	at com.carrotsearch.randomizedtesting.RandomizedRunner.invoke(RandomizedRunner.java:1750)
	at com.carrotsearch.randomizedtesting.RandomizedRunner$8.evaluate(RandomizedRunner.java:938)
	at com.carrotsearch.randomizedtesting.RandomizedRunner$9.evaluate(RandomizedRunner.java:974)
	at com.carrotsearch.randomizedtesting.RandomizedRunner$10.evaluate(RandomizedRunner.java:988)
	at com.carrotsearch.randomizedtesting.rules.SystemPropertiesRestoreRule$1.evaluate(SystemPropertiesRestoreRule.java:57)
	at org.apache.lucene.util.TestRuleSetupTeardownChained$1.evaluate(TestRuleSetupTeardownChained.java:49)
	at org.apache.lucene.util.AbstractBeforeAfterRule$1.evaluate(AbstractBeforeAfterRule.java:45)
	at org.apache.lucene.util.TestRuleThreadAndTestName$1.evaluate(TestRuleThreadAndTestName.java:48)
	at org.apache.lucene.util.TestRuleIgnoreAfterMaxFailures$1.evaluate(TestRuleIgnoreAfterMaxFailures.java:64)
	at org.apache.lucene.util.TestRuleMarkFailure$1.evaluate(TestRuleMarkFailure.java:47)
	at com.carrotsearch.randomizedtesting.rules.StatementAdapter.evaluate(StatementAdapter.java:36)
	at com.carrotsearch.randomizedtesting.ThreadLeakControl$StatementRunner.run(ThreadLeakControl.java:368)
	at com.carrotsearch.randomizedtesting.ThreadLeakControl.forkTimeoutingTask(ThreadLeakControl.java:817)
	at com.carrotsearch.randomizedtesting.ThreadLeakControl$3.evaluate(ThreadLeakControl.java:468)
	at com.carrotsearch.randomizedtesting.RandomizedRunner.runSingleTest(RandomizedRunner.java:947)
	at com.carrotsearch.randomizedtesting.RandomizedRunner$5.evaluate(RandomizedRunner.java:832)
	at com.carrotsearch.randomizedtesting.RandomizedRunner$6.evaluate(RandomizedRunner.java:883)
	at com.carrotsearch.randomizedtesting.RandomizedRunner$7.evaluate(RandomizedRunner.java:894)
	at com.carrotsearch.randomizedtesting.rules.StatementAdapter.evaluate(StatementAdapter.java:36)
	at com.carrotsearch.randomizedtesting.rules.SystemPropertiesRestoreRule$1.evaluate(SystemPropertiesRestoreRule.java:57)
	at org.apache.lucene.util.AbstractBeforeAfterRule$1.evaluate(AbstractBeforeAfterRule.java:45)
	at com.carrotsearch.randomizedtesting.rules.StatementAdapter.evaluate(StatementAdapter.java:36)
	at org.apache.lucene.util.TestRuleStoreClassName$1.evaluate(TestRuleStoreClassName.java:41)
	at com.carrotsearch.randomizedtesting.rules.NoShadowingOrOverridesOnMethodsRule$1.evaluate(NoShadowingOrOverridesOnMethodsRule.java:40)
	at com.carrotsearch.randomizedtesting.rules.NoShadowingOrOverridesOnMethodsRule$1.evaluate(NoShadowingOrOverridesOnMethodsRule.java:40)
	at com.carrotsearch.randomizedtesting.rules.StatementAdapter.evaluate(StatementAdapter.java:36)
	at com.carrotsearch.randomizedtesting.rules.StatementAdapter.evaluate(StatementAdapter.java:36)
	at com.carrotsearch.randomizedtesting.rules.StatementAdapter.evaluate(StatementAdapter.java:36)
	at org.apache.lucene.util.TestRuleAssertionsRequired$1.evaluate(TestRuleAssertionsRequired.java:53)
	at org.apache.lucene.util.TestRuleMarkFailure$1.evaluate(TestRuleMarkFailure.java:47)
	at org.apache.lucene.util.TestRuleIgnoreAfterMaxFailures$1.evaluate(TestRuleIgnoreAfterMaxFailures.java:64)
	at org.apache.lucene.util.TestRuleIgnoreTestSuites$1.evaluate(TestRuleIgnoreTestSuites.java:54)
	at com.carrotsearch.randomizedtesting.rules.StatementAdapter.evaluate(StatementAdapter.java:36)
	at com.carrotsearch.randomizedtesting.ThreadLeakControl$StatementRunner.run(ThreadLeakControl.java:368)
	at java.lang.Thread.run(Thread.java:748)


FAILED:  org.apache.solr.uninverting.TestDocTermOrdsUninvertLimit.testTriggerUnInvertLimit

Error Message:
GC overhead limit exceeded

Stack Trace:
java.lang.OutOfMemoryError: GC overhead limit exceeded
	at __randomizedtesting.SeedInfo.seed([B95938FF7F911E2B:8AEB103B7226C49C]:0)
	at org.apache.lucene.codecs.compressing.CompressingTermVectorsWriter$FieldData.<init>(CompressingTermVectorsWriter.java:156)
	at org.apache.lucene.codecs.compressing.CompressingTermVectorsWriter$DocData.addField(CompressingTermVectorsWriter.java:103)
	at org.apache.lucene.codecs.compressing.CompressingTermVectorsWriter.startField(CompressingTermVectorsWriter.java:284)
	at org.apache.lucene.codecs.asserting.AssertingTermVectorsFormat$AssertingTermVectorsWriter.startField(AssertingTermVectorsFormat.java:152)
	at org.apache.lucene.codecs.TermVectorsWriter.addAllDocVectors(TermVectorsWriter.java:286)
	at org.apache.lucene.codecs.TermVectorsWriter.merge(TermVectorsWriter.java:225)
	at org.apache.lucene.index.SegmentMerger.mergeVectors(SegmentMerger.java:225)
	at org.apache.lucene.index.SegmentMerger.merge(SegmentMerger.java:159)
	at org.apache.lucene.index.IndexWriter.mergeMiddle(IndexWriter.java:4482)
	at org.apache.lucene.index.IndexWriter.merge(IndexWriter.java:4077)
	at org.apache.lucene.index.SerialMergeScheduler.merge(SerialMergeScheduler.java:40)
	at org.apache.lucene.index.IndexWriter.maybeMerge(IndexWriter.java:2177)
	at org.apache.lucene.index.IndexWriter.processEvents(IndexWriter.java:5139)
	at org.apache.lucene.index.IndexWriter.updateDocument(IndexWriter.java:1619)
	at org.apache.lucene.index.IndexWriter.addDocument(IndexWriter.java:1235)
	at org.apache.lucene.index.RandomIndexWriter.addDocument(RandomIndexWriter.java:189)
	at org.apache.solr.uninverting.TestDocTermOrdsUninvertLimit.testTriggerUnInvertLimit(TestDocTermOrdsUninvertLimit.java:66)
	at sun.reflect.NativeMethodAccessorImpl.invoke0(Native Method)
	at sun.reflect.NativeMethodAccessorImpl.invoke(NativeMethodAccessorImpl.java:62)
	at sun.reflect.DelegatingMethodAccessorImpl.invoke(DelegatingMethodAccessorImpl.java:43)
	at java.lang.reflect.Method.invoke(Method.java:498)
	at com.carrotsearch.randomizedtesting.RandomizedRunner.invoke(RandomizedRunner.java:1750)
	at com.carrotsearch.randomizedtesting.RandomizedRunner$8.evaluate(RandomizedRunner.java:938)
	at com.carrotsearch.randomizedtesting.RandomizedRunner$9.evaluate(RandomizedRunner.java:974)
	at com.carrotsearch.randomizedtesting.RandomizedRunner$10.evaluate(RandomizedRunner.java:988)
	at org.apache.lucene.util.TestRuleSetupTeardownChained$1.evaluate(TestRuleSetupTeardownChained.java:49)
	at org.apache.lucene.util.AbstractBeforeAfterRule$1.evaluate(AbstractBeforeAfterRule.java:45)
	at org.apache.lucene.util.TestRuleThreadAndTestName$1.evaluate(TestRuleThreadAndTestName.java:48)
	at org.apache.lucene.util.TestRuleIgnoreAfterMaxFailures$1.evaluate(TestRuleIgnoreAfterMaxFailures.java:64)
	at org.apache.lucene.util.TestRuleMarkFailure$1.evaluate(TestRuleMarkFailure.java:47)
	at com.carrotsearch.randomizedtesting.rules.StatementAdapter.evaluate(StatementAdapter.java:36)
	at com.carrotsearch.randomizedtesting.ThreadLeakControl$StatementRunner.run(ThreadLeakControl.java:368)




Build Log:
[...truncated 4754 lines...]
   [junit4] Suite: org.apache.lucene.analysis.ko.TestKoreanTokenizer
   [junit4]   2> TEST FAIL: useCharFilter=true text='{{Wi}} <!--Excess long comment to prevent listing on [[Special:Shortpages]]....................................................................................................................................................................................................................................................................................................................................................................................................................................................................................................................................................................................-->'
   [junit4]   2> NOTE: download the large Jenkins line-docs file by running 'ant get-jenkins-line-docs' in the lucene directory.
   [junit4]   2> NOTE: reproduce with: ant test  -Dtestcase=TestKoreanTokenizer -Dtests.method=testRandomHugeStrings -Dtests.seed=8C5E2BE10F581CB -Dtests.multiplier=2 -Dtests.nightly=true -Dtests.slow=true -Dtests.linedocsfile=/home/jenkins/jenkins-slave/workspace/Lucene-Solr-NightlyTests-7.7/test-data/enwiki.random.lines.txt -Dtests.locale=uk-UA -Dtests.timezone=Europe/Istanbul -Dtests.asserts=true -Dtests.file.encoding=ISO-8859-1
   [junit4] FAILURE 7.73s J1 | TestKoreanTokenizer.testRandomHugeStrings <<<
   [junit4]    > Throwable #1: java.lang.AssertionError
   [junit4]    > 	at __randomizedtesting.SeedInfo.seed([8C5E2BE10F581CB:90E6857D4E833D83]:0)
   [junit4]    > 	at org.apache.lucene.analysis.ko.KoreanTokenizer.add(KoreanTokenizer.java:334)
   [junit4]    > 	at org.apache.lucene.analysis.ko.KoreanTokenizer.parse(KoreanTokenizer.java:707)
   [junit4]    > 	at org.apache.lucene.analysis.ko.KoreanTokenizer.incrementToken(KoreanTokenizer.java:377)
   [junit4]    > 	at org.apache.lucene.analysis.BaseTokenStreamTestCase.checkAnalysisConsistency(BaseTokenStreamTestCase.java:748)
   [junit4]    > 	at org.apache.lucene.analysis.BaseTokenStreamTestCase.checkRandomData(BaseTokenStreamTestCase.java:659)
   [junit4]    > 	at org.apache.lucene.analysis.BaseTokenStreamTestCase.checkRandomData(BaseTokenStreamTestCase.java:561)
   [junit4]    > 	at org.apache.lucene.analysis.BaseTokenStreamTestCase.checkRandomData(BaseTokenStreamTestCase.java:474)
   [junit4]    > 	at org.apache.lucene.analysis.ko.TestKoreanTokenizer.testRandomHugeStrings(TestKoreanTokenizer.java:313)
   [junit4]    > 	at java.lang.Thread.run(Thread.java:748)
   [junit4]   2> NOTE: leaving temporary files on disk at: /x1/jenkins/jenkins-slave/workspace/Lucene-Solr-NightlyTests-7.7/checkout/lucene/build/analysis/nori/test/J1/temp/lucene.analysis.ko.TestKoreanTokenizer_8C5E2BE10F581CB-001
   [junit4]   2> NOTE: test params are: codec=Asserting(Lucene70): {dummy=PostingsFormat(name=Asserting)}, docValues:{}, maxPointsInLeafNode=433, maxMBSortInHeap=6.8886878899241255, sim=RandomSimilarity(queryNorm=true): {}, locale=uk-UA, timezone=Europe/Istanbul
   [junit4]   2> NOTE: Linux 4.4.0-137-generic amd64/Oracle Corporation 1.8.0_191 (64-bit)/cpus=4,threads=1,free=181263208,total=346554368
   [junit4]   2> NOTE: All tests run in this JVM: [TestKoreanPartOfSpeechStopFilterFactory, TestKoreanTokenizer]
   [junit4] Completed [8/8 (1!)] on J1 in 12.83s, 12 tests, 1 failure <<< FAILURES!

[...truncated 8855 lines...]
   [junit4] Suite: org.apache.solr.cloud.hdfs.HdfsUnloadDistributedZkTest
   [junit4]   2> Creating dataDir: /x1/jenkins/jenkins-slave/workspace/Lucene-Solr-NightlyTests-7.7/checkout/solr/build/solr-core/test/J2/temp/solr.cloud.hdfs.HdfsUnloadDistributedZkTest_B95938FF7F911E2B-001/init-core-data-001
   [junit4]   2> 690020 INFO  (SUITE-HdfsUnloadDistributedZkTest-seed#[B95938FF7F911E2B]-worker) [    ] o.a.s.SolrTestCaseJ4 Using PointFields (NUMERIC_POINTS_SYSPROP=true) w/NUMERIC_DOCVALUES_SYSPROP=false
   [junit4]   2> 690022 INFO  (SUITE-HdfsUnloadDistributedZkTest-seed#[B95938FF7F911E2B]-worker) [    ] o.a.s.SolrTestCaseJ4 Randomized ssl (false) and clientAuth (false) via: @org.apache.solr.SolrTestCaseJ4$SuppressSSL(bugUrl=https://issues.apache.org/jira/browse/SOLR-5776)
   [junit4]   2> 690023 INFO  (SUITE-HdfsUnloadDistributedZkTest-seed#[B95938FF7F911E2B]-worker) [    ] o.a.s.SolrTestCaseJ4 SecureRandom sanity checks: test.solr.allowed.securerandom=null & java.security.egd=file:/dev/./urandom
   [junit4]   2> 690023 INFO  (SUITE-HdfsUnloadDistributedZkTest-seed#[B95938FF7F911E2B]-worker) [    ] o.a.s.BaseDistributedSearchTestCase Setting hostContext system property: /ztz/
   [junit4]   1> Formatting using clusterid: testClusterID
   [junit4]   2> 690080 WARN  (SUITE-HdfsUnloadDistributedZkTest-seed#[B95938FF7F911E2B]-worker) [    ] o.a.h.m.i.MetricsConfig Cannot locate configuration: tried hadoop-metrics2-namenode.properties,hadoop-metrics2.properties
   [junit4]   2> 690090 WARN  (SUITE-HdfsUnloadDistributedZkTest-seed#[B95938FF7F911E2B]-worker) [    ] o.a.h.h.HttpRequestLog Jetty request log can only be enabled using Log4j
   [junit4]   2> 690092 INFO  (SUITE-HdfsUnloadDistributedZkTest-seed#[B95938FF7F911E2B]-worker) [    ] o.m.log jetty-6.1.26
   [junit4]   2> 690136 INFO  (SUITE-HdfsUnloadDistributedZkTest-seed#[B95938FF7F911E2B]-worker) [    ] o.m.log Extract jar:file:/x1/jenkins/.ivy2/cache/org.apache.hadoop/hadoop-hdfs/tests/hadoop-hdfs-2.7.4-tests.jar!/webapps/hdfs to ./temp/Jetty_localhost_38030_hdfs____.eanccu/webapp
   [junit4]   2> 690594 INFO  (SUITE-HdfsUnloadDistributedZkTest-seed#[B95938FF7F911E2B]-worker) [    ] o.m.log Started HttpServer2$SelectChannelConnectorWithSafeStartup@localhost:38030
   [junit4]   2> 690717 WARN  (SUITE-HdfsUnloadDistributedZkTest-seed#[B95938FF7F911E2B]-worker) [    ] o.a.h.h.HttpRequestLog Jetty request log can only be enabled using Log4j
   [junit4]   2> 690719 INFO  (SUITE-HdfsUnloadDistributedZkTest-seed#[B95938FF7F911E2B]-worker) [    ] o.m.log jetty-6.1.26
   [junit4]   2> 690741 INFO  (SUITE-HdfsUnloadDistributedZkTest-seed#[B95938FF7F911E2B]-worker) [    ] o.m.log Extract jar:file:/x1/jenkins/.ivy2/cache/org.apache.hadoop/hadoop-hdfs/tests/hadoop-hdfs-2.7.4-tests.jar!/webapps/datanode to ./temp/Jetty_localhost_37500_datanode____.epqirs/webapp
   [junit4]   2> 691232 INFO  (SUITE-HdfsUnloadDistributedZkTest-seed#[B95938FF7F911E2B]-worker) [    ] o.m.log Started HttpServer2$SelectChannelConnectorWithSafeStartup@localhost:37500
   [junit4]   2> 691499 WARN  (SUITE-HdfsUnloadDistributedZkTest-seed#[B95938FF7F911E2B]-worker) [    ] o.a.h.h.HttpRequestLog Jetty request log can only be enabled using Log4j
   [junit4]   2> 691500 INFO  (SUITE-HdfsUnloadDistributedZkTest-seed#[B95938FF7F911E2B]-worker) [    ] o.m.log jetty-6.1.26
   [junit4]   2> 691557 INFO  (SUITE-HdfsUnloadDistributedZkTest-seed#[B95938FF7F911E2B]-worker) [    ] o.m.log Extract jar:file:/x1/jenkins/.ivy2/cache/org.apache.hadoop/hadoop-hdfs/tests/hadoop-hdfs-2.7.4-tests.jar!/webapps/datanode to ./temp/Jetty_localhost_35401_datanode____.rm270m/webapp
   [junit4]   2> 691676 ERROR (DataNode: [[[DISK]file:/x1/jenkins/jenkins-slave/workspace/Lucene-Solr-NightlyTests-7.7/checkout/solr/build/solr-core/test/J2/temp/solr.cloud.hdfs.HdfsUnloadDistributedZkTest_B95938FF7F911E2B-001/tempDir-001/hdfsBaseDir/data/data1/, [DISK]file:/x1/jenkins/jenkins-slave/workspace/Lucene-Solr-NightlyTests-7.7/checkout/solr/build/solr-core/test/J2/temp/solr.cloud.hdfs.HdfsUnloadDistributedZkTest_B95938FF7F911E2B-001/tempDir-001/hdfsBaseDir/data/data2/]]  heartbeating to localhost/127.0.0.1:37826) [    ] o.a.h.h.s.d.DirectoryScanner dfs.datanode.directoryscan.throttle.limit.ms.per.sec set to value below 1 ms/sec. Assuming default value of 1000
   [junit4]   2> 691700 INFO  (Block report processor) [    ] BlockStateChange BLOCK* processReport 0x23cc6c3e2b0bfc: from storage DS-5f2693bc-bdfb-40ff-acb3-0c4d5e3d8337 node DatanodeRegistration(127.0.0.1:38936, datanodeUuid=f46897de-7dbc-4050-ac04-bc46182e3c89, infoPort=41881, infoSecurePort=0, ipcPort=35601, storageInfo=lv=-56;cid=testClusterID;nsid=967415023;c=0), blocks: 0, hasStaleStorage: true, processing time: 0 msecs
   [junit4]   2> 691700 INFO  (Block report processor) [    ] BlockStateChange BLOCK* processReport 0x23cc6c3e2b0bfc: from storage DS-3e67563b-9066-4f76-92d6-2f5cd8797707 node DatanodeRegistration(127.0.0.1:38936, datanodeUuid=f46897de-7dbc-4050-ac04-bc46182e3c89, infoPort=41881, infoSecurePort=0, ipcPort=35601, storageInfo=lv=-56;cid=testClusterID;nsid=967415023;c=0), blocks: 0, hasStaleStorage: false, processing time: 0 msecs
   [junit4]   2> 692423 INFO  (SUITE-HdfsUnloadDistributedZkTest-seed#[B95938FF7F911E2B]-worker) [    ] o.m.log Started HttpServer2$SelectChannelConnectorWithSafeStartup@localhost:35401
   [junit4]   2> 692757 ERROR (DataNode: [[[DISK]file:/x1/jenkins/jenkins-slave/workspace/Lucene-Solr-NightlyTests-7.7/checkout/solr/build/solr-core/test/J2/temp/solr.cloud.hdfs.HdfsUnloadDistributedZkTest_B95938FF7F911E2B-001/tempDir-001/hdfsBaseDir/data/data3/, [DISK]file:/x1/jenkins/jenkins-slave/workspace/Lucene-Solr-NightlyTests-7.7/checkout/solr/build/solr-core/test/J2/temp/solr.cloud.hdfs.HdfsUnloadDistributedZkTest_B95938FF7F911E2B-001/tempDir-001/hdfsBaseDir/data/data4/]]  heartbeating to localhost/127.0.0.1:37826) [    ] o.a.h.h.s.d.DirectoryScanner dfs.datanode.directoryscan.throttle.limit.ms.per.sec set to value below 1 ms/sec. Assuming default value of 1000
   [junit4]   2> 692796 INFO  (Block report processor) [    ] BlockStateChange BLOCK* processReport 0x23cc6c7f89dff6: from storage DS-0d73356b-7ae3-4b00-9460-ffa056594158 node DatanodeRegistration(127.0.0.1:36581, datanodeUuid=b089ebff-444b-439b-b70d-2e3cea97d546, infoPort=43210, infoSecurePort=0, ipcPort=45722, storageInfo=lv=-56;cid=testClusterID;nsid=967415023;c=0), blocks: 0, hasStaleStorage: true, processing time: 0 msecs
   [junit4]   2> 692796 INFO  (Block report processor) [    ] BlockStateChange BLOCK* processReport 0x23cc6c7f89dff6: from storage DS-86dca10d-cb02-47ce-a086-408a4e0c9e04 node DatanodeRegistration(127.0.0.1:36581, datanodeUuid=b089ebff-444b-439b-b70d-2e3cea97d546, infoPort=43210, infoSecurePort=0, ipcPort=45722, storageInfo=lv=-56;cid=testClusterID;nsid=967415023;c=0), blocks: 0, hasStaleStorage: false, processing time: 0 msecs
   [junit4]   2> 692999 INFO  (TEST-HdfsUnloadDistributedZkTest.test-seed#[B95938FF7F911E2B]) [    ] o.a.s.c.ZkTestServer STARTING ZK TEST SERVER
   [junit4]   2> 693007 INFO  (ZkTestServer Run Thread) [    ] o.a.s.c.ZkTestServer client port:0.0.0.0/0.0.0.0:0
   [junit4]   2> 693007 INFO  (ZkTestServer Run Thread) [    ] o.a.s.c.ZkTestServer Starting server
   [junit4]   2> 693107 INFO  (TEST-HdfsUnloadDistributedZkTest.test-seed#[B95938FF7F911E2B]) [    ] o.a.s.c.ZkTestServer start zk server on port:45711
   [junit4]   2> 693107 INFO  (TEST-HdfsUnloadDistributedZkTest.test-seed#[B95938FF7F911E2B]) [    ] o.a.s.c.ZkTestServer parse host and port list: 127.0.0.1:45711
   [junit4]   2> 693107 INFO  (TEST-HdfsUnloadDistributedZkTest.test-seed#[B95938FF7F911E2B]) [    ] o.a.s.c.ZkTestServer connecting to 127.0.0.1 45711
   [junit4]   2> 693119 INFO  (zkConnectionManagerCallback-2095-thread-1) [    ] o.a.s.c.c.ConnectionManager zkClient has connected
   [junit4]   2> 693123 INFO  (zkConnectionManagerCallback-2097-thread-1) [    ] o.a.s.c.c.ConnectionManager zkClient has connected
   [junit4]   2> 693124 INFO  (TEST-HdfsUnloadDistributedZkTest.test-seed#[B95938FF7F911E2B]) [    ] o.a.s.c.ZkTestServer put /x1/jenkins/jenkins-slave/workspace/Lucene-Solr-NightlyTests-7.7/checkout/solr/core/src/test-files/solr/collection1/conf/solrconfig-tlog.xml to /configs/conf1/solrconfig.xml
   [junit4]   2> 693126 INFO  (TEST-HdfsUnloadDistributedZkTest.test-seed#[B95938FF7F911E2B]) [    ] o.a.s.c.ZkTestServer put /x1/jenkins/jenkins-slave/workspace/Lucene-Solr-NightlyTests-7.7/checkout/solr/core/src/test-files/solr/collection1/conf/schema.xml to /configs/conf1/schema.xml
   [junit4]   2> 693127 INFO  (TEST-HdfsUnloadDistributedZkTest.test-seed#[B95938FF7F911E2B]) [    ] o.a.s.c.ZkTestServer put /x1/jenkins/jenkins-slave/workspace/Lucene-Solr-NightlyTests-7.7/checkout/solr/core/src/test-files/solr/collection1/conf/solrconfig.snippet.randomindexconfig.xml to /configs/conf1/solrconfig.snippet.randomindexconfig.xml
   [junit4]   2> 693128 INFO  (TEST-HdfsUnloadDistributedZkTest.test-seed#[B95938FF7F911E2B]) [    ] o.a.s.c.ZkTestServer put /x1/jenkins/jenkins-slave/workspace/Lucene-Solr-NightlyTests-7.7/checkout/solr/core/src/test-files/solr/collection1/conf/stopwords.txt to /configs/conf1/stopwords.txt
   [junit4]   2> 693130 INFO  (TEST-HdfsUnloadDistributedZkTest.test-seed#[B95938FF7F911E2B]) [    ] o.a.s.c.ZkTestServer put /x1/jenkins/jenkins-slave/workspace/Lucene-Solr-NightlyTests-7.7/checkout/solr/core/src/test-files/solr/collection1/conf/protwords.txt to /configs/conf1/protwords.txt
   [junit4]   2> 693131 INFO  (TEST-HdfsUnloadDistributedZkTest.test-seed#[B95938FF7F911E2B]) [    ] o.a.s.c.ZkTestServer put /x1/jenkins/jenkins-slave/workspace/Lucene-Solr-NightlyTests-7.7/checkout/solr/core/src/test-files/solr/collection1/conf/currency.xml to /configs/conf1/currency.xml
   [junit4]   2> 693132 INFO  (TEST-HdfsUnloadDistributedZkTest.test-seed#[B95938FF7F911E2B]) [    ] o.a.s.c.ZkTestServer put /x1/jenkins/jenkins-slave/workspace/Lucene-Solr-NightlyTests-7.7/checkout/solr/core/src/test-files/solr/collection1/conf/enumsConfig.xml to /configs/conf1/enumsConfig.xml
   [junit4]   2> 693133 INFO  (TEST-HdfsUnloadDistributedZkTest.test-seed#[B95938FF7F911E2B]) [    ] o.a.s.c.ZkTestServer put /x1/jenkins/jenkins-slave/workspace/Lucene-Solr-NightlyTests-7.7/checkout/solr/core/src/test-files/solr/collection1/conf/open-exchange-rates.json to /configs/conf1/open-exchange-rates.json
   [junit4]   2> 693134 INFO  (TEST-HdfsUnloadDistributedZkTest.test-seed#[B95938FF7F911E2B]) [    ] o.a.s.c.ZkTestServer put /x1/jenkins/jenkins-slave/workspace/Lucene-Solr-NightlyTests-7.7/checkout/solr/core/src/test-files/solr/collection1/conf/mapping-ISOLatin1Accent.txt to /configs/conf1/mapping-ISOLatin1Accent.txt
   [junit4]   2> 693135 INFO  (TEST-HdfsUnloadDistributedZkTest.test-seed#[B95938FF7F911E2B]) [    ] o.a.s.c.ZkTestServer put /x1/jenkins/jenkins-slave/workspace/Lucene-Solr-NightlyTests-7.7/checkout/solr/core/src/test-files/solr/collection1/conf/old_synonyms.txt to /configs/conf1/old_synonyms.txt
   [junit4]   2> 693137 INFO  (TEST-HdfsUnloadDistributedZkTest.test-seed#[B95938FF7F911E2B]) [    ] o.a.s.c.ZkTestServer put /x1/jenkins/jenkins-slave/workspace/Lucene-Solr-NightlyTests-7.7/checkout/solr/core/src/test-files/solr/collection1/conf/synonyms.txt to /configs/conf1/synonyms.txt
   [junit4]   2> 693138 INFO  (TEST-HdfsUnloadDistributedZkTest.test-seed#[B95938FF7F911E2B]) [    ] o.a.s.c.AbstractFullDistribZkTestBase Will use NRT replicas unless explicitly asked otherwise
   [junit4]   2> 693362 WARN  (TEST-HdfsUnloadDistributedZkTest.test-seed#[B95938FF7F911E2B]) [    ] o.e.j.s.AbstractConnector Ignoring deprecated socket close linger time
   [junit4]   2> 693362 INFO  (TEST-HdfsUnloadDistributedZkTest.test-seed#[B95938FF7F911E2B]) [    ] o.a.s.c.s.e.JettySolrRunner Start Jetty (original configured port=0)
   [junit4]   2> 693363 INFO  (TEST-HdfsUnloadDistributedZkTest.test-seed#[B95938FF7F911E2B]) [    ] o.a.s.c.s.e.JettySolrRunner Trying to start Jetty on port 0 try number 1 ...
   [junit4]   2> 693363 INFO  (TEST-HdfsUnloadDistributedZkTest.test-seed#[B95938FF7F911E2B]) [    ] o.e.j.s.Server jetty-9.4.14.v20181114; built: 2018-11-14T21:20:31.478Z; git: c4550056e785fb5665914545889f21dc136ad9e6; jvm 1.8.0_191-b12
   [junit4]   2> 693364 INFO  (TEST-HdfsUnloadDistributedZkTest.test-seed#[B95938FF7F911E2B]) [    ] o.e.j.s.session DefaultSessionIdManager workerName=node0
   [junit4]   2> 693364 INFO  (TEST-HdfsUnloadDistributedZkTest.test-seed#[B95938FF7F911E2B]) [    ] o.e.j.s.session No SessionScavenger set, using defaults
   [junit4]   2> 693364 INFO  (TEST-HdfsUnloadDistributedZkTest.test-seed#[B95938FF7F911E2B]) [    ] o.e.j.s.session node0 Scavenging every 660000ms
   [junit4]   2> 693367 INFO  (TEST-HdfsUnloadDistributedZkTest.test-seed#[B95938FF7F911E2B]) [    ] o.e.j.s.h.ContextHandler Started o.e.j.s.ServletContextHandler@1efb46d7{/ztz,null,AVAILABLE}
   [junit4]   2> 693374 INFO  (TEST-HdfsUnloadDistributedZkTest.test-seed#[B95938FF7F911E2B]) [    ] o.e.j.s.AbstractConnector Started ServerConnector@40138c96{HTTP/1.1,[http/1.1]}{127.0.0.1:36292}
   [junit4]   2> 693374 INFO  (TEST-HdfsUnloadDistributedZkTest.test-seed#[B95938FF7F911E2B]) [    ] o.e.j.s.Server Started @693451ms
   [junit4]   2> 693374 INFO  (TEST-HdfsUnloadDistributedZkTest.test-seed#[B95938FF7F911E2B]) [    ] o.a.s.c.s.e.JettySolrRunner Jetty properties: {solr.data.dir=hdfs://localhost:37826/hdfs__localhost_37826__x1_jenkins_jenkins-slave_workspace_Lucene-Solr-NightlyTests-7.7_checkout_solr_build_solr-core_test_J2_temp_solr.cloud.hdfs.HdfsUnloadDistributedZkTest_B95938FF7F911E2B-001_tempDir-002_control_data, replicaType=NRT, hostContext=/ztz, hostPort=36292, coreRootDirectory=/x1/jenkins/jenkins-slave/workspace/Lucene-Solr-NightlyTests-7.7/checkout/solr/build/solr-core/test/J2/temp/solr.cloud.hdfs.HdfsUnloadDistributedZkTest_B95938FF7F911E2B-001/control-001/cores}
   [junit4]   2> 693375 ERROR (TEST-HdfsUnloadDistributedZkTest.test-seed#[B95938FF7F911E2B]) [    ] o.a.s.u.StartupLoggingUtils Missing Java Option solr.log.dir. Logging may be missing or incomplete.
   [junit4]   2> 693375 INFO  (TEST-HdfsUnloadDistributedZkTest.test-seed#[B95938FF7F911E2B]) [    ] o.a.s.s.SolrDispatchFilter Using logger factory org.apache.logging.slf4j.Log4jLoggerFactory
   [junit4]   2> 693375 INFO  (TEST-HdfsUnloadDistributedZkTest.test-seed#[B95938FF7F911E2B]) [    ] o.a.s.s.SolrDispatchFilter  ___      _       Welcome to Apache Solr? version 7.7.0
   [junit4]   2> 693375 INFO  (TEST-HdfsUnloadDistributedZkTest.test-seed#[B95938FF7F911E2B]) [    ] o.a.s.s.SolrDispatchFilter / __| ___| |_ _   Starting in cloud mode on port null
   [junit4]   2> 693375 INFO  (TEST-HdfsUnloadDistributedZkTest.test-seed#[B95938FF7F911E2B]) [    ] o.a.s.s.SolrDispatchFilter \__ \/ _ \ | '_|  Install dir: null
   [junit4]   2> 693375 INFO  (TEST-HdfsUnloadDistributedZkTest.test-seed#[B95938FF7F911E2B]) [    ] o.a.s.s.SolrDispatchFilter |___/\___/_|_|    Start time: 2019-01-31T13:33:49.281Z
   [junit4]   2> 693394 INFO  (zkConnectionManagerCallback-2099-thread-1) [    ] o.a.s.c.c.ConnectionManager zkClient has connected
   [junit4]   2> 693396 INFO  (TEST-HdfsUnloadDistributedZkTest.test-seed#[B95938FF7F911E2B]) [    ] o.a.s.s.SolrDispatchFilter Loading solr.xml from SolrHome (not found in ZooKeeper)
   [junit4]   2> 693396 INFO  (TEST-HdfsUnloadDistributedZkTest.test-seed#[B95938FF7F911E2B]) [    ] o.a.s.c.SolrXmlConfig Loading container configuration from /x1/jenkins/jenkins-slave/workspace/Lucene-Solr-NightlyTests-7.7/checkout/solr/build/solr-core/test/J2/temp/solr.cloud.hdfs.HdfsUnloadDistributedZkTest_B95938FF7F911E2B-001/control-001/solr.xml
   [junit4]   2> 693408 INFO  (TEST-HdfsUnloadDistributedZkTest.test-seed#[B95938FF7F911E2B]) [    ] o.a.s.c.SolrXmlConfig Configuration parameter autoReplicaFailoverWorkLoopDelay is ignored
   [junit4]   2> 693408 INFO  (TEST-HdfsUnloadDistributedZkTest.test-seed#[B95938FF7F911E2B]) [    ] o.a.s.c.SolrXmlConfig Configuration parameter autoReplicaFailoverBadNodeExpiration is ignored
   [junit4]   2> 693410 INFO  (TEST-HdfsUnloadDistributedZkTest.test-seed#[B95938FF7F911E2B]) [    ] o.a.s.c.SolrXmlConfig MBean server found: com.sun.jmx.mbeanserver.JmxMBeanServer@5fba287c, but no JMX reporters were configured - adding default JMX reporter.
   [junit4]   2> 693597 INFO  (TEST-HdfsUnloadDistributedZkTest.test-seed#[B95938FF7F911E2B]) [    ] o.a.s.h.c.HttpShardHandlerFactory Host whitelist initialized: WhitelistHostChecker [whitelistHosts=null, whitelistHostCheckingEnabled=false]
   [junit4]   2> 693633 INFO  (TEST-HdfsUnloadDistributedZkTest.test-seed#[B95938FF7F911E2B]) [    ] o.a.s.c.ZkContainer Zookeeper client=127.0.0.1:45711/solr
   [junit4]   2> 693635 INFO  (zkConnectionManagerCallback-2103-thread-1) [    ] o.a.s.c.c.ConnectionManager zkClient has connected
   [junit4]   2> 693711 INFO  (zkConnectionManagerCallback-2105-thread-1) [    ] o.a.s.c.c.ConnectionManager zkClient has connected
   [junit4]   2> 693871 INFO  (TEST-HdfsUnloadDistributedZkTest.test-seed#[B95938FF7F911E2B]) [n:127.0.0.1:36292_ztz    ] o.a.s.c.OverseerElectionContext I am going to be the leader 127.0.0.1:36292_ztz
   [junit4]   2> 693872 INFO  (TEST-HdfsUnloadDistributedZkTest.test-seed#[B95938FF7F911E2B]) [n:127.0.0.1:36292_ztz    ] o.a.s.c.Overseer Overseer (id=72717960383561732-127.0.0.1:36292_ztz-n_0000000000) starting
   [junit4]   2> 693901 INFO  (zkConnectionManagerCallback-2112-thread-1) [    ] o.a.s.c.c.ConnectionManager zkClient has connected
   [junit4]   2> 693904 INFO  (TEST-HdfsUnloadDistributedZkTest.test-seed#[B95938FF7F911E2B]) [n:127.0.0.1:36292_ztz    ] o.a.s.c.s.i.ZkClientClusterStateProvider Cluster at 127.0.0.1:45711/solr ready
   [junit4]   2> 693907 INFO  (OverseerStateUpdate-72717960383561732-127.0.0.1:36292_ztz-n_0000000000) [n:127.0.0.1:36292_ztz    ] o.a.s.c.Overseer Starting to work on the main queue : 127.0.0.1:36292_ztz
   [junit4]   2> 693908 INFO  (TEST-HdfsUnloadDistributedZkTest.test-seed#[B95938FF7F911E2B]) [n:127.0.0.1:36292_ztz    ] o.a.s.c.ZkController Register node as live in ZooKeeper:/live_nodes/127.0.0.1:36292_ztz
   [junit4]   2> 693924 INFO  (zkCallback-2111-thread-1) [    ] o.a.s.c.c.ZkStateReader Updated live nodes from ZooKeeper... (0) -> (1)
   [junit4]   2> 693934 INFO  (zkCallback-2104-thread-1) [    ] o.a.s.c.c.ZkStateReader Updated live nodes from ZooKeeper... (0) -> (1)
   [junit4]   2> 693947 INFO  (TEST-HdfsUnloadDistributedZkTest.test-seed#[B95938FF7F911E2B]) [n:127.0.0.1:36292_ztz    ] o.a.s.h.a.MetricsHistoryHandler No .system collection, keeping metrics history in memory.
   [junit4]   2> 693988 INFO  (TEST-HdfsUnloadDistributedZkTest.test-seed#[B95938FF7F911E2B]) [n:127.0.0.1:36292_ztz    ] o.a.s.m.r.SolrJmxReporter JMX monitoring for 'solr.node' (registry 'solr.node') enabled at server: com.sun.jmx.mbeanserver.JmxMBeanServer@5fba287c
   [junit4]   2> 694006 INFO  (TEST-HdfsUnloadDistributedZkTest.test-seed#[B95938FF7F911E2B]) [n:127.0.0.1:36292_ztz    ] o.a.s.m.r.SolrJmxReporter JMX monitoring for 'solr.jvm' (registry 'solr.jvm') enabled at server: com.sun.jmx.mbeanserver.JmxMBeanServer@5fba287c
   [junit4]   2> 694007 INFO  (TEST-HdfsUnloadDistributedZkTest.test-seed#[B95938FF7F911E2B]) [n:127.0.0.1:36292_ztz    ] o.a.s.m.r.SolrJmxReporter JMX monitoring for 'solr.jetty' (registry 'solr.jetty') enabled at server: com.sun.jmx.mbeanserver.JmxMBeanServer@5fba287c
   [junit4]   2> 694009 INFO  (TEST-HdfsUnloadDistributedZkTest.test-seed#[B95938FF7F911E2B]) [n:127.0.0.1:36292_ztz    ] o.a.s.c.CorePropertiesLocator Found 0 core definitions underneath /x1/jenkins/jenkins-slave/workspace/Lucene-Solr-NightlyTests-7.7/checkout/solr/build/solr-core/test/J2/temp/solr.cloud.hdfs.HdfsUnloadDistributedZkTest_B95938FF7F911E2B-001/control-001/cores
   [junit4]   2> 694046 INFO  (zkConnectionManagerCallback-2118-thread-1) [    ] o.a.s.c.c.ConnectionManager zkClient has connected
   [junit4]   2> 694047 INFO  (TEST-HdfsUnloadDistributedZkTest.test-seed#[B95938FF7F911E2B]) [    ] o.a.s.c.c.ZkStateReader Updated live nodes from ZooKeeper... (0) -> (1)
   [junit4]   2> 694048 INFO  (TEST-HdfsUnloadDistributedZkTest.test-seed#[B95938FF7F911E2B]) [   

[...truncated too long message...]

ang.Thread.run(Thread.java:748)
   [junit4] Completed [575/838 (3!)] on J1 in 174.81s, 1 test, 1 failure <<< FAILURES!

[...truncated 644 lines...]
   [junit4] Suite: org.apache.solr.uninverting.TestDocTermOrdsUninvertLimit
   [junit4]   2> NOTE: download the large Jenkins line-docs file by running 'ant get-jenkins-line-docs' in the lucene directory.
   [junit4]   2> NOTE: reproduce with: ant test  -Dtestcase=TestDocTermOrdsUninvertLimit -Dtests.method=testTriggerUnInvertLimit -Dtests.seed=B95938FF7F911E2B -Dtests.multiplier=2 -Dtests.nightly=true -Dtests.slow=true -Dtests.linedocsfile=/home/jenkins/jenkins-slave/workspace/Lucene-Solr-NightlyTests-7.7/test-data/enwiki.random.lines.txt -Dtests.locale=ja -Dtests.timezone=America/Dawson -Dtests.asserts=true -Dtests.file.encoding=ISO-8859-1
   [junit4] ERROR   45.9s J1 | TestDocTermOrdsUninvertLimit.testTriggerUnInvertLimit <<<
   [junit4]    > Throwable #1: java.lang.OutOfMemoryError: GC overhead limit exceeded
   [junit4]    > 	at __randomizedtesting.SeedInfo.seed([B95938FF7F911E2B:8AEB103B7226C49C]:0)
   [junit4]    > 	at org.apache.lucene.codecs.compressing.CompressingTermVectorsWriter$FieldData.<init>(CompressingTermVectorsWriter.java:156)
   [junit4]    > 	at org.apache.lucene.codecs.compressing.CompressingTermVectorsWriter$DocData.addField(CompressingTermVectorsWriter.java:103)
   [junit4]    > 	at org.apache.lucene.codecs.compressing.CompressingTermVectorsWriter.startField(CompressingTermVectorsWriter.java:284)
   [junit4]    > 	at org.apache.lucene.codecs.asserting.AssertingTermVectorsFormat$AssertingTermVectorsWriter.startField(AssertingTermVectorsFormat.java:152)
   [junit4]    > 	at org.apache.lucene.codecs.TermVectorsWriter.addAllDocVectors(TermVectorsWriter.java:286)
   [junit4]    > 	at org.apache.lucene.codecs.TermVectorsWriter.merge(TermVectorsWriter.java:225)
   [junit4]    > 	at org.apache.lucene.index.SegmentMerger.mergeVectors(SegmentMerger.java:225)
   [junit4]    > 	at org.apache.lucene.index.SegmentMerger.merge(SegmentMerger.java:159)
   [junit4]    > 	at org.apache.lucene.index.IndexWriter.mergeMiddle(IndexWriter.java:4482)
   [junit4]    > 	at org.apache.lucene.index.IndexWriter.merge(IndexWriter.java:4077)
   [junit4]    > 	at org.apache.lucene.index.SerialMergeScheduler.merge(SerialMergeScheduler.java:40)
   [junit4]    > 	at org.apache.lucene.index.IndexWriter.maybeMerge(IndexWriter.java:2177)
   [junit4]    > 	at org.apache.lucene.index.IndexWriter.processEvents(IndexWriter.java:5139)
   [junit4]    > 	at org.apache.lucene.index.IndexWriter.updateDocument(IndexWriter.java:1619)
   [junit4]    > 	at org.apache.lucene.index.IndexWriter.addDocument(IndexWriter.java:1235)
   [junit4]    > 	at org.apache.lucene.index.RandomIndexWriter.addDocument(RandomIndexWriter.java:189)
   [junit4]    > 	at org.apache.solr.uninverting.TestDocTermOrdsUninvertLimit.testTriggerUnInvertLimit(TestDocTermOrdsUninvertLimit.java:66)
   [junit4]   2> NOTE: test params are: codec=Asserting(Lucene70), sim=RandomSimilarity(queryNorm=true): {field=IB SPL-D3(800.0)}, locale=ja, timezone=America/Dawson
   [junit4]   2> NOTE: Linux 4.4.0-137-generic amd64/Oracle Corporation 1.8.0_191 (64-bit)/cpus=4,threads=1,free=36519928,total=477626368
   [junit4]   2> NOTE: All tests run in this JVM: [SolrInfoBeanTest, CurrencyFieldTypeTest, TestSortableTextField, RecoveryAfterSoftCommitTest, TestFuzzyAnalyzedSuggestions, TestQuerySenderListener, TestConfigSets, TestIndexingPerformance, TestDistributedSearch, TestFieldCacheWithThreads, TestSimLargeCluster, TestRandomFlRTGCloud, TestSubQueryTransformerCrossCore, DeleteStatusTest, LIRRollingUpdatesTest, BlockCacheTest, DistribJoinFromCollectionTest, TestUtilizeNode, SubstringBytesRefFilterTest, TestConfigsApi, TestCollapseQParserPlugin, TestIntervalFaceting, SharedFSAutoReplicaFailoverTest, OutOfBoxZkACLAndCredentialsProvidersTest, TestPrepRecovery, ExecutePlanActionTest, NodeAddedTriggerIntegrationTest, TestBadConfig, TestBlendedInfixSuggestions, ZkStateWriterTest, SchemaVersionSpecificBehaviorTest, TestElisionMultitermQuery, ExitableDirectoryReaderTest, SolrRrdBackendFactoryTest, TestSchemaSimilarityResource, TestSolrDeletionPolicy1, TestTestInjection, AnalysisErrorHandlingTest, TestMultiValuedNumericRangeQuery, TestSolrQueryParser, TestBlobHandler, ShardSplitTest, TestPerFieldSimilarity, TestFieldTypeResource, ZkSolrClientTest, TaggerTest, TestJsonFacetsWithNestedObjects, LeaderTragicEventTest, EmbeddedSolrNoSerializeTest, ConfigSetsAPITest, IgnoreCommitOptimizeUpdateProcessorFactoryTest, BasicFunctionalityTest, NotRequiredUniqueKeyTest, TestReversedWildcardFilterFactory, TestSolrConfigHandlerConcurrent, PolyFieldTest, TestXmlQParserPlugin, ClassificationUpdateProcessorTest, SolrCloudExampleTest, TestFieldCollectionResource, TestGeoJSONResponseWriter, TestEmbeddedSolrServerSchemaAPI, TestPseudoReturnFields, TestCollectionsAPIViaSolrCloudCluster, TestPartialUpdateDeduplication, TestRTGBase, EnumFieldTest, TestHdfsUpdateLog, DocValuesMissingTest, HdfsDirectoryTest, HdfsTlogReplayBufferedWhileIndexingTest, SimplePostToolTest, SpellingQueryConverterTest, TestInfoStreamLogging, TestFoldingMultitermQuery, TestChildDocTransformer, TestOverriddenPrefixQueryForCustomFieldType, SolrCmdDistributorTest, ActionThrottleTest, TestCoreBackup, TestJsonFacetRefinement, PhrasesIdentificationComponentTest, DebugComponentTest, NumberUtilsTest, TestReRankQParserPlugin, SolrSlf4jReporterTest, ProtectedTermFilterFactoryTest, FastVectorHighlighterTest, URLClassifyProcessorTest, TestTrieFacet, CdcrReplicationHandlerTest, TestRawTransformer, StressHdfsTest, TriggerIntegrationTest, MergeStrategyTest, TestComponentsName, TlogReplayBufferedWhileIndexingTest, TestLRUCache, DirectSolrConnectionTest, TestExactSharedStatsCache, ZkFailoverTest, TestSearchPerf, TestLockTree, TestReplicaProperties, TestShortCircuitedRequests, TestCloudManagedSchema, TestReplicationHandlerBackup, V2StandaloneTest, TestShardHandlerFactory, TestMacros, SuggestComponentContextFilterQueryTest, CdcrWithNodesRestartsTest, TestSolrCloudSnapshots, TestSlowCompositeReaderWrapper, DeleteNodeTest, TermVectorComponentTest, CurrencyRangeFacetCloudTest, BadComponentTest, RequestLoggingTest, TestStressCloudBlindAtomicUpdates, TestRequestForwarding, IndexSizeTriggerTest, TestPHPSerializedResponseWriter, BasicAuthIntegrationTest, TestTrackingShardHandlerFactory, TestConfigOverlay, TestCollationFieldDocValues, SuggesterFSTTest, SpellCheckCollatorTest, TestManagedSchemaAPI, DistributedFacetPivotSmallAdvancedTest, LeaderElectionTest, TestSimExecutePlanAction, TestTolerantSearch, SystemInfoHandlerTest, BlockJoinFacetRandomTest, CollectionsAPIDistributedZkTest, TestCollectionAPI, ComputePlanActionTest, ScheduledTriggerIntegrationTest, SearchRateTriggerIntegrationTest, CdcrVersionReplicationTest, HdfsBasicDistributedZkTest, HdfsChaosMonkeyNothingIsSafeTest, HdfsChaosMonkeySafeLeaderTest, TestDynamicURP, TestMergePolicyConfig, TestSolrIndexConfig, TestXIncludeConfig, DocumentAnalysisRequestHandlerTest, MoreLikeThisHandlerTest, SearchHandlerTest, TestSQLHandler, CoreAdminHandlerTest, CoreAdminOperationTest, CoreAdminRequestStatusTest, CoreMergeIndexesAdminHandlerTest, InfoHandlerTest, LoggingHandlerTest, LukeRequestHandlerTest, MetricsHandlerTest, MetricsHistoryHandlerTest, PropertiesRequestHandlerTest, SecurityConfHandlerTest, SegmentsInfoRequestHandlerTest, ShowFileRequestHandlerTest, TestCollectionAPIs, DistributedExpandComponentTest, DistributedFacetExistsSmallTest, DistributedFacetPivotLargeTest, DistributedMLTComponentTest, DistributedQueryComponentOptimizationTest, DistributedSpellCheckComponentTest, FacetPivotSmallTest, InfixSuggestersTest, ReplicaListTransformerTest, ResponseLogComponentTest, SearchHandlerTest, TestExpandComponent, TestHttpShardHandlerFactory, JavabinLoaderTest, XmlInterpolationTest, HighlighterTest, TestPostingsSolrHighlighter, TestUnifiedSolrHighlighter, CheckHdfsIndexTest, TestFaceting, TestStreamBody, TestUnInvertedFieldException, TestBinaryResponseWriter, TestCSVResponseWriter, TestRestManager, TestBulkSchemaAPI, TestManagedSynonymFilterFactory, BadCopyFieldTest, BooleanFieldTest, ChangedSchemaMergeTest, DocValuesTest, SynonymTokenizerTest, TestCollationField, TestOmitPositions, TestPointFields, TestMultiWordSynonyms, TestPayloadScoreQParserPlugin, TestRecovery, TestSimpleQParserPlugin, TestSmileRequest, TestSolr4Spatial, TestStressUserVersions, TestStressVersions, SpatialHeatmapFacetsTest, TestSha256AuthenticationProvider, TestDelegationWithHadoopAuth, TestZkAclsWithHadoopAuth, SolrRequestParserTest, IndexBasedSpellCheckerTest, SuggesterTest, TestAnalyzedSuggestions, TestDocTermOrdsUninvertLimit]
   [junit4] Completed [781/838 (4!)] on J1 in 46.60s, 1 test, 1 error <<< FAILURES!

[...truncated 168 lines...]
   [junit4] JVM J1: stdout was not empty, see: /x1/jenkins/jenkins-slave/workspace/Lucene-Solr-NightlyTests-7.7/checkout/solr/build/solr-core/test/temp/junit4-J1-20190131_132215_4951062453923059052763.sysout
   [junit4] >>> JVM J1 emitted unexpected output (verbatim) ----
   [junit4] java.lang.OutOfMemoryError: GC overhead limit exceeded
   [junit4] Dumping heap to /x1/jenkins/jenkins-slave/workspace/Lucene-Solr-NightlyTests-7.7/checkout/heapdumps/java_pid26476.hprof ...
   [junit4] Heap dump file created [483324638 bytes in 1.132 secs]
   [junit4] <<< JVM J1: EOF ----

[...truncated 8900 lines...]
BUILD FAILED
/x1/jenkins/jenkins-slave/workspace/Lucene-Solr-NightlyTests-7.7/checkout/build.xml:651: The following error occurred while executing this line:
/x1/jenkins/jenkins-slave/workspace/Lucene-Solr-NightlyTests-7.7/checkout/build.xml:585: Some of the tests produced a heap dump, but did not fail. Maybe a suppressed OutOfMemoryError? Dumps created:
* java_pid26476.hprof

Total time: 280 minutes 30 seconds
Build step 'Invoke Ant' marked build as failure
Archiving artifacts
Recording test results
Email was triggered for: Failure - Any
Sending email for trigger: Failure - Any

Mime
View raw message