lucene-dev mailing list archives

Site index · List index
Message view « Date » · « Thread »
Top « Date » · « Thread »
From Policeman Jenkins Server <jenk...@thetaphi.de>
Subject [JENKINS] Lucene-Solr-master-Linux (32bit/jdk1.8.0_172) - Build # 23444 - Unstable!
Date Tue, 01 Jan 2019 20:26:46 GMT
Build: https://jenkins.thetaphi.de/job/Lucene-Solr-master-Linux/23444/
Java: 32bit/jdk1.8.0_172 -client -XX:+UseSerialGC

2 tests failed.
FAILED:  junit.framework.TestSuite.org.apache.solr.cloud.MetricsHistoryIntegrationTest

Error Message:
committed = 143196160 should be < max = 143130624

Stack Trace:
java.lang.IllegalArgumentException: committed = 143196160 should be < max = 143130624
	at __randomizedtesting.SeedInfo.seed([F72592B91C0F93E9]:0)
	at java.lang.management.MemoryUsage.<init>(MemoryUsage.java:160)
	at sun.management.MemoryPoolImpl.getCollectionUsage0(Native Method)
	at sun.management.MemoryPoolImpl.getCollectionUsage(MemoryPoolImpl.java:266)
	at com.codahale.metrics.jvm.MemoryUsageGaugeSet.getMetrics(MemoryUsageGaugeSet.java:182)
	at org.apache.solr.metrics.SolrMetricManager.registerAll(SolrMetricManager.java:516)
	at org.apache.solr.cloud.autoscaling.sim.SimCloudManager.<init>(SimCloudManager.java:178)
	at org.apache.solr.cloud.autoscaling.sim.SimCloudManager.createCluster(SimCloudManager.java:258)
	at org.apache.solr.cloud.MetricsHistoryIntegrationTest.setupCluster(MetricsHistoryIntegrationTest.java:64)
	at sun.reflect.NativeMethodAccessorImpl.invoke0(Native Method)
	at sun.reflect.NativeMethodAccessorImpl.invoke(NativeMethodAccessorImpl.java:62)
	at sun.reflect.DelegatingMethodAccessorImpl.invoke(DelegatingMethodAccessorImpl.java:43)
	at java.lang.reflect.Method.invoke(Method.java:498)
	at com.carrotsearch.randomizedtesting.RandomizedRunner.invoke(RandomizedRunner.java:1750)
	at com.carrotsearch.randomizedtesting.RandomizedRunner$6.evaluate(RandomizedRunner.java:878)
	at com.carrotsearch.randomizedtesting.RandomizedRunner$7.evaluate(RandomizedRunner.java:894)
	at com.carrotsearch.randomizedtesting.rules.StatementAdapter.evaluate(StatementAdapter.java:36)
	at com.carrotsearch.randomizedtesting.rules.SystemPropertiesRestoreRule$1.evaluate(SystemPropertiesRestoreRule.java:57)
	at org.apache.lucene.util.AbstractBeforeAfterRule$1.evaluate(AbstractBeforeAfterRule.java:45)
	at com.carrotsearch.randomizedtesting.rules.StatementAdapter.evaluate(StatementAdapter.java:36)
	at org.apache.lucene.util.TestRuleStoreClassName$1.evaluate(TestRuleStoreClassName.java:41)
	at com.carrotsearch.randomizedtesting.rules.NoShadowingOrOverridesOnMethodsRule$1.evaluate(NoShadowingOrOverridesOnMethodsRule.java:40)
	at com.carrotsearch.randomizedtesting.rules.NoShadowingOrOverridesOnMethodsRule$1.evaluate(NoShadowingOrOverridesOnMethodsRule.java:40)
	at com.carrotsearch.randomizedtesting.rules.StatementAdapter.evaluate(StatementAdapter.java:36)
	at com.carrotsearch.randomizedtesting.rules.StatementAdapter.evaluate(StatementAdapter.java:36)
	at com.carrotsearch.randomizedtesting.rules.StatementAdapter.evaluate(StatementAdapter.java:36)
	at org.apache.lucene.util.TestRuleAssertionsRequired$1.evaluate(TestRuleAssertionsRequired.java:53)
	at org.apache.lucene.util.TestRuleMarkFailure$1.evaluate(TestRuleMarkFailure.java:47)
	at org.apache.lucene.util.TestRuleIgnoreAfterMaxFailures$1.evaluate(TestRuleIgnoreAfterMaxFailures.java:64)
	at org.apache.lucene.util.TestRuleIgnoreTestSuites$1.evaluate(TestRuleIgnoreTestSuites.java:54)
	at com.carrotsearch.randomizedtesting.rules.StatementAdapter.evaluate(StatementAdapter.java:36)
	at com.carrotsearch.randomizedtesting.ThreadLeakControl$StatementRunner.run(ThreadLeakControl.java:368)
	at java.lang.Thread.run(Thread.java:748)


FAILED:  org.apache.solr.core.TestDynamicLoading.testDynamicLoading

Error Message:
Could not get expected value  'org.apache.solr.core.BlobStoreTestRequestHandler' for path 'overlay/requestHandler/\/test1/class' full output: {   "responseHeader":{     "status":0,     "QTime":0},   "overlay":{     "znodeVersion":0,     "runtimeLib":{"colltest":{         "name":"colltest",         "version":1}}}},  from server:  null

Stack Trace:
java.lang.AssertionError: Could not get expected value  'org.apache.solr.core.BlobStoreTestRequestHandler' for path 'overlay/requestHandler/\/test1/class' full output: {
  "responseHeader":{
    "status":0,
    "QTime":0},
  "overlay":{
    "znodeVersion":0,
    "runtimeLib":{"colltest":{
        "name":"colltest",
        "version":1}}}},  from server:  null
	at __randomizedtesting.SeedInfo.seed([F72592B91C0F93E9:2F68BFEEEBD23649]:0)
	at org.junit.Assert.fail(Assert.java:88)
	at org.junit.Assert.assertTrue(Assert.java:41)
	at org.apache.solr.core.TestSolrConfigHandler.testForResponseElement(TestSolrConfigHandler.java:590)
	at org.apache.solr.core.TestDynamicLoading.testDynamicLoading(TestDynamicLoading.java:80)
	at sun.reflect.NativeMethodAccessorImpl.invoke0(Native Method)
	at sun.reflect.NativeMethodAccessorImpl.invoke(NativeMethodAccessorImpl.java:62)
	at sun.reflect.DelegatingMethodAccessorImpl.invoke(DelegatingMethodAccessorImpl.java:43)
	at java.lang.reflect.Method.invoke(Method.java:498)
	at com.carrotsearch.randomizedtesting.RandomizedRunner.invoke(RandomizedRunner.java:1750)
	at com.carrotsearch.randomizedtesting.RandomizedRunner$8.evaluate(RandomizedRunner.java:938)
	at com.carrotsearch.randomizedtesting.RandomizedRunner$9.evaluate(RandomizedRunner.java:974)
	at com.carrotsearch.randomizedtesting.RandomizedRunner$10.evaluate(RandomizedRunner.java:988)
	at org.apache.solr.BaseDistributedSearchTestCase$ShardsRepeatRule$ShardsFixedStatement.callStatement(BaseDistributedSearchTestCase.java:1070)
	at org.apache.solr.BaseDistributedSearchTestCase$ShardsRepeatRule$ShardsStatement.evaluate(BaseDistributedSearchTestCase.java:1042)
	at com.carrotsearch.randomizedtesting.rules.SystemPropertiesRestoreRule$1.evaluate(SystemPropertiesRestoreRule.java:57)
	at org.apache.lucene.util.TestRuleSetupTeardownChained$1.evaluate(TestRuleSetupTeardownChained.java:49)
	at org.apache.lucene.util.AbstractBeforeAfterRule$1.evaluate(AbstractBeforeAfterRule.java:45)
	at org.apache.lucene.util.TestRuleThreadAndTestName$1.evaluate(TestRuleThreadAndTestName.java:48)
	at org.apache.lucene.util.TestRuleIgnoreAfterMaxFailures$1.evaluate(TestRuleIgnoreAfterMaxFailures.java:64)
	at org.apache.lucene.util.TestRuleMarkFailure$1.evaluate(TestRuleMarkFailure.java:47)
	at com.carrotsearch.randomizedtesting.rules.StatementAdapter.evaluate(StatementAdapter.java:36)
	at com.carrotsearch.randomizedtesting.ThreadLeakControl$StatementRunner.run(ThreadLeakControl.java:368)
	at com.carrotsearch.randomizedtesting.ThreadLeakControl.forkTimeoutingTask(ThreadLeakControl.java:817)
	at com.carrotsearch.randomizedtesting.ThreadLeakControl$3.evaluate(ThreadLeakControl.java:468)
	at com.carrotsearch.randomizedtesting.RandomizedRunner.runSingleTest(RandomizedRunner.java:947)
	at com.carrotsearch.randomizedtesting.RandomizedRunner$5.evaluate(RandomizedRunner.java:832)
	at com.carrotsearch.randomizedtesting.RandomizedRunner$6.evaluate(RandomizedRunner.java:883)
	at com.carrotsearch.randomizedtesting.RandomizedRunner$7.evaluate(RandomizedRunner.java:894)
	at com.carrotsearch.randomizedtesting.rules.StatementAdapter.evaluate(StatementAdapter.java:36)
	at com.carrotsearch.randomizedtesting.rules.SystemPropertiesRestoreRule$1.evaluate(SystemPropertiesRestoreRule.java:57)
	at org.apache.lucene.util.AbstractBeforeAfterRule$1.evaluate(AbstractBeforeAfterRule.java:45)
	at com.carrotsearch.randomizedtesting.rules.StatementAdapter.evaluate(StatementAdapter.java:36)
	at org.apache.lucene.util.TestRuleStoreClassName$1.evaluate(TestRuleStoreClassName.java:41)
	at com.carrotsearch.randomizedtesting.rules.NoShadowingOrOverridesOnMethodsRule$1.evaluate(NoShadowingOrOverridesOnMethodsRule.java:40)
	at com.carrotsearch.randomizedtesting.rules.NoShadowingOrOverridesOnMethodsRule$1.evaluate(NoShadowingOrOverridesOnMethodsRule.java:40)
	at com.carrotsearch.randomizedtesting.rules.StatementAdapter.evaluate(StatementAdapter.java:36)
	at com.carrotsearch.randomizedtesting.rules.StatementAdapter.evaluate(StatementAdapter.java:36)
	at com.carrotsearch.randomizedtesting.rules.StatementAdapter.evaluate(StatementAdapter.java:36)
	at org.apache.lucene.util.TestRuleAssertionsRequired$1.evaluate(TestRuleAssertionsRequired.java:53)
	at org.apache.lucene.util.TestRuleMarkFailure$1.evaluate(TestRuleMarkFailure.java:47)
	at org.apache.lucene.util.TestRuleIgnoreAfterMaxFailures$1.evaluate(TestRuleIgnoreAfterMaxFailures.java:64)
	at org.apache.lucene.util.TestRuleIgnoreTestSuites$1.evaluate(TestRuleIgnoreTestSuites.java:54)
	at com.carrotsearch.randomizedtesting.rules.StatementAdapter.evaluate(StatementAdapter.java:36)
	at com.carrotsearch.randomizedtesting.ThreadLeakControl$StatementRunner.run(ThreadLeakControl.java:368)
	at java.lang.Thread.run(Thread.java:748)




Build Log:
[...truncated 13633 lines...]
   [junit4] Suite: org.apache.solr.core.TestDynamicLoading
   [junit4]   2> Creating dataDir: /home/jenkins/workspace/Lucene-Solr-master-Linux/solr/build/solr-core/test/J1/temp/solr.core.TestDynamicLoading_F72592B91C0F93E9-001/init-core-data-001
   [junit4]   2> 896432 WARN  (SUITE-TestDynamicLoading-seed#[F72592B91C0F93E9]-worker) [    ] o.a.s.SolrTestCaseJ4 startTrackingSearchers: numOpens=10 numCloses=10
   [junit4]   2> 896432 INFO  (SUITE-TestDynamicLoading-seed#[F72592B91C0F93E9]-worker) [    ] o.a.s.SolrTestCaseJ4 Using PointFields (NUMERIC_POINTS_SYSPROP=true) w/NUMERIC_DOCVALUES_SYSPROP=true
   [junit4]   2> 896434 INFO  (SUITE-TestDynamicLoading-seed#[F72592B91C0F93E9]-worker) [    ] o.a.s.SolrTestCaseJ4 Randomized ssl (true) and clientAuth (true) via: @org.apache.solr.util.RandomizeSSL(reason=, ssl=NaN, value=NaN, clientAuth=NaN)
   [junit4]   2> 896436 INFO  (SUITE-TestDynamicLoading-seed#[F72592B91C0F93E9]-worker) [    ] o.a.s.SolrTestCaseJ4 SecureRandom sanity checks: test.solr.allowed.securerandom=null & java.security.egd=file:/dev/./urandom
   [junit4]   2> 896436 INFO  (SUITE-TestDynamicLoading-seed#[F72592B91C0F93E9]-worker) [    ] o.a.s.BaseDistributedSearchTestCase Setting hostContext system property: /
   [junit4]   2> 896440 INFO  (TEST-TestDynamicLoading.testDynamicLoading-seed#[F72592B91C0F93E9]) [    ] o.a.s.c.ZkTestServer STARTING ZK TEST SERVER
   [junit4]   2> 896440 INFO  (ZkTestServer Run Thread) [    ] o.a.s.c.ZkTestServer client port:0.0.0.0/0.0.0.0:0
   [junit4]   2> 896441 INFO  (ZkTestServer Run Thread) [    ] o.a.s.c.ZkTestServer Starting server
   [junit4]   2> 896540 INFO  (TEST-TestDynamicLoading.testDynamicLoading-seed#[F72592B91C0F93E9]) [    ] o.a.s.c.ZkTestServer start zk server on port:39051
   [junit4]   2> 896541 INFO  (TEST-TestDynamicLoading.testDynamicLoading-seed#[F72592B91C0F93E9]) [    ] o.a.s.c.ZkTestServer parse host and port list: 127.0.0.1:39051
   [junit4]   2> 896541 INFO  (TEST-TestDynamicLoading.testDynamicLoading-seed#[F72592B91C0F93E9]) [    ] o.a.s.c.ZkTestServer connecting to 127.0.0.1 39051
   [junit4]   2> 896549 INFO  (zkConnectionManagerCallback-4038-thread-1) [    ] o.a.s.c.c.ConnectionManager zkClient has connected
   [junit4]   2> 896552 INFO  (zkConnectionManagerCallback-4040-thread-1) [    ] o.a.s.c.c.ConnectionManager zkClient has connected
   [junit4]   2> 896554 INFO  (TEST-TestDynamicLoading.testDynamicLoading-seed#[F72592B91C0F93E9]) [    ] o.a.s.c.ZkTestServer put /home/jenkins/workspace/Lucene-Solr-master-Linux/solr/core/src/test-files/solr/collection1/conf/solrconfig-tlog.xml to /configs/conf1/solrconfig.xml
   [junit4]   2> 896555 INFO  (TEST-TestDynamicLoading.testDynamicLoading-seed#[F72592B91C0F93E9]) [    ] o.a.s.c.ZkTestServer put /home/jenkins/workspace/Lucene-Solr-master-Linux/solr/core/src/test-files/solr/collection1/conf/schema.xml to /configs/conf1/schema.xml
   [junit4]   2> 896557 INFO  (TEST-TestDynamicLoading.testDynamicLoading-seed#[F72592B91C0F93E9]) [    ] o.a.s.c.ZkTestServer put /home/jenkins/workspace/Lucene-Solr-master-Linux/solr/core/src/test-files/solr/collection1/conf/solrconfig.snippet.randomindexconfig.xml to /configs/conf1/solrconfig.snippet.randomindexconfig.xml
   [junit4]   2> 896558 INFO  (TEST-TestDynamicLoading.testDynamicLoading-seed#[F72592B91C0F93E9]) [    ] o.a.s.c.ZkTestServer put /home/jenkins/workspace/Lucene-Solr-master-Linux/solr/core/src/test-files/solr/collection1/conf/stopwords.txt to /configs/conf1/stopwords.txt
   [junit4]   2> 896559 INFO  (TEST-TestDynamicLoading.testDynamicLoading-seed#[F72592B91C0F93E9]) [    ] o.a.s.c.ZkTestServer put /home/jenkins/workspace/Lucene-Solr-master-Linux/solr/core/src/test-files/solr/collection1/conf/protwords.txt to /configs/conf1/protwords.txt
   [junit4]   2> 896561 INFO  (TEST-TestDynamicLoading.testDynamicLoading-seed#[F72592B91C0F93E9]) [    ] o.a.s.c.ZkTestServer put /home/jenkins/workspace/Lucene-Solr-master-Linux/solr/core/src/test-files/solr/collection1/conf/currency.xml to /configs/conf1/currency.xml
   [junit4]   2> 896562 INFO  (TEST-TestDynamicLoading.testDynamicLoading-seed#[F72592B91C0F93E9]) [    ] o.a.s.c.ZkTestServer put /home/jenkins/workspace/Lucene-Solr-master-Linux/solr/core/src/test-files/solr/collection1/conf/enumsConfig.xml to /configs/conf1/enumsConfig.xml
   [junit4]   2> 896564 INFO  (TEST-TestDynamicLoading.testDynamicLoading-seed#[F72592B91C0F93E9]) [    ] o.a.s.c.ZkTestServer put /home/jenkins/workspace/Lucene-Solr-master-Linux/solr/core/src/test-files/solr/collection1/conf/open-exchange-rates.json to /configs/conf1/open-exchange-rates.json
   [junit4]   2> 896566 INFO  (TEST-TestDynamicLoading.testDynamicLoading-seed#[F72592B91C0F93E9]) [    ] o.a.s.c.ZkTestServer put /home/jenkins/workspace/Lucene-Solr-master-Linux/solr/core/src/test-files/solr/collection1/conf/mapping-ISOLatin1Accent.txt to /configs/conf1/mapping-ISOLatin1Accent.txt
   [junit4]   2> 896567 INFO  (TEST-TestDynamicLoading.testDynamicLoading-seed#[F72592B91C0F93E9]) [    ] o.a.s.c.ZkTestServer put /home/jenkins/workspace/Lucene-Solr-master-Linux/solr/core/src/test-files/solr/collection1/conf/old_synonyms.txt to /configs/conf1/old_synonyms.txt
   [junit4]   2> 896569 INFO  (TEST-TestDynamicLoading.testDynamicLoading-seed#[F72592B91C0F93E9]) [    ] o.a.s.c.ZkTestServer put /home/jenkins/workspace/Lucene-Solr-master-Linux/solr/core/src/test-files/solr/collection1/conf/synonyms.txt to /configs/conf1/synonyms.txt
   [junit4]   2> 896575 INFO  (zkConnectionManagerCallback-4044-thread-1) [    ] o.a.s.c.c.ConnectionManager zkClient has connected
   [junit4]   2> 896578 INFO  (TEST-TestDynamicLoading.testDynamicLoading-seed#[F72592B91C0F93E9]) [    ] o.a.s.c.AbstractFullDistribZkTestBase Will use NRT replicas unless explicitly asked otherwise
   [junit4]   2> 896699 WARN  (TEST-TestDynamicLoading.testDynamicLoading-seed#[F72592B91C0F93E9]) [    ] o.e.j.s.AbstractConnector Ignoring deprecated socket close linger time
   [junit4]   2> 896700 INFO  (TEST-TestDynamicLoading.testDynamicLoading-seed#[F72592B91C0F93E9]) [    ] o.a.s.c.s.e.JettySolrRunner Start Jetty (original configured port=0)
   [junit4]   2> 896700 INFO  (TEST-TestDynamicLoading.testDynamicLoading-seed#[F72592B91C0F93E9]) [    ] o.a.s.c.s.e.JettySolrRunner Trying to start Jetty on port 0 try number 1 ...
   [junit4]   2> 896700 INFO  (TEST-TestDynamicLoading.testDynamicLoading-seed#[F72592B91C0F93E9]) [    ] o.e.j.s.Server jetty-9.4.14.v20181114; built: 2018-11-14T21:20:31.478Z; git: c4550056e785fb5665914545889f21dc136ad9e6; jvm 1.8.0_172-b11
   [junit4]   2> 896700 INFO  (TEST-TestDynamicLoading.testDynamicLoading-seed#[F72592B91C0F93E9]) [    ] o.e.j.s.session DefaultSessionIdManager workerName=node0
   [junit4]   2> 896700 INFO  (TEST-TestDynamicLoading.testDynamicLoading-seed#[F72592B91C0F93E9]) [    ] o.e.j.s.session No SessionScavenger set, using defaults
   [junit4]   2> 896700 INFO  (TEST-TestDynamicLoading.testDynamicLoading-seed#[F72592B91C0F93E9]) [    ] o.e.j.s.session node0 Scavenging every 600000ms
   [junit4]   2> 896701 INFO  (TEST-TestDynamicLoading.testDynamicLoading-seed#[F72592B91C0F93E9]) [    ] o.e.j.s.h.ContextHandler Started o.e.j.s.ServletContextHandler@1590928{/,null,AVAILABLE}
   [junit4]   2> 896702 WARN  (TEST-TestDynamicLoading.testDynamicLoading-seed#[F72592B91C0F93E9]) [    ] o.e.j.u.s.S.config No Client EndPointIdentificationAlgorithm configured for SslContextFactory@9efcda[provider=null,keyStore=null,trustStore=null]
   [junit4]   2> 896703 INFO  (TEST-TestDynamicLoading.testDynamicLoading-seed#[F72592B91C0F93E9]) [    ] o.e.j.s.AbstractConnector Started ServerConnector@e0173d{SSL,[ssl, http/1.1]}{127.0.0.1:40483}
   [junit4]   2> 896703 INFO  (TEST-TestDynamicLoading.testDynamicLoading-seed#[F72592B91C0F93E9]) [    ] o.e.j.s.Server Started @896739ms
   [junit4]   2> 896703 INFO  (TEST-TestDynamicLoading.testDynamicLoading-seed#[F72592B91C0F93E9]) [    ] o.a.s.c.s.e.JettySolrRunner Jetty properties: {solr.data.dir=/home/jenkins/workspace/Lucene-Solr-master-Linux/solr/build/solr-core/test/J1/temp/solr.core.TestDynamicLoading_F72592B91C0F93E9-001/tempDir-001/control/data, replicaType=NRT, hostContext=/, hostPort=40483, coreRootDirectory=/home/jenkins/workspace/Lucene-Solr-master-Linux/solr/build/solr-core/test/J1/../../../../../../../../../home/jenkins/workspace/Lucene-Solr-master-Linux/solr/build/solr-core/test/J1/temp/solr.core.TestDynamicLoading_F72592B91C0F93E9-001/control-001/cores}
   [junit4]   2> 896704 ERROR (TEST-TestDynamicLoading.testDynamicLoading-seed#[F72592B91C0F93E9]) [    ] o.a.s.u.StartupLoggingUtils Missing Java Option solr.log.dir. Logging may be missing or incomplete.
   [junit4]   2> 896704 INFO  (TEST-TestDynamicLoading.testDynamicLoading-seed#[F72592B91C0F93E9]) [    ] o.a.s.s.SolrDispatchFilter Using logger factory org.apache.logging.slf4j.Log4jLoggerFactory
   [junit4]   2> 896704 INFO  (TEST-TestDynamicLoading.testDynamicLoading-seed#[F72592B91C0F93E9]) [    ] o.a.s.s.SolrDispatchFilter  ___      _       Welcome to Apache Solr™ version 8.0.0
   [junit4]   2> 896704 INFO  (TEST-TestDynamicLoading.testDynamicLoading-seed#[F72592B91C0F93E9]) [    ] o.a.s.s.SolrDispatchFilter / __| ___| |_ _   Starting in cloud mode on port null
   [junit4]   2> 896704 INFO  (TEST-TestDynamicLoading.testDynamicLoading-seed#[F72592B91C0F93E9]) [    ] o.a.s.s.SolrDispatchFilter \__ \/ _ \ | '_|  Install dir: null
   [junit4]   2> 896704 INFO  (TEST-TestDynamicLoading.testDynamicLoading-seed#[F72592B91C0F93E9]) [    ] o.a.s.s.SolrDispatchFilter |___/\___/_|_|    Start time: 2019-01-01T19:25:08.459Z
   [junit4]   2> 896706 INFO  (zkConnectionManagerCallback-4046-thread-1) [    ] o.a.s.c.c.ConnectionManager zkClient has connected
   [junit4]   2> 896707 INFO  (TEST-TestDynamicLoading.testDynamicLoading-seed#[F72592B91C0F93E9]) [    ] o.a.s.s.SolrDispatchFilter Loading solr.xml from SolrHome (not found in ZooKeeper)
   [junit4]   2> 896708 INFO  (TEST-TestDynamicLoading.testDynamicLoading-seed#[F72592B91C0F93E9]) [    ] o.a.s.c.SolrXmlConfig Loading container configuration from /home/jenkins/workspace/Lucene-Solr-master-Linux/solr/build/solr-core/test/J1/temp/solr.core.TestDynamicLoading_F72592B91C0F93E9-001/control-001/solr.xml
   [junit4]   2> 896714 INFO  (TEST-TestDynamicLoading.testDynamicLoading-seed#[F72592B91C0F93E9]) [    ] o.a.s.c.SolrXmlConfig Configuration parameter autoReplicaFailoverWorkLoopDelay is ignored
   [junit4]   2> 896714 INFO  (TEST-TestDynamicLoading.testDynamicLoading-seed#[F72592B91C0F93E9]) [    ] o.a.s.c.SolrXmlConfig Configuration parameter autoReplicaFailoverBadNodeExpiration is ignored
   [junit4]   2> 896717 INFO  (TEST-TestDynamicLoading.testDynamicLoading-seed#[F72592B91C0F93E9]) [    ] o.a.s.c.SolrXmlConfig MBean server found: com.sun.jmx.mbeanserver.JmxMBeanServer@10ffe0, but no JMX reporters were configured - adding default JMX reporter.
   [junit4]   2> 897358 WARN  (TEST-TestDynamicLoading.testDynamicLoading-seed#[F72592B91C0F93E9]) [    ] o.a.s.c.s.i.Http2SolrClient Create Http2SolrClient with HTTP/1.1 transport since Java 8 or lower versions does not support SSL + HTTP/2
   [junit4]   2> 897358 WARN  (TEST-TestDynamicLoading.testDynamicLoading-seed#[F72592B91C0F93E9]) [    ] o.e.j.u.s.S.config No Client EndPointIdentificationAlgorithm configured for SslContextFactory@31b73[provider=null,keyStore=null,trustStore=null]
   [junit4]   2> 897362 WARN  (TEST-TestDynamicLoading.testDynamicLoading-seed#[F72592B91C0F93E9]) [    ] o.a.s.c.s.i.Http2SolrClient Create Http2SolrClient with HTTP/1.1 transport since Java 8 or lower versions does not support SSL + HTTP/2
   [junit4]   2> 897364 WARN  (TEST-TestDynamicLoading.testDynamicLoading-seed#[F72592B91C0F93E9]) [    ] o.e.j.u.s.S.config No Client EndPointIdentificationAlgorithm configured for SslContextFactory@1ac7251[provider=null,keyStore=null,trustStore=null]
   [junit4]   2> 897366 INFO  (TEST-TestDynamicLoading.testDynamicLoading-seed#[F72592B91C0F93E9]) [    ] o.a.s.c.ZkContainer Zookeeper client=127.0.0.1:39051/solr
   [junit4]   2> 897367 INFO  (zkConnectionManagerCallback-4052-thread-1) [    ] o.a.s.c.c.ConnectionManager zkClient has connected
   [junit4]   2> 897370 INFO  (zkConnectionManagerCallback-4054-thread-1) [    ] o.a.s.c.c.ConnectionManager zkClient has connected
   [junit4]   2> 897497 INFO  (TEST-TestDynamicLoading.testDynamicLoading-seed#[F72592B91C0F93E9]) [n:127.0.0.1:40483_    ] o.a.s.c.OverseerElectionContext I am going to be the leader 127.0.0.1:40483_
   [junit4]   2> 897500 INFO  (TEST-TestDynamicLoading.testDynamicLoading-seed#[F72592B91C0F93E9]) [n:127.0.0.1:40483_    ] o.a.s.c.Overseer Overseer (id=72143314243878917-127.0.0.1:40483_-n_0000000000) starting
   [junit4]   2> 897512 INFO  (zkConnectionManagerCallback-4061-thread-1) [    ] o.a.s.c.c.ConnectionManager zkClient has connected
   [junit4]   2> 897516 INFO  (TEST-TestDynamicLoading.testDynamicLoading-seed#[F72592B91C0F93E9]) [n:127.0.0.1:40483_    ] o.a.s.c.s.i.ZkClientClusterStateProvider Cluster at 127.0.0.1:39051/solr ready
   [junit4]   2> 897520 INFO  (OverseerStateUpdate-72143314243878917-127.0.0.1:40483_-n_0000000000) [n:127.0.0.1:40483_    ] o.a.s.c.Overseer Starting to work on the main queue : 127.0.0.1:40483_
   [junit4]   2> 897521 INFO  (TEST-TestDynamicLoading.testDynamicLoading-seed#[F72592B91C0F93E9]) [n:127.0.0.1:40483_    ] o.a.s.c.ZkController Register node as live in ZooKeeper:/live_nodes/127.0.0.1:40483_
   [junit4]   2> 897523 INFO  (OverseerStateUpdate-72143314243878917-127.0.0.1:40483_-n_0000000000) [n:127.0.0.1:40483_    ] o.a.s.c.c.ZkStateReader Updated live nodes from ZooKeeper... (0) -> (1)
   [junit4]   2> 897538 INFO  (zkCallback-4060-thread-1) [    ] o.a.s.c.c.ZkStateReader Updated live nodes from ZooKeeper... (0) -> (1)
   [junit4]   2> 897561 INFO  (TEST-TestDynamicLoading.testDynamicLoading-seed#[F72592B91C0F93E9]) [n:127.0.0.1:40483_    ] o.a.s.h.a.MetricsHistoryHandler No .system collection, keeping metrics history in memory.
   [junit4]   2> 897588 INFO  (TEST-TestDynamicLoading.testDynamicLoading-seed#[F72592B91C0F93E9]) [n:127.0.0.1:40483_    ] o.a.s.m.r.SolrJmxReporter JMX monitoring for 'solr.node' (registry 'solr.node') enabled at server: com.sun.jmx.mbeanserver.JmxMBeanServer@10ffe0
   [junit4]   2> 897601 INFO  (TEST-TestDynamicLoading.testDynamicLoading-seed#[F72592B91C0F93E9]) [n:127.0.0.1:40483_    ] o.a.s.m.r.SolrJmxReporter JMX monitoring for 'solr.jvm' (registry 'solr.jvm') enabled at server: com.sun.jmx.mbeanserver.JmxMBeanServer@10ffe0
   [junit4]   2> 897601 INFO  (TEST-TestDynamicLoading.testDynamicLoading-seed#[F72592B91C0F93E9]) [n:127.0.0.1:40483_    ] o.a.s.m.r.SolrJmxReporter JMX monitoring for 'solr.jetty' (registry 'solr.jetty') enabled at server: com.sun.jmx.mbeanserver.JmxMBeanServer@10ffe0
   [junit4]   2> 897603 INFO  (TEST-TestDynamicLoading.testDynamicLoading-seed#[F72592B91C0F93E9]) [n:127.0.0.1:40483_    ] o.a.s.c.CorePropertiesLocator Found 0 core definitions underneath /home/jenkins/workspace/Lucene-Solr-master-Linux/solr/build/solr-core/test/J1/../../../../../../../../../home/jenkins/workspace/Lucene-Solr-master-Linux/solr/build/solr-core/test/J1/temp/solr.core.TestDynamicLoading_F72592B91C0F93E9-001/control-001/cores
   [junit4]   2> 897628 INFO  (zkConnectionManagerCallback-4067-thread-1) [    ] o.a.s.c.c.ConnectionManager zkClient has connected
   [junit4]   2> 897629 INFO  (TEST-TestDynamicLoading.testDynamicLoading-seed#[F72592B91C0F93E9]) [    ] o.a.s.c.c.ZkStateReader Updated live nodes from ZooKeeper... (0) -> (1)
   [junit4]   2> 897630 INFO  (TEST-TestDynamicLoading.testDynamicLoading-seed#[F72592B91C0F93E9]) [    ] o.a.s.c.s.i.ZkClientClusterStateProvider Cluster at 127.0.0.1:39051/solr ready
   [junit4]   2> 897711 INFO  (qtp1733474-11807) [n:127.0.0.1:40483_    ] o.a.s.h.a.CollectionsHandler Invoked Collection Action :create with params collection.configName=conf1&name=control_collection&nrtReplicas=1&action=CREATE&numShards=1&createNodeSet=127.0.0.1:40483_&wt=javabin&version=2 and sendToOCPQueue=true
   [junit4]   2> 897714 INFO  (OverseerThreadFactory-3348-thread-1-processing-n:127.0.0.1:40483_) [n:127.0.0.1:40483_    ] o.a.s.c.a.c.CreateCollectionCmd Create collection control_collection
   [junit4]   2> 897830 INFO  (qtp1733474-11808) [n:127.0.0.1:40483_    ] o.a.s.s.HttpSolrCall [admin] webapp=null path=/admin/metrics params={prefix=CONTAINER.fs.usableSpace,CONTAINER.fs.totalSpace,CORE.coreName&wt=javabin&version=2&group=solr.node,solr.core} status=0 QTime=1
   [junit4]   2> 897834 INFO  (qtp1733474-11806) [n:127.0.0.1:40483_    ] o.a.s.s.HttpSolrCall [admin] webapp=null path=/admin/metrics params={prefix=CONTAINER.fs.usableSpace,CONTAINER.fs.totalSpace,CORE.coreName&wt=javabin&version=2&group=solr.node,solr.core} status=0 QTime=1
   [junit4]   2> 897838 INFO  (qtp1733474-11808) [n:127.0.0.1:40483_    ] o.a.s.s.HttpSolrCall [admin] webapp=null path=/admin/metrics params={prefix=CONTAINER.fs.usableSpace,CONTAINER.fs.totalSpace,CORE.coreName&wt=javabin&version=2&group=solr.node,solr.core} status=0 QTime=1
   [junit4]   2> 897841 INFO  (qtp1733474-11806) [n:127.0.0.1:40483_    ] o.a.s.s.HttpSolrCall [admin] webapp=null path=/admin/metrics params={prefix=CONTAINER.fs.usableSpace,CONTAINER.fs.totalSpace,CORE.coreName&wt=javabin&version=2&group=solr.node,solr.core} status=0 QTime=1
   [junit4]   2> 897845 INFO  (qtp1733474-11808) [n:127.0.0.1:40483_    ] o.a.s.s.HttpSolrCall [admin] webapp=null path=/admin/metrics params={prefix=CONTAINER.fs.usableSpace,CONTAINER.fs.totalSpace,CORE.coreName&wt=javabin&version=2&group=solr.node,solr.core} status=0 QTime=1
   [junit4]   2> 897856 INFO  (qtp1733474-11806) [n:127.0.0.1:40483_    x:control_collection_shard1_replica_n1] o.a.s.h.a.CoreAdminOperation core create command qt=/admin/cores&collection.configName=conf1&newCollection=true&name=control_collection_shard1_replica_n1&action=CREATE&numShards=1&collection=control_collection&shard=shard1&wt=javabin&version=2&replicaType=NRT
   [junit4]   2> 897857 INFO  (qtp1733474-11806) [n:127.0.0.1:40483_    x:control_collection_shard1_replica_n1] o.a.s.c.TransientSolrCoreCacheDefault Allocating transient cache for 4 transient cores
   [junit4]   2> 898897 INFO  (qtp1733474-11806) [n:127.0.0.1:40483_ c:control_collection s:shard1  x:control_collection_shard1_replica_n1] o.a.s.c.SolrConfig Using Lucene MatchVersion: 8.0.0
   [junit4]   2> 898978 INFO  (qtp1733474-11806) [n:127.0.0.1:40483_ c:control_collection s:shard1  x:control_collection_shard1_replica_n1] o.a.s.s.IndexSchema [control_collection_shard1_replica_n1] Schema name=test
   [junit4]   2> 899137 INFO  (qtp1733474-11806) [n:127.0.0.1:40483_ c:control_collection s:shard1  x:control_collection_shard1_replica_n1] o.a.s.s.IndexSchema Loaded schema test/1.0 with uniqueid field id
   [junit4]   2> 899171 INFO  (qtp1733474-11806) [n:127.0.0.1:40483_ c:control_collection s:shard1  x:control_collection_shard1_replica_n1] o.a.s.c.CoreContainer Creating SolrCore 'control_collection_shard1_replica_n1' using configuration from collection control_collection, trusted=true
   [junit4]   2> 899172 INFO  (qtp1733474-11806) [n:127.0.0.1:40483_ c:control_collection s:shard1  x:control_collection_shard1_replica_n1] o.a.s.m.r.SolrJmxReporter JMX monitoring for 'solr.core.control_collection.shard1.replica_n1' (registry 'solr.core.control_collection.shard1.replica_n1') enabled at server: com.sun.jmx.mbeanserver.JmxMBeanServer@10ffe0
   [junit4]   2> 899172 INFO  (qtp1733474-11806) [n:127.0.0.1:40483_ c:control_collection s:shard1  x:control_collection_shard1_replica_n1] o.a.s.c.SolrCore [[control_collection_shard1_replica_n1] ] Opening new SolrCore at [/home/jenkins/workspace/Lucene-Solr-master-Linux/solr/build/solr-core/test/J1/temp/solr.core.TestDynamicLoading_F72592B91C0F93E9-001/control-001/cores/control_collection_shard1_replica_n1], dataDir=[/home/jenkins/workspace/Lucene-Solr-master-Linux/solr/build/solr-core/test/J1/../../../../../../../../../home/jenkins/workspace/Lucene-Solr-master-Linux/solr/build/solr-core/test/J1/temp/solr.core.TestDynamicLoading_F72592B91C0F93E9-001/control-001/cores/control_collection_shard1_replica_n1/data/]
   [junit4]   2> 899176 INFO  (qtp1733474-11806) [n:127.0.0.1:40483_ c:control_collection s:shard1  x:control_collection_shard1_replica_n1] o.a.s.u.RandomMergePolicy RandomMergePolicy wrapping class org.apache.lucene.index.TieredMergePolicy: [TieredMergePolicy: maxMergeAtOnce=18, maxMergeAtOnceExplicit=38, maxMergedSegmentMB=50.90234375, floorSegmentMB=1.1474609375, forceMergeDeletesPctAllowed=25.94401125351518, segmentsPerTier=47.0, maxCFSSegmentSizeMB=8.796093022207999E12, noCFSRatio=0.7421172575558928, deletesPctAllowed=40.23891877182824
   [junit4]   2> 899179 WARN  (qtp1733474-11806) [n:127.0.0.1:40483_ c:control_collection s:shard1  x:control_collection_shard1_replica_n1] o.a.s.c.RequestHandlers INVALID paramSet a in requestHandler {type = requestHandler,name = /dump,class = DumpRequestHandler,attributes = {initParams=a, name=/dump, class=DumpRequestHandler},args = {defaults={a=A,b=B}}}
   [junit4]   2> 899229 INFO  (qtp1733474-11806) [n:127.0.0.1:40483_ c:control_collection s:shard1  x:control_collection_shard1_replica_n1] o.a.s.u.UpdateHandler Using UpdateLog implementation: org.apache.solr.update.UpdateLog
   [junit4]   2> 899229 INFO  (qtp1733474-11806) [n:127.0.0.1:40483_ c:control_collection s:shard1  x:control_collection_shard1_replica_n1] o.a.s.u.UpdateLog Initializing UpdateLog: dataDir= defaultSyncLevel=FLUSH numRecordsToKeep=100 maxNumLogsToKeep=10 numVersionBuckets=65536
   [junit4]   2> 899231 INFO  (qtp1733474-11806) [n:127.0.0.1:40483_ c:control_collection s:shard1  x:control_collection_shard1_replica_n1] o.a.s.u.CommitTracker Hard AutoCommit: disabled
   [junit4]   2> 899231 INFO  (qtp1733474-11806) [n:127.0.0.1:40483_ c:control_collection s:shard1  x:control_collection_shard1_replica_n1] o.a.s.u.CommitTracker Soft AutoCommit: disabled
   [junit4]   2> 899232 INFO  (qtp1733474-11806) [n:127.0.0.1:40483_ c:control_collection s:shard1  x:control_collection_shard1_replica_n1] o.a.s.u.RandomMergePolicy RandomMergePolicy wrapping class org.apache.lucene.index.LogByteSizeMergePolicy: [LogByteSizeMergePolicy: minMergeSize=1677721, mergeFactor=42, maxMergeSize=2147483648, maxMergeSizeForForcedMerge=9223372036854775807, calibrateSizeByDeletes=false, maxMergeDocs=2147483647, maxCFSSegmentSizeMB=8.796093022207999E12, noCFSRatio=0.7410879463176804]
   [junit4]   2> 899233 INFO  (qtp1733474-11806) [n:127.0.0.1:40483_ c:control_collection s:shard1  x:control_collection_shard1_replica_n1] o.a.s.s.SolrIndexSearcher Opening [Searcher@967ab5[control_collection_shard1_replica_n1] main]
   [junit4]   2> 899234 INFO  (qtp1733474-11806) [n:127.0.0.1:40483_ c:control_collection s:shard1  x:control_collection_shard1_replica_n1] o.a.s.r.ManagedResourceStorage Configured ZooKeeperStorageIO with znodeBase: /configs/conf1
   [junit4]   2> 899234 INFO  (qtp1733474-11806) [n:127.0.0.1:40483_ c:control_collection s:shard1  x:control_collection_shard1_replica_n1] o.a.s.r.ManagedResourceStorage Loaded null at path _rest_managed.json using ZooKeeperStorageIO:path=/configs/conf1
   [junit4]   2> 899235 INFO  (qtp1733474-11806) [n:127.0.0.1:40483_ c:control_collection s:shard1  x:control_collection_shard1_replica_n1] o.a.s.h.ReplicationHandler Commits will be reserved for 10000ms.
   [junit4]   2> 899235 INFO  (qtp1733474-11806) [n:127.0.0.1:40483_ c:control_collection s:shard1  x:control_collection_shard1_replica_n1] o.a.s.u.UpdateLog Could not find max version in index or recent updates, using new clock 1621487214647050240
   [junit4]   2> 899241 INFO  (searcherExecutor-3353-thread-1-processing-n:127.0.0.1:40483_ x:control_collection_shard1_replica_n1 c:control_collection s:shard1) [n:127.0.0.1:40483_ c:control_collection s:shard1  x:control_collection_shard1_replica_n1] o.a.s.c.SolrCore [control_collection_shard1_replica_n1] Registered new searcher Searcher@967ab5[control_collection_shard1_replica_n1] main{ExitableDirectoryReader(UninvertingDirectoryReader())}
   [junit4]   2> 899243 INFO  (qtp1733474-11806) [n:127.0.0.1:40483_ c:control_collection s:shard1  x:control_collection_shard1_replica_n1] o.a.s.c.ZkShardTerms Successful update of terms at /collections/control_collection/terms/shard1 to Terms{values={core_node2=0}, version=0}
   [junit4]   2> 899244 INFO  (qtp1733474-11806) [n:127.0.0.1:40483_ c:control_collection s:shard1  x:control_collection_shard1_replica_n1] o.a.s.c.ShardLeaderElectionContextBase make sure parent is created /collections/control_collection/leaders/shard1
   [junit4]   2> 899248 INFO  (qtp1733474-11806) [n:127.0.0.1:40483_ c:control_collection s:shard1  x:control_collection_shard1_replica_n1] o.a.s.c.ShardLeaderElectionContext Enough replicas found to continue.
   [junit4]   2> 899248 INFO  (qtp1733474-11806) [n:127.0.0.1:40483_ c:control_collection s:shard1  x:control_collection_shard1_replica_n1] o.a.s.c.ShardLeaderElectionContext I may be the new leader - try and sync
   [junit4]   2> 899248 INFO  (qtp1733474-11806) [n:127.0.0.1:40483_ c:control_collection s:shard1  x:control_collection_shard1_replica_n1] o.a.s.c.SyncStrategy Sync replicas to https://127.0.0.1:40483/control_collection_shard1_replica_n1/
   [junit4]   2> 899248 INFO  (qtp1733474-11806) [n:127.0.0.1:40483_ c:control_collection s:shard1  x:control_collection_shard1_replica_n1] o.a.s.c.SyncStrategy Sync Success - now sync replicas to me
   [junit4]   2> 899248 INFO  (qtp1733474-11806) [n:127.0.0.1:40483_ c:control_collection s:shard1  x:control_collection_shard1_replica_n1] o.a.s.c.SyncStrategy https://127.0.0.1:40483/control_collection_shard1_replica_n1/ has no replicas
   [junit4]   2> 899248 INFO  (qtp1733474-11806) [n:127.0.0.1:40483_ c:control_collection s:shard1  x:control_collection_shard1_replica_n1] o.a.s.c.ShardLeaderElectionContextBase Creating leader registration node /collections/control_collection/leaders/shard1/leader after winning as /collections/control_collection/leader_elect/shard1/election/72143314243878917-core_node2-n_0000000000
   [junit4]   2> 899250 INFO  (qtp1733474-11806) [n:127.0.0.1:40483_ c:control_collection s:shard1  x:control_collection_shard1_replica_n1] o.a.s.c.ShardLeaderElectionContext I am the new leader: https://127.0.0.1:40483/control_collection_shard1_replica_n1/ shard1
   [junit4]   2> 899352 INFO  (zkCallback-4053-thread-1) [    ] o.a.s.c.c.ZkStateReader A cluster state change: [WatchedEvent state:SyncConnected type:NodeDataChanged path:/collections/control_collection/state.json] for collection [control_collection] has occurred - updating... (live nodes size: [1])
   [junit4]   2> 899353 INFO  (zkCallback-4053-thread-2) [    ] o.a.s.c.c.ZkStateReader A cluster state change: [WatchedEvent state:SyncConnected type:NodeDataChanged path:/collections/control_collection/state.json] for collection [control_collection] has occurred - updating... (live nodes size: [1])
   [junit4]   2> 899354 INFO  (qtp1733474-11806) [n:127.0.0.1:40483_ c:control_collection s:shard1  x:control_collection_shard1_replica_n1] o.a.s.c.ZkController I am the leader, no recovery necessary
   [junit4]   2> 899356 INFO  (qtp1733474-11806) [n:127.0.0.1:40483_ c:control_collection s:shard1  x:control_collection_shard1_replica_n1] o.a.s.s.HttpSolrCall [admin] webapp=null path=/admin/cores params={qt=/admin/cores&collection.configName=conf1&newCollection=true&name=control_collection_shard1_replica_n1&action=CREATE&numShards=1&collection=control_collection&shard=shard1&wt=javabin&version=2&replicaType=NRT} status=0 QTime=1500
   [junit4]   2> 899360 INFO  (qtp1733474-11807) [n:127.0.0.1:40483_    ] o.a.s.h.a.CollectionsHandler Wait for new collection to be active for at most 45 seconds. Check all shard replicas
   [junit4]   2> 899458 INFO  (zkCallback-4053-thread-2) [    ] o.a.s.c.c.ZkStateReader A cluster state change: [WatchedEvent state:SyncConnected type:NodeDataChanged path:/collections/control_collection/state.json] for collection [control_collection] has occurred - updating... (live nodes size: [1])
   [junit4]   2> 899458 INFO  (zkCallback-4053-thread-3) [    ] o.a.s.c.c.ZkStateReader A cluster state change: [WatchedEvent state:SyncConnected type:NodeDataChanged path:/collections/control_collection/state.json] for collection [control_collection] has occurred - updating... (live nodes size: [1])
   [junit4]   2> 899458 INFO  (zkCallback-4053-thread-1) [    ] o.a.s.c.c.ZkStateReader A cluster state change: [WatchedEvent state:SyncConnected type:NodeDataChanged path:/collections/control_collection/state.json] for collection [control_collection] has occurred - updating... (live nodes size: [1])
   [junit4]   2> 899459 INFO  (qtp1733474-11807) [n:127.0.0.1:40483_    ] o.a.s.s.HttpSolrCall [admin] webapp=null path=/admin/collections params={collection.configName=conf1&name=control_collection&nrtReplicas=1&action=CREATE&numShards=1&createNodeSet=127.0.0.1:40483_&wt=javabin&version=2} status=0 QTime=1748
   [junit4]   2> 899464 INFO  (zkConnectionManagerCallback-4072-thread-1) [    ] o.a.s.c.c.ConnectionManager zkClient has connected
   [junit4]   2> 899466 INFO  (TEST-TestDynamicLoading.testDynamicLoading-seed#[F72592B91C0F93E9]) [    ] o.a.s.c.c.ZkStateReader Updated live nodes from ZooKeeper... (0) -> (1)
   [junit4]   2> 899467 INFO  (TEST-TestDynamicLoading.testDynamicLoading-seed#[F72592B91C0F93E9]) [    ] o.a.s.c.s.i.ZkClientClusterStateProvider Cluster at 127.0.0.1:39051/solr ready
   [junit4]   2> 899467 INFO  (TEST-TestDynamicLoading.testDynamicLoading-seed#[F72592B91C0F93E9]) [    ] o.a.s.c.ChaosMonkey monkey: init - expire sessions:false cause connection loss:false
   [junit4]   2> 899472 INFO  (qtp1733474-11806) [n:127.0.0.1:40483_    ] o.a.s.h.a.CollectionsHandler Invoked Collection Action :create with params collection.configName=conf1&name=collection1&nrtReplicas=1&action=CREATE&numShards=2&createNodeSet=&stateFormat=2&wt=javabin&version=2 and sendToOCPQueue=true
   [junit4]   2> 899474 INFO  (OverseerThreadFactory-3348-thread-2-processing-n:127.0.0.1:40483_) [n:127.0.0.1:40483_    ] o.a.s.c.a.c.CreateCollectionCmd Create collection collection1
   [junit4]   2> 899474 INFO  (OverseerCollectionConfigSetProcessor-72143314243878917-127.0.0.1:40483_-n_0000000000) [n:127.0.0.1:40483_    ] o.a.s.c.OverseerTaskQueue Response ZK path: /overseer/collection-queue-work/qnr-0000000000 doesn't exist.  Requestor may have disconnected from ZooKeeper
   [junit4]   2> 899677 WARN  (OverseerThreadFactory-3348-thread-2-processing-n:127.0.0.1:40483_) [n:127.0.0.1:40483_    ] o.a.s.c.a.c.CreateCollectionCmd It is unusual to create a collection (collection1) without cores.
   [junit4]   2> 899679 INFO  (qtp1733474-11806) [n:127.0.0.1:40483_    ] o.a.s.h.a.CollectionsHandler Wait for new collection to be active for at most 45 seconds. Check all shard replicas
   [junit4]   2> 899680 INFO  (qtp1733474-11806) [n:127.0.0.1:40483_    ] o.a.s.s.HttpSolrCall [admin] webapp=null path=/admin/collections params={collection.configName=conf1&name=collection1&nrtReplicas=1&action=CREATE&numShards=2&createNodeSet=&stateFormat=2&wt=javabin&version=2} status=0 QTime=208
   [junit4]   2> 899681 INFO  (TEST-TestDynamicLoading.testDynamicLoading-seed#[F72592B91C0F93E9]) [    ] o.a.s.c.AbstractFullDistribZkTestBase Creating jetty instances pullReplicaCount=0 numOtherReplicas=4
   [junit4]   2> 899786 INFO  (TEST-TestDynamicLoading.testDynamicLoading-seed#[F72592B91C0F93E9]) [    ] o.a.s.c.AbstractFullDistribZkTestBase create jetty 1 in directory /home/jenkins/workspace/Lucene-Solr-master-Linux/solr/build/solr-core/test/J1/temp/solr.core.TestDynamicLoading_F72592B91C0F93E9-001/shard-1-001 of type NRT
   [junit4]   2> 899788 WARN  (closeThreadPool-4073-thread-1) [    ] o.e.j.s.AbstractConnector Ignoring deprecated socket close linger time
   [junit4]   2> 899788 INFO  (closeThreadPool-4073-thread-1) [    ] o.a.s.c.s.e.JettySolrRunner Start Jetty (original configured port=0)
   [junit4]   2> 899788 INFO  (closeThreadPool-4073-thread-1) [    ] o.a.s.c.s.e.JettySolrRunner Trying to start Jetty on port 0 try number 1 ...
   [junit4]   2> 899788 INFO  (closeThreadPool-4073-thread-1) [    ] o.e.j.s.Server jetty-9.4.14.v20181114; built: 2018-11-14T21:20:31.478Z; git: c4550056e785fb5665914545889f21dc136ad9e6; jvm 1.8.0_172-b11
   [junit4]   2> 899800 INFO  (closeThreadPool-4073-thread-1) [    ] o.e.j.s.session DefaultSessionIdManager workerName=node0
   [junit4]   2> 899800 INFO  (closeThreadPool-4073-thread-1) [    ] o.e.j.s.session No SessionScavenger set, using defaults
   [junit4]   2> 899800 INFO  (closeThreadPool-4073-thread-1) [    ] o.e.j.s.session node0 Scavenging every 600000ms
   [junit4]   2> 899801 INFO  (closeThreadPool-4073-thread-1) [    ] o.e.j.s.h.ContextHandler Started o.e.j.s.ServletContextHandler@5bb87{/,null,AVAILABLE}
   [junit4]   2> 899801 WARN  (closeThreadPool-4073-thread-1) [    ] o.e.j.u.s.S.config No Client EndPointIdentificationAlgorithm configured for SslContextFactory@128ac81[provider=null,keyStore=null,trustStore=null]
   [junit4]   2> 899802 INFO  (closeThreadPool-4073-thread-1) [    ] o.e.j.s.AbstractConnector Started ServerConnector@d3bc90{SSL,[ssl, http/1.1]}{127.0.0.1:38777}
   [junit4]   2> 899802 INFO  (closeThreadPool-4073-thread-1) [    ] o.e.j.s.Server Started @899838ms
   [junit4]   2> 899802 INFO  (closeThreadPool-4073-thread-1) [    ] o.a.s.c.s.e.JettySolrRunner Jetty properties: {solr.data.dir=/home/jenkins/workspace/Lucene-Solr-master-Linux/solr/build/solr-core/test/J1/temp/solr.core.TestDynamicLoading_F72592B91C0F93E9-001/tempDir-001/jetty1, replicaType=NRT, solrconfig=solrconfig.xml, hostContext=/, hostPort=38777, coreRootDirectory=/home/jenkins/workspace/Lucene-Solr-master-Linux/solr/build/solr-core/test/J1/../../../../../../../../../home/jenkins/workspace/Lucene-Solr-master-Linux/solr/build/solr-core/test/J1/temp/solr.core.TestDynamicLoading_F72592B91C0F93E9-001/shard-1-001/cores}
   [junit4]   2> 899803 ERROR (closeThreadPool-4073-thread-1) [    ] o.a.s.u.StartupLoggingUtils Missing Java Option solr.log.dir. Logging may be missing or incomplete.
   [junit4]   2> 899803 INFO  (closeThreadPool-4073-thread-1) [    ] o.a.s.s.SolrDispatchFilter Using logger factory org.apache.logging.slf4j.Log4jLoggerFactory
   [junit4]   2> 899803 INFO  (closeThreadPool-4073-thread-1) [    ] o.a.s.s.SolrDispatchFilter  ___      _       Welcome to Apache Solr™ version 8.0.0
   [junit4]   2> 899803 INFO  (closeThreadPool-4073-thread-1) [    ] o.a.s.s.SolrDispatchFilter / __| ___| |_ _   Starting in cloud mode on port null
   [junit4]   2> 899803 INFO  (closeThreadPool-4073-thread-1) [    ] o.a.s.s.SolrDispatchFilter \__ \/ _ \ | '_|  Install dir: null
   [junit4]   2> 899803 INFO  (closeThreadPool-4073-thread-1) [    ] o.a.s.s.SolrDispatchFilter |___/\___/_|_|    Start time: 2019-01-01T19:25:11.558Z
   [junit4]   2> 899812 INFO  (zkConnectionManagerCallback-4075-thread-1) [    ] o.a.s.c.c.ConnectionManager zkClient has connected
   [junit4]   2> 899813 INFO  (closeThreadPool-4073-thread-1) [    ] o.a.s.s.SolrDispatchFilter Loading solr.xml from SolrHome (not found in ZooKeeper)
   [junit4]   2> 899813 INFO  (closeThreadPool-4073-thread-1) [    ] o.a.s.c.SolrXmlConfig Loading container configuration from /home/jenkins/workspace/Lucene-Solr-master-Linux/solr/build/solr-core/test/J1/temp/solr.core.TestDynamicLoading_F72592B91C0F93E9-001/shard-1-001/solr.xml
   [junit4]   2> 899819 INFO  (closeThreadPool-4073-thread-1) [    ] o.a.s.c.SolrXmlConfig Configuration parameter autoReplicaFailoverWorkLoopDelay is ignored
   [junit4]   2> 899819 INFO  (closeThreadPool-4073-thread-1) [    ] o.a.s.c.SolrXmlConfig Configuration parameter autoReplicaFailoverBadNodeExpiration is ignored
   [junit4]   2> 899820 INFO  (closeThreadPool-4073-thread-1) [    ] o.a.s.c.SolrXmlConfig MBean server found: com.sun.jmx.mbeanserver.JmxMBeanServer@10ffe0, but no JMX reporters were configured - adding default JMX reporter.
   [junit4]   2> 899896 INFO  (TEST-TestDynamicLoading.testDynamicLoading-seed#[F72592B91C0F93E9]) [    ] o.a.s.c.AbstractFullDistribZkTestBase create jetty 2 in directory /home/jenkins/workspace/Lucene-Solr-master-Linux/solr/build/solr-core/test/J1/temp/solr.core.TestDynamicLoading_F72592B91C0F93E9-001/shard-2-001 of type NRT
   [junit4]   2> 899897 WARN  (closeThreadPool-4073-thread-2) [    ] o.e.j.s.AbstractConnector Ignoring deprecated socket close linger time
   [junit4]   2> 899898 INFO  (closeThreadPool-4073-thread-2) [    ] o.a.s.c.s.e.JettySolrRunner Start Jetty (original configured port=0)
   [junit4]   2> 899898 INFO  (closeThreadPool-4073-thread-2) [    ] o.a.s.c.s.e.JettySolrRunner Trying to start Jetty on port 0 try number 1 ...
   [junit4]   2> 899898 INFO  (closeThreadPool-4073-thread-2) [    ] o.e.j.s.Server jetty-9.4.14.v20181114; built: 2018-11-14T21:20:31.478Z; git: c4550056e785fb5665914545889f21dc136ad9e6; jvm 1.8.0_172-b11
   [junit4]   2> 899912 INFO  (closeThreadPool-4073-thread-2) [    ] o.e.j.s.session DefaultSessionIdManager workerName=node0
   [junit4]   2> 899912 INFO  (closeThreadPool-4073-thread-2) [    ] o.e.j.s.session No SessionScavenger set, using defaults
   [junit4]   2> 899912 INFO  (closeThreadPool-4073-thread-2) [    ] o.e.j.s.session node0 Scavenging every 600000ms
   [junit4]   2> 899918 INFO  (closeThreadPool-4073-thread-2) [    ] o.e.j.s.h.ContextHandler Started o.e.j.s.ServletContextHandler@11d4e54{/,null,AVAILABLE}
   [junit4]   2> 899919 WARN  (closeThreadPool-4073-thread-2) [    ] o.e.j.u.s.S.config No Client EndPointIdentificationAlgorithm configured for SslContextFactory@19084fc[provider=null,keyStore=null,trustStore=null]
   [junit4]   2> 899920 INFO  (closeThreadPool-4073-thread-2) [    ] o.e.j.s.AbstractConnector Started ServerConnector@efe83{SSL,[ssl, http/1.1]}{127.0.0.1:42311}
   [junit4]   2> 899920 INFO  (closeThreadPool-4073-thread-2) [    ] o.e.j.s.Server Started @899956ms
   [junit4]   2> 899920 INFO  (closeThreadPool-4073-thread-2) [    ] o.a.s.c.s.e.JettySolrRunner Jetty properties: {solr.data.dir=/home/jenkins/workspace/Lucene-Solr-master-Linux/solr/build/solr-core/test/J1/temp/solr.core.TestDynamicLoading_F72592B91C0F93E9-001/tempDir-001/jetty2, replicaType=NRT, solrconfig=solrconfig.xml, hostContext=/, hostPort=42311, coreRootDirectory=/home/jenkins/workspace/Lucene-Solr-master-Linux/solr/build/solr-core/test/J1/../../../../../../../../../home/jenkins/workspace/Lucene-Solr-master-Linux/solr/build/solr-core/test/J1/temp/solr.core.TestDynamicLoading_F72592B91C0F93E9-001/shard-2-001/cores}
   [junit4]   2> 899920 ERROR (closeThreadPool-4073-thread-2) [    ] o.a.s.u.StartupLoggingUtils Missing Java Option solr.log.dir. Logging may be missing or incomplete.
   [junit4]   2> 899920 INFO  (closeThreadPool-4073-thread-2) [    ] o.a.s.s.SolrDispatchFilter Using logger factory org.apache.logging.slf4j.Log4jLoggerFactory
   [junit4]   2> 899920 INFO  (closeThreadPool-4073-thread-2) [    ] o.a.s.s.SolrDispatchFilter  ___      _       Welcome to Apache Solr™ version 8.0.0
   [junit4]   2> 899921 INFO  (closeThreadPool-4073-thread-2) [    ] o.a.s.s.SolrDispatchFilter / __| ___| |_ _   Starting in cloud mode on port null
   [junit4]   2> 899921 INFO  (closeThreadPool-4073-thread-2) [    ] o.a.s.s.SolrDispatchFilter \__ \/ _ \ | '_|  Install dir: null
   [junit4]   2> 899921 INFO  (closeThreadPool-4073-thread-2) [    ] o.a.s.s.SolrDispatchFilter |___/\___/_|_|    Start time: 2019-01-01T19:25:11.676Z
   [junit4]   2> 899934 INFO  (zkConnectionManagerCallback-4077-thread-1) [    ] o.a.s.c.c.ConnectionManager zkClient has connected
   [junit4]   2> 899935 INFO  (closeThreadPool-4073-thread-2) [    ] o.a.s.s.SolrDispatchFilter Loading solr.xml from SolrHome (not found in ZooKeeper)
   [junit4]   2> 899935 INFO  (closeThreadPool-4073-thread-2) [    ] o.a.s.c.SolrXmlConfig Loading container configuration from /home/jenkins/workspace/Lucene-Solr-master-Linux/solr/build/solr-core/test/J1/temp/solr.core.TestDynamicLoading_F72592B91C0F93E9-001/shard-2-001/solr.xml
   [junit4]   2> 899940 INFO  (closeThreadPool-4073-thread-2) [    ] o.a.s.c.SolrXmlConfig Configuration parameter autoReplicaFailoverWorkLoopDelay is ignored
   [junit4]   2> 899940 INFO  (closeThreadPool-4073-thread-2) [    ] o.a.s.c.SolrXmlConfig Configuration parameter autoReplicaFailoverBadNodeExpiration is ignored
   [junit4]   2> 899948 INFO  (closeThreadPool-4073-thread-2) [    ] o.a.s.c.SolrXmlConfig MBean server found: com.sun.jmx.mbeanserver.JmxMBeanServer@10ffe0, but no JMX reporters were configured - adding default JMX reporter.
   [junit4]   2> 900005 INFO  (TEST-TestDynamicLoading.testDynamicLoading-seed#[F72592B91C0F93E9]) [    ] o.a.s.c.AbstractFullDistribZkTestBase create jetty 3 in directory /home/jenkins/workspace/Lucene-Solr-master-Linux/solr/build/solr-core/test/J1/temp/solr.core.TestDynamicLoading_F72592B91C0F93E9-001/shard-3-001 of type NRT
   [junit4]   2> 900026 WARN  (closeThreadPool-4073-thread-3) [    ] o.e.j.s.AbstractConnector Ignoring deprecated socket close linger time
   [junit4]   2> 900026 INFO  (closeThreadPool-4073-thread-3) [    ] o.a.s.c.s.e.JettySolrRunner Start Jetty (original configured port=0)
   [junit4]   2> 900026 INFO  (closeThreadPool-4073-thread-3) [    ] o.a.s.c.s.e.JettySolrRunner Trying to start Jetty on port 0 try number 1 ...
   [junit4]   2> 900027 INFO  (closeThreadPool-4073-thread-3) [    ] o.e.j.s.Server jetty-9.4.14.v20181114; built: 2018-11-14T21:20:31.478Z; git: c4550056e785fb5665914545889f21dc136ad9e6; jvm 1.8.0_172-b11
   [junit4]   2> 900128 INFO  (closeThreadPool-4073-thread-3) [    ] o.e.j.s.session DefaultSessionIdManager workerName=node0
   [junit4]   2> 900128 INFO  (closeThreadPool-4073-thread-3) [    ] o.e.j.s.session No SessionScavenger set, using defaults
   [junit4]   2> 900128 INFO  (closeThreadPool-4073-thread-3) [    ] o.e.j.s.session node0 Scavenging every 600000ms
   [junit4]   2> 900136 INFO  (TEST-TestDynamicLoading.testDynamicLoading-seed#[F72592B91C0F93E9]) [    ] o.a.s.c.AbstractFullDistribZkTestBase create jetty 4 in directory /home/jenkins/workspace/Lucene-Solr-master-Linux/solr/build/solr-core/test/J1/temp/solr.core.TestDynamicLoading_F72592B91C0F93E9-001/shard-4-001 of type NRT
   [junit4]   2> 900138 INFO  (closeThreadPool-4073-thread-3) [    ] o.e.j.s.h.ContextHandler Started o.e.j.s.ServletContextHandler@1303979{/,null,AVAILABLE}
   [junit4]   2> 900139 WARN  (closeThreadPool-4073-thread-3) [    ] o.e.j.u.s.S.config No Client EndPointIdentificationAlgorithm configured for SslContextFactory@ba2599[provider=null,keyStore=null,trustStore=null]
   [junit4]   2> 900144 INFO  (closeThreadPool-4073-thread-3) [    ] o.e.j.s.AbstractConnector Started ServerConnector@8b6425{SSL,[ssl, http/1.1]}{127.0.0.1:45251}
   [junit4]   2> 900145 INFO  (closeThreadPool-4073-thread-3) [    ] o.e.j.s.Server Started @900181ms
   [junit4]   2> 900145 INFO  (closeThreadPool-4073-thread-3) [    ] o.a.s.c.s.e.JettySolrRunner Jetty properties: {solr.data.dir=/home/jenkins/workspace/Lucene-Solr-master-Linux/solr/build/solr-core/test/J1/temp/solr.core.TestDynamicLoading_F72592B91C0F93E9-001/tempDir-001/jetty3, replicaType=NRT, solrconfig=solrconfig.xml, hostContext=/, hostPort=45251, coreRootDirectory=/home/jenkins/workspace/Lucene-Solr-master-Linux/solr/build/solr-core/test/J1/../../../../../../../../../home/jenkins/workspace/Lucene-Solr-master-Linux/solr/build/solr-core/test/J1/temp/solr.core.TestDynamicLoading_F72592B91C0F93E9-001/shard-3-001/cores}
   [junit4]   2> 900145 ERROR (closeThreadPool-4073-thread-3) [    ] o.a.s.u.StartupLoggingUtils Missing Java Option solr.log.dir. Logging may be missing or incomplete.
   [junit4]   2> 900145 INFO  (closeThreadPool-4073-thread-3) [    ] o.a.s.s.SolrDispatchFilter Using logger factory org.apache.logging.slf4j.Log4jLoggerFactory
   [junit4]   2> 900145 INFO  (closeThreadPool-4073-thread-3) [    ] o.a.s.s.SolrDispatchFilter  ___      _       Welcome to Apache Solr™ version 8.0.0
   [junit4]   2> 900145 INFO  (closeThreadPool-4073-thread-3) [    ] o.a.s.s.SolrDispatchFilter / __| ___| |_ _   Starting in cloud mode on port null
   [junit4]   2> 900145 INFO  (closeThreadPool-4073-thread-3) [    ] o.a.s.s.SolrDispatchFilter \__ \/ _ \ | '_|  Install dir: null
   [junit4]   2> 900145 INFO  (closeThreadPool-4073-thread-3) [    ] o.a.s.s.SolrDispatchFilter |___/\___/_|_|    Start time: 2019-01-01T19:25:11.900Z
   [junit4]   2> 900146 WARN  (closeThreadPool-4073-thread-4) [    ] o.e.j.s.AbstractConnector Ignoring deprecated socket close linger time
   [junit4]   2> 900152 INFO  (closeThreadPool-4073-thread-4) [    ] o.a.s.c.s.e.JettySolrRunner Start Jetty (original configured port=0)
   [junit4]   2> 900153 INFO  (closeThreadPool-4073-thread-4) [    ] o.a.s.c.s.e.JettySolrRunner Trying to start Jetty on port 0 try number 1 ...
   [junit4]   2> 900153 INFO  (closeThreadPool-4073-thread-4) [    ] o.e.j.s.Server jetty-9.4.14.v20181114; built: 2018-11-14T21:20:31.478Z; git: c4550056e785fb5665914545889f21dc136ad9e6; jvm 1.8.0_172-b11
   [junit4]   2> 900162 INFO  (zkConnectionManagerCallback-4079-thread-1) [    ] o.a.s.c.c.ConnectionManager zkClient has connected
   [junit4]   2> 900180 INFO  (closeThreadPool-4073-thread-3) [    ] o.a.s.s.SolrDispatchFilter Loading solr.xml from SolrHome (not found in ZooKeeper)
   [junit4]   2> 900180 INFO  (closeThreadPool-4073-thread-3) [    ] o.a.s.c.SolrXmlConfig Loading container configuration from /home/jenkins/workspace/Lucene-Solr-master-Linux/solr/build/solr-core/test/J1/temp/solr.core.TestDynamicLoading_F72592B91C0F93E9-001/shard-3-001/solr.xml
   [junit4]   2> 900186 INFO  (closeThreadPool-4073-thread-3) [    ] o.a.s.c.SolrXmlConfig Configuration parameter autoReplicaFailoverWorkLoopDelay is ignored
   [junit4]   2> 900186 INFO  (closeThreadPool-4073-thread-3) [    ] o.a.s.c.SolrXmlConfig Configuration parameter autoReplicaFailoverBadNodeExpiration is ignored
   [junit4]   2> 900188 INFO  (closeThreadPool-4073-thread-3) [    ] o.a.s.c.SolrXmlConfig MBean server found: com.sun.jmx.mbeanserver.JmxMBeanServer@10ffe0, but no JMX reporters were configured - adding default JMX reporter.
   [junit4]   2> 900192 INFO  (closeThreadPool-4073-thread-4) [    ] o.e.j.s.session DefaultSessionIdManager workerName=node0
   [junit4]   2> 900192 INFO  (closeThreadPool-4073-thread-4) [    ] o.e.j.s.session No SessionScavenger set, using defaults
   [junit4]   2> 900192 INFO  (closeThreadPool-4073-thread-4) [    ] o.e.j.s.session node0 Scavenging every 600000ms
   [junit4]   2> 900204 INFO  (closeThreadPool-4073-thread-4) [    ] o.e.j.s.h.ContextHandler Started o.e.j.s.ServletContextHandler@1c2c310{/,null,AVAILABLE}
   [junit4]   2> 900205 WARN  (closeThreadPool-4073-thread-4) [    ] o.e.j.u.s.S.config No Client EndPointIdentificationAlgorithm configured for SslContextFactory@9fa9fc[provider=null,keyStore=null,trustStore=null]
   [junit4]   2> 900206 INFO  (closeThreadPool-4073-thread-4) [    ] o.e.j.s.AbstractConnector Started ServerConnector@187d4c6{SSL,[ssl, http/1.1]}{127.0.0.1:46185}
   [junit4]   2> 900206 INFO  (closeThreadPool-4073-thread-4) [    ] o.e.j.s.Server Started @900242ms
   [junit4]   2> 900206 INFO  (closeThreadPool-4073-thread-4) [    ] o.a.s.c.s.e.JettySolrRunner Jetty properties: {solr.data.dir=/home/jenkins/workspace/Lucene-Solr-master-Linux/solr/build/solr-core/test/J1/temp/solr.core.TestDynamicLoading_F72592B91C0F93E9-001/tempDir-001/jetty4, replicaType=NRT, solrconfig=solrconfig.xml, hostContext=/, hostPort=46185, coreRootDirectory=/home/jenkins/workspace/Lucene-Solr-master-Linux/solr/build/solr-core/test/J1/../../../../../../../../../home/jenkins/workspace/Lucene-Solr-master-Linux/solr/build/solr-core/test/J1/temp/solr.core.TestDynamicLoading_F72592B91C0F93E9-001/shard-4-001/cores}
   [junit4]   2> 900206 ERROR (closeThreadPool-4073-thread-4) [    ] o.a.s.u.StartupLoggingUtils Missing Java Option solr.log.dir. Logging may be missing or incomplete.
   [junit4]   2> 900206 INFO  (closeThreadPool-4073-thread-4) [    ] o.a.s.s.SolrDispatchFilter Using logger factory org.apache.logging.slf4j.Log4jLoggerFactory
   [junit4]   2> 900206 INFO  (closeThreadPool-4073-thread-4) [    ] o.a.s.s.SolrDispatchFilter  ___      _       Welcome to Apache Solr™ version 8.0.0
   [junit4]   2> 900206 INFO  (closeThreadPool-4073-thread-4) [    ] o.a.s.s.SolrDispatchFilter / __| ___| |_ _   Starting in cloud mode on port null
   [junit4]   2> 900206 INFO  (closeThreadPool-4073-thread-4) [    ] o.a.s.s.SolrDispatchFilter \__ \/ _ \ | '_|  Install dir: null
   [junit4]   2> 900206 INFO  (closeThreadPool-4073-thread-4) [    ] o.a.s.s.SolrDispatchFilter |___/\___/_|_|    Start time: 2019-01-01T19:25:11.961Z
   [junit4]   2> 900220 INFO  (zkConnectionManagerCallback-4081-thread-1) [    ] o.a.s.c.c.ConnectionManager zkClient has connected
   [junit4]   2> 900221 INFO  (closeThreadPool-4073-thread-4) [    ] o.a.s.s.SolrDispatchFilter Loading solr.xml from SolrHome (not found in ZooKeeper)
   [junit4]   2> 900221 INFO  (closeThreadPool-4073-thread-4) [    ] o.a.s.c.SolrXmlConfig Loading container configuration from /home/jenkins/workspace/Lucene-Solr-master-Linux/solr/build/solr-core/test/J1/temp/solr.core.TestDynamicLoading_F72592B91C0F93E9-001/shard-4-001/solr.xml
   [junit4]   2> 900225 INFO  (closeThreadPool-4073-thread-4) [    ] o.a.s.c.SolrXmlConfig Configuration parameter autoReplicaFailoverWorkLoopDelay is ignored
   [junit4]   2> 900225 INFO  (closeThreadPool-4073-thread-4) [    ] o.a.s.c.SolrXmlConfig Configuration parameter autoReplicaFailoverBadNodeExpiration is ignored
   [junit4]   2> 900227 INFO  (closeThreadPool-4073-thread-4) [    ] o.a.s.c.SolrXmlConfig MBean server found: com.sun.jmx.mbeanserver.JmxMBeanServer@10ffe0, but no JMX reporters were configured - adding default JMX reporter.
   [junit4]   2> 900683 WARN  (closeThreadPool-4073-thread-1) [    ] o.a.s.c.s.i.Http2SolrClient Create Http2SolrClient with HTTP/1.1 transport since Java 8 or lower versions does not support SSL + HTTP/2
   [junit4]   2> 900684 WARN  (closeThreadPool-4073-thread-1) [    ] o.e.j.u.s.S.config No Client EndPointIdentificationAlgorithm configured for SslContextFactory@6cc786[provider=null,keyStore=null,trustStore=null]
   [junit4]   2> 900697 WARN  (closeThreadPool-4073-thread-1) [    ] o.a.s.c.s.i.Http2SolrClient Create Http2SolrClient with HTTP/1.1 transport since Java 8 or lower versions does not support SSL + HTTP/2
   [junit4]   2> 900700 WARN  (closeThreadPool-4073-thread-1) [    ] o.e.j.u.s.S.config No Client EndPointIdentificationAlgorithm configured for SslContextFactory@5b5ca7[provider=null,keyStore=null,trustStore=null]
   [junit4]   2> 900702 INFO  (closeThreadPool-4073-thread-1) [    ] o.a.s.c.ZkContainer Zookeeper client=127.0.0.1:39051/solr
   [junit4]   2> 900711 INFO  (zkConnectionManagerCallback-4087-thread-1) [    ] o.a.s.c.c.ConnectionManager zkClient has connected
   [junit4]   2> 900724 INFO  (zkConnectionManagerCallback-4089-thread-1) [    ] o.a.s.c.c.ConnectionManager zkClient has connected
   [junit4]   2> 900730 INFO  (closeThreadPool-4073-thread-1) [n:127.0.0.1:38777_    ] o.a.s.c.c.ZkStateReader Updated live nodes from ZooKeeper... (0) -> (1)
   [junit4]   2> 900735 INFO  (closeThreadPool-4073-thread-1) [n:127.0.0.1:38777_    ] o.a.s.c.ZkController Publish node=127.0.0.1:38777_ as DOWN
   [junit4]   2> 900735 INFO  (closeThreadPool-4073-thread-1) [n:127.0.0.1:38777_    ] o.a.s.c.TransientSolrCoreCacheDefault Allocating transient cache for 4 transient cores
   [junit4]   2> 900735 INFO  (closeThreadPool-4073-thread-1) [n:127.0.0.1:38777_    ] o.a.s.c.ZkController Register node as live in ZooKeeper:/live_nodes/127.0.0.1:38777_
   [junit4]   2> 900737 INFO  (zkCallback-4053-thread-1) [    ] o.a.s.c.c.ZkStateReader Updated live nodes from ZooKeeper... (1) -> (2)
   [junit4]   2> 900744 INFO  (zkCallback-4060-thread-1) [    ] o.a.s.c.c.ZkStateReader Updated live nodes from ZooKeeper... (1) -> (2)
   [junit4]   2> 900745 INFO  (zkCallback-4071-thread-1) [    ] o.a.s.c.c.ZkStateReader Updated live nodes from ZooKeeper... (1) -> (2)
   [junit4]   2> 900757 INFO  (zkCallback-4088-thread-1) [    ] o.a.s.c.c.ZkStateReader Updated live nodes from ZooKeeper... (1) -> (2)
   [junit4]   2> 900780 INFO  (zkConnectionManagerCallback-4096-thread-1) [    ] o.a.s.c.c.ConnectionManager zkClient has connected
   [junit4]   2> 900781 INFO  (closeThreadPool-4073-thread-1) [n:127.0.0.1:38777_    ] o.a.s.c.c.ZkStateReader Updated live nodes from ZooKeeper... (0) -> (2)
   [junit4]   2> 900782 INFO  (closeThreadPool-4073-thread-1) [n:127.0.0.1:38777_    ] o.a.s.c.s.i.ZkClientClusterStateProvider Cluster at 127.0.0.1:39051/solr ready
   [junit4]   2> 900785 INFO  (closeThreadPool-4073-thread-1) [n:127.0.0.1:38777_    ] o.a.s.h.a.MetricsHistoryHandler No .system collection, keeping metrics history in memory.
   [junit4]   2> 900809 INFO  (closeThreadPool-4073-thread-1) [n:127.0.0.1:38777_    ] o.a.s.m.r.SolrJmxReporter JMX monitoring for 'solr.node' (registry 'solr.node') enabled at server: com.sun.jmx.mbeanserver.JmxMBeanServer@10ffe0
   [junit4]   2> 900826 INFO  (closeThreadPool-4073-thread-1) [n:127.0.0.1:38777_    ] o.a.s.m.r.SolrJmxReporter JMX monitoring for 'solr.jvm' (registry 'solr.jvm') enabled at server: com.sun.jmx.mbeanserver.JmxMBeanServer@10ffe0
   [junit4]   2> 900826 INFO  (closeThreadPool-4073-thread-1) [n:127.0.0.1:38777_    ] o.a.s.m.r.SolrJmxReporter JMX monitoring for 'solr.jetty' (registry 'solr.jetty') enabled at server: com.sun.jmx.mbeanserver.JmxMBeanServer@10ffe0
   [junit4]   2> 900827 INFO  (closeThreadPool-4073-thread-1) [n:127.0.0.1:38777_    ] o.a.s.c.CorePropertiesLocator Found 0 core definitions underneath /home/jenkins/workspace/Lucene-Solr-master-Linux/solr/build/solr-core/test/J1/../../../../../../../../../home/jenkins/workspace/Lucene-Solr-master-Linux/solr/build/solr-core/test/J1/temp/solr.core.TestDynamicLoading_F72592B91C0F93E9-001/shard-1-001/cores
   [junit4]   2> 900908 WARN  (closeThreadPool-4073-thread-2) [    ] o.a.s.c.s.i.Http2SolrClient Create Http2SolrClient with HTTP/1.1 transport since Java 8 or lower versions does not support SSL + HTTP/2
   [junit4]   2> 900910 WARN  (closeThreadPool-4073-thread-2) [    ] o.e.j.u.s.S.config No Client EndPointIdentificationAlgorithm configured for SslContextFactory@114c8d6[provider=null,keyStore=null,trustStore=null]
   [junit4]   2> 900914 WARN  (closeThreadPool-4073-thread-2) [    ] o.a.s.c.s.i.Http2SolrClient Create Http2SolrClient with HTTP/1.1 transport since Java 8 or lower versions does not support SSL + HTTP/2
   [junit4]   2> 900916 WARN  (closeThreadPool-4073-thread-2) [    ] o.e.j.u.s.S.config No Client EndPointIdentificationAlgorithm configured for SslContextFactory@1ec83dd[provider=null,keyStore=null,trustStore=null]
   [junit4]   2> 900917 INFO  (closeThreadPool-4073-thread-2) [    ] o.a.s.c.ZkContainer Zookeeper client=127.0.0.1:39051/solr
   [junit4]   2> 900924 INFO  (zkConnectionManagerCallback-4103-thread-1) [    ] o.a.s.c.c.ConnectionManager zkClient has connected
   [junit4]   2> 900928 INFO  (zkConnectionManagerCallback-4105-thread-1) [    ] o.a.s.c.c.ConnectionManager zkClient has connected
   [junit4]   2> 900931 INFO  (closeThreadPool-4073-thread-2) [n:127.0.0.1:42311_    ] o.a.s.c.c.ZkStateReader Updated live nodes from ZooKeeper... (0) -> (2)
   [junit4]   2> 900934 INFO  (closeThreadPool-4073-thread-2) [n:127.0.0.1:42311_    ] o.a.s.c.ZkController Publish node=127.0.0.1:42311_ as DOWN
   [junit4]   2> 900934 INFO  (closeThreadPool-4073-thread-2) [n:127.0.0.1:42311_    ] o.a.s.c.TransientSolrCoreCacheDefault Allocating transient cache for 4 transient cores
   [junit4]   2> 900934 INFO  (closeThreadPool-4073-thread-2) [n:127.0.0.1:42311_    ] o.a.s.c.ZkController Register node as live in ZooKeeper:/live_nodes/127.0.0.1:42311_
   [junit4]   2> 900935 INFO  (zkCallback-4053-thread-1) [    ] o.a.s.c.c.ZkStateReader Updated live nodes from ZooKeeper... (2) -> (3)
   [junit4]   2> 900935 INFO  (zkCallback-4060-thread-1) [    ] o.a.s.c.c.ZkStateReader Updated live nodes from ZooKeeper... (2) -> (3)
   [junit4]   2> 900936 INFO  (zkCallback-4104-thread-1) [    ] o.a.s.c.c.ZkStateReader Updated live nodes from ZooKeeper... (2) -> (3)
   [junit4]   2> 900936 INFO  (zkCallback-4088-thread-1) [    ] o.a.s.c.c.ZkStateReader Updated live nodes from ZooKeeper... (2) -> (3)
   [junit4]   2> 900936 INFO  (zkCallback-4095-thread-1) [    ] o.a.s.c.c.ZkStateReader Updated live nodes from ZooKeeper... (2) -> (3)
   [junit4]   2> 900936 INFO  (zkCallback-4071-thread-1) [    ] o.a.s.c.c.ZkStateReader Updated live nodes from ZooKeeper... (2) -> (3)
   [junit4]   2> 900957 INFO  (zkConnectionManagerCallback-4112-thread-1) [    ] o.a.s.c.c.ConnectionManager zkClient has connected
   [junit4]   2> 900958 INFO  (closeThreadPool-4073-thread-2) [n:127.0.0.1:42311_    ] o.a.s.c.c.ZkStateReader Updated live nodes from ZooKeeper... (0) -> (3)
   [junit4]   2> 900959 INFO  (closeThreadPool-4073-thread-2) [n:127.0.0.1:42311_    ] o.a.s.c.s.i.ZkClientClusterStateProvider Cluster at 127.0.0.1:39051/solr ready
   [junit4]   2> 900959 INFO  (closeThreadPool-4073-thread-2) [n:127.0.0.1:42311_    ] o.a.s.h.a.MetricsHistoryHandler No .system collection, keeping metrics history in memory.
   [junit4]   2> 900976 INFO  (closeThreadPool-4073-thread-2) [n:127.0.0.1:42311_    ] o.a.s.m.r.SolrJmxReporter JMX monitoring for 'solr.node' (registry 'solr.node') enabled at server: com.sun.jmx.mbeanserver.JmxMBeanServer@10ffe0
   [junit4]   2> 900987 WARN  (closeThreadPool-4073-thread-3) [    ] o.a.s.c.s.i.Http2SolrClient Create Http2SolrClient with HTTP/1.1 transport since Java 8 or lower versions does not support SSL + HTTP/2
   [junit4]   2> 900988 WARN  (closeThreadPool-4073-thread-3) [    ] o.e.j.u.s.S.config No Client EndPointIdentificationAlgorithm configured for SslContextFactory@164ebde[provider=null,keyStore=null,trustStore=null]
   [junit4]   2> 900990 WARN  (closeThreadPool-4073-thread-3) [    ] o.a.s.c.s.i.Http2SolrClient Create Http2SolrClient with HTTP/1.1 transport since Java 8 or lower versions does not support SSL + HTTP/2
   [junit4]   2> 900991 WARN  (closeThreadPool-4073-thread-3) [    ] o.e.j.u.s.S.config No Client EndPointIdentificationAlgorithm configured for SslContextFactory@422315[provider=null,keyStore=null,trustStore=null]
   [junit4]   2> 900992 INFO  (closeThreadPool-4073-thread-2) [n:127.0.0.1:42311_    ] o.a.s.m.r.SolrJmxReporter JMX monitoring for 'solr.jvm' (registry 'solr.jvm') enabled at server: com.sun.jmx.mbeanserver.JmxMBeanServer@10ffe0
   [junit4]   2> 900992 INFO  (closeThreadPool-4073-thread-3) [    ] o.a.s.c.ZkContainer Zookeeper client=127.0.0.1:39051/solr
   [junit4]   2> 900992 INFO  (closeThreadPool-4073-thread-2) [n:127.0.0.1:42311_    ] o.a.s.m.r.SolrJmxReporter JMX monitoring for 'solr.jetty' (registry 'solr.jetty') enabled at server: com.sun.jmx.mbeanserver.JmxMBeanServer@10ffe0
   [junit4]   2> 900993 INFO  (closeThreadPool-4073-thread-2) [n:127.0.0.1:42311_    ] o.a.s.c.CorePropertiesLocator Found 0 core definitions underneath /home/jenkins/workspace/Lucene-Solr-master-Linux/solr/build/solr-core/test/J1/../../../../../../../../../home/jenkins/workspace/Lucene-Solr-master-Linux/solr/build/solr-core/test/J1/temp/solr.core.TestDynamicLoading_F72592B91C0F93E9-001/shard-2-001/cores
   [junit4]   2> 900996 INFO  (zkConnectionManagerCallback-4119-thread-1) [    ] o.a.s.c.c.ConnectionManager zkClient has connected
   [junit4]   2> 901006 INFO  (zkConnectionManagerCallback-4121-thread-1) [    ] o.a.s.c.c.ConnectionManager zkClient has connected
   [junit4]   2> 901010 INFO  (closeThreadPool-4073-thread-3) [n:127.0.0.1:45251_    ] o.a.s.c.c.ZkStateReader Updated live nodes from ZooKeeper... (0) -> (3)
   [junit4]   2> 901013 INFO  (closeThreadPool-4073-thread-3) [n:127.0.0.1:45251_    ] o.a.s.c.ZkController Publish node=127.0.0.1:45251_ as DOWN
   [junit4]   2> 901013 INFO  (closeThreadPool-4073-thread-3) [n:127.0.0.1:45251_    ] o.a.s.c.TransientSolrCoreCacheDefault Allocating transient cache for 4 transient cores
   [junit4]   2> 901013 INFO  (closeThreadPool-4073-thread-3) [n:127.0.0.1:45251_    ] o.a.s.c.ZkController Register node as live in ZooKeeper:/live_nodes/127.0.0.1:45251_
   [junit4]   2> 901014 INFO  (zkCallback-4104-thread-1) [    ] o.a.s.c.c.ZkStateReader Updated live nodes from ZooKeeper... (3) -> (4)
   [junit4]   2> 901014 INFO  (zkCallback-4060-thread-1) [    ] o.a.s.c.c.ZkStateReader Updated live nodes from ZooKeeper... (3) -> (4)
   [junit4]   2> 901014 INFO  (zkCallback-4095-thread-1) [    ] o.a.s.c.c.ZkStateReader Updated live nodes from ZooKeeper... (3) -> (4)
   [junit4]   2> 901015 INFO  (zkCallback-4071-thread-1) [    ] o.a.s.c.c.ZkStateReader Updated live nodes from ZooKeeper... (3) -> (4)
   [junit4]   2> 901015 INFO  (zkCallback-4088-thread-1) [    ] o.a.s.c.c.ZkStateReader Updated live nodes from ZooKeeper... (3) -> (4)
   [junit4]   2> 901015 INFO  (zkCallback-4053-thread-1) [    ] o.a.s.c.c.ZkStateReader Updated live nodes from ZooKeeper... (3) -> (4)
   [junit4]   2> 901016 INFO  (zkCallback-4120-thread-1) [    ] o.a.s.c.c.ZkStateReader Updated live nodes from ZooKeeper... (3) -> (4)
   [junit4]   2> 901016 INFO  (zkCallback-4111-thread-1) [    ] o.a.s.c.c.ZkStateReader Updated live nodes from ZooKeeper... (3) -> (4)
   [junit4]   2> 901068 INFO  (zkConnectionManagerCallback-4128-thread-1) [    ] o.a.s.c.c.ConnectionManager zkClient has connected
   [junit4]   2> 901069 INFO  (closeThreadPool-4073-thread-3) [n:127.0.0.1:45251_    ] o.a.s.c.c.ZkStateReader Updated live nodes from ZooKeeper... (0) -> (4)
   [junit4]   2> 901070 INFO  (closeThreadPool-4073-thread-3) [n:127.0.0.1:45251_    ] o.a.s.c.s.i.ZkClientClusterStateProvider Cluster at 127.0.0.1:39051/solr ready
   [junit4]   2> 901072 INFO  (closeThreadPool-4073-thread-3) [n:127.0.0.1:45251_    ] o.a.s.h.a.MetricsHistoryHandler No .system collection, keeping metrics history in memory.
   [junit4]   2> 901098 INFO  (closeThreadPool-4073-thread-3) [n:127.0.0.1:45251_    ] o.a.s.m.r.SolrJmxReporter JMX monitoring for 'solr.node' (registry 'solr.node') enabled at server: com.sun.jmx.mbeanserver.JmxMBeanServer@10ffe0
   [junit4]   2> 901109 INFO  (closeThreadPool-4073-thread-3) [n:127.0.0.1:45251_    ] o.a.s.m.r.SolrJmxReporter JMX monitoring for 'solr.jvm' (registry 'solr.jvm') enabled at server: com.sun.jmx.mbeanserver.JmxMBeanServer@10ffe0
   [junit4]   2> 901109 INFO  (closeThreadPool-4073-thread-3) [n:127.0.0.1:45251_    ] o.a.s.m.r.SolrJmxReporter JMX monitoring for 'solr.jetty' (registry 'solr.jetty') enabled at server: com.sun.jmx.mbeanserver.JmxMBeanServer@10ffe0
   [junit4]   2> 901110 INFO  (closeThreadPool-4073-thread-3) [n:127.0.0.1:45251_    ] o.a.s.c.CorePropertiesLocator Found 0 core definitions underneath /home/jenkins/workspace/Lucene-Solr-master-Linux/solr/build/solr-core/test/J1/../../../../../../../../../home/jenkins/workspace/Lucene-Solr-master-Linux/solr/build/solr-core/test/J1/temp/solr.core.TestDynamicLoading_F72592B91C0F93E9-001/shard-3-001/cores
   [junit4]   2> 901476 INFO  (OverseerCollectionConfigSetProcessor-72143314243878917-127.0.0.1:40483_-n_0000000000) [n:127.0.0.1:40483_    ] o.a.s.c.OverseerTaskQueue Response ZK path: /overseer/collection-queue-work/qnr-0000000002 doesn't exist.  Requestor may have disconnected from ZooKeeper
   [junit4]   2> 902261 WARN  (closeThreadPool-4073-thread-4) [    ] o.a.s.c.s.i.Http2SolrClient Create Http2SolrClient with HTTP/1.1 transport since Java 8 or lower versions does not support SSL + HTTP/2
   [junit4]   2> 902264 WARN  (closeThreadPool-4073-thread-4) [    ] o.e.j.u.s.S.config No Client EndPointIdentificationAlgorithm configured for SslContextFactory@1931e09[provider=null,keyStore=null,trustStore=null]
   [junit4]   2> 902267 WARN  (closeThreadPool-4073-thread-4) [    ] o.a.s.c.s.i.Http2SolrClient Create Http2SolrClient with HTTP/1.1 transport since Java 8 or lower versions does not support SSL + HTTP/2
   [junit4]   2> 902268 WARN  (closeThreadPool-4073-thread-4) [    ] o.e.j.u.s.S.config No Client EndPointIdentificationAlgorithm configured for SslContextFactory@12eea5e[provider=null,keyStore=null,trustStore=null]
   [junit4]   2> 902269 INFO  (closeThreadPool-4073-thread-4) [    ] o.a.s.c.ZkContainer Zookeeper client=127.0.0.1:39051/solr
   [junit4]   2> 902271 INFO  (zkConnectionManagerCallback-4135-thread-1) [    ] o.a.s.c.c.ConnectionManager zkClient has connected
   [junit4]   2> 902275 INFO  (zkConnectionManagerCallback-4137-thread-1) [    ] o.a.s.c.c.ConnectionManager zkClient has connected
   [junit4]   2> 902278 INFO  (closeThreadPool-4073-thread-4) [n:127.0.0.1:46185_    ] o.a.s.c.c.ZkStateReader Updated live nodes from ZooKeeper... (0) -> (4)
   [junit4]   2> 902281 INFO  (closeThreadPool-4073-thread-4) [n:127.0.0.1:46185_    ] o.a.s.c.ZkController Publish node=127.0.0.1:46185_ as DOWN
   [junit4]   2> 902281 INFO  (closeThreadPool-4073-thread-4) [n:127.0.0.1:46185_    ] o.a.s.c.TransientSolrCoreCacheDefault Allocating transient cache for 4 transient cores
   [junit4]   2> 902281 INFO  (closeThreadPool-4073-thread-4) [n:127.0.0.1:46185_    ] o.a.s.c.ZkController Register node as live in ZooKeeper:/live_nodes/127.0.0.1:46185_
   [junit4]   2> 902282 INFO  (zkCallback-4060-thread-1) [    ] o.a.s.c.c.ZkStateReader Updated live nodes from ZooKeeper... (4) -> (5)
   [junit4]   2> 902282 INFO  (zkCallback-4111-thread-1) [    ] o.a.s.c.c.ZkStateReader Updated live nodes from ZooKeeper... (4) -> (5)
   [junit4]   2> 902282 INFO  (zkCallback-4088-thread-1) [    ] o.a.s.c.c.ZkStateReader Updated live nodes from ZooKeeper... (4) -> (5)
   [junit4]   2> 902282 INFO  (zkCallback-4104-thread-1) [    ] o.a.s.c.c.ZkStateReader Updated live nodes from ZooKeeper... (4) -> (5)
   [junit4]   2> 902282 INFO  (zkCallback-4053-thread-1) [    ] o.a.s.c.c.ZkStateReader Updated live nodes from ZooKeeper... (4) -> (5)
   [junit4]   2> 902282 INFO  (zkCallback-4120-thread-1) [    ] o.a.s.c.c.ZkStateReader Updated live nodes from ZooKeeper... (4) -> (5)
   [junit4]   2> 902282 INFO  (zkCallback-4095-thread-1) [    ] o.a.s.c.c.ZkStateReader Updated live nodes from ZooKeeper... (4) -> (5)
   [junit4]   2> 902284 INFO  (zkCallback-4071-thread-1) [    ] o.a.s.c.c.ZkStateReader Updated live nodes from ZooKeeper... (4) -> (5)
   [junit4]   2> 902288 INFO  (zkCallback-4136-thread-1) [    ] o.a.s.c.c.ZkStateReader Updated live nodes from ZooKeeper... (4) -> (5)
   [junit4]   2> 902288 INFO  (zkCallback-4127-thread-1) [    ] o.a.s.c.c.ZkStateReader Updated live nodes from ZooKeeper... (4) -> (5)
   [junit4]   2> 902299 INFO  (zkConnectionManagerCallback-4144-thread-1) [    ] o.a.s.c.c.ConnectionManager zkClient has connected
   [junit4]   2> 902300 INFO  (closeThreadPool-4073-thread-4) [n:127.0.0.1:46185_    ] o.a.s.c.c.ZkStateReader Updated live nodes from ZooKeeper... (0) -> (5)
   [junit4]   2> 902300 INFO  (closeThreadPool-4073-thread-4) [n:127.0.0.1:46185_    ] o.a.s.c.s.i.ZkClientClusterStateProvider Cluster at 127.0.0.1:39051/solr ready
   [junit4]   2> 902302 INFO  (closeThreadPool-4073-thread-4) [n:127.0.0.1:46185_    ] o.a.s.h.a.MetricsHistoryHandler No .system collection, keeping metrics history in memory.
   [junit4]   2> 902329 INFO  (closeThreadPool-4073-thread-4) [n:127.0.0.1:46185_    ] o.a.s.m.r.SolrJmxReporter JMX monitoring for 'solr.node' (registry 'solr.node') enabled at server: com.sun.jmx.mbeanserver.JmxMBeanServer@10ffe0
   [junit4]   2> 902345 INFO  (closeThreadPool-4073-thread-4) [n:127.0.0.1:46185_    ] o.a.s.m.r.SolrJmxReporter JMX monitoring for 'solr.jvm' (registry 'solr.jvm') enabled at server: com.sun.jmx.mbeanserver.JmxMBeanServer@10ffe0
   [junit4]   2> 902345 INFO  (closeThreadPool-4073-thread-4) [n:127.0.0.1:46185_    ] o.a.s.m.r.SolrJmxReporter JMX monitoring for 'solr.jetty' (registry 'solr.jetty') enabled at server: com.sun.jmx.mbeanserver.JmxMBeanServer@10ffe0
   [junit4]   2> 902346 INFO  (closeThreadPool-4073-thread-4) [n:127.0.0.1:46185_    ] o.a.s.c.CorePropertiesLocator Found 0 core definitions underneath /home/jenkins/workspace/Lucene-Solr-master-Linux/solr/build/solr-core/test/J1/../../../../../../../../../home/jenkins/workspace/Lucene-Solr-master-Linux/solr/build/solr-core/test/J1/temp/solr.core.TestDynamicLoading_F72592B91C0F93E9-001/shard-4-001/cores
   [junit4]   2> 902518 INFO  (qtp15108755-12012) [n:127.0.0.1:38777_    ] o.a.s.h.a.CollectionsHandler Invoked Collection Action :addreplica with params node=127.0.0.1:42311_&action=ADDREPLICA&collection=collection1&shard=shard1&type=NRT&wt=javabin&version=2 and sendToOCPQueue=true
   [junit4]   2> 902531 INFO  (qtp15108755-12011) [n:127.0.0.1:38777_    ] o.a.s.h.a.CollectionsHandler Invoked Collection Action :addreplica with params node=127.0.0.1:45251_&action=ADDREPLICA&collection=collection1&shard=shard2&type=NRT&wt=javabin&version=2 and sendToOCPQueue=true
   [junit4]   2> 902533 INFO  (qtp15108755-11870) [n:127.0.0.1:38777_    ] o.a.s.h.a.CollectionsHandler Invoked Collection Action :addreplica with params node=127.0.0.1:38777_&action=ADDREPLICA&collection=collection1&shard=shard2&type=NRT&wt=javabin&version=2 and sendToOCPQueue=true
   [junit4]   2> 902534 INFO  (qtp15108755-11868) [n:127.0.0.1:38777_    ] o.a.s.s.HttpSolrCall [admin] webapp=null path=/admin/metrics params={prefix=CONTAINER.fs.usableSpace,CONTAINER.fs.totalSpace,CORE.coreName&wt=javabin&version=2&group=solr.node,solr.core} status=0 QTime=2
   [junit4]   2> 902536 INFO  (qtp15108755-11869) [n:127.0.0.1:38777_    ] o.a.s.s.HttpSolrCall [admin] webapp=null path=/admin/metrics params={prefix=CONTAINER.fs.usableSpace,CONTAINER.fs.totalSpace,CORE.coreName&wt=javabin&version=2&group=solr.node,solr.core} status=0 QTime=0
   [junit4]   2> 902541 INFO  (qtp15108755-12015) [n:127.0.0.1:38777_    ] o.a.s.h.a.CollectionsHandler Invoked Collection Action :addreplica with params node=127.0.0.1:46185_&action=ADDREPLICA&collection=collection1&shard=shard1&type=NRT&wt=javabin&version=2 and sendToOCPQueue=true
   [junit4]   2> 902541 INFO  (qtp15108755-11869) [n:127.0.0.1:38777_    ] o.a.s.s.HttpSolrCall [admin] webapp=null path=/admin/metrics params={prefix=CONTAINER.fs.usableSpace,CONTAINER.fs.totalSpace,CORE.coreName&wt=javabin&version=2&group=solr.node,solr.core} status=0 QTime=1
   [junit4]   2> 902543 INFO  (qtp15108755-11868) [n:127.0.0.1:38777_    ] o.a.s.s.HttpSolrCall [admin] webapp=null path=/admin/metrics params={prefix=CONTAINER.fs.usableSpace,CONTAINER.fs.totalSpace,CORE.coreName&wt=javabin&version=2&group=solr.node,solr.core} status=0 QTime=0
   [junit4]   2> 902545 INFO  (qtp15108755-11869) [n:127.0.0.1:38777_    ] o.a.s.s.HttpSolrCall [admin] webapp=null path=/admin/metrics params={prefix=CONTAINER.fs.usableSpace,CONTAINER.fs.totalSpace,CORE.coreName&wt=javabin&version=2&group=solr.node,solr.core} status=0 QTime=0
   [junit4]   2> 902548 INFO  (qtp1733474-11807) [n:127.0.0.1:40483_    ] o.a.s.s.HttpSolrCall [admin] webapp=null path=/admin/metrics params={wt=javabin&version=2&key=solr.core.control_collection.shard1.replica_n1:INDEX.sizeInBytes} status=0 QTime=0
   [junit4]   2> 902550 INFO  (qtp1733474-11808) [n:127.0.0.1:40483_    ] o.a.s.s.HttpSolrCall [admin] webapp=null path=/admin/metrics params={wt=javabin&version=2&key=solr.core.control_collection.shard1.replica_n1:INDEX.sizeInBytes} status=0 QTime=0
   [junit4]   2> 902552 INFO  (qtp1733474-11806) [n:127.0.0.1:40483_    ] o.a.s.s.HttpSolrCall [admin] webapp=null path=/admin/metrics params={wt=javabin&version=2&key=solr.core.control_collection.shard1.replica_n1:INDEX.sizeInBytes} status=0 QTime=0
   [junit4]   2> 902554 INFO  (qtp1733474-11807) [n:127.0.0.1:40483_    ] o.a.s.s.HttpSolrCall [admin] webapp=null path=/admin/metrics params={prefix=CONTAINER.fs.usableSpace,CONTAINER.fs.totalSpace,CORE.coreName&wt=javabin&version=2&group=solr.node,solr.core} status=0 QTime=1
   [junit4]   2> 902557 INFO  (qtp1733474-11808) [n:127.0.0.1:40483_    ] o.a.s.s.HttpSolrCall [admin] webapp=null path=/admin/metrics params={prefix=CONTAINER.fs.usableSpace,CONTAINER.fs.totalSpace,CORE.coreName&wt=javabin&version=2&group=solr.node,solr.core} status=0 QTime=1
   [junit4]   2> 902559 INFO  (qtp1733474-11806) [n:127.0.0.1:40483_    ] o.a.s.s.HttpSolrCall [admin] webapp=null path=/admin/metrics params={prefix=CONTAINER.fs.usableSpace,CONTAINER.fs.totalSpace,CORE.coreName&wt=javabin&version=2&group=solr.node,solr.core} status=0 QTime=0
   [junit4]   2> 902561 INFO  (qtp1733474-11807) [n:127.0.0.1:40483_    ] o.a.s.s.HttpSolrCall [admin] webapp=null path=/admin/metrics params={prefix=CONTAINER.fs.usableSpace,CONTAINER.fs.totalSpace,CORE.coreName&wt=javabin&version=2&group=solr.node,solr.core} status=0 QTime=1
   [junit4]   2> 902563 INFO  (qtp1733474-11808) [n:127.0.0.1:40483_    ] o.a.s.s.HttpSolrCall [admin] webapp=null path=/admin/metrics params={prefix=CONTAINER.fs.usableSpace,CONTAINER.fs.totalSpace,CORE.coreName&wt=javabin&version=2&group=solr.node,solr.core} status=0 QTime=0
   [junit4]   2> 902654 INFO  (qtp22049879-11882) [n:127.0.0.1:42311_    ] o.a.s.s.HttpSolrCall [admin] webapp=null path=/admin/metrics params={prefix=CONTAINER.fs.usableSpace,CONTAINER.fs.totalSpace,CORE.coreName&wt=javabin&version=2&group=solr.node,solr.core} status=0 QTime=0
   [junit4]   2> 902656 INFO  (qtp22049879-11883) [n:127.0.0.1:42311_    ] o.a.s.s.HttpSolrCall [admin] webapp=null path=/admin/metrics params={prefix=CONTAINER.fs.usableSpace,CONTAINER.fs.totalSpace,CORE.coreName&wt=javabin&version=2&group=solr.node,solr.core} status=0 QTime=0
   [junit4]   2> 902657 INFO  (qtp22049879-11881) [n:127.0.0.1:42311_    ] o.a.s.s.HttpSolrCall [admin] webapp=null path=/admin/metrics params={prefix=CONTAINER.fs.usableSpace,CONTAINER.fs.totalSpace,CORE.coreName&wt=javabin&version=2&group=solr.node,solr.core} status=0 QTime=0
   [junit4]   2> 902659 INFO  (qtp22049879-11882) [n:127.0.0.1:42311_    ] o.a.s.s.HttpSolrCall [admin] webapp=null path=/admin/metrics params={prefix=CONTAINER.fs.usableSpace,CONTAINER.fs.totalSpace,CORE.coreName&wt=javabin&version=2&group=solr.node,solr.core} status=0 QTime=0
   [junit4]   2> 902660 INFO  (qtp22049879-11883) [n:127.0.0.1:42311_    ] o.a.s.s.HttpSolrCall [admin] webapp=null path=/admin/metrics params={prefix=CONTAINER.fs.usableSpace,CONTAINER.fs.totalSpace,CORE.coreName&wt=javabin&version=2&group=solr.node,solr.core} status=0 QTime=0
   [junit4]   2> 902756 INFO  (qtp19317137-11895) [n:127.0.0.1:45251_    ] o.a.s.s.HttpSolrCall [admin] webapp=null path=/admin/metrics params={prefix=CONTAINER.fs.usableSpace,CONTAINER.fs.totalSpace,CORE.coreName&wt=javabin&version=2&group=solr.node,solr.core} status=0 QTime=0
   [junit4]   2> 902758 INFO  (qtp19317137-11896) [n:127.0.0.1:45251_    ] o.a.s.s.HttpSolrCall [admin] webapp=null path=/admin/metrics params={prefix=CONTAINER.fs.usableSpace,CONTAINER.fs.totalSpace,CORE.coreName&wt=javabin&version=2&group=solr.node,solr.core} status=0 QTime=0
   [junit4]   2> 902759 INFO  (qtp19317137-11894) [n:127.0.0.1:45251_    ] o.a.s.s.HttpSolrCall [admin] webapp=null path=/admin/metrics params={prefix=CONTAINER.fs.usableSpace,CONTAINER.fs.totalSpace,CORE.coreName&wt=javabin&version=2&group=solr.node,solr.core} status=0 QTime=0
   [junit4]   2> 902761 INFO  (qtp19317137-11895) [n:127.0.0.1:45251_    ] o.a.s.s.HttpSolrCall [admin] webapp=null path=/admin/metrics params={prefix=CONTAINER.fs.usableSpace,CONTAINER.fs.totalSpace,CORE.coreName&wt=javabin&version=2&group=solr.node,solr.core} status=0 QTime=0
   [junit4]   2> 902762 INFO  (qtp19317137-11896) [n:127.0.0.1:45251_    ] o.a.s.s.HttpSolrCall [admin] webapp=null path=/admin/metrics params={prefix=CONTAINER.fs.usableSpace,CONTAINER.fs.totalSpace,CORE.coreName&wt=javabin&version=2&group=solr.node,solr.core} status=0 QTime=0
   [junit4]   2> 902829 INFO  (qtp20566891-11908) [n:127.0.0.1:46185_    ] o.a.s.s.HttpSolrCall [admin] webapp=null path=/admin/metrics params={prefix=CONTAINER.fs.usableSpace,CONTAINER.fs.totalSpace,CORE.coreName&wt=javabin&version=2&group=solr.node,solr.core} status=0 QTime=0
   [junit4]   2> 902830 INFO  (qtp20566891-11909) [n:127.0.0.1:46185_    ] o.a.s.s.HttpSolrCall [admin] webapp=null path=/admin/metrics params={prefix=CONTAINER.fs.usableSpace,CONTAINER.fs.totalSpace,CORE.coreName&wt=javabin&version=2&group=solr.node,solr.core} status=0 QTime=0
   [junit4]   2> 902832 INFO  (qtp20566891-11907) [n:127.0.0.1:46185_    ] o.a.s.s.HttpSolrCall [admin] webapp=null path=/admin/metrics params={prefix=CONTAINER.fs.usableSpace,CONTAINER.fs.totalSpace,CORE.coreName&wt=javabin&version=2&group=solr.node,solr.core} status=0 QTime=0
   [junit4]   2> 902833 INFO  (qtp20566891-11908) [n:127.0.0.1:46185_    ] o.a.s.s.HttpSolrCall [admin] webapp=null path=/admin/metrics params={prefix=CONTAINER.fs.usableSpace,CONTAINER.fs.totalSpace,CORE.coreName&wt=javabin&version=2&group=solr.node,solr.core} status=0 QTime=0
   [junit4]   2> 902834 INFO  (qtp20566891-11909) [n:127.0.0.1:46185_    ] o.a.s.s.HttpSolrCall [admin] webapp=null path=/admin/metrics params={prefix=CONTAINER.fs.usableSpace,CONTAINER.fs.totalSpace,CORE.coreName&wt=javabin&version=2&group=solr.node,solr.core} status=0 QTime=0
   [junit4]   2> 902835 INFO  (OverseerThreadFactory-3348-thread-3-processing-n:127.0.0.1:40483_) [n:127.0.0.1:40483_ c:collection1 s:shard1  ] o.a.s.c.a.c.AddReplicaCmd Node Identified 127.0.0.1:42311_ for creating new replica of shard shard1 for collection collection1
   [junit4]   2> 902835 INFO  (OverseerThreadFactory-3348-thread-4-processing-n:127.0.0.1:40483_) [n:127.0.0.1:40483_ c:collection1 s:shard2  ] o.a.s.c.a.c.AddReplicaCmd Node Identified 127.0.0.1:45251_ for creating new replica of shard shard2 for collection collection1
   [junit4]   2> 902837 INFO  (OverseerThreadFactory-3348-thread-3-processing-n:127.0.0.1:40483_) [n:127.0.0.1:40483_ c:collection1 s:shard1  ] o.a.s.c.a.c.AddReplicaCmd Returning CreateReplica command.
   [junit4]   2> 902837 INFO  (OverseerThreadFactory-3348-thread-4-processing-n:127.0.0.1:40483_) [n:127.0.0.1:40483_ c:collection1 s:shard2  ] o.a.s.c.a.c.AddReplicaCmd Returning CreateReplica command.
   [junit4]   2> 902956 INFO  (qtp19317137-11894) [n:127.0.0.1:45251_    x:collection1_shard2_replica_n2] o.a.s.h.a.CoreAdminOperation core create command qt=/admin/cores&collection.configName=conf1&name=collection1_shard2_replica_n2&action=CREATE&collection=collection1&shard=shard2&wt=javabin&version=2&replicaType=NRT
   [junit4]   2> 902978 INFO  (qtp22049879-11881) [n:127.0.0.1:42311_    x:collection1_shard1_replica_n1] o.a.s.h.a.CoreAdminOperation core create command qt=/admin/cores&collection.configName=conf1&name=collection1_shard1_replica_n1&action=CREATE&collection=collection1&shard=shard1&wt=javabin&version=2&replicaType=NRT
   [junit4]   2> 903978 INFO  (qtp19317137-11894) [n:127.0.0.1:45251_ c:collection1 s:shard2  x:collection1_shard2_replica_n2] o.a.s.c.SolrConfig Using Lucene MatchVersion: 8.0.0
   [junit4]   2> 903994 INFO  (qtp22049879-11881) [n:127.0.0.1:42311_ c:collection1 s:shard1  x:collection1_shard1_replica_n1] o.a.s.c.SolrConfig Using Lucene MatchVersion: 8.0.0
   [junit4]   2> 904000 INFO  (qtp19317137-11894) [n:127.0.0.1:45251_ c:collection1 s:shard2  x:collection1_shard2_replica_n2] o.a.s.s.IndexSchema [collection1_shard2_replica_n2] Schema name=test
   [junit4]   2> 904032 INFO  (qtp22049879-11881) [n:127.0.0.1:42311_ c:collection1 s:shard1  x:collection1_shard1_replica_n1] o.a.s.s.IndexSchema [collection1_shard1_replica_n1] Schema name=test
   [junit4]   2> 904134 INFO  (qtp19317137-11894) [n:127.0.0.1:45251_ c:collection1 s:shard2  x:collection1_shard2_replica_n2] o.a.s.s.IndexSchema Loaded schema test/1.0 with uniqueid field id
   [junit4]   2> 904154 INFO  (qtp19317137-11894) [n:127.0.0.1:45251_ c:collection1 s:shard2  x:collection1_shard2_replica_n2] o.a.s.c.CoreContainer Creating SolrCore 'collection1_shard2_replica_n2' using configuration from collection collection1, trusted=true
   [junit4]   2> 904155 INFO  (qtp19317137-11894) [n:127.0.0.1:45251_ c:collection1 s:shard2  x:collection1_shard2_replica_n2] o.a.s.m.r.SolrJmxReporter JMX monitoring for 'solr.core.collection1.shard2.replica_n2' (registry 'solr.core.collection1.shard2.replica_n2') enabled at server: com.sun.jmx.mbeanserver.JmxMBeanServer@10ffe0
   [junit4]   2> 904155 INFO  (qtp19317137-11894) [n:127.0.0.1:45251_ c:collection1 s:shard2  x:collection1_shard2_replica_n2] o.a.s.c.SolrCore [[collection1_shard2_replica_n2] ] Opening new SolrCore at [/home/jenkins/workspace/Lucene-Solr-master-Linux/solr/build/solr-core/test/J1/temp/solr.core.TestDynamicLoading_F72592B91C0F93E9-001/shard-3-001/cores/collection1_shard2_replica_n2], dataDir=[/home/jenkins/workspace/Lucene-Solr-master-Linux/solr/build/solr-core/test/J1/../../../../../../../../../home/jenkins/workspace/Lucene-Solr-master-Linux/solr/build/solr-core/test/J1/temp/solr.core.TestDynamicLoading_F72592B91C0F93E9-001/shard-3-001/cores/collection1_shard2_replica_n2/data/]
   [junit4]   2> 904170 INFO  (qtp19317137-11894) [n:127.0.0.1:45251_

[...truncated too long message...]

tTrieFacet, TestStressUserVersions, TokenizerChainTest, LeaderTragicEventTest, IndexBasedSpellCheckerTest, ZkFailoverTest, TestInitQParser, TestAtomicUpdateErrorCases, StressHdfsTest, RulesTest, TestRTGBase, DataDrivenBlockJoinTest, FullSolrCloudDistribCmdsTest, TestRuleBasedAuthorizationPlugin, SuggesterTest, TestCloudRecovery2, ConnectionReuseTest, TestGraphTermsQParserPlugin, CurrencyFieldTypeTest, TestObjectReleaseTracker, EnumFieldTest, CollectionPropsTest, TimeRoutedAliasUpdateProcessorTest, SuggestComponentContextFilterQueryTest, AtomicUpdatesTest, TestFreeTextSuggestions, TestStressLucene, AliasIntegrationTest, VMParamsZkACLAndCredentialsProvidersTest, TestShortCircuitedRequests, TestSolrCoreParser, TestGeoJSONResponseWriter, DistanceUnitsTest, TestAnalyzedSuggestions, TestConfigSetsAPI, FastVectorHighlighterTest, BlockJoinFacetRandomTest, AutoscalingHistoryHandlerTest, TestExpandComponent, MinimalSchemaTest, CreateCollectionCleanupTest, SolrGraphiteReporterTest, TestSchemaSimilarityResource, TestLegacyFieldReuse, TestImpersonationWithHadoopAuth, DistanceFunctionTest, TestRawTransformer, SolrPluginUtilsTest, TestUtilizeNode, SolrMetricReporterTest, TestFieldCacheVsDocValues, DocumentAnalysisRequestHandlerTest, TestTrackingShardHandlerFactory, TestDistributedSearch, TestXmlQParserPlugin, TestDynamicLoading]
   [junit4] Completed [261/837 (1!)] on J1 in 22.58s, 1 test, 1 failure <<< FAILURES!

[...truncated 571 lines...]
   [junit4] Suite: org.apache.solr.cloud.MetricsHistoryIntegrationTest
   [junit4]   2> 1637498 INFO  (SUITE-MetricsHistoryIntegrationTest-seed#[F72592B91C0F93E9]-worker) [    ] o.a.s.SolrTestCaseJ4 SecureRandom sanity checks: test.solr.allowed.securerandom=null & java.security.egd=file:/dev/./urandom
   [junit4]   2> Creating dataDir: /home/jenkins/workspace/Lucene-Solr-master-Linux/solr/build/solr-core/test/J0/temp/solr.cloud.MetricsHistoryIntegrationTest_F72592B91C0F93E9-001/init-core-data-001
   [junit4]   2> 1637500 WARN  (SUITE-MetricsHistoryIntegrationTest-seed#[F72592B91C0F93E9]-worker) [    ] o.a.s.SolrTestCaseJ4 startTrackingSearchers: numOpens=4 numCloses=4
   [junit4]   2> 1637500 INFO  (SUITE-MetricsHistoryIntegrationTest-seed#[F72592B91C0F93E9]-worker) [    ] o.a.s.SolrTestCaseJ4 Using PointFields (NUMERIC_POINTS_SYSPROP=true) w/NUMERIC_DOCVALUES_SYSPROP=true
   [junit4]   2> 1637502 INFO  (SUITE-MetricsHistoryIntegrationTest-seed#[F72592B91C0F93E9]-worker) [    ] o.a.s.SolrTestCaseJ4 Randomized ssl (false) and clientAuth (true) via: @org.apache.solr.util.RandomizeSSL(reason=, ssl=NaN, value=NaN, clientAuth=NaN)
   [junit4]   2> 1637515 INFO  (SUITE-MetricsHistoryIntegrationTest-seed#[F72592B91C0F93E9]-worker) [    ] o.a.s.SolrTestCaseJ4 ------------------------------------------------------- Done waiting for tracked resources to be released
   [junit4]   2> NOTE: test params are: codec=Asserting(Lucene80), sim=Asserting(org.apache.lucene.search.similarities.AssertingSimilarity@1ed2614), locale=ca, timezone=Asia/Kathmandu
   [junit4]   2> NOTE: Linux 4.15.0-42-generic i386/Oracle Corporation 1.8.0_172 (32-bit)/cpus=8,threads=1,free=165042008,total=517988352
   [junit4]   2> NOTE: All tests run in this JVM: [TestPointFields, RAMDirectoryFactoryTest, TestFieldTypeCollectionResource, OverseerCollectionConfigSetProcessorTest, TestLegacyTerms, LeaderElectionIntegrationTest, Tagger2Test, TestConfigSetsAPIZkFailure, BigEndianAscendingWordDeserializerTest, TestCloudPhrasesIdentificationComponent, DocumentBuilderTest, TestGroupingSearch, AutoAddReplicasIntegrationTest, CdcrOpsAndBoundariesTest, TestConfigsApi, HighlighterMaxOffsetTest, ClassificationUpdateProcessorIntegrationTest, HttpTriggerListenerTest, SortSpecParsingTest, TestSimGenericDistributedQueue, TestStressLiveNodes, DefaultValueUpdateProcessorTest, V2StandaloneTest, TestSkipOverseerOperations, CollectionsAPISolrJTest, OverseerStatusTest, TestReplicationHandlerBackup, BasicZkTest, HdfsRecoveryZkTest, JsonLoaderTest, ReplicationFactorTest, TestCoreBackup, ScriptEngineTest, ChaosMonkeySafeLeaderTest, LukeRequestHandlerTest, HdfsThreadLeakTest, HdfsChaosMonkeySafeLeaderTest, DateRangeFieldTest, UpdateRequestProcessorFactoryTest, CdcrVersionReplicationTest, TestManagedResource, TestSerializedLuceneMatchVersion, SystemLogListenerTest, TestSolrQueryResponse, TestRandomDVFaceting, SolrShardReporterTest, NodeLostTriggerIntegrationTest, SynonymTokenizerTest, SystemInfoHandlerTest, TestSurroundQueryParser, TestStressReorder, TestWordDelimiterFilterFactory, LeaderFailureAfterFreshStartTest, FileBasedSpellCheckerTest, ZkControllerTest, TestIndexSearcher, SolrIndexSplitterTest, HdfsWriteToMultipleCollectionsTest, RuleEngineTest, TestQueryUtils, CdcrUpdateLogTest, ForceLeaderTest, TestPKIAuthenticationPlugin, SuggesterTSTTest, TestCloudRecovery, TestJettySolrRunner, TestFoldingMultitermQuery, CopyFieldTest, TestMaxTokenLenTokenizer, DocValuesTest, ClusterStateUpdateTest, SchemaVersionSpecificBehaviorTest, TestPartialUpdateDeduplication, StatsComponentTest, AtomicUpdateProcessorFactoryTest, TestFileDictionaryLookup, TestStandardQParsers, AddReplicaTest, UnloadDistributedZkTest, TestSegmentSorting, TestSolr4Spatial2, TestCustomDocTransformer, DateMathParserTest, TestAnalyzeInfixSuggestions, TestClusterProperties, XmlInterpolationTest, BlockJoinFacetDistribTest, AdminHandlersProxyTest, TestDistributedStatsComponentCardinality, EchoParamsTest, ConnectionManagerTest, SolrGangliaReporterTest, TestSchemaResource, TestLegacyField, TestDelegationWithHadoopAuth, TestSortByMinMaxFunction, TestRawResponseWriter, SimplePostToolTest, TestTolerantUpdateProcessorRandomCloud, SolrMetricManagerTest, TestFieldCacheSortRandom, CSVRequestHandlerTest, TestPivotHelperCode, TestDistributedMissingSort, TestXmlQParser, TestDirectoryFactory, SearchHandlerTest, IndexSchemaRuntimeFieldTest, SpellCheckCollatorWithCollapseTest, TestImplicitCoreProperties, PeerSyncReplicationTest, UtilsToolTest, TestCloudJSONFacetSKG, SOLR749Test, TestSolrCoreProperties, MissingSegmentRecoveryTest, TestPullReplicaErrorHandling, PolyFieldTest, TestSubQueryTransformer, TestDistribDocBasedVersion, RangeFacetCloudTest, TestManagedSchemaAPI, ZkStateReaderTest, StatelessScriptUpdateProcessorFactoryTest, TestReloadAndDeleteDocs, TestIBSimilarityFactory, TestEmbeddedSolrServerAdminHandler, TestStreamBody, TestNoOpRegenerator, TestUpdate, DistributedDebugComponentTest, TestSQLHandler, TestLeaderElectionZkExpiry, NodeMutatorTest, BlobRepositoryCloudTest, TestNumericRangeQuery64, PrimitiveFieldTypeTest, CachingDirectoryFactoryTest, BasicDistributedZkTest, CleanupOldIndexTest, CloudExitableDirectoryReaderTest, DeleteLastCustomShardedReplicaTest, DeleteNodeTest, DeleteReplicaTest, DistribDocExpirationUpdateProcessorTest, DistributedQueueTest, DocValuesNotIndexedTest, HttpPartitionOnCommitTest, LeaderElectionContextKeyTest, LegacyCloudClusterPropTest, MetricsHistoryIntegrationTest]
   [junit4]   2> NOTE: reproduce with: ant test  -Dtestcase=MetricsHistoryIntegrationTest -Dtests.seed=F72592B91C0F93E9 -Dtests.multiplier=3 -Dtests.slow=true -Dtests.locale=ca -Dtests.timezone=Asia/Kathmandu -Dtests.asserts=true -Dtests.file.encoding=UTF-8
   [junit4] ERROR   0.00s J0 | MetricsHistoryIntegrationTest (suite) <<<
   [junit4]    > Throwable #1: java.lang.IllegalArgumentException: committed = 143196160 should be < max = 143130624
   [junit4]    > 	at __randomizedtesting.SeedInfo.seed([F72592B91C0F93E9]:0)
   [junit4]    > 	at java.lang.management.MemoryUsage.<init>(MemoryUsage.java:160)
   [junit4]    > 	at sun.management.MemoryPoolImpl.getCollectionUsage0(Native Method)
   [junit4]    > 	at sun.management.MemoryPoolImpl.getCollectionUsage(MemoryPoolImpl.java:266)
   [junit4]    > 	at com.codahale.metrics.jvm.MemoryUsageGaugeSet.getMetrics(MemoryUsageGaugeSet.java:182)
   [junit4]    > 	at org.apache.solr.metrics.SolrMetricManager.registerAll(SolrMetricManager.java:516)
   [junit4]    > 	at org.apache.solr.cloud.autoscaling.sim.SimCloudManager.<init>(SimCloudManager.java:178)
   [junit4]    > 	at org.apache.solr.cloud.autoscaling.sim.SimCloudManager.createCluster(SimCloudManager.java:258)
   [junit4]    > 	at org.apache.solr.cloud.MetricsHistoryIntegrationTest.setupCluster(MetricsHistoryIntegrationTest.java:64)
   [junit4]    > 	at java.lang.Thread.run(Thread.java:748)
   [junit4] Completed [438/837 (2!)] on J0 in 0.31s, 0 tests, 1 error <<< FAILURES!

[...truncated 46442 lines...]
[repro] Jenkins log URL: https://jenkins.thetaphi.de/job/Lucene-Solr-master-Linux/23444/consoleText

[repro] Revision: 2532a5d31c8e4086120d74c8fb83102b8533777c

[repro] Ant options: "-Dargs=-client -XX:+UseSerialGC"
[repro] Repro line:  ant test  -Dtestcase=TestDynamicLoading -Dtests.method=testDynamicLoading -Dtests.seed=F72592B91C0F93E9 -Dtests.multiplier=3 -Dtests.slow=true -Dtests.locale=en-GB -Dtests.timezone=SystemV/HST10 -Dtests.asserts=true -Dtests.file.encoding=UTF-8

[repro] Repro line:  ant test  -Dtestcase=MetricsHistoryIntegrationTest -Dtests.seed=F72592B91C0F93E9 -Dtests.multiplier=3 -Dtests.slow=true -Dtests.locale=ca -Dtests.timezone=Asia/Kathmandu -Dtests.asserts=true -Dtests.file.encoding=UTF-8

[repro] ant clean

[...truncated 6 lines...]
[repro] Test suites by module:
[repro]    solr/core
[repro]       MetricsHistoryIntegrationTest
[repro]       TestDynamicLoading
[repro] ant compile-test

[...truncated 3592 lines...]
[repro] ant test-nocompile -Dtests.dups=5 -Dtests.maxfailures=10 -Dtests.class="*.MetricsHistoryIntegrationTest|*.TestDynamicLoading" -Dtests.showOutput=onerror "-Dargs=-client -XX:+UseSerialGC" -Dtests.seed=F72592B91C0F93E9 -Dtests.multiplier=3 -Dtests.slow=true -Dtests.locale=ca -Dtests.timezone=Asia/Kathmandu -Dtests.asserts=true -Dtests.file.encoding=UTF-8

[...truncated 100 lines...]
[repro] Failures:
[repro]   0/5 failed: org.apache.solr.cloud.MetricsHistoryIntegrationTest
[repro]   0/5 failed: org.apache.solr.core.TestDynamicLoading
[repro] Exiting with code 0

[...truncated 40 lines...]

Mime
View raw message