lucene-dev mailing list archives

Site index · List index
Message view « Date » · « Thread »
Top « Date » · « Thread »
From Apache Jenkins Server <jenk...@builds.apache.org>
Subject [JENKINS] Lucene-Solr-Tests-7.x - Build # 1212 - Unstable
Date Tue, 15 Jan 2019 09:32:45 GMT
Build: https://builds.apache.org/job/Lucene-Solr-Tests-7.x/1212/

1 tests failed.
FAILED:  org.apache.solr.cloud.ShardRoutingTest.test

Error Message:
expected:<5> but was:<7>

Stack Trace:
java.lang.AssertionError: expected:<5> but was:<7>
	at __randomizedtesting.SeedInfo.seed([2ED07635D40FE828:A68449EF7AF385D0]:0)
	at org.junit.Assert.fail(Assert.java:88)
	at org.junit.Assert.failNotEquals(Assert.java:834)
	at org.junit.Assert.assertEquals(Assert.java:645)
	at org.junit.Assert.assertEquals(Assert.java:631)
	at org.apache.solr.cloud.ShardRoutingTest.doTestNumRequests(ShardRoutingTest.java:294)
	at org.apache.solr.cloud.ShardRoutingTest.test(ShardRoutingTest.java:110)
	at sun.reflect.NativeMethodAccessorImpl.invoke0(Native Method)
	at sun.reflect.NativeMethodAccessorImpl.invoke(NativeMethodAccessorImpl.java:62)
	at sun.reflect.DelegatingMethodAccessorImpl.invoke(DelegatingMethodAccessorImpl.java:43)
	at java.lang.reflect.Method.invoke(Method.java:498)
	at com.carrotsearch.randomizedtesting.RandomizedRunner.invoke(RandomizedRunner.java:1750)
	at com.carrotsearch.randomizedtesting.RandomizedRunner$8.evaluate(RandomizedRunner.java:938)
	at com.carrotsearch.randomizedtesting.RandomizedRunner$9.evaluate(RandomizedRunner.java:974)
	at com.carrotsearch.randomizedtesting.RandomizedRunner$10.evaluate(RandomizedRunner.java:988)
	at org.apache.solr.BaseDistributedSearchTestCase$ShardsRepeatRule$ShardsFixedStatement.callStatement(BaseDistributedSearchTestCase.java:1063)
	at org.apache.solr.BaseDistributedSearchTestCase$ShardsRepeatRule$ShardsStatement.evaluate(BaseDistributedSearchTestCase.java:1035)
	at com.carrotsearch.randomizedtesting.rules.SystemPropertiesRestoreRule$1.evaluate(SystemPropertiesRestoreRule.java:57)
	at org.apache.lucene.util.TestRuleSetupTeardownChained$1.evaluate(TestRuleSetupTeardownChained.java:49)
	at org.apache.lucene.util.AbstractBeforeAfterRule$1.evaluate(AbstractBeforeAfterRule.java:45)
	at org.apache.lucene.util.TestRuleThreadAndTestName$1.evaluate(TestRuleThreadAndTestName.java:48)
	at org.apache.lucene.util.TestRuleIgnoreAfterMaxFailures$1.evaluate(TestRuleIgnoreAfterMaxFailures.java:64)
	at org.apache.lucene.util.TestRuleMarkFailure$1.evaluate(TestRuleMarkFailure.java:47)
	at com.carrotsearch.randomizedtesting.rules.StatementAdapter.evaluate(StatementAdapter.java:36)
	at com.carrotsearch.randomizedtesting.ThreadLeakControl$StatementRunner.run(ThreadLeakControl.java:368)
	at com.carrotsearch.randomizedtesting.ThreadLeakControl.forkTimeoutingTask(ThreadLeakControl.java:817)
	at com.carrotsearch.randomizedtesting.ThreadLeakControl$3.evaluate(ThreadLeakControl.java:468)
	at com.carrotsearch.randomizedtesting.RandomizedRunner.runSingleTest(RandomizedRunner.java:947)
	at com.carrotsearch.randomizedtesting.RandomizedRunner$5.evaluate(RandomizedRunner.java:832)
	at com.carrotsearch.randomizedtesting.RandomizedRunner$6.evaluate(RandomizedRunner.java:883)
	at com.carrotsearch.randomizedtesting.RandomizedRunner$7.evaluate(RandomizedRunner.java:894)
	at com.carrotsearch.randomizedtesting.rules.StatementAdapter.evaluate(StatementAdapter.java:36)
	at com.carrotsearch.randomizedtesting.rules.SystemPropertiesRestoreRule$1.evaluate(SystemPropertiesRestoreRule.java:57)
	at org.apache.lucene.util.AbstractBeforeAfterRule$1.evaluate(AbstractBeforeAfterRule.java:45)
	at com.carrotsearch.randomizedtesting.rules.StatementAdapter.evaluate(StatementAdapter.java:36)
	at org.apache.lucene.util.TestRuleStoreClassName$1.evaluate(TestRuleStoreClassName.java:41)
	at com.carrotsearch.randomizedtesting.rules.NoShadowingOrOverridesOnMethodsRule$1.evaluate(NoShadowingOrOverridesOnMethodsRule.java:40)
	at com.carrotsearch.randomizedtesting.rules.NoShadowingOrOverridesOnMethodsRule$1.evaluate(NoShadowingOrOverridesOnMethodsRule.java:40)
	at com.carrotsearch.randomizedtesting.rules.StatementAdapter.evaluate(StatementAdapter.java:36)
	at com.carrotsearch.randomizedtesting.rules.StatementAdapter.evaluate(StatementAdapter.java:36)
	at com.carrotsearch.randomizedtesting.rules.StatementAdapter.evaluate(StatementAdapter.java:36)
	at org.apache.lucene.util.TestRuleAssertionsRequired$1.evaluate(TestRuleAssertionsRequired.java:53)
	at org.apache.lucene.util.TestRuleMarkFailure$1.evaluate(TestRuleMarkFailure.java:47)
	at org.apache.lucene.util.TestRuleIgnoreAfterMaxFailures$1.evaluate(TestRuleIgnoreAfterMaxFailures.java:64)
	at org.apache.lucene.util.TestRuleIgnoreTestSuites$1.evaluate(TestRuleIgnoreTestSuites.java:54)
	at com.carrotsearch.randomizedtesting.rules.StatementAdapter.evaluate(StatementAdapter.java:36)
	at com.carrotsearch.randomizedtesting.ThreadLeakControl$StatementRunner.run(ThreadLeakControl.java:368)
	at java.lang.Thread.run(Thread.java:748)




Build Log:
[...truncated 14027 lines...]
   [junit4] Suite: org.apache.solr.cloud.ShardRoutingTest
   [junit4]   2> 2184696 INFO  (SUITE-ShardRoutingTest-seed#[2ED07635D40FE828]-worker) [    ] o.a.s.SolrTestCaseJ4 SecureRandom sanity checks: test.solr.allowed.securerandom=null & java.security.egd=file:/dev/./urandom
   [junit4]   2> Creating dataDir: /home/jenkins/jenkins-slave/workspace/Lucene-Solr-Tests-7.x/solr/build/solr-core/test/J0/temp/solr.cloud.ShardRoutingTest_2ED07635D40FE828-001/init-core-data-001
   [junit4]   2> 2184697 WARN  (SUITE-ShardRoutingTest-seed#[2ED07635D40FE828]-worker) [    ] o.a.s.SolrTestCaseJ4 startTrackingSearchers: numOpens=7 numCloses=7
   [junit4]   2> 2184697 INFO  (SUITE-ShardRoutingTest-seed#[2ED07635D40FE828]-worker) [    ] o.a.s.SolrTestCaseJ4 Using PointFields (NUMERIC_POINTS_SYSPROP=true) w/NUMERIC_DOCVALUES_SYSPROP=false
   [junit4]   2> 2184699 INFO  (SUITE-ShardRoutingTest-seed#[2ED07635D40FE828]-worker) [    ] o.a.s.SolrTestCaseJ4 Randomized ssl (false) and clientAuth (true) via: @org.apache.solr.util.RandomizeSSL(reason=, ssl=NaN, value=NaN, clientAuth=NaN)
   [junit4]   2> 2184699 INFO  (SUITE-ShardRoutingTest-seed#[2ED07635D40FE828]-worker) [    ] o.a.s.BaseDistributedSearchTestCase Setting hostContext system property: /
   [junit4]   2> 2184989 INFO  (TEST-ShardRoutingTest.test-seed#[2ED07635D40FE828]) [    ] o.a.s.c.ZkTestServer STARTING ZK TEST SERVER
   [junit4]   2> 2184991 INFO  (ZkTestServer Run Thread) [    ] o.a.s.c.ZkTestServer client port:0.0.0.0/0.0.0.0:0
   [junit4]   2> 2184991 INFO  (ZkTestServer Run Thread) [    ] o.a.s.c.ZkTestServer Starting server
   [junit4]   2> 2185091 INFO  (TEST-ShardRoutingTest.test-seed#[2ED07635D40FE828]) [    ] o.a.s.c.ZkTestServer start zk server on port:43129
   [junit4]   2> 2185091 INFO  (TEST-ShardRoutingTest.test-seed#[2ED07635D40FE828]) [    ] o.a.s.c.ZkTestServer parse host and port list: 127.0.0.1:43129
   [junit4]   2> 2185091 INFO  (TEST-ShardRoutingTest.test-seed#[2ED07635D40FE828]) [    ] o.a.s.c.ZkTestServer connecting to 127.0.0.1 43129
   [junit4]   2> 2185095 INFO  (zkConnectionManagerCallback-5183-thread-1) [    ] o.a.s.c.c.ConnectionManager zkClient has connected
   [junit4]   2> 2185127 INFO  (zkConnectionManagerCallback-5185-thread-1) [    ] o.a.s.c.c.ConnectionManager zkClient has connected
   [junit4]   2> 2185127 INFO  (TEST-ShardRoutingTest.test-seed#[2ED07635D40FE828]) [    ] o.a.s.c.ZkTestServer put /home/jenkins/jenkins-slave/workspace/Lucene-Solr-Tests-7.x/solr/core/src/test-files/solr/collection1/conf/solrconfig-tlog.xml to /configs/conf1/solrconfig.xml
   [junit4]   2> 2185128 INFO  (TEST-ShardRoutingTest.test-seed#[2ED07635D40FE828]) [    ] o.a.s.c.ZkTestServer put /home/jenkins/jenkins-slave/workspace/Lucene-Solr-Tests-7.x/solr/core/src/test-files/solr/collection1/conf/schema15.xml to /configs/conf1/schema.xml
   [junit4]   2> 2185129 INFO  (TEST-ShardRoutingTest.test-seed#[2ED07635D40FE828]) [    ] o.a.s.c.ZkTestServer put /home/jenkins/jenkins-slave/workspace/Lucene-Solr-Tests-7.x/solr/core/src/test-files/solr/collection1/conf/solrconfig.snippet.randomindexconfig.xml to /configs/conf1/solrconfig.snippet.randomindexconfig.xml
   [junit4]   2> 2185130 INFO  (TEST-ShardRoutingTest.test-seed#[2ED07635D40FE828]) [    ] o.a.s.c.ZkTestServer put /home/jenkins/jenkins-slave/workspace/Lucene-Solr-Tests-7.x/solr/core/src/test-files/solr/collection1/conf/stopwords.txt to /configs/conf1/stopwords.txt
   [junit4]   2> 2185131 INFO  (TEST-ShardRoutingTest.test-seed#[2ED07635D40FE828]) [    ] o.a.s.c.ZkTestServer put /home/jenkins/jenkins-slave/workspace/Lucene-Solr-Tests-7.x/solr/core/src/test-files/solr/collection1/conf/protwords.txt to /configs/conf1/protwords.txt
   [junit4]   2> 2185131 INFO  (TEST-ShardRoutingTest.test-seed#[2ED07635D40FE828]) [    ] o.a.s.c.ZkTestServer put /home/jenkins/jenkins-slave/workspace/Lucene-Solr-Tests-7.x/solr/core/src/test-files/solr/collection1/conf/currency.xml to /configs/conf1/currency.xml
   [junit4]   2> 2185132 INFO  (TEST-ShardRoutingTest.test-seed#[2ED07635D40FE828]) [    ] o.a.s.c.ZkTestServer put /home/jenkins/jenkins-slave/workspace/Lucene-Solr-Tests-7.x/solr/core/src/test-files/solr/collection1/conf/enumsConfig.xml to /configs/conf1/enumsConfig.xml
   [junit4]   2> 2185133 INFO  (TEST-ShardRoutingTest.test-seed#[2ED07635D40FE828]) [    ] o.a.s.c.ZkTestServer put /home/jenkins/jenkins-slave/workspace/Lucene-Solr-Tests-7.x/solr/core/src/test-files/solr/collection1/conf/open-exchange-rates.json to /configs/conf1/open-exchange-rates.json
   [junit4]   2> 2185154 INFO  (TEST-ShardRoutingTest.test-seed#[2ED07635D40FE828]) [    ] o.a.s.c.ZkTestServer put /home/jenkins/jenkins-slave/workspace/Lucene-Solr-Tests-7.x/solr/core/src/test-files/solr/collection1/conf/mapping-ISOLatin1Accent.txt to /configs/conf1/mapping-ISOLatin1Accent.txt
   [junit4]   2> 2185155 INFO  (TEST-ShardRoutingTest.test-seed#[2ED07635D40FE828]) [    ] o.a.s.c.ZkTestServer put /home/jenkins/jenkins-slave/workspace/Lucene-Solr-Tests-7.x/solr/core/src/test-files/solr/collection1/conf/old_synonyms.txt to /configs/conf1/old_synonyms.txt
   [junit4]   2> 2185155 INFO  (TEST-ShardRoutingTest.test-seed#[2ED07635D40FE828]) [    ] o.a.s.c.ZkTestServer put /home/jenkins/jenkins-slave/workspace/Lucene-Solr-Tests-7.x/solr/core/src/test-files/solr/collection1/conf/synonyms.txt to /configs/conf1/synonyms.txt
   [junit4]   2> 2185156 INFO  (TEST-ShardRoutingTest.test-seed#[2ED07635D40FE828]) [    ] o.a.s.c.AbstractFullDistribZkTestBase Will use NRT replicas unless explicitly asked otherwise
   [junit4]   2> 2185709 WARN  (TEST-ShardRoutingTest.test-seed#[2ED07635D40FE828]) [    ] o.e.j.s.AbstractConnector Ignoring deprecated socket close linger time
   [junit4]   2> 2185724 INFO  (TEST-ShardRoutingTest.test-seed#[2ED07635D40FE828]) [    ] o.a.s.c.s.e.JettySolrRunner Start Jetty (original configured port=0)
   [junit4]   2> 2185724 INFO  (TEST-ShardRoutingTest.test-seed#[2ED07635D40FE828]) [    ] o.a.s.c.s.e.JettySolrRunner Trying to start Jetty on port 0 try number 1 ...
   [junit4]   2> 2185725 INFO  (TEST-ShardRoutingTest.test-seed#[2ED07635D40FE828]) [    ] o.e.j.s.Server jetty-9.4.14.v20181114; built: 2018-11-14T21:20:31.478Z; git: c4550056e785fb5665914545889f21dc136ad9e6; jvm 1.8.0_191-b12
   [junit4]   2> 2185744 INFO  (TEST-ShardRoutingTest.test-seed#[2ED07635D40FE828]) [    ] o.e.j.s.session DefaultSessionIdManager workerName=node0
   [junit4]   2> 2185744 INFO  (TEST-ShardRoutingTest.test-seed#[2ED07635D40FE828]) [    ] o.e.j.s.session No SessionScavenger set, using defaults
   [junit4]   2> 2185744 INFO  (TEST-ShardRoutingTest.test-seed#[2ED07635D40FE828]) [    ] o.e.j.s.session node0 Scavenging every 600000ms
   [junit4]   2> 2185761 INFO  (TEST-ShardRoutingTest.test-seed#[2ED07635D40FE828]) [    ] o.e.j.s.h.ContextHandler Started o.e.j.s.ServletContextHandler@7e1e68e7{/,null,AVAILABLE}
   [junit4]   2> 2185763 INFO  (TEST-ShardRoutingTest.test-seed#[2ED07635D40FE828]) [    ] o.e.j.s.AbstractConnector Started ServerConnector@3fac3565{HTTP/1.1,[http/1.1]}{127.0.0.1:42070}
   [junit4]   2> 2185763 INFO  (TEST-ShardRoutingTest.test-seed#[2ED07635D40FE828]) [    ] o.e.j.s.Server Started @2185813ms
   [junit4]   2> 2185763 INFO  (TEST-ShardRoutingTest.test-seed#[2ED07635D40FE828]) [    ] o.a.s.c.s.e.JettySolrRunner Jetty properties: {solr.data.dir=/home/jenkins/jenkins-slave/workspace/Lucene-Solr-Tests-7.x/solr/build/solr-core/test/J0/temp/solr.cloud.ShardRoutingTest_2ED07635D40FE828-001/tempDir-001/control/data, hostContext=/, hostPort=42070, coreRootDirectory=/home/jenkins/jenkins-slave/workspace/Lucene-Solr-Tests-7.x/solr/build/solr-core/test/J0/../../../../../../../../../../home/jenkins/jenkins-slave/workspace/Lucene-Solr-Tests-7.x/solr/build/solr-core/test/J0/temp/solr.cloud.ShardRoutingTest_2ED07635D40FE828-001/control-001/cores}
   [junit4]   2> 2185763 ERROR (TEST-ShardRoutingTest.test-seed#[2ED07635D40FE828]) [    ] o.a.s.u.StartupLoggingUtils Missing Java Option solr.log.dir. Logging may be missing or incomplete.
   [junit4]   2> 2185763 INFO  (TEST-ShardRoutingTest.test-seed#[2ED07635D40FE828]) [    ] o.a.s.s.SolrDispatchFilter Using logger factory org.apache.logging.slf4j.Log4jLoggerFactory
   [junit4]   2> 2185763 INFO  (TEST-ShardRoutingTest.test-seed#[2ED07635D40FE828]) [    ] o.a.s.s.SolrDispatchFilter  ___      _       Welcome to Apache Solr™ version 7.7.0
   [junit4]   2> 2185763 INFO  (TEST-ShardRoutingTest.test-seed#[2ED07635D40FE828]) [    ] o.a.s.s.SolrDispatchFilter / __| ___| |_ _   Starting in cloud mode on port null
   [junit4]   2> 2185763 INFO  (TEST-ShardRoutingTest.test-seed#[2ED07635D40FE828]) [    ] o.a.s.s.SolrDispatchFilter \__ \/ _ \ | '_|  Install dir: null
   [junit4]   2> 2185763 INFO  (TEST-ShardRoutingTest.test-seed#[2ED07635D40FE828]) [    ] o.a.s.s.SolrDispatchFilter |___/\___/_|_|    Start time: 2019-01-15T08:01:50.380Z
   [junit4]   2> 2185784 INFO  (zkConnectionManagerCallback-5187-thread-1) [    ] o.a.s.c.c.ConnectionManager zkClient has connected
   [junit4]   2> 2185794 INFO  (TEST-ShardRoutingTest.test-seed#[2ED07635D40FE828]) [    ] o.a.s.s.SolrDispatchFilter Loading solr.xml from SolrHome (not found in ZooKeeper)
   [junit4]   2> 2185794 INFO  (TEST-ShardRoutingTest.test-seed#[2ED07635D40FE828]) [    ] o.a.s.c.SolrXmlConfig Loading container configuration from /home/jenkins/jenkins-slave/workspace/Lucene-Solr-Tests-7.x/solr/build/solr-core/test/J0/temp/solr.cloud.ShardRoutingTest_2ED07635D40FE828-001/control-001/solr.xml
   [junit4]   2> 2185798 INFO  (TEST-ShardRoutingTest.test-seed#[2ED07635D40FE828]) [    ] o.a.s.c.SolrXmlConfig Configuration parameter autoReplicaFailoverWorkLoopDelay is ignored
   [junit4]   2> 2185798 INFO  (TEST-ShardRoutingTest.test-seed#[2ED07635D40FE828]) [    ] o.a.s.c.SolrXmlConfig Configuration parameter autoReplicaFailoverBadNodeExpiration is ignored
   [junit4]   2> 2185799 INFO  (TEST-ShardRoutingTest.test-seed#[2ED07635D40FE828]) [    ] o.a.s.c.SolrXmlConfig MBean server found: com.sun.jmx.mbeanserver.JmxMBeanServer@6a5c1a61, but no JMX reporters were configured - adding default JMX reporter.
   [junit4]   2> 2186087 INFO  (TEST-ShardRoutingTest.test-seed#[2ED07635D40FE828]) [    ] o.a.s.c.ZkContainer Zookeeper client=127.0.0.1:43129/solr
   [junit4]   2> 2186167 INFO  (zkConnectionManagerCallback-5191-thread-1) [    ] o.a.s.c.c.ConnectionManager zkClient has connected
   [junit4]   2> 2186186 INFO  (zkConnectionManagerCallback-5193-thread-1) [    ] o.a.s.c.c.ConnectionManager zkClient has connected
   [junit4]   2> 2186458 INFO  (TEST-ShardRoutingTest.test-seed#[2ED07635D40FE828]) [n:127.0.0.1:42070_    ] o.a.s.c.OverseerElectionContext I am going to be the leader 127.0.0.1:42070_
   [junit4]   2> 2186459 INFO  (TEST-ShardRoutingTest.test-seed#[2ED07635D40FE828]) [n:127.0.0.1:42070_    ] o.a.s.c.Overseer Overseer (id=74015594141253636-127.0.0.1:42070_-n_0000000000) starting
   [junit4]   2> 2186523 INFO  (zkConnectionManagerCallback-5200-thread-1) [    ] o.a.s.c.c.ConnectionManager zkClient has connected
   [junit4]   2> 2186526 INFO  (TEST-ShardRoutingTest.test-seed#[2ED07635D40FE828]) [n:127.0.0.1:42070_    ] o.a.s.c.s.i.ZkClientClusterStateProvider Cluster at 127.0.0.1:43129/solr ready
   [junit4]   2> 2186539 INFO  (OverseerStateUpdate-74015594141253636-127.0.0.1:42070_-n_0000000000) [n:127.0.0.1:42070_    ] o.a.s.c.Overseer Starting to work on the main queue : 127.0.0.1:42070_
   [junit4]   2> 2186542 INFO  (TEST-ShardRoutingTest.test-seed#[2ED07635D40FE828]) [n:127.0.0.1:42070_    ] o.a.s.c.ZkController Register node as live in ZooKeeper:/live_nodes/127.0.0.1:42070_
   [junit4]   2> 2186620 INFO  (zkCallback-5199-thread-1) [    ] o.a.s.c.c.ZkStateReader Updated live nodes from ZooKeeper... (0) -> (1)
   [junit4]   2> 2186632 INFO  (zkCallback-5192-thread-1) [    ] o.a.s.c.c.ZkStateReader Updated live nodes from ZooKeeper... (0) -> (1)
   [junit4]   2> 2186669 INFO  (TEST-ShardRoutingTest.test-seed#[2ED07635D40FE828]) [n:127.0.0.1:42070_    ] o.a.s.h.a.MetricsHistoryHandler No .system collection, keeping metrics history in memory.
   [junit4]   2> 2186742 INFO  (TEST-ShardRoutingTest.test-seed#[2ED07635D40FE828]) [n:127.0.0.1:42070_    ] o.a.s.m.r.SolrJmxReporter JMX monitoring for 'solr.node' (registry 'solr.node') enabled at server: com.sun.jmx.mbeanserver.JmxMBeanServer@6a5c1a61
   [junit4]   2> 2186780 INFO  (TEST-ShardRoutingTest.test-seed#[2ED07635D40FE828]) [n:127.0.0.1:42070_    ] o.a.s.m.r.SolrJmxReporter JMX monitoring for 'solr.jvm' (registry 'solr.jvm') enabled at server: com.sun.jmx.mbeanserver.JmxMBeanServer@6a5c1a61
   [junit4]   2> 2186780 INFO  (TEST-ShardRoutingTest.test-seed#[2ED07635D40FE828]) [n:127.0.0.1:42070_    ] o.a.s.m.r.SolrJmxReporter JMX monitoring for 'solr.jetty' (registry 'solr.jetty') enabled at server: com.sun.jmx.mbeanserver.JmxMBeanServer@6a5c1a61
   [junit4]   2> 2186781 INFO  (TEST-ShardRoutingTest.test-seed#[2ED07635D40FE828]) [n:127.0.0.1:42070_    ] o.a.s.c.CorePropertiesLocator Found 0 core definitions underneath /home/jenkins/jenkins-slave/workspace/Lucene-Solr-Tests-7.x/solr/build/solr-core/test/J0/../../../../../../../../../../home/jenkins/jenkins-slave/workspace/Lucene-Solr-Tests-7.x/solr/build/solr-core/test/J0/temp/solr.cloud.ShardRoutingTest_2ED07635D40FE828-001/control-001/cores
   [junit4]   2> 2186986 INFO  (zkConnectionManagerCallback-5206-thread-1) [    ] o.a.s.c.c.ConnectionManager zkClient has connected
   [junit4]   2> 2186987 INFO  (TEST-ShardRoutingTest.test-seed#[2ED07635D40FE828]) [    ] o.a.s.c.c.ZkStateReader Updated live nodes from ZooKeeper... (0) -> (1)
   [junit4]   2> 2186988 INFO  (TEST-ShardRoutingTest.test-seed#[2ED07635D40FE828]) [    ] o.a.s.c.s.i.ZkClientClusterStateProvider Cluster at 127.0.0.1:43129/solr ready
   [junit4]   2> 2187067 INFO  (qtp882632197-16361) [n:127.0.0.1:42070_    ] o.a.s.h.a.CollectionsHandler Invoked Collection Action :create with params collection.configName=conf1&name=control_collection&nrtReplicas=1&action=CREATE&numShards=1&createNodeSet=127.0.0.1:42070_&wt=javabin&version=2 and sendToOCPQueue=true
   [junit4]   2> 2187148 INFO  (OverseerThreadFactory-6379-thread-1-processing-n:127.0.0.1:42070_) [n:127.0.0.1:42070_    ] o.a.s.c.a.c.CreateCollectionCmd Create collection control_collection
   [junit4]   2> 2187269 INFO  (qtp882632197-16363) [n:127.0.0.1:42070_    ] o.a.s.s.HttpSolrCall [admin] webapp=null path=/admin/metrics params={prefix=CONTAINER.fs.usableSpace,CONTAINER.fs.totalSpace,CORE.coreName&wt=javabin&version=2&group=solr.node,solr.core} status=0 QTime=0
   [junit4]   2> 2187270 INFO  (qtp882632197-16364) [n:127.0.0.1:42070_    ] o.a.s.s.HttpSolrCall [admin] webapp=null path=/admin/metrics params={prefix=CONTAINER.fs.usableSpace,CONTAINER.fs.totalSpace,CORE.coreName&wt=javabin&version=2&group=solr.node,solr.core} status=0 QTime=0
   [junit4]   2> 2187270 INFO  (qtp882632197-16360) [n:127.0.0.1:42070_    ] o.a.s.s.HttpSolrCall [admin] webapp=null path=/admin/metrics params={prefix=CONTAINER.fs.usableSpace,CONTAINER.fs.totalSpace,CORE.coreName&wt=javabin&version=2&group=solr.node,solr.core} status=0 QTime=0
   [junit4]   2> 2187271 INFO  (qtp882632197-16362) [n:127.0.0.1:42070_    ] o.a.s.s.HttpSolrCall [admin] webapp=null path=/admin/metrics params={prefix=CONTAINER.fs.usableSpace,CONTAINER.fs.totalSpace,CORE.coreName&wt=javabin&version=2&group=solr.node,solr.core} status=0 QTime=0
   [junit4]   2> 2187272 INFO  (qtp882632197-16363) [n:127.0.0.1:42070_    ] o.a.s.s.HttpSolrCall [admin] webapp=null path=/admin/metrics params={prefix=CONTAINER.fs.usableSpace,CONTAINER.fs.totalSpace,CORE.coreName&wt=javabin&version=2&group=solr.node,solr.core} status=0 QTime=0
   [junit4]   2> 2187313 INFO  (qtp882632197-16364) [n:127.0.0.1:42070_    x:control_collection_shard1_replica_n1] o.a.s.h.a.CoreAdminOperation core create command qt=/admin/cores&collection.configName=conf1&newCollection=true&name=control_collection_shard1_replica_n1&action=CREATE&numShards=1&collection=control_collection&shard=shard1&wt=javabin&version=2&replicaType=NRT
   [junit4]   2> 2187313 INFO  (qtp882632197-16364) [n:127.0.0.1:42070_    x:control_collection_shard1_replica_n1] o.a.s.c.TransientSolrCoreCacheDefault Allocating transient cache for 4 transient cores
   [junit4]   2> 2188616 INFO  (qtp882632197-16364) [n:127.0.0.1:42070_ c:control_collection s:shard1  x:control_collection_shard1_replica_n1] o.a.s.c.SolrConfig Using Lucene MatchVersion: 7.7.0
   [junit4]   2> 2188721 INFO  (qtp882632197-16364) [n:127.0.0.1:42070_ c:control_collection s:shard1  x:control_collection_shard1_replica_n1] o.a.s.s.IndexSchema [control_collection_shard1_replica_n1] Schema name=test
   [junit4]   2> 2189208 INFO  (qtp882632197-16364) [n:127.0.0.1:42070_ c:control_collection s:shard1  x:control_collection_shard1_replica_n1] o.a.s.s.IndexSchema Loaded schema test/1.6 with uniqueid field id
   [junit4]   2> 2189283 INFO  (qtp882632197-16364) [n:127.0.0.1:42070_ c:control_collection s:shard1  x:control_collection_shard1_replica_n1] o.a.s.c.CoreContainer Creating SolrCore 'control_collection_shard1_replica_n1' using configuration from collection control_collection, trusted=true
   [junit4]   2> 2189284 INFO  (qtp882632197-16364) [n:127.0.0.1:42070_ c:control_collection s:shard1  x:control_collection_shard1_replica_n1] o.a.s.m.r.SolrJmxReporter JMX monitoring for 'solr.core.control_collection.shard1.replica_n1' (registry 'solr.core.control_collection.shard1.replica_n1') enabled at server: com.sun.jmx.mbeanserver.JmxMBeanServer@6a5c1a61
   [junit4]   2> 2189284 INFO  (qtp882632197-16364) [n:127.0.0.1:42070_ c:control_collection s:shard1  x:control_collection_shard1_replica_n1] o.a.s.c.SolrCore [[control_collection_shard1_replica_n1] ] Opening new SolrCore at [/home/jenkins/jenkins-slave/workspace/Lucene-Solr-Tests-7.x/solr/build/solr-core/test/J0/temp/solr.cloud.ShardRoutingTest_2ED07635D40FE828-001/control-001/cores/control_collection_shard1_replica_n1], dataDir=[/home/jenkins/jenkins-slave/workspace/Lucene-Solr-Tests-7.x/solr/build/solr-core/test/J0/../../../../../../../../../../home/jenkins/jenkins-slave/workspace/Lucene-Solr-Tests-7.x/solr/build/solr-core/test/J0/temp/solr.cloud.ShardRoutingTest_2ED07635D40FE828-001/control-001/cores/control_collection_shard1_replica_n1/data/]
   [junit4]   2> 2189299 INFO  (qtp882632197-16364) [n:127.0.0.1:42070_ c:control_collection s:shard1  x:control_collection_shard1_replica_n1] o.a.s.u.RandomMergePolicy RandomMergePolicy wrapping class org.apache.lucene.index.MockRandomMergePolicy: org.apache.lucene.index.MockRandomMergePolicy@117adc51
   [junit4]   2> 2189347 WARN  (qtp882632197-16364) [n:127.0.0.1:42070_ c:control_collection s:shard1  x:control_collection_shard1_replica_n1] o.a.s.c.RequestHandlers INVALID paramSet a in requestHandler {type = requestHandler,name = /dump,class = DumpRequestHandler,attributes = {initParams=a, name=/dump, class=DumpRequestHandler},args = {defaults={a=A,b=B}}}
   [junit4]   2> 2189531 INFO  (qtp882632197-16364) [n:127.0.0.1:42070_ c:control_collection s:shard1  x:control_collection_shard1_replica_n1] o.a.s.u.UpdateHandler Using UpdateLog implementation: org.apache.solr.update.UpdateLog
   [junit4]   2> 2189531 INFO  (qtp882632197-16364) [n:127.0.0.1:42070_ c:control_collection s:shard1  x:control_collection_shard1_replica_n1] o.a.s.u.UpdateLog Initializing UpdateLog: dataDir= defaultSyncLevel=FLUSH numRecordsToKeep=100 maxNumLogsToKeep=10 numVersionBuckets=65536
   [junit4]   2> 2189566 INFO  (qtp882632197-16364) [n:127.0.0.1:42070_ c:control_collection s:shard1  x:control_collection_shard1_replica_n1] o.a.s.u.CommitTracker Hard AutoCommit: disabled
   [junit4]   2> 2189566 INFO  (qtp882632197-16364) [n:127.0.0.1:42070_ c:control_collection s:shard1  x:control_collection_shard1_replica_n1] o.a.s.u.CommitTracker Soft AutoCommit: disabled
   [junit4]   2> 2189567 INFO  (qtp882632197-16364) [n:127.0.0.1:42070_ c:control_collection s:shard1  x:control_collection_shard1_replica_n1] o.a.s.u.RandomMergePolicy RandomMergePolicy wrapping class org.apache.lucene.index.LogDocMergePolicy: [LogDocMergePolicy: minMergeSize=1000, mergeFactor=11, maxMergeSize=9223372036854775807, maxMergeSizeForForcedMerge=9223372036854775807, calibrateSizeByDeletes=true, maxMergeDocs=2147483647, maxCFSSegmentSizeMB=8.796093022207999E12, noCFSRatio=0.7139099492317723]
   [junit4]   2> 2189567 INFO  (qtp882632197-16364) [n:127.0.0.1:42070_ c:control_collection s:shard1  x:control_collection_shard1_replica_n1] o.a.s.s.SolrIndexSearcher Opening [Searcher@713637ff[control_collection_shard1_replica_n1] main]
   [junit4]   2> 2189581 INFO  (qtp882632197-16364) [n:127.0.0.1:42070_ c:control_collection s:shard1  x:control_collection_shard1_replica_n1] o.a.s.r.ManagedResourceStorage Configured ZooKeeperStorageIO with znodeBase: /configs/conf1
   [junit4]   2> 2189583 INFO  (qtp882632197-16364) [n:127.0.0.1:42070_ c:control_collection s:shard1  x:control_collection_shard1_replica_n1] o.a.s.r.ManagedResourceStorage Loaded null at path _rest_managed.json using ZooKeeperStorageIO:path=/configs/conf1
   [junit4]   2> 2189583 INFO  (qtp882632197-16364) [n:127.0.0.1:42070_ c:control_collection s:shard1  x:control_collection_shard1_replica_n1] o.a.s.h.ReplicationHandler Commits will be reserved for 10000ms.
   [junit4]   2> 2189583 INFO  (qtp882632197-16364) [n:127.0.0.1:42070_ c:control_collection s:shard1  x:control_collection_shard1_replica_n1] o.a.s.u.UpdateLog Could not find max version in index or recent updates, using new clock 1622712583926579200
   [junit4]   2> 2189618 INFO  (searcherExecutor-6384-thread-1-processing-n:127.0.0.1:42070_ x:control_collection_shard1_replica_n1 c:control_collection s:shard1) [n:127.0.0.1:42070_ c:control_collection s:shard1  x:control_collection_shard1_replica_n1] o.a.s.c.SolrCore [control_collection_shard1_replica_n1] Registered new searcher Searcher@713637ff[control_collection_shard1_replica_n1] main{ExitableDirectoryReader(UninvertingDirectoryReader())}
   [junit4]   2> 2189652 INFO  (qtp882632197-16364) [n:127.0.0.1:42070_ c:control_collection s:shard1  x:control_collection_shard1_replica_n1] o.a.s.c.ZkShardTerms Successful update of terms at /collections/control_collection/terms/shard1 to Terms{values={core_node2=0}, version=0}
   [junit4]   2> 2189652 INFO  (qtp882632197-16364) [n:127.0.0.1:42070_ c:control_collection s:shard1  x:control_collection_shard1_replica_n1] o.a.s.c.ShardLeaderElectionContextBase make sure parent is created /collections/control_collection/leaders/shard1
   [junit4]   2> 2189666 INFO  (qtp882632197-16364) [n:127.0.0.1:42070_ c:control_collection s:shard1  x:control_collection_shard1_replica_n1] o.a.s.c.ShardLeaderElectionContext Enough replicas found to continue.
   [junit4]   2> 2189666 INFO  (qtp882632197-16364) [n:127.0.0.1:42070_ c:control_collection s:shard1  x:control_collection_shard1_replica_n1] o.a.s.c.ShardLeaderElectionContext I may be the new leader - try and sync
   [junit4]   2> 2189666 INFO  (qtp882632197-16364) [n:127.0.0.1:42070_ c:control_collection s:shard1  x:control_collection_shard1_replica_n1] o.a.s.c.SyncStrategy Sync replicas to http://127.0.0.1:42070/control_collection_shard1_replica_n1/
   [junit4]   2> 2189667 INFO  (qtp882632197-16364) [n:127.0.0.1:42070_ c:control_collection s:shard1  x:control_collection_shard1_replica_n1] o.a.s.c.SyncStrategy Sync Success - now sync replicas to me
   [junit4]   2> 2189667 INFO  (qtp882632197-16364) [n:127.0.0.1:42070_ c:control_collection s:shard1  x:control_collection_shard1_replica_n1] o.a.s.c.SyncStrategy http://127.0.0.1:42070/control_collection_shard1_replica_n1/ has no replicas
   [junit4]   2> 2189667 INFO  (qtp882632197-16364) [n:127.0.0.1:42070_ c:control_collection s:shard1  x:control_collection_shard1_replica_n1] o.a.s.c.ShardLeaderElectionContext Found all replicas participating in election, clear LIR
   [junit4]   2> 2189667 INFO  (qtp882632197-16364) [n:127.0.0.1:42070_ c:control_collection s:shard1  x:control_collection_shard1_replica_n1] o.a.s.c.ShardLeaderElectionContextBase Creating leader registration node /collections/control_collection/leaders/shard1/leader after winning as /collections/control_collection/leader_elect/shard1/election/74015594141253636-core_node2-n_0000000000
   [junit4]   2> 2189668 INFO  (qtp882632197-16364) [n:127.0.0.1:42070_ c:control_collection s:shard1  x:control_collection_shard1_replica_n1] o.a.s.c.ShardLeaderElectionContext I am the new leader: http://127.0.0.1:42070/control_collection_shard1_replica_n1/ shard1
   [junit4]   2> 2189670 INFO  (zkCallback-5192-thread-1) [    ] o.a.s.c.c.ZkStateReader A cluster state change: [WatchedEvent state:SyncConnected type:NodeDataChanged path:/collections/control_collection/state.json] for collection [control_collection] has occurred - updating... (live nodes size: [1])
   [junit4]   2> 2189674 INFO  (zkCallback-5192-thread-2) [    ] o.a.s.c.c.ZkStateReader A cluster state change: [WatchedEvent state:SyncConnected type:NodeDataChanged path:/collections/control_collection/state.json] for collection [control_collection] has occurred - updating... (live nodes size: [1])
   [junit4]   2> 2189687 INFO  (qtp882632197-16364) [n:127.0.0.1:42070_ c:control_collection s:shard1  x:control_collection_shard1_replica_n1] o.a.s.c.ZkController I am the leader, no recovery necessary
   [junit4]   2> 2189688 INFO  (qtp882632197-16364) [n:127.0.0.1:42070_ c:control_collection s:shard1  x:control_collection_shard1_replica_n1] o.a.s.s.HttpSolrCall [admin] webapp=null path=/admin/cores params={qt=/admin/cores&collection.configName=conf1&newCollection=true&name=control_collection_shard1_replica_n1&action=CREATE&numShards=1&collection=control_collection&shard=shard1&wt=javabin&version=2&replicaType=NRT} status=0 QTime=2375
   [junit4]   2> 2189720 INFO  (qtp882632197-16361) [n:127.0.0.1:42070_    ] o.a.s.h.a.CollectionsHandler Wait for new collection to be active for at most 45 seconds. Check all shard replicas
   [junit4]   2> 2189893 INFO  (zkCallback-5192-thread-2) [    ] o.a.s.c.c.ZkStateReader A cluster state change: [WatchedEvent state:SyncConnected type:NodeDataChanged path:/collections/control_collection/state.json] for collection [control_collection] has occurred - updating... (live nodes size: [1])
   [junit4]   2> 2189893 INFO  (zkCallback-5192-thread-1) [    ] o.a.s.c.c.ZkStateReader A cluster state change: [WatchedEvent state:SyncConnected type:NodeDataChanged path:/collections/control_collection/state.json] for collection [control_collection] has occurred - updating... (live nodes size: [1])
   [junit4]   2> 2189909 INFO  (zkCallback-5192-thread-3) [    ] o.a.s.c.c.ZkStateReader A cluster state change: [WatchedEvent state:SyncConnected type:NodeDataChanged path:/collections/control_collection/state.json] for collection [control_collection] has occurred - updating... (live nodes size: [1])
   [junit4]   2> 2189913 INFO  (qtp882632197-16361) [n:127.0.0.1:42070_    ] o.a.s.s.HttpSolrCall [admin] webapp=null path=/admin/collections params={collection.configName=conf1&name=control_collection&nrtReplicas=1&action=CREATE&numShards=1&createNodeSet=127.0.0.1:42070_&wt=javabin&version=2} status=0 QTime=2846
   [junit4]   2> 2189955 INFO  (zkConnectionManagerCallback-5211-thread-1) [    ] o.a.s.c.c.ConnectionManager zkClient has connected
   [junit4]   2> 2189956 INFO  (TEST-ShardRoutingTest.test-seed#[2ED07635D40FE828]) [    ] o.a.s.c.c.ZkStateReader Updated live nodes from ZooKeeper... (0) -> (1)
   [junit4]   2> 2189956 INFO  (TEST-ShardRoutingTest.test-seed#[2ED07635D40FE828]) [    ] o.a.s.c.s.i.ZkClientClusterStateProvider Cluster at 127.0.0.1:43129/solr ready
   [junit4]   2> 2189956 INFO  (TEST-ShardRoutingTest.test-seed#[2ED07635D40FE828]) [    ] o.a.s.c.ChaosMonkey monkey: init - expire sessions:false cause connection loss:false
   [junit4]   2> 2189974 INFO  (qtp882632197-16364) [n:127.0.0.1:42070_    ] o.a.s.h.a.CollectionsHandler Invoked Collection Action :create with params collection.configName=conf1&name=collection1&nrtReplicas=1&action=CREATE&numShards=4&createNodeSet=&stateFormat=2&wt=javabin&version=2 and sendToOCPQueue=true
   [junit4]   2> 2190035 INFO  (OverseerThreadFactory-6379-thread-2-processing-n:127.0.0.1:42070_) [n:127.0.0.1:42070_    ] o.a.s.c.a.c.CreateCollectionCmd Create collection collection1
   [junit4]   2> 2190035 INFO  (OverseerCollectionConfigSetProcessor-74015594141253636-127.0.0.1:42070_-n_0000000000) [n:127.0.0.1:42070_    ] o.a.s.c.OverseerTaskQueue Response ZK path: /overseer/collection-queue-work/qnr-0000000000 doesn't exist.  Requestor may have disconnected from ZooKeeper
   [junit4]   2> 2190254 WARN  (OverseerThreadFactory-6379-thread-2-processing-n:127.0.0.1:42070_) [n:127.0.0.1:42070_    ] o.a.s.c.a.c.CreateCollectionCmd It is unusual to create a collection (collection1) without cores.
   [junit4]   2> 2190255 INFO  (qtp882632197-16364) [n:127.0.0.1:42070_    ] o.a.s.h.a.CollectionsHandler Wait for new collection to be active for at most 45 seconds. Check all shard replicas
   [junit4]   2> 2190256 INFO  (qtp882632197-16364) [n:127.0.0.1:42070_    ] o.a.s.s.HttpSolrCall [admin] webapp=null path=/admin/collections params={collection.configName=conf1&name=collection1&nrtReplicas=1&action=CREATE&numShards=4&createNodeSet=&stateFormat=2&wt=javabin&version=2} status=0 QTime=281
   [junit4]   2> 2190270 INFO  (TEST-ShardRoutingTest.test-seed#[2ED07635D40FE828]) [    ] o.a.s.c.AbstractFullDistribZkTestBase Creating jetty instances pullReplicaCount=0 numOtherReplicas=8
   [junit4]   2> 2191110 INFO  (TEST-ShardRoutingTest.test-seed#[2ED07635D40FE828]) [    ] o.a.s.c.AbstractFullDistribZkTestBase create jetty 1 in directory /home/jenkins/jenkins-slave/workspace/Lucene-Solr-Tests-7.x/solr/build/solr-core/test/J0/temp/solr.cloud.ShardRoutingTest_2ED07635D40FE828-001/shard-1-001 of type NRT
   [junit4]   2> 2191124 WARN  (closeThreadPool-5212-thread-1) [    ] o.e.j.s.AbstractConnector Ignoring deprecated socket close linger time
   [junit4]   2> 2191125 INFO  (closeThreadPool-5212-thread-1) [    ] o.a.s.c.s.e.JettySolrRunner Start Jetty (original configured port=0)
   [junit4]   2> 2191125 INFO  (closeThreadPool-5212-thread-1) [    ] o.a.s.c.s.e.JettySolrRunner Trying to start Jetty on port 0 try number 1 ...
   [junit4]   2> 2191125 INFO  (closeThreadPool-5212-thread-1) [    ] o.e.j.s.Server jetty-9.4.14.v20181114; built: 2018-11-14T21:20:31.478Z; git: c4550056e785fb5665914545889f21dc136ad9e6; jvm 1.8.0_191-b12
   [junit4]   2> 2191161 INFO  (closeThreadPool-5212-thread-1) [    ] o.e.j.s.session DefaultSessionIdManager workerName=node0
   [junit4]   2> 2191161 INFO  (closeThreadPool-5212-thread-1) [    ] o.e.j.s.session No SessionScavenger set, using defaults
   [junit4]   2> 2191161 INFO  (closeThreadPool-5212-thread-1) [    ] o.e.j.s.session node0 Scavenging every 660000ms
   [junit4]   2> 2191181 INFO  (closeThreadPool-5212-thread-1) [    ] o.e.j.s.h.ContextHandler Started o.e.j.s.ServletContextHandler@242ca571{/,null,AVAILABLE}
   [junit4]   2> 2191182 INFO  (closeThreadPool-5212-thread-1) [    ] o.e.j.s.AbstractConnector Started ServerConnector@76f0073b{HTTP/1.1,[http/1.1]}{127.0.0.1:38304}
   [junit4]   2> 2191182 INFO  (closeThreadPool-5212-thread-1) [    ] o.e.j.s.Server Started @2191232ms
   [junit4]   2> 2191182 INFO  (closeThreadPool-5212-thread-1) [    ] o.a.s.c.s.e.JettySolrRunner Jetty properties: {solr.data.dir=/home/jenkins/jenkins-slave/workspace/Lucene-Solr-Tests-7.x/solr/build/solr-core/test/J0/temp/solr.cloud.ShardRoutingTest_2ED07635D40FE828-001/tempDir-001/jetty1, replicaType=NRT, solrconfig=solrconfig.xml, hostContext=/, hostPort=38304, coreRootDirectory=/home/jenkins/jenkins-slave/workspace/Lucene-Solr-Tests-7.x/solr/build/solr-core/test/J0/../../../../../../../../../../home/jenkins/jenkins-slave/workspace/Lucene-Solr-Tests-7.x/solr/build/solr-core/test/J0/temp/solr.cloud.ShardRoutingTest_2ED07635D40FE828-001/shard-1-001/cores}
   [junit4]   2> 2191182 ERROR (closeThreadPool-5212-thread-1) [    ] o.a.s.u.StartupLoggingUtils Missing Java Option solr.log.dir. Logging may be missing or incomplete.
   [junit4]   2> 2191182 INFO  (closeThreadPool-5212-thread-1) [    ] o.a.s.s.SolrDispatchFilter Using logger factory org.apache.logging.slf4j.Log4jLoggerFactory
   [junit4]   2> 2191182 INFO  (closeThreadPool-5212-thread-1) [    ] o.a.s.s.SolrDispatchFilter  ___      _       Welcome to Apache Solr™ version 7.7.0
   [junit4]   2> 2191182 INFO  (closeThreadPool-5212-thread-1) [    ] o.a.s.s.SolrDispatchFilter / __| ___| |_ _   Starting in cloud mode on port null
   [junit4]   2> 2191182 INFO  (closeThreadPool-5212-thread-1) [    ] o.a.s.s.SolrDispatchFilter \__ \/ _ \ | '_|  Install dir: null
   [junit4]   2> 2191182 INFO  (closeThreadPool-5212-thread-1) [    ] o.a.s.s.SolrDispatchFilter |___/\___/_|_|    Start time: 2019-01-15T08:01:55.799Z
   [junit4]   2> 2191184 INFO  (zkConnectionManagerCallback-5214-thread-1) [    ] o.a.s.c.c.ConnectionManager zkClient has connected
   [junit4]   2> 2191185 INFO  (closeThreadPool-5212-thread-1) [    ] o.a.s.s.SolrDispatchFilter Loading solr.xml from SolrHome (not found in ZooKeeper)
   [junit4]   2> 2191185 INFO  (closeThreadPool-5212-thread-1) [    ] o.a.s.c.SolrXmlConfig Loading container configuration from /home/jenkins/jenkins-slave/workspace/Lucene-Solr-Tests-7.x/solr/build/solr-core/test/J0/temp/solr.cloud.ShardRoutingTest_2ED07635D40FE828-001/shard-1-001/solr.xml
   [junit4]   2> 2191221 INFO  (closeThreadPool-5212-thread-1) [    ] o.a.s.c.SolrXmlConfig Configuration parameter autoReplicaFailoverWorkLoopDelay is ignored
   [junit4]   2> 2191221 INFO  (closeThreadPool-5212-thread-1) [    ] o.a.s.c.SolrXmlConfig Configuration parameter autoReplicaFailoverBadNodeExpiration is ignored
   [junit4]   2> 2191234 INFO  (closeThreadPool-5212-thread-1) [    ] o.a.s.c.SolrXmlConfig MBean server found: com.sun.jmx.mbeanserver.JmxMBeanServer@6a5c1a61, but no JMX reporters were configured - adding default JMX reporter.
   [junit4]   2> 2192041 INFO  (OverseerCollectionConfigSetProcessor-74015594141253636-127.0.0.1:42070_-n_0000000000) [n:127.0.0.1:42070_    ] o.a.s.c.OverseerTaskQueue Response ZK path: /overseer/collection-queue-work/qnr-0000000002 doesn't exist.  Requestor may have disconnected from ZooKeeper
   [junit4]   2> 2192649 INFO  (TEST-ShardRoutingTest.test-seed#[2ED07635D40FE828]) [    ] o.a.s.c.AbstractFullDistribZkTestBase create jetty 2 in directory /home/jenkins/jenkins-slave/workspace/Lucene-Solr-Tests-7.x/solr/build/solr-core/test/J0/temp/solr.cloud.ShardRoutingTest_2ED07635D40FE828-001/shard-2-001 of type NRT
   [junit4]   2> 2192684 WARN  (closeThreadPool-5212-thread-2) [    ] o.e.j.s.AbstractConnector Ignoring deprecated socket close linger time
   [junit4]   2> 2192685 INFO  (closeThreadPool-5212-thread-2) [    ] o.a.s.c.s.e.JettySolrRunner Start Jetty (original configured port=0)
   [junit4]   2> 2192685 INFO  (closeThreadPool-5212-thread-2) [    ] o.a.s.c.s.e.JettySolrRunner Trying to start Jetty on port 0 try number 1 ...
   [junit4]   2> 2192685 INFO  (closeThreadPool-5212-thread-2) [    ] o.e.j.s.Server jetty-9.4.14.v20181114; built: 2018-11-14T21:20:31.478Z; git: c4550056e785fb5665914545889f21dc136ad9e6; jvm 1.8.0_191-b12
   [junit4]   2> 2192903 INFO  (closeThreadPool-5212-thread-2) [    ] o.e.j.s.session DefaultSessionIdManager workerName=node0
   [junit4]   2> 2192903 INFO  (closeThreadPool-5212-thread-2) [    ] o.e.j.s.session No SessionScavenger set, using defaults
   [junit4]   2> 2192903 INFO  (closeThreadPool-5212-thread-2) [    ] o.e.j.s.session node0 Scavenging every 660000ms
   [junit4]   2> 2192903 INFO  (closeThreadPool-5212-thread-2) [    ] o.e.j.s.h.ContextHandler Started o.e.j.s.ServletContextHandler@22383fbb{/,null,AVAILABLE}
   [junit4]   2> 2192942 INFO  (closeThreadPool-5212-thread-1) [    ] o.a.s.c.ZkContainer Zookeeper client=127.0.0.1:43129/solr
   [junit4]   2> 2192959 INFO  (closeThreadPool-5212-thread-2) [    ] o.e.j.s.AbstractConnector Started ServerConnector@383ca5f{HTTP/1.1,[http/1.1]}{127.0.0.1:34485}
   [junit4]   2> 2192960 INFO  (closeThreadPool-5212-thread-2) [    ] o.e.j.s.Server Started @2193010ms
   [junit4]   2> 2192960 INFO  (closeThreadPool-5212-thread-2) [    ] o.a.s.c.s.e.JettySolrRunner Jetty properties: {solr.data.dir=/home/jenkins/jenkins-slave/workspace/Lucene-Solr-Tests-7.x/solr/build/solr-core/test/J0/temp/solr.cloud.ShardRoutingTest_2ED07635D40FE828-001/tempDir-001/jetty2, replicaType=NRT, solrconfig=solrconfig.xml, hostContext=/, hostPort=34485, coreRootDirectory=/home/jenkins/jenkins-slave/workspace/Lucene-Solr-Tests-7.x/solr/build/solr-core/test/J0/../../../../../../../../../../home/jenkins/jenkins-slave/workspace/Lucene-Solr-Tests-7.x/solr/build/solr-core/test/J0/temp/solr.cloud.ShardRoutingTest_2ED07635D40FE828-001/shard-2-001/cores}
   [junit4]   2> 2192960 ERROR (closeThreadPool-5212-thread-2) [    ] o.a.s.u.StartupLoggingUtils Missing Java Option solr.log.dir. Logging may be missing or incomplete.
   [junit4]   2> 2192960 INFO  (closeThreadPool-5212-thread-2) [    ] o.a.s.s.SolrDispatchFilter Using logger factory org.apache.logging.slf4j.Log4jLoggerFactory
   [junit4]   2> 2192960 INFO  (closeThreadPool-5212-thread-2) [    ] o.a.s.s.SolrDispatchFilter  ___      _       Welcome to Apache Solr™ version 7.7.0
   [junit4]   2> 2192960 INFO  (closeThreadPool-5212-thread-2) [    ] o.a.s.s.SolrDispatchFilter / __| ___| |_ _   Starting in cloud mode on port null
   [junit4]   2> 2192960 INFO  (closeThreadPool-5212-thread-2) [    ] o.a.s.s.SolrDispatchFilter \__ \/ _ \ | '_|  Install dir: null
   [junit4]   2> 2192960 INFO  (closeThreadPool-5212-thread-2) [    ] o.a.s.s.SolrDispatchFilter |___/\___/_|_|    Start time: 2019-01-15T08:01:57.577Z
   [junit4]   2> 2193013 INFO  (zkConnectionManagerCallback-5220-thread-1) [    ] o.a.s.c.c.ConnectionManager zkClient has connected
   [junit4]   2> 2193031 INFO  (zkConnectionManagerCallback-5218-thread-1) [    ] o.a.s.c.c.ConnectionManager zkClient has connected
   [junit4]   2> 2193035 INFO  (closeThreadPool-5212-thread-2) [    ] o.a.s.s.SolrDispatchFilter Loading solr.xml from SolrHome (not found in ZooKeeper)
   [junit4]   2> 2193035 INFO  (closeThreadPool-5212-thread-2) [    ] o.a.s.c.SolrXmlConfig Loading container configuration from /home/jenkins/jenkins-slave/workspace/Lucene-Solr-Tests-7.x/solr/build/solr-core/test/J0/temp/solr.cloud.ShardRoutingTest_2ED07635D40FE828-001/shard-2-001/solr.xml
   [junit4]   2> 2193052 INFO  (closeThreadPool-5212-thread-2) [    ] o.a.s.c.SolrXmlConfig Configuration parameter autoReplicaFailoverWorkLoopDelay is ignored
   [junit4]   2> 2193052 INFO  (closeThreadPool-5212-thread-2) [    ] o.a.s.c.SolrXmlConfig Configuration parameter autoReplicaFailoverBadNodeExpiration is ignored
   [junit4]   2> 2193070 INFO  (closeThreadPool-5212-thread-2) [    ] o.a.s.c.SolrXmlConfig MBean server found: com.sun.jmx.mbeanserver.JmxMBeanServer@6a5c1a61, but no JMX reporters were configured - adding default JMX reporter.
   [junit4]   2> 2193178 INFO  (zkConnectionManagerCallback-5222-thread-1) [    ] o.a.s.c.c.ConnectionManager zkClient has connected
   [junit4]   2> 2193518 INFO  (closeThreadPool-5212-thread-1) [n:127.0.0.1:38304_    ] o.a.s.c.c.ZkStateReader Updated live nodes from ZooKeeper... (0) -> (1)
   [junit4]   2> 2193521 INFO  (closeThreadPool-5212-thread-1) [n:127.0.0.1:38304_    ] o.a.s.c.ZkController Publish node=127.0.0.1:38304_ as DOWN
   [junit4]   2> 2193521 INFO  (closeThreadPool-5212-thread-1) [n:127.0.0.1:38304_    ] o.a.s.c.TransientSolrCoreCacheDefault Allocating transient cache for 4 transient cores
   [junit4]   2> 2193521 INFO  (closeThreadPool-5212-thread-1) [n:127.0.0.1:38304_    ] o.a.s.c.ZkController Register node as live in ZooKeeper:/live_nodes/127.0.0.1:38304_
   [junit4]   2> 2193526 INFO  (closeThreadPool-5212-thread-2) [    ] o.a.s.c.ZkContainer Zookeeper client=127.0.0.1:43129/solr
   [junit4]   2> 2193547 INFO  (zkCallback-5192-thread-1) [    ] o.a.s.c.c.ZkStateReader Updated live nodes from ZooKeeper... (1) -> (2)
   [junit4]   2> 2193555 INFO  (zkCallback-5199-thread-1) [    ] o.a.s.c.c.ZkStateReader Updated live nodes from ZooKeeper... (1) -> (2)
   [junit4]   2> 2193603 INFO  (zkCallback-5221-thread-1) [    ] o.a.s.c.c.ZkStateReader Updated live nodes from ZooKeeper... (1) -> (2)
   [junit4]   2> 2193640 INFO  (zkCallback-5210-thread-1) [    ] o.a.s.c.c.ZkStateReader Updated live nodes from ZooKeeper... (1) -> (2)
   [junit4]   2> 2193656 INFO  (zkConnectionManagerCallback-5228-thread-1) [    ] o.a.s.c.c.ConnectionManager zkClient has connected
   [junit4]   2> 2193786 INFO  (zkConnectionManagerCallback-5230-thread-1) [    ] o.a.s.c.c.ConnectionManager zkClient has connected
   [junit4]   2> 2193792 INFO  (closeThreadPool-5212-thread-2) [n:127.0.0.1:34485_    ] o.a.s.c.c.ZkStateReader Updated live nodes from ZooKeeper... (0) -> (2)
   [junit4]   2> 2193849 INFO  (closeThreadPool-5212-thread-2) [n:127.0.0.1:34485_    ] o.a.s.c.ZkController Publish node=127.0.0.1:34485_ as DOWN
   [junit4]   2> 2193850 INFO  (closeThreadPool-5212-thread-2) [n:127.0.0.1:34485_    ] o.a.s.c.TransientSolrCoreCacheDefault Allocating transient cache for 4 transient cores
   [junit4]   2> 2193850 INFO  (closeThreadPool-5212-thread-2) [n:127.0.0.1:34485_    ] o.a.s.c.ZkController Register node as live in ZooKeeper:/live_nodes/127.0.0.1:34485_
   [junit4]   2> 2193875 INFO  (zkCallback-5210-thread-1) [    ] o.a.s.c.c.ZkStateReader Updated live nodes from ZooKeeper... (2) -> (3)
   [junit4]   2> 2193895 INFO  (zkCallback-5192-thread-1) [    ] o.a.s.c.c.ZkStateReader Updated live nodes from ZooKeeper... (2) -> (3)
   [junit4]   2> 2193895 INFO  (zkCallback-5221-thread-1) [    ] o.a.s.c.c.ZkStateReader Updated live nodes from ZooKeeper... (2) -> (3)
   [junit4]   2> 2193907 INFO  (zkCallback-5199-thread-1) [    ] o.a.s.c.c.ZkStateReader Updated live nodes from ZooKeeper... (2) -> (3)
   [junit4]   2> 2194009 INFO  (zkCallback-5229-thread-1) [    ] o.a.s.c.c.ZkStateReader Updated live nodes from ZooKeeper... (2) -> (3)
   [junit4]   2> 2194057 INFO  (zkConnectionManagerCallback-5237-thread-1) [    ] o.a.s.c.c.ConnectionManager zkClient has connected
   [junit4]   2> 2194079 INFO  (zkConnectionManagerCallback-5242-thread-1) [    ] o.a.s.c.c.ConnectionManager zkClient has connected
   [junit4]   2> 2194079 INFO  (closeThreadPool-5212-thread-2) [n:127.0.0.1:34485_    ] o.a.s.c.c.ZkStateReader Updated live nodes from ZooKeeper... (0) -> (3)
   [junit4]   2> 2194080 INFO  (closeThreadPool-5212-thread-2) [n:127.0.0.1:34485_    ] o.a.s.c.s.i.ZkClientClusterStateProvider Cluster at 127.0.0.1:43129/solr ready
   [junit4]   2> 2194080 INFO  (closeThreadPool-5212-thread-2) [n:127.0.0.1:34485_    ] o.a.s.h.a.MetricsHistoryHandler No .system collection, keeping metrics history in memory.
   [junit4]   2> 2194094 INFO  (closeThreadPool-5212-thread-1) [n:127.0.0.1:38304_    ] o.a.s.c.c.ZkStateReader Updated live nodes from ZooKeeper... (0) -> (3)
   [junit4]   2> 2194095 INFO  (closeThreadPool-5212-thread-1) [n:127.0.0.1:38304_    ] o.a.s.c.s.i.ZkClientClusterStateProvider Cluster at 127.0.0.1:43129/solr ready
   [junit4]   2> 2194142 INFO  (closeThreadPool-5212-thread-1) [n:127.0.0.1:38304_    ] o.a.s.h.a.MetricsHistoryHandler No .system collection, keeping metrics history in memory.
   [junit4]   2> 2194479 INFO  (closeThreadPool-5212-thread-2) [n:127.0.0.1:34485_    ] o.a.s.m.r.SolrJmxReporter JMX monitoring for 'solr.node' (registry 'solr.node') enabled at server: com.sun.jmx.mbeanserver.JmxMBeanServer@6a5c1a61
   [junit4]   2> 2194537 INFO  (closeThreadPool-5212-thread-2) [n:127.0.0.1:34485_    ] o.a.s.m.r.SolrJmxReporter JMX monitoring for 'solr.jvm' (registry 'solr.jvm') enabled at server: com.sun.jmx.mbeanserver.JmxMBeanServer@6a5c1a61
   [junit4]   2> 2194537 INFO  (closeThreadPool-5212-thread-2) [n:127.0.0.1:34485_    ] o.a.s.m.r.SolrJmxReporter JMX monitoring for 'solr.jetty' (registry 'solr.jetty') enabled at server: com.sun.jmx.mbeanserver.JmxMBeanServer@6a5c1a61
   [junit4]   2> 2194572 INFO  (closeThreadPool-5212-thread-2) [n:127.0.0.1:34485_    ] o.a.s.c.CorePropertiesLocator Found 0 core definitions underneath /home/jenkins/jenkins-slave/workspace/Lucene-Solr-Tests-7.x/solr/build/solr-core/test/J0/../../../../../../../../../../home/jenkins/jenkins-slave/workspace/Lucene-Solr-Tests-7.x/solr/build/solr-core/test/J0/temp/solr.cloud.ShardRoutingTest_2ED07635D40FE828-001/shard-2-001/cores
   [junit4]   2> 2194594 INFO  (closeThreadPool-5212-thread-1) [n:127.0.0.1:38304_    ] o.a.s.m.r.SolrJmxReporter JMX monitoring for 'solr.node' (registry 'solr.node') enabled at server: com.sun.jmx.mbeanserver.JmxMBeanServer@6a5c1a61
   [junit4]   2> 2194705 INFO  (closeThreadPool-5212-thread-1) [n:127.0.0.1:38304_    ] o.a.s.m.r.SolrJmxReporter JMX monitoring for 'solr.jvm' (registry 'solr.jvm') enabled at server: com.sun.jmx.mbeanserver.JmxMBeanServer@6a5c1a61
   [junit4]   2> 2194705 INFO  (closeThreadPool-5212-thread-1) [n:127.0.0.1:38304_    ] o.a.s.m.r.SolrJmxReporter JMX monitoring for 'solr.jetty' (registry 'solr.jetty') enabled at server: com.sun.jmx.mbeanserver.JmxMBeanServer@6a5c1a61
   [junit4]   2> 2194739 INFO  (closeThreadPool-5212-thread-1) [n:127.0.0.1:38304_    ] o.a.s.c.CorePropertiesLocator Found 0 core definitions underneath /home/jenkins/jenkins-slave/workspace/Lucene-Solr-Tests-7.x/solr/build/solr-core/test/J0/../../../../../../../../../../home/jenkins/jenkins-slave/workspace/Lucene-Solr-Tests-7.x/solr/build/solr-core/test/J0/temp/solr.cloud.ShardRoutingTest_2ED07635D40FE828-001/shard-1-001/cores
   [junit4]   2> 2194754 INFO  (TEST-ShardRoutingTest.test-seed#[2ED07635D40FE828]) [    ] o.a.s.c.AbstractFullDistribZkTestBase create jetty 3 in directory /home/jenkins/jenkins-slave/workspace/Lucene-Solr-Tests-7.x/solr/build/solr-core/test/J0/temp/solr.cloud.ShardRoutingTest_2ED07635D40FE828-001/shard-3-001 of type NRT
   [junit4]   2> 2194827 WARN  (closeThreadPool-5212-thread-3) [    ] o.e.j.s.AbstractConnector Ignoring deprecated socket close linger time
   [junit4]   2> 2194827 INFO  (closeThreadPool-5212-thread-3) [    ] o.a.s.c.s.e.JettySolrRunner Start Jetty (original configured port=0)
   [junit4]   2> 2194827 INFO  (closeThreadPool-5212-thread-3) [    ] o.a.s.c.s.e.JettySolrRunner Trying to start Jetty on port 0 try number 1 ...
   [junit4]   2> 2194828 INFO  (closeThreadPool-5212-thread-3) [    ] o.e.j.s.Server jetty-9.4.14.v20181114; built: 2018-11-14T21:20:31.478Z; git: c4550056e785fb5665914545889f21dc136ad9e6; jvm 1.8.0_191-b12
   [junit4]   2> 2194876 INFO  (closeThreadPool-5212-thread-3) [    ] o.e.j.s.session DefaultSessionIdManager workerName=node0
   [junit4]   2> 2194876 INFO  (closeThreadPool-5212-thread-3) [    ] o.e.j.s.session No SessionScavenger set, using defaults
   [junit4]   2> 2194876 INFO  (closeThreadPool-5212-thread-3) [    ] o.e.j.s.session node0 Scavenging every 600000ms
   [junit4]   2> 2194896 INFO  (closeThreadPool-5212-thread-3) [    ] o.e.j.s.h.ContextHandler Started o.e.j.s.ServletContextHandler@661107ae{/,null,AVAILABLE}
   [junit4]   2> 2194900 INFO  (closeThreadPool-5212-thread-3) [    ] o.e.j.s.AbstractConnector Started ServerConnector@156c938e{HTTP/1.1,[http/1.1]}{127.0.0.1:37562}
   [junit4]   2> 2194900 INFO  (closeThreadPool-5212-thread-3) [    ] o.e.j.s.Server Started @2194950ms
   [junit4]   2> 2194900 INFO  (closeThreadPool-5212-thread-3) [    ] o.a.s.c.s.e.JettySolrRunner Jetty properties: {solr.data.dir=/home/jenkins/jenkins-slave/workspace/Lucene-Solr-Tests-7.x/solr/build/solr-core/test/J0/temp/solr.cloud.ShardRoutingTest_2ED07635D40FE828-001/tempDir-001/jetty3, replicaType=NRT, solrconfig=solrconfig.xml, hostContext=/, hostPort=37562, coreRootDirectory=/home/jenkins/jenkins-slave/workspace/Lucene-Solr-Tests-7.x/solr/build/solr-core/test/J0/../../../../../../../../../../home/jenkins/jenkins-slave/workspace/Lucene-Solr-Tests-7.x/solr/build/solr-core/test/J0/temp/solr.cloud.ShardRoutingTest_2ED07635D40FE828-001/shard-3-001/cores}
   [junit4]   2> 2194900 ERROR (closeThreadPool-5212-thread-3) [    ] o.a.s.u.StartupLoggingUtils Missing Java Option solr.log.dir. Logging may be missing or incomplete.
   [junit4]   2> 2194900 INFO  (closeThreadPool-5212-thread-3) [    ] o.a.s.s.SolrDispatchFilter Using logger factory org.apache.logging.slf4j.Log4jLoggerFactory
   [junit4]   2> 2194900 INFO  (closeThreadPool-5212-thread-3) [    ] o.a.s.s.SolrDispatchFilter  ___      _       Welcome to Apache Solr™ version 7.7.0
   [junit4]   2> 2194900 INFO  (closeThreadPool-5212-thread-3) [    ] o.a.s.s.SolrDispatchFilter / __| ___| |_ _   Starting in cloud mode on port null
   [junit4]   2> 2194900 INFO  (closeThreadPool-5212-thread-3) [    ] o.a.s.s.SolrDispatchFilter \__ \/ _ \ | '_|  Install dir: null
   [junit4]   2> 2194900 INFO  (closeThreadPool-5212-thread-3) [    ] o.a.s.s.SolrDispatchFilter |___/\___/_|_|    Start time: 2019-01-15T08:01:59.517Z
   [junit4]   2> 2194948 INFO  (zkConnectionManagerCallback-5246-thread-1) [    ] o.a.s.c.c.ConnectionManager zkClient has connected
   [junit4]   2> 2194985 INFO  (closeThreadPool-5212-thread-3) [    ] o.a.s.s.SolrDispatchFilter Loading solr.xml from SolrHome (not found in ZooKeeper)
   [junit4]   2> 2194985 INFO  (closeThreadPool-5212-thread-3) [    ] o.a.s.c.SolrXmlConfig Loading container configuration from /home/jenkins/jenkins-slave/workspace/Lucene-Solr-Tests-7.x/solr/build/solr-core/test/J0/temp/solr.cloud.ShardRoutingTest_2ED07635D40FE828-001/shard-3-001/solr.xml
   [junit4]   2> 2194988 INFO  (closeThreadPool-5212-thread-3) [    ] o.a.s.c.SolrXmlConfig Configuration parameter autoReplicaFailoverWorkLoopDelay is ignored
   [junit4]   2> 2194988 INFO  (closeThreadPool-5212-thread-3) [    ] o.a.s.c.SolrXmlConfig Configuration parameter autoReplicaFailoverBadNodeExpiration is ignored
   [junit4]   2> 2195022 INFO  (closeThreadPool-5212-thread-3) [    ] o.a.s.c.SolrXmlConfig MBean server found: com.sun.jmx.mbeanserver.JmxMBeanServer@6a5c1a61, but no JMX reporters were configured - adding default JMX reporter.
   [junit4]   2> 2196173 INFO  (closeThreadPool-5212-thread-3) [    ] o.a.s.c.ZkContainer Zookeeper client=127.0.0.1:43129/solr
   [junit4]   2> 2196233 INFO  (zkConnectionManagerCallback-5250-thread-1) [    ] o.a.s.c.c.ConnectionManager zkClient has connected
   [junit4]   2> 2196257 INFO  (zkConnectionManagerCallback-5252-thread-1) [    ] o.a.s.c.c.ConnectionManager zkClient has connected
   [junit4]   2> 2196260 INFO  (closeThreadPool-5212-thread-3) [n:127.0.0.1:37562_    ] o.a.s.c.c.ZkStateReader Updated live nodes from ZooKeeper... (0) -> (3)
   [junit4]   2> 2196294 INFO  (closeThreadPool-5212-thread-3) [n:127.0.0.1:37562_    ] o.a.s.c.ZkController Publish node=127.0.0.1:37562_ as DOWN
   [junit4]   2> 2196295 INFO  (closeThreadPool-5212-thread-3) [n:127.0.0.1:37562_    ] o.a.s.c.TransientSolrCoreCacheDefault Allocating transient cache for 4 transient cores
   [junit4]   2> 2196295 INFO  (closeThreadPool-5212-thread-3) [n:127.0.0.1:37562_    ] o.a.s.c.ZkController Register node as live in ZooKeeper:/live_nodes/127.0.0.1:37562_
   [junit4]   2> 2196296 INFO  (zkCallback-5210-thread-1) [    ] o.a.s.c.c.ZkStateReader Updated live nodes from ZooKeeper... (3) -> (4)
   [junit4]   2> 2196296 INFO  (zkCallback-5221-thread-1) [    ] o.a.s.c.c.ZkStateReader Updated live nodes from ZooKeeper... (3) -> (4)
   [junit4]   2> 2196319 INFO  (zkCallback-5192-thread-3) [    ] o.a.s.c.c.ZkStateReader Updated live nodes from ZooKeeper... (3) -> (4)
   [junit4]   2> 2196334 INFO  (zkCallback-5229-thread-1) [    ] o.a.s.c.c.ZkStateReader Updated live nodes from ZooKeeper... (3) -> (4)
   [junit4]   2> 2196342 INFO  (zkCallback-5199-thread-1) [    ] o.a.s.c.c.ZkStateReader Updated live nodes from ZooKeeper... (3) -> (4)
   [junit4]   2> 2196464 INFO  (zkCallback-5236-thread-1) [    ] o.a.s.c.c.ZkStateReader Updated live nodes from ZooKeeper... (3) -> (4)
   [junit4]   2> 2196472 INFO  (zkCallback-5251-thread-1) [    ] o.a.s.c.c.ZkStateReader Updated live nodes from ZooKeeper... (3) -> (4)
   [junit4]   2> 2196512 INFO  (zkCallback-5241-thread-1) [    ] o.a.s.c.c.ZkStateReader Updated live nodes from ZooKeeper... (3) -> (4)
   [junit4]   2> 2196574 INFO  (zkConnectionManagerCallback-5259-thread-1) [    ] o.a.s.c.c.ConnectionManager zkClient has connected
   [junit4]   2> 2196626 INFO  (TEST-ShardRoutingTest.test-seed#[2ED07635D40FE828]) [    ] o.a.s.c.AbstractFullDistribZkTestBase create jetty 4 in directory /home/jenkins/jenkins-slave/workspace/Lucene-Solr-Tests-7.x/solr/build/solr-core/test/J0/temp/solr.cloud.ShardRoutingTest_2ED07635D40FE828-001/shard-4-001 of type NRT
   [junit4]   2> 2196627 WARN  (closeThreadPool-5212-thread-1) [    ] o.e.j.s.AbstractConnector Ignoring deprecated socket close linger time
   [junit4]   2> 2196627 INFO  (closeThreadPool-5212-thread-1) [    ] o.a.s.c.s.e.JettySolrRunner Start Jetty (original configured port=0)
   [junit4]   2> 2196627 INFO  (closeThreadPool-5212-thread-1) [    ] o.a.s.c.s.e.JettySolrRunner Trying to start Jetty on port 0 try number 1 ...
   [junit4]   2> 2196627 INFO  (closeThreadPool-5212-thread-1) [    ] o.e.j.s.Server jetty-9.4.14.v20181114; built: 2018-11-14T21:20:31.478Z; git: c4550056e785fb5665914545889f21dc136ad9e6; jvm 1.8.0_191-b12
   [junit4]   2> 2196683 INFO  (closeThreadPool-5212-thread-3) [n:127.0.0.1:37562_    ] o.a.s.c.c.ZkStateReader Updated live nodes from ZooKeeper... (0) -> (4)
   [junit4]   2> 2196743 INFO  (closeThreadPool-5212-thread-1) [    ] o.e.j.s.session DefaultSessionIdManager workerName=node0
   [junit4]   2> 2196743 INFO  (closeThreadPool-5212-thread-1) [    ] o.e.j.s.session No SessionScavenger set, using defaults
   [junit4]   2> 2196743 INFO  (closeThreadPool-5212-thread-1) [    ] o.e.j.s.session node0 Scavenging every 660000ms
   [junit4]   2> 2196744 INFO  (closeThreadPool-5212-thread-1) [    ] o.e.j.s.h.ContextHandler Started o.e.j.s.ServletContextHandler@f3a5112{/,null,AVAILABLE}
   [junit4]   2> 2196756 INFO  (closeThreadPool-5212-thread-1) [    ] o.e.j.s.AbstractConnector Started ServerConnector@7a3f1607{HTTP/1.1,[http/1.1]}{127.0.0.1:35588}
   [junit4]   2> 2196756 INFO  (closeThreadPool-5212-thread-1) [    ] o.e.j.s.Server Started @2196806ms
   [junit4]   2> 2196756 INFO  (closeThreadPool-5212-thread-1) [    ] o.a.s.c.s.e.JettySolrRunner Jetty properties: {solr.data.dir=/home/jenkins/jenkins-slave/workspace/Lucene-Solr-Tests-7.x/solr/build/solr-core/test/J0/temp/solr.cloud.ShardRoutingTest_2ED07635D40FE828-001/tempDir-001/jetty4, solrconfig=solrconfig.xml, hostContext=/, hostPort=35588, coreRootDirectory=/home/jenkins/jenkins-slave/workspace/Lucene-Solr-Tests-7.x/solr/build/solr-core/test/J0/../../../../../../../../../../home/jenkins/jenkins-slave/workspace/Lucene-Solr-Tests-7.x/solr/build/solr-core/test/J0/temp/solr.cloud.ShardRoutingTest_2ED07635D40FE828-001/shard-4-001/cores}
   [junit4]   2> 2196756 ERROR (closeThreadPool-5212-thread-1) [    ] o.a.s.u.StartupLoggingUtils Missing Java Option solr.log.dir. Logging may be missing or incomplete.
   [junit4]   2> 2196756 INFO  (closeThreadPool-5212-thread-1) [    ] o.a.s.s.SolrDispatchFilter Using logger factory org.apache.logging.slf4j.Log4jLoggerFactory
   [junit4]   2> 2196756 INFO  (closeThreadPool-5212-thread-1) [    ] o.a.s.s.SolrDispatchFilter  ___      _       Welcome to Apache Solr™ version 7.7.0
   [junit4]   2> 2196756 INFO  (closeThreadPool-5212-thread-1) [    ] o.a.s.s.SolrDispatchFilter / __| ___| |_ _   Starting in cloud mode on port null
   [junit4]   2> 2196756 INFO  (closeThreadPool-5212-thread-1) [    ] o.a.s.s.SolrDispatchFilter \__ \/ _ \ | '_|  Install dir: null
   [junit4]   2> 2196756 INFO  (closeThreadPool-5212-thread-1) [    ] o.a.s.s.SolrDispatchFilter |___/\___/_|_|    Start time: 2019-01-15T08:02:01.373Z
   [junit4]   2> 2196776 INFO  (closeThreadPool-5212-thread-3) [n:127.0.0.1:37562_    ] o.a.s.c.s.i.ZkClientClusterStateProvider Cluster at 127.0.0.1:43129/solr ready
   [junit4]   2> 2196869 INFO  (closeThreadPool-5212-thread-3) [n:127.0.0.1:37562_    ] o.a.s.h.a.MetricsHistoryHandler No .system collection, keeping metrics history in memory.
   [junit4]   2> 2196938 INFO  (zkConnectionManagerCallback-5261-thread-1) [    ] o.a.s.c.c.ConnectionManager zkClient has connected
   [junit4]   2> 2196994 INFO  (closeThreadPool-5212-thread-1) [    ] o.a.s.s.SolrDispatchFilter Loading solr.xml from SolrHome (not found in ZooKeeper)
   [junit4]   2> 2197011 INFO  (closeThreadPool-5212-thread-1) [    ] o.a.s.c.SolrXmlConfig Loading container configuration from /home/jenkins/jenkins-slave/workspace/Lucene-Solr-Tests-7.x/solr/build/solr-core/test/J0/temp/solr.cloud.ShardRoutingTest_2ED07635D40FE828-001/shard-4-001/solr.xml
   [junit4]   2> 2197014 INFO  (closeThreadPool-5212-thread-1) [    ] o.a.s.c.SolrXmlConfig Configuration parameter autoReplicaFailoverWorkLoopDelay is ignored
   [junit4]   2> 2197014 INFO  (closeThreadPool-5212-thread-1) [    ] o.a.s.c.SolrXmlConfig Configuration parameter autoReplicaFailoverBadNodeExpiration is ignored
   [junit4]   2> 2197028 INFO  (closeThreadPool-5212-thread-3) [n:127.0.0.1:37562_    ] o.a.s.m.r.SolrJmxReporter JMX monitoring for 'solr.node' (registry 'solr.node') enabled at server: com.sun.jmx.mbeanserver.JmxMBeanServer@6a5c1a61
   [junit4]   2> 2197048 INFO  (closeThreadPool-5212-thread-1) [    ] o.a.s.c.SolrXmlConfig MBean server found: com.sun.jmx.mbeanserver.JmxMBeanServer@6a5c1a61, but no JMX reporters were configured - adding default JMX reporter.
   [junit4]   2> 2197103 INFO  (closeThreadPool-5212-thread-3) [n:127.0.0.1:37562_    ] o.a.s.m.r.SolrJmxReporter JMX monitoring for 'solr.jvm' (registry 'solr.jvm') enabled at server: com.sun.jmx.mbeanserver.JmxMBeanServer@6a5c1a61
   [junit4]   2> 2197103 INFO  (closeThreadPool-5212-thread-3) [n:127.0.0.1:37562_    ] o.a.s.m.r.SolrJmxReporter JMX monitoring for 'solr.jetty' (registry 'solr.jetty') enabled at server: com.sun.jmx.mbeanserver.JmxMBeanServer@6a5c1a61
   [junit4]   2> 2197157 INFO  (closeThreadPool-5212-thread-3) [n:127.0.0.1:37562_    ] o.a.s.c.CorePropertiesLocator Found 0 core definitions underneath /home/jenkins/jenkins-slave/workspace/Lucene-Solr-Tests-7.x/solr/build/solr-core/test/J0/../../../../../../../../../../home/jenkins/jenkins-slave/workspace/Lucene-Solr-Tests-7.x/solr/build/solr-core/test/J0/temp/solr.cloud.ShardRoutingTest_2ED07635D40FE828-001/shard-3-001/cores
   [junit4]   2> 2197688 INFO  (closeThreadPool-5212-thread-1) [    ] o.a.s.c.ZkContainer Zookeeper client=127.0.0.1:43129/solr
   [junit4]   2> 2197781 INFO  (zkConnectionManagerCallback-5266-thread-1) [    ] o.a.s.c.c.ConnectionManager zkClient has connected
   [junit4]   2> 2197784 INFO  (zkConnectionManagerCallback-5268-thread-1) [    ] o.a.s.c.c.ConnectionManager zkClient has connected
   [junit4]   2> 2197799 INFO  (closeThreadPool-5212-thread-1) [    ] o.a.s.c.c.ZkStateReader Updated live nodes from ZooKeeper... (0) -> (4)
   [junit4]   2> 2197814 INFO  (closeThreadPool-5212-thread-1) [    ] o.a.s.c.ZkController Publish node=127.0.0.1:35588_ as DOWN
   [junit4]   2> 2197815 INFO  (closeThreadPool-5212-thread-1) [    ] o.a.s.c.TransientSolrCoreCacheDefault Allocating transient cache for 4 transient cores
   [junit4]   2> 2197815 INFO  (closeThreadPool-5212-thread-1) [    ] o.a.s.c.ZkController Register node as live in ZooKeeper:/live_nodes/127.0.0.1:35588_
   [junit4]   2> 2197833 INFO  (zkCallback-5229-thread-1) [    ] o.a.s.c.c.ZkStateReader Updated live nodes from ZooKeeper... (4) -> (5)
   [junit4]   2> 2197834 INFO  (zkCallback-5192-thread-3) [    ] o.a.s.c.c.ZkStateReader Updated live nodes from ZooKeeper... (4) -> (5)
   [junit4]   2> 2197834 INFO  (zkCallback-5241-thread-1) [    ] o.a.s.c.c.ZkStateReader Updated live nodes from ZooKeeper... (4) -> (5)
   [junit4]   2> 2197851 INFO  (zkCallback-5251-thread-1) [    ] o.a.s.c.c.ZkStateReader Updated live nodes from ZooKeeper... (4) -> (5)
   [junit4]   2> 2197851 INFO  (zkCallback-5236-thread-1) [    ] o.a.s.c.c.ZkStateReader Updated live nodes from ZooKeeper... (4) -> (5)
   [junit4]   2> 2197851 INFO  (zkCallback-5267-thread-1) [    ] o.a.s.c.c.ZkStateReader Updated live nodes from ZooKeeper... (4) -> (5)
   [junit4]   2> 2197854 INFO  (zkCallback-5210-thread-1) [    ] o.a.s.c.c.ZkStateReader Updated live nodes from ZooKeeper... (4) -> (5)
   [junit4]   2> 2197854 INFO  (zkCallback-5199-thread-1) [    ] o.a.s.c.c.ZkStateReader Updated live nodes from ZooKeeper... (4) -> (5)
   [junit4]   2> 2197854 INFO  (zkCallback-5221-thread-1) [    ] o.a.s.c.c.ZkStateReader Updated live nodes from ZooKeeper... (4) -> (5)
   [junit4]   2> 2197854 INFO  (zkCallback-5258-thread-1) [    ] o.a.s.c.c.ZkStateReader Updated live nodes from ZooKeeper... (4) -> (5)
   [junit4]   2> 2198032 INFO  (zkConnectionManagerCallback-5275-thread-1) [    ] o.a.s.c.c.ConnectionManager zkClient has connected
   [junit4]   2> 2198037 INFO  (closeThreadPool-5212-thread-1) [    ] o.a.s.c.c.ZkStateReader Updated live nodes from ZooKeeper... (0) -> (5)
   [junit4]   2> 2198038 INFO  (closeThreadPool-5212-thread-1) [    ] o.a.s.c.s.i.ZkClientClusterStateProvider Cluster at 127.0.0.1:43129/solr ready
   [junit4]   2> 2198088 INFO  (closeThreadPool-5212-thread-1) [    ] o.a.s.h.a.MetricsHistoryHandler No .system collection, keeping metrics history in memory.
   [junit4]   2> 2198148 INFO  (closeThreadPool-5212-thread-1) [    ] o.a.s.m.r.SolrJmxReporter JMX monitoring for 'solr.node' (registry 'solr.node') enabled at server: com.sun.jmx.mbeanserver.JmxMBeanServer@6a5c1a61
   [junit4]   2> 2198217 INFO  (TEST-ShardRoutingTest.test-seed#[2ED07635D40FE828]) [    ] o.a.s.c.AbstractFullDistribZkTestBase create jetty 5 in directory /home/jenkins/jenkins-slave/workspace/Lucene-Solr-Tests-7.x/solr/build/solr-core/test/J0/temp/solr.cloud.ShardRoutingTest_2ED07635D40FE828-001/shard-5-001 of type NRT
   [junit4]   2> 2198217 WARN  (closeThreadPool-5212-thread-3) [    ] o.e.j.s.AbstractConnector Ignoring deprecated socket close linger time
   [junit4]   2> 2198217 INFO  (closeThreadPool-5212-thread-3) [    ] o.a.s.c.s.e.JettySolrRunner Start Jetty (original configured port=0)
   [junit4]   2> 2198217 INFO  (closeThreadPool-5212-thread-3) [    ] o.a.s.c.s.e.JettySolrRunner Trying to start Jetty on port 0 try number 1 ...
   [junit4]   2> 2198217 INFO  (closeThreadPool-5212-thread-3) [    ] o.e.j.s.Server jetty-9.4.14.v20181114; built: 2018-11-14T21:20:31.478Z; git: c4550056e785fb5665914545889f21dc136ad9e6; jvm 1.8.0_191-b12
   [junit4]   2> 2198221 INFO  (closeThreadPool-5212-thread-1) [    ] o.a.s.m.r.SolrJmxReporter JMX monitoring for 'solr.jvm' (registry 'solr.jvm') enabled at server: com.sun.jmx.mbeanserver.JmxMBeanServer@6a5c1a61
   [junit4]   2> 2198221 INFO  (closeThreadPool-5212-thread-1) [    ] o.a.s.m.r.SolrJmxReporter JMX monitoring for 'solr.jetty' (registry 'solr.jetty') enabled at server: com.sun.jmx.mbeanserver.JmxMBeanServer@6a5c1a61
   [junit4]   2> 2198272 INFO  (closeThreadPool-5212-thread-1) [    ] o.a.s.c.CorePropertiesLocator Found 0 core definitions underneath /home/jenkins/jenkins-slave/workspace/Lucene-Solr-Tests-7.x/solr/build/solr-core/test/J0/../../../../../../../../../../home/jenkins/jenkins-slave/workspace/Lucene-Solr-Tests-7.x/solr/build/solr-core/test/J0/temp/solr.cloud.ShardRoutingTest_2ED07635D40FE828-001/shard-4-001/cores
   [junit4]   2> 2198364 INFO  (closeThreadPool-5212-thread-3) [    ] o.e.j.s.session DefaultSessionIdManager workerName=node0
   [junit4]   2> 2198364 INFO  (closeThreadPool-5212-thread-3) [    ] o.e.j.s.session No SessionScavenger set, using defaults
   [junit4]   2> 2198364 INFO  (closeThreadPool-5212-thread-3) [    ] o.e.j.s.session node0 Scavenging every 600000ms
   [junit4]   2> 2198365 INFO  (closeThreadPool-5212-thread-3) [    ] o.e.j.s.h.ContextHandler Started o.e.j.s.ServletContextHandler@504de119{/,null,AVAILABLE}
   [junit4]   2> 2198376 INFO  (closeThreadPool-5212-thread-3) [    ] o.e.j.s.AbstractConnector Started ServerConnector@5c84fd16{HTTP/1.1,[http/1.1]}{127.0.0.1:32911}
   [junit4]   2> 2198376 INFO  (closeThreadPool-5212-thread-3) [    ] o.e.j.s.Server Started @2198426ms
   [junit4]   2> 2198376 INFO  (closeThreadPool-5212-thread-3) [    ] o.a.s.c.s.e.JettySolrRunner Jetty properties: {solr.data.dir=/home/jenkins/jenkins-slave/workspace/Lucene-Solr-Tests-7.x/solr/build/solr-core/test/J0/temp/solr.cloud.ShardRoutingTest_2ED07635D40FE828-001/tempDir-001/jetty5, solrconfig=solrconfig.xml, hostContext=/, hostPort=32911, coreRootDirectory=/home/jenkins/jenkins-slave/workspace/Lucene-Solr-Tests-7.x/solr/build/solr-core/test/J0/../../../../../../../../../../home/jenkins/jenkins-slave/workspace/Lucene-Solr-Tests-7.x/solr/build/solr-core/test/J0/temp/solr.cloud.ShardRoutingTest_2ED07635D40FE828-001/shard-5-001/cores}
   [junit4]   2> 2198377 ERROR (closeThreadPool-5212-thread-3) [    ] o.a.s.u.StartupLoggingUtils Missing Java Option solr.log.dir. Logging may be missing or incomplete.
   [junit4]   2> 2198377 INFO  (closeThreadPool-5212-thread-3) [    ] o.a.s.s.SolrDispatchFilter Using logger factory org.apache.logging.slf4j.Log4jLoggerFactory
   [junit4]   2> 2198377 INFO  (closeThreadPool-5212-thread-3) [    ] o.a.s.s.SolrDispatchFilter  ___      _       Welcome to Apache Solr™ version 7.7.0
   [junit4]   2> 2198377 INFO  (closeThreadPool-5212-thread-3) [    ] o.a.s.s.SolrDispatchFilter / __| ___| |_ _   Starting in cloud mode on port null
   [junit4]   2> 2198377 INFO  (closeThreadPool-5212-thread-3) [    ] o.a.s.s.SolrDispatchFilter \__ \/ _ \ | '_|  Install dir: null
   [junit4]   2> 2198377 INFO  (closeThreadPool-5212-thread-3) [    ] o.a.s.s.SolrDispatchFilter |___/\___/_|_|    Start time: 2019-01-15T08:02:02.994Z
   [junit4]   2> 2198485 INFO  (zkConnectionManagerCallback-5278-thread-1) [    ] o.a.s.c.c.ConnectionManager zkClient has connected
   [junit4]   2> 2198488 INFO  (closeThreadPool-5212-thread-3) [    ] o.a.s.s.SolrDispatchFilter Loading solr.xml from SolrHome (not found in ZooKeeper)
   [junit4]   2> 2198488 INFO  (closeThreadPool-5212-thread-3) [    ] o.a.s.c.SolrXmlConfig Loading container configuration from /home/jenkins/jenkins-slave/workspace/Lucene-Solr-Tests-7.x/solr/build/solr-core/test/J0/temp/solr.cloud.ShardRoutingTest_2ED07635D40FE828-001/shard-5-001/solr.xml
   [junit4]   2> 2198595 INFO  (closeThreadPool-5212-thread-3) [    ] o.a.s.c.SolrXmlConfig Configuration parameter autoReplicaFailoverWorkLoopDelay is ignored
   [junit4]   2> 2198595 INFO  (closeThreadPool-5212-thread-3) [    ] o.a.s.c.SolrXmlConfig Configuration parameter autoReplicaFailoverBadNodeExpiration is ignored
   [junit4]   2> 2198597 INFO  (closeThreadPool-5212-thread-3) [    ] o.a.s.c.SolrXmlConfig MBean server found: com.sun.jmx.mbeanserver.JmxMBeanServer@6a5c1a61, but no JMX reporters were configured - adding default JMX reporter.
   [junit4]   2> 2199611 INFO  (TEST-ShardRoutingTest.test-seed#[2ED07635D40FE828]) [    ] o.a.s.c.AbstractFullDistribZkTestBase create jetty 6 in directory /home/jenkins/jenkins-slave/workspace/Lucene-Solr-Tests-7.x/solr/build/solr-core/test/J0/temp/solr.cloud.ShardRoutingTest_2ED07635D40FE828-001/shard-6-001 of type NRT
   [junit4]   2> 2199612 WARN  (closeThreadPool-5212-thread-1) [    ] o.e.j.s.AbstractConnector Ignoring deprecated socket close linger time
   [junit4]   2> 2199612 INFO  (closeThreadPool-5212-thread-1) [    ] o.a.s.c.s.e.JettySolrRunner Start Jetty (original configured port=0)
   [junit4]   2> 2199612 INFO  (closeThreadPool-5212-thread-1) [    ] o.a.s.c.s.e.JettySolrRunner Trying to start Jetty on port 0 try number 1 ...
   [junit4]   2> 2199612 INFO  (closeThreadPool-5212-thread-1) [    ] o.e.j.s.Server jetty-9.4.14.v20181114; built: 2018-11-14T21:20:31.478Z; git: c4550056e785fb5665914545889f21dc136ad9e6; jvm 1.8.0_191-b12
   [junit4]   2> 2199778 INFO  (closeThreadPool-5212-thread-1) [    ] o.e.j.s.session DefaultSessionIdManager workerName=node0
   [junit4]   2> 2199778 INFO  (closeThreadPool-5212-thread-1) [    ] o.e.j.s.session No SessionScavenger set, using defaults
   [junit4]   2> 2199778 INFO  (closeThreadPool-5212-thread-1) [    ] o.e.j.s.session node0 Scavenging every 600000ms
   [junit4]   2> 2199798 INFO  (closeThreadPool-5212-thread-1) [    ] o.e.j.s.h.ContextHandler Started o.e.j.s.ServletContextHandler@200e1787{/,null,AVAILABLE}
   [junit4]   2> 2199801 INFO  (closeThreadPool-5212-thread-3) [    ] o.a.s.c.ZkContainer Zookeeper client=127.0.0.1:43129/solr
   [junit4]   2> 2199826 INFO  (closeThreadPool-5212-thread-1) [    ] o.e.j.s.AbstractConnector Started ServerConnector@685ee2b6{HTTP/1.1,[http/1.1]}{127.0.0.1:40133}
   [junit4]   2> 2199826 INFO  (closeThreadPool-5212-thread-1) [    ] o.e.j.s.Server Started @2199876ms
   [junit4]   2> 2199826 INFO  (closeThreadPool-5212-thread-1) [    ] o.a.s.c.s.e.JettySolrRunner Jetty properties: {solr.data.dir=/home/jenkins/jenkins-slave/workspace/Lucene-Solr-Tests-7.x/solr/build/solr-core/test/J0/temp/solr.cloud.ShardRoutingTest_2ED07635D40FE828-001/tempDir-001/jetty6, replicaType=NRT, solrconfig=solrconfig.xml, hostContext=/, hostPort=40133, coreRootDirectory=/home/jenkins/jenkins-slave/workspace/Lucene-Solr-Tests-7.x/solr/build/solr-core/test/J0/../../../../../../../../../../home/jenkins/jenkins-slave/workspace/Lucene-Solr-Tests-7.x/solr/build/solr-core/test/J0/temp/solr.cloud.ShardRoutingTest_2ED07635D40FE828-001/shard-6-001/cores}
   [junit4]   2> 2199834 ERROR (closeThreadPool-5212-thread-1) [    ] o.a.s.u.StartupLoggingUtils Missing Java Option solr.log.dir. Logging may be missing or incomplete.
   [junit4]   2> 2199834 INFO  (closeThreadPool-5212-thread-1) [    ] o.a.s.s.SolrDispatchFilter Using logger factory org.apache.logging.slf4j.Log4jLoggerFactory
   [junit4]   2> 2199834 INFO  (closeThreadPool-5212-thread-1) [    ] o.a.s.s.SolrDispatchFilter  ___      _       Welcome to Apache Solr™ version 7.7.0
   [junit4]   2> 2199834 INFO  (closeThreadPool-5212-thread-1) [    ] o.a.s.s.SolrDispatchFilter / __| ___| |_ _   Starting in cloud mode on port null
   [junit4]   2> 2199835 INFO  (closeThreadPool-5212-thread-1) [    ] o.a.s.s.SolrDispatchFilter \__ \/ _ \ | '_|  Install dir: null
   [junit4]   2> 2199835 INFO  (closeThreadPool-5212-thread-1) [    ] o.a.s.s.SolrDispatchFilter |___/\___/_|_|    Start time: 2019-01-15T08:02:04.452Z
   [junit4]   2> 2199851 INFO  (zkConnectionManagerCallback-5282-thread-1) [    ] o.a.s.c.c.ConnectionManager zkClient has connected
   [junit4]   2> 2199871 INFO  (zkConnectionManagerCallback-5284-thread-1) [    ] o.a.s.c.c.ConnectionManager zkClient has connected
   [junit4]   2> 2199908 INFO  (closeThreadPool-5212-thread-1) [    ] o.a.s.s.SolrDispatchFilter Loading solr.xml from SolrHome (not found in ZooKeeper)
   [junit4]   2> 2199908 INFO  (closeThreadPool-5212-thread-1) [    ] o.a.s.c.SolrXmlConfig Loading container configuration from /home/jenkins/jenkins-slave/workspace/Lucene-Solr-Tests-7.x/solr/build/solr-core/test/J0/temp/solr.cloud.ShardRoutingTest_2ED07635D40FE828-001/shard-6-001/solr.xml
   [junit4]   2> 2199923 WARN  (NIOServerCxn.Factory:0.0.0.0/0.0.0.0:0) [    ] o.a.z.s.NIOServerCnxn Unable to read additional data from client sessionid 0x106f4ca6ca1001a, likely client has closed socket
   [junit4]   2> 2199924 INFO  (closeThreadPool-5212-thread-1) [    ] o.a.s.c.SolrXmlConfig Configuration parameter autoReplicaFailoverWorkLoopDelay is ignored
   [junit4]   2> 2199924 INFO  (closeThreadPool-5212-thread-1) [    ] o.a.s.c.SolrXmlConfig Configuration parameter autoReplicaFailoverBadNodeExpiration is ignored
   [junit4]   2> 2199950 INFO  (closeThreadPool-5212-thread-1) [    ] o.a.s.c.SolrXmlConfig MBean server found: com.sun.jmx.mbeanserver.JmxMBeanServer@6a5c1a61, but no JMX reporters were configured - adding default JMX reporter.
   [junit4]   2> 2200037 INFO  (zkConnectionManagerCallback-5286-thread-1) [    ] o.a.s.c.c.ConnectionManager zkClient has connected
   [junit4]   2> 2200044 INFO  (closeThreadPool-5212-thread-3) [    ] o.a.s.c.c.ZkStateReader Updated live nodes from ZooKeeper... (0) -> (5)
   [junit4]   2> 2200081 INFO  (closeThreadPool-5212-thread-3) [    ] o.a.s.c.ZkController Publish node=127.0.0.1:32911_ as DOWN
   [junit4]   2> 2200117 INFO  (closeThreadPool-5212-thread-3) [    ] o.a.s.c.TransientSolrCoreCacheDefault Allocating transient cache for 4 transient cores
   [junit4]   2> 2200117 INFO  (closeThreadPool-5212-thread-3) [    ] o.a.s.c.ZkController Register node as live in ZooKeeper:/live_nodes/127.0.0.1:32911_
   [junit4]   2> 2200130 INFO  (zkCallback-5251-thread-1) [    ] o.a.s.c.c.ZkStateReader Updated live nodes from ZooKeeper... (5) -> (6)
   [junit4]   2> 2200131 INFO  (zkCallback-5192-thread-1) [    ] o.a.s.c.c.ZkStateReader Updated live nodes from ZooKeeper... (5) -> (6)
   [junit4]   2> 2200142 INFO  (zkCallback-5236-thread-1) [    ] o.a.s.c.c.ZkStateReader Updated live nodes from ZooKeeper... (5) -> (6)
   [junit4]   2> 2200142 INFO  (zkCallback-5229-thread-1) [    ] o.a.s.c.c.ZkStateReader Updated live nodes from ZooKeeper... (5) -> (6)
   [junit4]   2> 2200146 INFO  (zkCallback-5199-thread-1) [    ] o.a.s.c.c.ZkStateReader Updated live nodes from ZooKeeper... (5) -> (6)
   [junit4]   2> 2200146 INFO  (zkCallback-5210-thread-1) [    ] o.a.s.c.c.ZkStateReader Updated live nodes from ZooKeeper... (5) -> (6)
   [junit4]   2> 2200146 INFO  (zkCallback-5221-thread-1) [    ] o.a.s.c.c.ZkStateReader Updated live nodes from ZooKeeper... (5) -> (6)
   [junit4]   2> 2200146 INFO  (zkCallback-5241-thread-1) [    ] o.a.s.c.c.ZkStateReader Updated live nodes from ZooKeeper... (5) -> (6)
   [junit4]   2> 2200183 INFO  (zkCallback-5258-thread-1) [    ] o.a.s.c.c.ZkStateReader Updated live nodes from ZooKeeper... (5) -> (6)
   [junit4]   2> 2200183 INFO  (zkCallback-5267-thread-1) [    ] o.a.s.c.c.ZkStateReader Updated live nodes from ZooKeeper... (5) -> (6)
   [junit4]   2> 2200236 INFO  (zkCallback-5285-thread-1) [    ] o.a.s.c.c.ZkStateReader Updated live nodes from ZooKeeper... (5) -> (6)
   [junit4]   2> 2200236 INFO  (zkCallback-5274-thread-1) [    ] o.a.s.c.c.ZkStateReader Updated live nodes from ZooKeeper... (5) -> (6)
   [junit4]   2> 2200470 INFO  (zkConnectionManagerCallback-5293-thread-1) [    ] o.a.s.c.c.ConnectionManager zkClient has connected
   [junit4]   2> 2200527 INFO  (closeThreadPool-5212-thread-3) [    ] o.a.s.c.c.ZkStateReader Updated live nodes from ZooKeeper... (0) -> (6)
   [junit4]   2> 2200528 INFO  (closeThreadPool-5212-thread-3) [    ] o.a.s.c.s.i.ZkClientClusterStateProvider Cluster at 127.0.0.1:43129/solr ready
   [junit4]   2> 2200543 INFO  (closeThreadPool-5212-thread-3) [    ] o.a.s.h.a.MetricsHistoryHandler No .system collection, keeping metrics history in memory.
   [junit4]   2> 2200655 INFO  (closeThreadPool-5212-thread-3) [    ] o.a.s.m.r.SolrJmxReporter JMX monitoring for 'solr.node' (registry 'solr.node') enabled at server: com.sun.jmx.mbeanserver.JmxMBeanServer@6a5c1a61
   [junit4]   2> 2200765 INFO  (closeThreadPool-5212-thread-3) [    ] o.a.s.m.r.SolrJmxReporter JMX monitoring for 'solr.jvm' (registry 'solr.jvm') enabled at server: com.sun.jmx.mbeanserver.JmxMBeanServer@6a5c1a61
   [junit4]   2> 2200818 INFO  (closeThreadPool-5212-thread-3) [    ] o.a.s.m.r.SolrJmxReporter JMX monitoring for 'solr.jetty' (registry 'solr.jetty') enabled at server: com.sun.jmx.mbeanserver.JmxMBeanServer@6a5c1a61
   [junit4]   2> 2200820 INFO  (closeThreadPool-5212-thread-3) [    ] o.a.s.c.CorePropertiesLocator Found 0 core definitions underneath /home/jenkins/jenkins-slave/workspace/Lucene-Solr-Tests-7.x/solr/build/solr-core/test/J0/../../../../../../../../../../home/jenkins/jenkins-slave/workspace/Lucene-Solr-Tests-7.x/solr/build/solr-core/test/J0/temp/solr.cloud.ShardRoutingTest_2ED07635D40FE828-001/shard-5-001/cores
   [junit4]   2> 2201165 INFO  (closeThreadPool-5212-thread-1) [    ] o.a.s.c.ZkContainer Zookeeper client=127.0.0.1:43129/solr
   [junit4]   2> 2201200 INFO  (zkConnectionManagerCallback-5298-thread-1) [    ] o.a.s.c.c.ConnectionManager zkClient has connected
   [junit4]   2> 2201333 INFO  (zkConnectionManagerCallback-5300-thread-1) [    ] o.a.s.c.c.ConnectionManager zkClient has connected
   [junit4]   2> 2201419 INFO  (closeThreadPool-5212-thread-1) [    ] o.a.s.c.c.ZkStateReader Updated live nodes from ZooKeeper... (0) -> (6)
   [junit4]   2> 2201421 INFO  (closeThreadPool-5212-thread-1) [    ] o.a.s.c.ZkController Publish node=127.0.0.1:40133_ as DOWN
   [junit4]   2> 2201422 INFO  (closeThreadPool-5212-thread-1) [    ] o.a.s.c.TransientSolrCoreCacheDefault Allocating transient cache for 4 transient cores
   [junit4]   2> 2201422 INFO  (closeThreadPool-5212-thread-1) [    ] o.a.s.c.ZkController Register node as live in ZooKeeper:/live_nodes/127.0.0.1:40133_
   [junit4]   2> 2201436 INFO  (zkCallback-5274-thread-1) [    ] o.a.s.c.c.ZkStateReader Updated live nodes from ZooKeeper... (6) -> (7)
   [junit4]   2> 2201436 INFO  (zkCallback-5267-thread-1) [    ] o.a.s.c.c.ZkStateReader Updated live nodes from ZooKeeper... (6) -> (7)
   [junit4]   2> 2201436 INFO  (zkCallback-5210-thread-1) [    ] o.a.s.c.c.ZkStateReader Updated live nodes from ZooKeeper... (6) -> (7)
   [junit4]   2> 2201436 INFO  (zkCallback-5258-thread-1) [    ] o.a.s.c.c.ZkStateReader Updated live nodes from ZooKeeper... (6) -> (7)
   [junit4]   2> 2201436 INFO  (zkCallback-5251-thread-1) [    ] o.a.s.c.c.ZkStateReader Updated live nodes from ZooKeeper... (6) -> (7)
   [junit4]   2> 2201436 INFO  (zkCallback-5192-thread-1) [    ] o.a.s.c.c.ZkStateReader Updated live nodes from ZooKeeper... (6) -> (7)
   [junit4]   2> 2201436 INFO  (zkCallback-5241-thread-1) [    ] o.a.s.c.c.ZkStateReader Updated live nodes from ZooKeeper... (6) -> (7)
   [junit4]   2> 2201436 INFO  (zkCallback-5221-thread-1) [    ] o.a.s.c.c.ZkStateReader Updated live nodes from ZooKeeper... (6) -> (7)
   [junit4]   2> 2201436 INFO  (zkCallback-5285-thread-1) [    ] o.a.s.c.c.ZkStateReader Updated live nodes from ZooKeeper... (6) -> (7)
   [junit4]   2> 2201439 INFO  (zkCallback-5229-thread-1) [    ] o.a.s.c.c.ZkStateReader Updated live nodes from ZooKeeper... (6) -> (7)
   [junit4]   2> 2201439 INFO  (zkCallback-5236-thread-1) [    ] o.a.s.c.c.ZkStateReader Updated live nodes from ZooKeeper... (6) -> (7)
   [junit4]   2> 2201439 INFO  (zkCallback-5199-thread-1) [    ] o.a.s.c.c.ZkStateReader Updated live nodes from ZooKeeper... (6) -> (7)
   [junit4]   2> 2201475 INFO  (zkCallback-5299-thread-1) [    ] o.a.s.c.c.ZkStateReader Updated live nodes from ZooKeeper... (6) -> (7)
   [junit4]   2> 2201478 INFO  (zkCallback-5292-thread-1) [    ] o.a.s.c.c.ZkStateReader Updated live nodes from ZooKeeper... (6) -> (7)
   [junit4]   2> 2201689 INFO  (zkConnectionManagerCallback-5307-thread-1) [    ] o.a.s.c.c.ConnectionManager zkClient has connected
   [junit4]   2> 2201690 INFO  (closeThreadPool-5212-thread-1) [    ] o.a.s.c.c.ZkStateReader Updated live nodes from ZooKeeper... (0) -> (7)
   [junit4]   2> 2201691 INFO  (closeThreadPool-5212-thread-1) [    ] o.a.s.c.s.i.ZkClientClusterStateProvider Cluster at 127.0.0.1:43129/solr ready
   [junit4]   2> 2201693 INFO  (TEST-ShardRoutingTest.test-seed#[2ED07635D40FE828]) [    ] o.a.s.c.AbstractFullDistribZkTestBase create jetty 7 in directory /home/jenkins/jenkins-slave/workspace/Lucene-Solr-Tests-7.x/solr/build/solr-core/test/J0/temp/solr.cloud.ShardRoutingTest_2ED07635D40FE828-001/shard-7-001 of type NRT
   [junit4]   2> 2201694 WARN  (closeThreadPool-5212-thread-3) [    ] o.e.j.s.AbstractConnector Ignoring deprecated socket close linger time
   [junit4]   2> 2201694 INFO  (closeThreadPool-5212-thread-3) [    ] o.a.s.c.s.e.JettySolrRunner Start Jetty (original configured port=0)
   [junit4]   2> 2201694 INFO  (closeThreadPool-5212-thread-3) [    ] o.a.s.c.s.e.JettySolrRunner Trying to start Jetty on port 0 try number 1 ...
   [junit4]   2> 2201694 INFO  (closeThreadPool-5212-thread-3) [    ] o.e.j.s.Server jetty-9.4.14.v20181114; built: 2018-11-14T21:20:31.478Z; git: c4550056e785fb5665914545889f21dc136ad9e6; jvm 1.8.0_191-b12
   [junit4]   2> 2201710 INFO  (closeThreadPool-5212-thread-1) [    ] o.a.s.h.a.MetricsHistoryHandler No .system collection, keeping metrics history in memory.
   [junit4]   2> 2201876 INFO  (closeThreadPool-5212-thread-3) [    ] o.e.j.s.session DefaultSessionIdManager workerName=node0
   [junit4]   2> 2201876 INFO  (closeThreadPool-5212-thread-3) [    ] o.e.j.s.session No SessionScavenger set, using defaults
   [junit4]   2> 2201876 INFO  (closeThreadPool-5212-thread-3) [    ] o.e.j.s.session node0 Scavenging every 600000ms
   [junit4]   2> 2201888 INFO  (closeThreadPool-5212-thread-3) [    ] o.e.j.s.h.ContextHandler Started o.e.j.s.ServletContextHandler@52e04cf9{/,null,AVAILABLE}
   [junit4]   2> 2201909 INFO  (closeThreadPool-5212-thread-3) [    ] o.e.j.s.AbstractConnector Started ServerConnector@594aa323{HTTP/1.1,[http/1.1]}{127.0.0.1:46864}
   [junit4]   2> 2201909 INFO  (closeThreadPool-5212-thread-3) [    ] o.e.j.s.Server Started @2201959ms
   [junit4]   2> 2201909 INFO  (closeThreadPool-5212-thread-3) [    ] o.a.s.c.s.e.JettySolrRunner Jetty properties: {solr.data.dir=/home/jenkins/jenkins-slave/workspace/Lucene-Solr-Tests-7.x/solr/build/solr-core/test/J0/temp/solr.cloud.ShardRoutingTest_2ED07635D40FE828-001/tempDir-001/jetty7, replicaType=NRT, solrconfig=solrconfig.xml, hostContext=/, hostPort=46864, coreRootDirectory=/home/jenkins/jenkins-slave/workspace/Lucene-Solr-Tests-7.x/solr/build/solr-core/test/J0/../../../../../../../../../../home/jenkins/jenkins-slave/workspace/Lucene-Solr-Tests-7.x/solr/build/solr-core/test/J0/temp/solr.cloud.ShardRoutingTest_2ED07635D40FE828-001/shard-7-001/cores}
   [junit4]   2> 2201909 ERROR (closeThreadPool-5212-thread-3) [    ] o.a.s.u.StartupLoggingUtils Missing Java Option solr.log.dir. Logging may be missing or incomplete.
   [junit4]   2> 2201909 INFO  (closeThreadPool-5212-thread-3) [    ] o.a.s.s.SolrDispatchFilter Using logger factory org.apache.logging.slf4j.Log4jLoggerFactory
   [junit4]   2> 2201909 INFO  (closeThreadPool-5212-thread-3) [    ] o.a.s.s.SolrDispatchFilter  ___      _       Welcome to Apache Solr™ version 7.7.0
   [junit4]   2> 2201909 INFO  (closeThreadPool-5212-thread-3) [    ] o.a.s.s.SolrDispatchFilter / __| ___| |_ _   Starting in cloud mode on port null
   [junit4]   2> 2201909 INFO  (closeThreadPool-5212-thread-3) [    ] o.a.s.s.SolrDispatchFilter \__ \/ _ \ | '_|  Install dir: null
   [junit4]   2> 2201909 INFO  (closeThreadPool-5212-thread-3) [    ] o.a.s.s.SolrDispatchFilter |___/\___/_|_|    Start time: 2019-01-15T08:02:06.526Z
   [junit4]   2> 2201910 INFO  (closeThreadPool-5212-thread-1) [    ] o.a.s.m.r.SolrJmxReporter JMX monitoring for 'solr.node' (registry 'solr.node') enabled at server: com.sun.jmx.mbeanserver.JmxMBeanServer@6a5c1a61
   [junit4]   2> 2201961 INFO  (zkConnectionManagerCallback-5310-thread-1) [    ] o.a.s.c.c.ConnectionManager zkClient has connected
   [junit4]   2> 2201981 INFO  (closeThreadPool-5212-thread-3) [    ] o.a.s.s.SolrDispatchFilter Loading solr.xml from SolrHome (not found in ZooKeeper)
   [junit4]   2> 2201981 INFO  (closeThreadPool-5212-thread-3) [    ] o.a.s.c.SolrXmlConfig Loading container configuration from /home/jenkins/jenkins-slave/workspace/Lucene-Solr-Tests-7.x/solr/build/solr-core/test/J0/temp/solr.cloud.ShardRoutingTest_2ED07635D40FE828-001/shard-7-001/solr.xml
   [junit4]   2> 2201985 INFO  (closeThreadPool-5212-thread-1) [    ] o.a.s.m.r.SolrJmxReporter JMX monitoring for 'solr.jvm' (registry 'solr.jvm') enabled at server: com.sun.jmx.mbeanserver.JmxMBeanServer@6a5c1a61
   [junit4]   2> 2201985 INFO  (closeThreadPool-5212-thread-1) [    ] o.a.s.m.r.SolrJmxReporter JMX monitoring for 'solr.jetty' (registry 'solr.jetty') enabled at server: com.sun.jmx.mbeanserver.JmxMBeanServer@6a5c1a61
   [junit4]   2> 2201985 INFO  (closeThreadPool-5212-thread-3) [    ] o.a.s.c.SolrXmlConfig Configuration parameter autoReplicaFailoverWorkLoopDelay is ignored
   [junit4]   2> 2201985 INFO  (closeThreadPool-5212-thread-3) [    ] o.a.s.c.SolrXmlConfig Configuration parameter autoReplicaFailoverBadNodeExpiration is ignored
   [junit4]   2> 2202018 INFO  (closeThreadPool-5212-thread-1) [    ] o.a.s.c.CorePropertiesLocator Found 0 core definitions underneath /home/jenkins/jenkins-slave/workspace/Lucene-Solr-Tests-7.x/solr/build/solr-core/test/J0/../../../../../../../../../../home/jenkins/jenkins-slave/workspace/Lucene-Solr-Tests-7.x/solr/build/solr-core/test/J0/temp/solr.cloud.ShardRoutingTest_2ED07635D40FE828-001/shard-6-001/cores
   [junit4]   2> 2202019 INFO  (closeThreadPool-5212-thread-3) [    ] o.a.s.c.SolrXmlConfig MBean server found: com.sun.jmx.mbeanserver.JmxMBeanServer@6a5c1a61, but no JMX reporters were configured - adding default JMX reporter.
   [junit4]   2> 2204312 INFO  (TEST-ShardRoutingTest.test-seed#[2ED07635D40FE828]) [    ] o.a.s.c.AbstractFullDistribZkTestBase create jetty 8 in directory /home/jenkins/jenkins

[...truncated too long message...]



-ivy-fail-disallowed-ivy-version:

ivy-fail:

ivy-fail:

ivy-configure:
[ivy:configure] :: loading settings :: file = /home/jenkins/jenkins-slave/workspace/Lucene-Solr-Tests-7.x/lucene/top-level-ivy-settings.xml

resolve:

ivy-availability-check:
[loadresource] Do not set property disallowed.ivy.jars.list as its length is 0.

-ivy-fail-disallowed-ivy-version:

ivy-fail:

ivy-configure:
[ivy:configure] :: loading settings :: file = /home/jenkins/jenkins-slave/workspace/Lucene-Solr-Tests-7.x/lucene/top-level-ivy-settings.xml

resolve:

ivy-availability-check:
[loadresource] Do not set property disallowed.ivy.jars.list as its length is 0.

-ivy-fail-disallowed-ivy-version:

ivy-fail:

ivy-fail:

ivy-configure:
[ivy:configure] :: loading settings :: file = /home/jenkins/jenkins-slave/workspace/Lucene-Solr-Tests-7.x/lucene/top-level-ivy-settings.xml

resolve:

ivy-availability-check:
[loadresource] Do not set property disallowed.ivy.jars.list as its length is 0.

-ivy-fail-disallowed-ivy-version:

ivy-fail:

ivy-configure:
[ivy:configure] :: loading settings :: file = /home/jenkins/jenkins-slave/workspace/Lucene-Solr-Tests-7.x/lucene/top-level-ivy-settings.xml

resolve:

ivy-availability-check:
[loadresource] Do not set property disallowed.ivy.jars.list as its length is 0.

-ivy-fail-disallowed-ivy-version:

ivy-fail:

ivy-fail:

ivy-configure:
[ivy:configure] :: loading settings :: file = /home/jenkins/jenkins-slave/workspace/Lucene-Solr-Tests-7.x/lucene/top-level-ivy-settings.xml

resolve:

ivy-availability-check:
[loadresource] Do not set property disallowed.ivy.jars.list as its length is 0.

-ivy-fail-disallowed-ivy-version:

ivy-fail:

ivy-fail:

ivy-configure:
[ivy:configure] :: loading settings :: file = /home/jenkins/jenkins-slave/workspace/Lucene-Solr-Tests-7.x/lucene/top-level-ivy-settings.xml

resolve:

ivy-availability-check:
[loadresource] Do not set property disallowed.ivy.jars.list as its length is 0.

-ivy-fail-disallowed-ivy-version:

ivy-fail:

ivy-fail:

ivy-configure:
[ivy:configure] :: loading settings :: file = /home/jenkins/jenkins-slave/workspace/Lucene-Solr-Tests-7.x/lucene/top-level-ivy-settings.xml

resolve:

ivy-availability-check:
[loadresource] Do not set property disallowed.ivy.jars.list as its length is 0.

-ivy-fail-disallowed-ivy-version:

ivy-fail:

ivy-fail:

ivy-configure:
[ivy:configure] :: loading settings :: file = /home/jenkins/jenkins-slave/workspace/Lucene-Solr-Tests-7.x/lucene/top-level-ivy-settings.xml

resolve:

ivy-availability-check:
[loadresource] Do not set property disallowed.ivy.jars.list as its length is 0.

-ivy-fail-disallowed-ivy-version:

ivy-fail:

ivy-fail:

ivy-configure:
[ivy:configure] :: loading settings :: file = /home/jenkins/jenkins-slave/workspace/Lucene-Solr-Tests-7.x/lucene/top-level-ivy-settings.xml

resolve:

ivy-availability-check:
[loadresource] Do not set property disallowed.ivy.jars.list as its length is 0.

-ivy-fail-disallowed-ivy-version:

ivy-fail:

ivy-fail:

ivy-configure:
[ivy:configure] :: loading settings :: file = /home/jenkins/jenkins-slave/workspace/Lucene-Solr-Tests-7.x/lucene/top-level-ivy-settings.xml

resolve:

ivy-availability-check:
[loadresource] Do not set property disallowed.ivy.jars.list as its length is 0.

-ivy-fail-disallowed-ivy-version:

ivy-fail:

ivy-fail:

ivy-configure:
[ivy:configure] :: loading settings :: file = /home/jenkins/jenkins-slave/workspace/Lucene-Solr-Tests-7.x/lucene/top-level-ivy-settings.xml

resolve:

ivy-availability-check:
[loadresource] Do not set property disallowed.ivy.jars.list as its length is 0.

-ivy-fail-disallowed-ivy-version:

ivy-fail:

ivy-fail:

ivy-configure:
[ivy:configure] :: loading settings :: file = /home/jenkins/jenkins-slave/workspace/Lucene-Solr-Tests-7.x/lucene/top-level-ivy-settings.xml

resolve:

ivy-availability-check:
[loadresource] Do not set property disallowed.ivy.jars.list as its length is 0.

-ivy-fail-disallowed-ivy-version:

ivy-fail:

ivy-fail:

ivy-configure:
[ivy:configure] :: loading settings :: file = /home/jenkins/jenkins-slave/workspace/Lucene-Solr-Tests-7.x/lucene/top-level-ivy-settings.xml

resolve:

ivy-availability-check:
[loadresource] Do not set property disallowed.ivy.jars.list as its length is 0.

-ivy-fail-disallowed-ivy-version:

ivy-fail:

ivy-fail:

ivy-configure:
[ivy:configure] :: loading settings :: file = /home/jenkins/jenkins-slave/workspace/Lucene-Solr-Tests-7.x/lucene/top-level-ivy-settings.xml

resolve:

jar-checksums:
    [mkdir] Created dir: /home/jenkins/jenkins-slave/workspace/Lucene-Solr-Tests-7.x/solr/null718090434
     [copy] Copying 242 files to /home/jenkins/jenkins-slave/workspace/Lucene-Solr-Tests-7.x/solr/null718090434
   [delete] Deleting directory /home/jenkins/jenkins-slave/workspace/Lucene-Solr-Tests-7.x/solr/null718090434

check-working-copy:
[ivy:cachepath] :: resolving dependencies :: org.eclipse.jgit#org.eclipse.jgit-caller;working
[ivy:cachepath] 	confs: [default]
[ivy:cachepath] 	found org.eclipse.jgit#org.eclipse.jgit;4.6.0.201612231935-r in public
[ivy:cachepath] 	found com.jcraft#jsch;0.1.53 in public
[ivy:cachepath] 	found com.googlecode.javaewah#JavaEWAH;1.1.6 in public
[ivy:cachepath] 	found org.apache.httpcomponents#httpclient;4.3.6 in public
[ivy:cachepath] 	found org.apache.httpcomponents#httpcore;4.3.3 in public
[ivy:cachepath] 	found commons-logging#commons-logging;1.1.3 in public
[ivy:cachepath] 	found commons-codec#commons-codec;1.6 in public
[ivy:cachepath] 	found org.slf4j#slf4j-api;1.7.2 in public
[ivy:cachepath] :: resolution report :: resolve 69ms :: artifacts dl 2ms
	---------------------------------------------------------------------
	|                  |            modules            ||   artifacts   |
	|       conf       | number| search|dwnlded|evicted|| number|dwnlded|
	---------------------------------------------------------------------
	|      default     |   8   |   0   |   0   |   0   ||   8   |   0   |
	---------------------------------------------------------------------
[wc-checker] Initializing working copy...
[wc-checker] SLF4J: Failed to load class "org.slf4j.impl.StaticLoggerBinder".
[wc-checker] SLF4J: Defaulting to no-operation (NOP) logger implementation
[wc-checker] SLF4J: See http://www.slf4j.org/codes.html#StaticLoggerBinder for further details.
[wc-checker] Checking working copy status...

-jenkins-base:

BUILD SUCCESSFUL
Total time: 211 minutes 15 seconds
Archiving artifacts
java.lang.InterruptedException: no matches found within 10000
	at hudson.FilePath$ValidateAntFileMask.hasMatch(FilePath.java:2847)
	at hudson.FilePath$ValidateAntFileMask.invoke(FilePath.java:2726)
	at hudson.FilePath$ValidateAntFileMask.invoke(FilePath.java:2707)
	at hudson.FilePath$FileCallableWrapper.call(FilePath.java:3086)
Also:   hudson.remoting.Channel$CallSiteStackTrace: Remote call to lucene2
		at hudson.remoting.Channel.attachCallSiteStackTrace(Channel.java:1741)
		at hudson.remoting.UserRequest$ExceptionResponse.retrieve(UserRequest.java:357)
		at hudson.remoting.Channel.call(Channel.java:955)
		at hudson.FilePath.act(FilePath.java:1072)
		at hudson.FilePath.act(FilePath.java:1061)
		at hudson.FilePath.validateAntFileMask(FilePath.java:2705)
		at hudson.tasks.ArtifactArchiver.perform(ArtifactArchiver.java:243)
		at hudson.tasks.BuildStepCompatibilityLayer.perform(BuildStepCompatibilityLayer.java:81)
		at hudson.tasks.BuildStepMonitor$1.perform(BuildStepMonitor.java:20)
		at hudson.model.AbstractBuild$AbstractBuildExecution.perform(AbstractBuild.java:744)
		at hudson.model.AbstractBuild$AbstractBuildExecution.performAllBuildSteps(AbstractBuild.java:690)
		at hudson.model.Build$BuildExecution.post2(Build.java:186)
		at hudson.model.AbstractBuild$AbstractBuildExecution.post(AbstractBuild.java:635)
		at hudson.model.Run.execute(Run.java:1835)
		at hudson.model.FreeStyleBuild.run(FreeStyleBuild.java:43)
		at hudson.model.ResourceController.execute(ResourceController.java:97)
		at hudson.model.Executor.run(Executor.java:429)
Caused: hudson.FilePath$TunneledInterruptedException
	at hudson.FilePath$FileCallableWrapper.call(FilePath.java:3088)
	at hudson.remoting.UserRequest.perform(UserRequest.java:212)
	at hudson.remoting.UserRequest.perform(UserRequest.java:54)
	at hudson.remoting.Request$2.run(Request.java:369)
	at hudson.remoting.InterceptingExecutorService$1.call(InterceptingExecutorService.java:72)
	at java.util.concurrent.FutureTask.run(FutureTask.java:266)
	at java.util.concurrent.ThreadPoolExecutor.runWorker(ThreadPoolExecutor.java:1142)
	at java.util.concurrent.ThreadPoolExecutor$Worker.run(ThreadPoolExecutor.java:617)
	at java.lang.Thread.run(Thread.java:748)
Caused: java.lang.InterruptedException: java.lang.InterruptedException: no matches found within 10000
	at hudson.FilePath.act(FilePath.java:1074)
	at hudson.FilePath.act(FilePath.java:1061)
	at hudson.FilePath.validateAntFileMask(FilePath.java:2705)
	at hudson.tasks.ArtifactArchiver.perform(ArtifactArchiver.java:243)
	at hudson.tasks.BuildStepCompatibilityLayer.perform(BuildStepCompatibilityLayer.java:81)
	at hudson.tasks.BuildStepMonitor$1.perform(BuildStepMonitor.java:20)
	at hudson.model.AbstractBuild$AbstractBuildExecution.perform(AbstractBuild.java:744)
	at hudson.model.AbstractBuild$AbstractBuildExecution.performAllBuildSteps(AbstractBuild.java:690)
	at hudson.model.Build$BuildExecution.post2(Build.java:186)
	at hudson.model.AbstractBuild$AbstractBuildExecution.post(AbstractBuild.java:635)
	at hudson.model.Run.execute(Run.java:1835)
	at hudson.model.FreeStyleBuild.run(FreeStyleBuild.java:43)
	at hudson.model.ResourceController.execute(ResourceController.java:97)
	at hudson.model.Executor.run(Executor.java:429)
No artifacts found that match the file pattern "**/*.events,heapdumps/**,**/hs_err_pid*". Configuration error?
Recording test results
Build step 'Publish JUnit test result report' changed build result to UNSTABLE
Email was triggered for: Unstable (Test Failures)
Sending email for trigger: Unstable (Test Failures)

Mime
View raw message