lucene-dev mailing list archives

Site index · List index
Message view « Date » · « Thread »
Top « Date » · « Thread »
From Policeman Jenkins Server <jenk...@thetaphi.de>
Subject [JENKINS] Lucene-Solr-master-Solaris (64bit/jdk1.8.0) - Build # 2265 - Unstable!
Date Sat, 19 Jan 2019 06:53:25 GMT
Build: https://jenkins.thetaphi.de/job/Lucene-Solr-master-Solaris/2265/
Java: 64bit/jdk1.8.0 -XX:-UseCompressedOops -XX:+UseG1GC

1 tests failed.
FAILED:  org.apache.solr.cloud.TestWithCollection.testMultipleWithCollections

Error Message:
Timeout occured while waiting response from server at: http://127.0.0.1:36264/solr

Stack Trace:
org.apache.solr.client.solrj.SolrServerException: Timeout occured while waiting response from server at: http://127.0.0.1:36264/solr
	at __randomizedtesting.SeedInfo.seed([D8F5F3B315FED680:BA37DE859A323DF8]:0)
	at org.apache.solr.client.solrj.impl.HttpSolrClient.executeMethod(HttpSolrClient.java:661)
	at org.apache.solr.client.solrj.impl.HttpSolrClient.request(HttpSolrClient.java:256)
	at org.apache.solr.client.solrj.impl.HttpSolrClient.request(HttpSolrClient.java:245)
	at org.apache.solr.client.solrj.impl.LBSolrClient.doRequest(LBSolrClient.java:368)
	at org.apache.solr.client.solrj.impl.LBSolrClient.request(LBSolrClient.java:296)
	at org.apache.solr.client.solrj.impl.LBHttpSolrClient.request(LBHttpSolrClient.java:213)
	at org.apache.solr.client.solrj.impl.CloudSolrClient.sendRequest(CloudSolrClient.java:1110)
	at org.apache.solr.client.solrj.impl.CloudSolrClient.requestWithRetryOnStaleState(CloudSolrClient.java:884)
	at org.apache.solr.client.solrj.impl.CloudSolrClient.request(CloudSolrClient.java:817)
	at org.apache.solr.client.solrj.SolrRequest.process(SolrRequest.java:207)
	at org.apache.solr.client.solrj.SolrRequest.process(SolrRequest.java:224)
	at org.apache.solr.cloud.TestWithCollection.testMultipleWithCollections(TestWithCollection.java:564)
	at sun.reflect.NativeMethodAccessorImpl.invoke0(Native Method)
	at sun.reflect.NativeMethodAccessorImpl.invoke(NativeMethodAccessorImpl.java:62)
	at sun.reflect.DelegatingMethodAccessorImpl.invoke(DelegatingMethodAccessorImpl.java:43)
	at java.lang.reflect.Method.invoke(Method.java:498)
	at com.carrotsearch.randomizedtesting.RandomizedRunner.invoke(RandomizedRunner.java:1750)
	at com.carrotsearch.randomizedtesting.RandomizedRunner$8.evaluate(RandomizedRunner.java:938)
	at com.carrotsearch.randomizedtesting.RandomizedRunner$9.evaluate(RandomizedRunner.java:974)
	at com.carrotsearch.randomizedtesting.RandomizedRunner$10.evaluate(RandomizedRunner.java:988)
	at com.carrotsearch.randomizedtesting.rules.SystemPropertiesRestoreRule$1.evaluate(SystemPropertiesRestoreRule.java:57)
	at org.apache.lucene.util.TestRuleSetupTeardownChained$1.evaluate(TestRuleSetupTeardownChained.java:49)
	at org.apache.lucene.util.AbstractBeforeAfterRule$1.evaluate(AbstractBeforeAfterRule.java:45)
	at org.apache.lucene.util.TestRuleThreadAndTestName$1.evaluate(TestRuleThreadAndTestName.java:48)
	at org.apache.lucene.util.TestRuleIgnoreAfterMaxFailures$1.evaluate(TestRuleIgnoreAfterMaxFailures.java:64)
	at org.apache.lucene.util.TestRuleMarkFailure$1.evaluate(TestRuleMarkFailure.java:47)
	at com.carrotsearch.randomizedtesting.rules.StatementAdapter.evaluate(StatementAdapter.java:36)
	at com.carrotsearch.randomizedtesting.ThreadLeakControl$StatementRunner.run(ThreadLeakControl.java:368)
	at com.carrotsearch.randomizedtesting.ThreadLeakControl.forkTimeoutingTask(ThreadLeakControl.java:817)
	at com.carrotsearch.randomizedtesting.ThreadLeakControl$3.evaluate(ThreadLeakControl.java:468)
	at com.carrotsearch.randomizedtesting.RandomizedRunner.runSingleTest(RandomizedRunner.java:947)
	at com.carrotsearch.randomizedtesting.RandomizedRunner$5.evaluate(RandomizedRunner.java:832)
	at com.carrotsearch.randomizedtesting.RandomizedRunner$6.evaluate(RandomizedRunner.java:883)
	at com.carrotsearch.randomizedtesting.RandomizedRunner$7.evaluate(RandomizedRunner.java:894)
	at com.carrotsearch.randomizedtesting.rules.StatementAdapter.evaluate(StatementAdapter.java:36)
	at com.carrotsearch.randomizedtesting.rules.SystemPropertiesRestoreRule$1.evaluate(SystemPropertiesRestoreRule.java:57)
	at org.apache.lucene.util.AbstractBeforeAfterRule$1.evaluate(AbstractBeforeAfterRule.java:45)
	at com.carrotsearch.randomizedtesting.rules.StatementAdapter.evaluate(StatementAdapter.java:36)
	at org.apache.lucene.util.TestRuleStoreClassName$1.evaluate(TestRuleStoreClassName.java:41)
	at com.carrotsearch.randomizedtesting.rules.NoShadowingOrOverridesOnMethodsRule$1.evaluate(NoShadowingOrOverridesOnMethodsRule.java:40)
	at com.carrotsearch.randomizedtesting.rules.NoShadowingOrOverridesOnMethodsRule$1.evaluate(NoShadowingOrOverridesOnMethodsRule.java:40)
	at com.carrotsearch.randomizedtesting.rules.StatementAdapter.evaluate(StatementAdapter.java:36)
	at com.carrotsearch.randomizedtesting.rules.StatementAdapter.evaluate(StatementAdapter.java:36)
	at com.carrotsearch.randomizedtesting.rules.StatementAdapter.evaluate(StatementAdapter.java:36)
	at org.apache.lucene.util.TestRuleAssertionsRequired$1.evaluate(TestRuleAssertionsRequired.java:53)
	at org.apache.lucene.util.TestRuleMarkFailure$1.evaluate(TestRuleMarkFailure.java:47)
	at org.apache.lucene.util.TestRuleIgnoreAfterMaxFailures$1.evaluate(TestRuleIgnoreAfterMaxFailures.java:64)
	at org.apache.lucene.util.TestRuleIgnoreTestSuites$1.evaluate(TestRuleIgnoreTestSuites.java:54)
	at com.carrotsearch.randomizedtesting.rules.StatementAdapter.evaluate(StatementAdapter.java:36)
	at com.carrotsearch.randomizedtesting.ThreadLeakControl$StatementRunner.run(ThreadLeakControl.java:368)
	at java.lang.Thread.run(Thread.java:748)
Caused by: java.net.SocketTimeoutException: Read timed out
	at java.net.SocketInputStream.socketRead0(Native Method)
	at java.net.SocketInputStream.socketRead(SocketInputStream.java:116)
	at java.net.SocketInputStream.read(SocketInputStream.java:171)
	at java.net.SocketInputStream.read(SocketInputStream.java:141)
	at org.apache.http.impl.io.SessionInputBufferImpl.streamRead(SessionInputBufferImpl.java:137)
	at org.apache.http.impl.io.SessionInputBufferImpl.fillBuffer(SessionInputBufferImpl.java:153)
	at org.apache.http.impl.io.SessionInputBufferImpl.readLine(SessionInputBufferImpl.java:282)
	at org.apache.http.impl.conn.DefaultHttpResponseParser.parseHead(DefaultHttpResponseParser.java:138)
	at org.apache.http.impl.conn.DefaultHttpResponseParser.parseHead(DefaultHttpResponseParser.java:56)
	at org.apache.http.impl.io.AbstractMessageParser.parse(AbstractMessageParser.java:259)
	at org.apache.http.impl.DefaultBHttpClientConnection.receiveResponseHeader(DefaultBHttpClientConnection.java:163)
	at org.apache.http.impl.conn.CPoolProxy.receiveResponseHeader(CPoolProxy.java:165)
	at org.apache.http.protocol.HttpRequestExecutor.doReceiveResponse(HttpRequestExecutor.java:273)
	at org.apache.http.protocol.HttpRequestExecutor.execute(HttpRequestExecutor.java:125)
	at org.apache.http.impl.execchain.MainClientExec.execute(MainClientExec.java:272)
	at org.apache.http.impl.execchain.ProtocolExec.execute(ProtocolExec.java:185)
	at org.apache.http.impl.execchain.RetryExec.execute(RetryExec.java:89)
	at org.apache.http.impl.execchain.RedirectExec.execute(RedirectExec.java:110)
	at org.apache.http.impl.client.InternalHttpClient.doExecute(InternalHttpClient.java:185)
	at org.apache.http.impl.client.CloseableHttpClient.execute(CloseableHttpClient.java:83)
	at org.apache.http.impl.client.CloseableHttpClient.execute(CloseableHttpClient.java:56)
	at org.apache.solr.client.solrj.impl.HttpSolrClient.executeMethod(HttpSolrClient.java:549)
	... 50 more




Build Log:
[...truncated 12638 lines...]
   [junit4] Suite: org.apache.solr.cloud.TestWithCollection
   [junit4]   2> Creating dataDir: /export/home/jenkins/workspace/Lucene-Solr-master-Solaris/solr/build/solr-core/test/J0/temp/solr.cloud.TestWithCollection_D8F5F3B315FED680-001/init-core-data-001
   [junit4]   2> 10440 WARN  (SUITE-TestWithCollection-seed#[D8F5F3B315FED680]-worker) [    ] o.a.s.SolrTestCaseJ4 startTrackingSearchers: numOpens=1 numCloses=1
   [junit4]   2> 10443 INFO  (SUITE-TestWithCollection-seed#[D8F5F3B315FED680]-worker) [    ] o.a.s.SolrTestCaseJ4 Using PointFields (NUMERIC_POINTS_SYSPROP=true) w/NUMERIC_DOCVALUES_SYSPROP=true
   [junit4]   2> 10446 INFO  (SUITE-TestWithCollection-seed#[D8F5F3B315FED680]-worker) [    ] o.a.s.SolrTestCaseJ4 Randomized ssl (false) and clientAuth (false) via: @org.apache.solr.util.RandomizeSSL(reason=, value=NaN, ssl=NaN, clientAuth=NaN)
   [junit4]   2> 10446 INFO  (SUITE-TestWithCollection-seed#[D8F5F3B315FED680]-worker) [    ] o.a.s.SolrTestCaseJ4 SecureRandom sanity checks: test.solr.allowed.securerandom=null & java.security.egd=file:/dev/./urandom
   [junit4]   2> 10451 INFO  (TEST-TestWithCollection.testMoveReplicaMainCollection-seed#[D8F5F3B315FED680]) [    ] o.a.s.SolrTestCaseJ4 ###Starting testMoveReplicaMainCollection
   [junit4]   2> 10458 INFO  (TEST-TestWithCollection.testMoveReplicaMainCollection-seed#[D8F5F3B315FED680]) [    ] o.a.s.c.MiniSolrCloudCluster Starting cluster of 2 servers in /export/home/jenkins/workspace/Lucene-Solr-master-Solaris/solr/build/solr-core/test/J0/temp/solr.cloud.TestWithCollection_D8F5F3B315FED680-001/tempDir-001
   [junit4]   2> 10474 INFO  (TEST-TestWithCollection.testMoveReplicaMainCollection-seed#[D8F5F3B315FED680]) [    ] o.a.s.c.ZkTestServer STARTING ZK TEST SERVER
   [junit4]   2> 10476 INFO  (ZkTestServer Run Thread) [    ] o.a.s.c.ZkTestServer client port:0.0.0.0/0.0.0.0:0
   [junit4]   2> 10477 INFO  (ZkTestServer Run Thread) [    ] o.a.s.c.ZkTestServer Starting server
   [junit4]   2> 10678 INFO  (TEST-TestWithCollection.testMoveReplicaMainCollection-seed#[D8F5F3B315FED680]) [    ] o.a.s.c.ZkTestServer start zk server on port:42693
   [junit4]   2> 10679 INFO  (TEST-TestWithCollection.testMoveReplicaMainCollection-seed#[D8F5F3B315FED680]) [    ] o.a.s.c.ZkTestServer parse host and port list: 127.0.0.1:42693
   [junit4]   2> 10680 INFO  (TEST-TestWithCollection.testMoveReplicaMainCollection-seed#[D8F5F3B315FED680]) [    ] o.a.s.c.ZkTestServer connecting to 127.0.0.1 42693
   [junit4]   2> 10850 INFO  (zkConnectionManagerCallback-10-thread-1) [    ] o.a.s.c.c.ConnectionManager zkClient has connected
   [junit4]   2> 10887 INFO  (zkConnectionManagerCallback-12-thread-1) [    ] o.a.s.c.c.ConnectionManager zkClient has connected
   [junit4]   2> 10894 INFO  (zkConnectionManagerCallback-14-thread-1) [    ] o.a.s.c.c.ConnectionManager zkClient has connected
   [junit4]   2> 11013 WARN  (jetty-launcher-15-thread-1) [    ] o.e.j.s.AbstractConnector Ignoring deprecated socket close linger time
   [junit4]   2> 11013 WARN  (jetty-launcher-15-thread-2) [    ] o.e.j.s.AbstractConnector Ignoring deprecated socket close linger time
   [junit4]   2> 11197 INFO  (jetty-launcher-15-thread-2) [    ] o.a.s.c.s.e.JettySolrRunner Start Jetty (original configured port=0)
   [junit4]   2> 11197 INFO  (jetty-launcher-15-thread-1) [    ] o.a.s.c.s.e.JettySolrRunner Start Jetty (original configured port=0)
   [junit4]   2> 11197 INFO  (jetty-launcher-15-thread-1) [    ] o.a.s.c.s.e.JettySolrRunner Trying to start Jetty on port 0 try number 1 ...
   [junit4]   2> 11197 INFO  (jetty-launcher-15-thread-2) [    ] o.a.s.c.s.e.JettySolrRunner Trying to start Jetty on port 0 try number 1 ...
   [junit4]   2> 11207 INFO  (jetty-launcher-15-thread-2) [    ] o.e.j.s.Server jetty-9.4.14.v20181114; built: 2018-11-14T21:20:31.478Z; git: c4550056e785fb5665914545889f21dc136ad9e6; jvm 1.8.0_191-b12
   [junit4]   2> 11209 INFO  (jetty-launcher-15-thread-1) [    ] o.e.j.s.Server jetty-9.4.14.v20181114; built: 2018-11-14T21:20:31.478Z; git: c4550056e785fb5665914545889f21dc136ad9e6; jvm 1.8.0_191-b12
   [junit4]   2> 11227 INFO  (jetty-launcher-15-thread-1) [    ] o.e.j.s.session DefaultSessionIdManager workerName=node0
   [junit4]   2> 11227 INFO  (jetty-launcher-15-thread-1) [    ] o.e.j.s.session No SessionScavenger set, using defaults
   [junit4]   2> 11232 INFO  (jetty-launcher-15-thread-1) [    ] o.e.j.s.session node0 Scavenging every 600000ms
   [junit4]   2> 11241 INFO  (jetty-launcher-15-thread-2) [    ] o.e.j.s.session DefaultSessionIdManager workerName=node0
   [junit4]   2> 11241 INFO  (jetty-launcher-15-thread-2) [    ] o.e.j.s.session No SessionScavenger set, using defaults
   [junit4]   2> 11242 INFO  (jetty-launcher-15-thread-2) [    ] o.e.j.s.session node0 Scavenging every 660000ms
   [junit4]   2> 11258 INFO  (jetty-launcher-15-thread-2) [    ] o.e.j.s.h.ContextHandler Started o.e.j.s.ServletContextHandler@1125043c{/solr,null,AVAILABLE}
   [junit4]   2> 11258 INFO  (jetty-launcher-15-thread-1) [    ] o.e.j.s.h.ContextHandler Started o.e.j.s.ServletContextHandler@5246c9e8{/solr,null,AVAILABLE}
   [junit4]   2> 11266 INFO  (jetty-launcher-15-thread-1) [    ] o.e.j.s.AbstractConnector Started ServerConnector@7bc7b6d3{HTTP/1.1,[http/1.1, h2c]}{127.0.0.1:34061}
   [junit4]   2> 11267 INFO  (jetty-launcher-15-thread-1) [    ] o.e.j.s.Server Started @11349ms
   [junit4]   2> 11267 INFO  (jetty-launcher-15-thread-1) [    ] o.a.s.c.s.e.JettySolrRunner Jetty properties: {hostContext=/solr, hostPort=34061}
   [junit4]   2> 11280 INFO  (jetty-launcher-15-thread-2) [    ] o.e.j.s.AbstractConnector Started ServerConnector@6461c17a{HTTP/1.1,[http/1.1, h2c]}{127.0.0.1:53470}
   [junit4]   2> 11280 INFO  (jetty-launcher-15-thread-2) [    ] o.e.j.s.Server Started @11363ms
   [junit4]   2> 11281 INFO  (jetty-launcher-15-thread-2) [    ] o.a.s.c.s.e.JettySolrRunner Jetty properties: {hostContext=/solr, hostPort=53470}
   [junit4]   2> 11312 INFO  (jetty-launcher-15-thread-1) [    ] o.a.s.u.c.SSLCredentialProviderFactory Processing SSL Credential Provider chain: env;sysprop
   [junit4]   2> 11316 ERROR (jetty-launcher-15-thread-1) [    ] o.a.s.u.StartupLoggingUtils Missing Java Option solr.log.dir. Logging may be missing or incomplete.
   [junit4]   2> 11316 INFO  (jetty-launcher-15-thread-1) [    ] o.a.s.s.SolrDispatchFilter Using logger factory org.apache.logging.slf4j.Log4jLoggerFactory
   [junit4]   2> 11316 INFO  (jetty-launcher-15-thread-1) [    ] o.a.s.s.SolrDispatchFilter  ___      _       Welcome to Apache Solr™ version 9.0.0
   [junit4]   2> 11316 INFO  (jetty-launcher-15-thread-1) [    ] o.a.s.s.SolrDispatchFilter / __| ___| |_ _   Starting in cloud mode on port null
   [junit4]   2> 11316 INFO  (jetty-launcher-15-thread-1) [    ] o.a.s.s.SolrDispatchFilter \__ \/ _ \ | '_|  Install dir: null
   [junit4]   2> 11317 INFO  (jetty-launcher-15-thread-1) [    ] o.a.s.s.SolrDispatchFilter |___/\___/_|_|    Start time: 2019-01-19T05:23:42.900Z
   [junit4]   2> 11317 INFO  (jetty-launcher-15-thread-1) [    ] o.a.s.c.SolrResourceLoader solr home defaulted to 'solr/' (could not find system property or JNDI)
   [junit4]   2> 11322 ERROR (jetty-launcher-15-thread-2) [    ] o.a.s.u.StartupLoggingUtils Missing Java Option solr.log.dir. Logging may be missing or incomplete.
   [junit4]   2> 11322 INFO  (jetty-launcher-15-thread-2) [    ] o.a.s.s.SolrDispatchFilter Using logger factory org.apache.logging.slf4j.Log4jLoggerFactory
   [junit4]   2> 11323 INFO  (jetty-launcher-15-thread-2) [    ] o.a.s.s.SolrDispatchFilter  ___      _       Welcome to Apache Solr™ version 9.0.0
   [junit4]   2> 11339 INFO  (jetty-launcher-15-thread-2) [    ] o.a.s.s.SolrDispatchFilter / __| ___| |_ _   Starting in cloud mode on port null
   [junit4]   2> 11339 INFO  (jetty-launcher-15-thread-2) [    ] o.a.s.s.SolrDispatchFilter \__ \/ _ \ | '_|  Install dir: null
   [junit4]   2> 11339 INFO  (jetty-launcher-15-thread-2) [    ] o.a.s.s.SolrDispatchFilter |___/\___/_|_|    Start time: 2019-01-19T05:23:42.922Z
   [junit4]   2> 11340 INFO  (zkConnectionManagerCallback-17-thread-1) [    ] o.a.s.c.c.ConnectionManager zkClient has connected
   [junit4]   2> 11352 INFO  (jetty-launcher-15-thread-1) [    ] o.a.s.s.SolrDispatchFilter solr.xml found in ZooKeeper. Loading...
   [junit4]   2> 11365 INFO  (zkConnectionManagerCallback-19-thread-1) [    ] o.a.s.c.c.ConnectionManager zkClient has connected
   [junit4]   2> 11426 INFO  (jetty-launcher-15-thread-2) [    ] o.a.s.s.SolrDispatchFilter solr.xml found in ZooKeeper. Loading...
   [junit4]   2> 11868 INFO  (jetty-launcher-15-thread-1) [    ] o.a.s.h.c.HttpShardHandlerFactory Host whitelist initialized: WhitelistHostChecker [whitelistHosts=null, whitelistHostCheckingEnabled=true]
   [junit4]   2> 11874 WARN  (jetty-launcher-15-thread-1) [    ] o.e.j.u.s.S.config No Client EndPointIdentificationAlgorithm configured for SslContextFactory@22047ebb[provider=null,keyStore=null,trustStore=null]
   [junit4]   2> 11953 WARN  (jetty-launcher-15-thread-1) [    ] o.e.j.u.s.S.config No Client EndPointIdentificationAlgorithm configured for SslContextFactory@cda02a0[provider=null,keyStore=null,trustStore=null]
   [junit4]   2> 11955 INFO  (jetty-launcher-15-thread-1) [    ] o.a.s.c.ZkContainer Zookeeper client=127.0.0.1:42693/solr
   [junit4]   2> 11978 INFO  (zkConnectionManagerCallback-25-thread-1) [    ] o.a.s.c.c.ConnectionManager zkClient has connected
   [junit4]   2> 12004 INFO  (zkConnectionManagerCallback-27-thread-1) [    ] o.a.s.c.c.ConnectionManager zkClient has connected
   [junit4]   2> 12388 INFO  (jetty-launcher-15-thread-1) [n:127.0.0.1:34061_solr    ] o.a.s.c.OverseerElectionContext I am going to be the leader 127.0.0.1:34061_solr
   [junit4]   2> 12391 INFO  (jetty-launcher-15-thread-1) [n:127.0.0.1:34061_solr    ] o.a.s.c.Overseer Overseer (id=72125099488903174-127.0.0.1:34061_solr-n_0000000000) starting
   [junit4]   2> 12503 INFO  (zkConnectionManagerCallback-34-thread-1) [    ] o.a.s.c.c.ConnectionManager zkClient has connected
   [junit4]   2> 12514 INFO  (jetty-launcher-15-thread-1) [n:127.0.0.1:34061_solr    ] o.a.s.c.s.i.ZkClientClusterStateProvider Cluster at 127.0.0.1:42693/solr ready
   [junit4]   2> 12613 INFO  (jetty-launcher-15-thread-1) [n:127.0.0.1:34061_solr    ] o.a.s.c.ZkController Register node as live in ZooKeeper:/live_nodes/127.0.0.1:34061_solr
   [junit4]   2> 12615 INFO  (OverseerStateUpdate-72125099488903174-127.0.0.1:34061_solr-n_0000000000) [n:127.0.0.1:34061_solr    ] o.a.s.c.Overseer Starting to work on the main queue : 127.0.0.1:34061_solr
   [junit4]   2> 12693 DEBUG (OverseerAutoScalingTriggerThread-72125099488903174-127.0.0.1:34061_solr-n_0000000000) [    ] o.a.s.c.a.OverseerTriggerThread Adding .auto_add_replicas and .scheduled_maintenance triggers
   [junit4]   2> 12698 INFO  (zkCallback-26-thread-1) [    ] o.a.s.c.c.ZkStateReader Updated live nodes from ZooKeeper... (0) -> (1)
   [junit4]   2> 12705 INFO  (zkCallback-33-thread-1) [    ] o.a.s.c.c.ZkStateReader Updated live nodes from ZooKeeper... (0) -> (1)
   [junit4]   2> 12709 DEBUG (OverseerAutoScalingTriggerThread-72125099488903174-127.0.0.1:34061_solr-n_0000000000) [    ] o.a.s.c.a.OverseerTriggerThread Refreshing /autoscaling.json with znode version 1
   [junit4]   2> 12748 INFO  (jetty-launcher-15-thread-1) [n:127.0.0.1:34061_solr    ] o.a.s.h.a.MetricsHistoryHandler No .system collection, keeping metrics history in memory.
   [junit4]   2> 12782 INFO  (jetty-launcher-15-thread-1) [n:127.0.0.1:34061_solr    ] o.a.s.m.r.SolrJmxReporter JMX monitoring for 'solr_34061.solr.node' (registry 'solr.node') enabled at server: com.sun.jmx.mbeanserver.JmxMBeanServer@60da2240
   [junit4]   2> 12782 INFO  (jetty-launcher-15-thread-1) [n:127.0.0.1:34061_solr    ] o.a.s.m.r.SolrJmxReporter JMX monitoring for 'solr_34061.solr.jvm' (registry 'solr.jvm') enabled at server: com.sun.jmx.mbeanserver.JmxMBeanServer@60da2240
   [junit4]   2> 12783 INFO  (jetty-launcher-15-thread-1) [n:127.0.0.1:34061_solr    ] o.a.s.m.r.SolrJmxReporter JMX monitoring for 'solr_34061.solr.jetty' (registry 'solr.jetty') enabled at server: com.sun.jmx.mbeanserver.JmxMBeanServer@60da2240
   [junit4]   2> 12786 INFO  (jetty-launcher-15-thread-1) [n:127.0.0.1:34061_solr    ] o.a.s.c.CorePropertiesLocator Found 0 core definitions underneath /export/home/jenkins/workspace/Lucene-Solr-master-Solaris/solr/build/solr-core/test/J0/temp/solr.cloud.TestWithCollection_D8F5F3B315FED680-001/tempDir-001/node1/.
   [junit4]   2> 12983 DEBUG (OverseerAutoScalingTriggerThread-72125099488903174-127.0.0.1:34061_solr-n_0000000000) [    ] o.a.s.c.a.OverseerTriggerThread Current znodeVersion 1, lastZnodeVersion 0
   [junit4]   2> 12983 DEBUG (OverseerAutoScalingTriggerThread-72125099488903174-127.0.0.1:34061_solr-n_0000000000) [    ] o.a.s.c.a.OverseerTriggerThread Processed trigger updates upto znodeVersion 1
   [junit4]   2> 12999 DEBUG (OverseerAutoScalingTriggerThread-72125099488903174-127.0.0.1:34061_solr-n_0000000000) [    ] o.a.s.c.a.NodeLostTrigger NodeLostTrigger .auto_add_replicas - Initial livenodes: [127.0.0.1:34061_solr]
   [junit4]   2> 13001 DEBUG (OverseerAutoScalingTriggerThread-72125099488903174-127.0.0.1:34061_solr-n_0000000000) [    ] o.a.s.c.a.OverseerTriggerThread -- cleaning old nodeLost / nodeAdded markers
   [junit4]   2> 13002 DEBUG (OverseerAutoScalingTriggerThread-72125099488903174-127.0.0.1:34061_solr-n_0000000000) [    ] o.a.s.c.a.OverseerTriggerThread Current znodeVersion 1, lastZnodeVersion 1
   [junit4]   2> 13003 DEBUG (ScheduledTrigger-24-thread-2) [    ] o.a.s.c.a.NodeLostTrigger Running NodeLostTrigger: .auto_add_replicas with currently live nodes: 1 and last live nodes: 1
   [junit4]   2> 13092 INFO  (jetty-launcher-15-thread-2) [    ] o.a.s.h.c.HttpShardHandlerFactory Host whitelist initialized: WhitelistHostChecker [whitelistHosts=null, whitelistHostCheckingEnabled=true]
   [junit4]   2> 13127 WARN  (jetty-launcher-15-thread-2) [    ] o.e.j.u.s.S.config No Client EndPointIdentificationAlgorithm configured for SslContextFactory@484d4b79[provider=null,keyStore=null,trustStore=null]
   [junit4]   2> 13142 WARN  (jetty-launcher-15-thread-2) [    ] o.e.j.u.s.S.config No Client EndPointIdentificationAlgorithm configured for SslContextFactory@23757cf0[provider=null,keyStore=null,trustStore=null]
   [junit4]   2> 13143 INFO  (jetty-launcher-15-thread-2) [    ] o.a.s.c.ZkContainer Zookeeper client=127.0.0.1:42693/solr
   [junit4]   2> 13148 INFO  (zkConnectionManagerCallback-41-thread-1) [    ] o.a.s.c.c.ConnectionManager zkClient has connected
   [junit4]   2> 13155 INFO  (zkConnectionManagerCallback-43-thread-1) [    ] o.a.s.c.c.ConnectionManager zkClient has connected
   [junit4]   2> 13165 INFO  (jetty-launcher-15-thread-2) [n:127.0.0.1:53470_solr    ] o.a.s.c.c.ZkStateReader Updated live nodes from ZooKeeper... (0) -> (1)
   [junit4]   2> 13173 INFO  (jetty-launcher-15-thread-2) [n:127.0.0.1:53470_solr    ] o.a.s.c.ZkController Publish node=127.0.0.1:53470_solr as DOWN
   [junit4]   2> 13176 INFO  (jetty-launcher-15-thread-2) [n:127.0.0.1:53470_solr    ] o.a.s.c.TransientSolrCoreCacheDefault Allocating transient cache for 2147483647 transient cores
   [junit4]   2> 13177 INFO  (jetty-launcher-15-thread-2) [n:127.0.0.1:53470_solr    ] o.a.s.c.ZkController Register node as live in ZooKeeper:/live_nodes/127.0.0.1:53470_solr
   [junit4]   2> 13179 INFO  (zkCallback-26-thread-1) [    ] o.a.s.c.c.ZkStateReader Updated live nodes from ZooKeeper... (1) -> (2)
   [junit4]   2> 13179 INFO  (zkCallback-33-thread-1) [    ] o.a.s.c.c.ZkStateReader Updated live nodes from ZooKeeper... (1) -> (2)
   [junit4]   2> 13246 DEBUG (OverseerStateUpdate-72125099488903174-127.0.0.1:34061_solr-n_0000000000) [n:127.0.0.1:34061_solr    ] o.a.s.c.o.NodeMutator DownNode state invoked for node: 127.0.0.1:53470_solr
   [junit4]   2> 13248 INFO  (zkCallback-42-thread-1) [    ] o.a.s.c.c.ZkStateReader Updated live nodes from ZooKeeper... (1) -> (2)
   [junit4]   2> 13251 INFO  (zkConnectionManagerCallback-50-thread-1) [    ] o.a.s.c.c.ConnectionManager zkClient has connected
   [junit4]   2> 13253 INFO  (jetty-launcher-15-thread-2) [n:127.0.0.1:53470_solr    ] o.a.s.c.c.ZkStateReader Updated live nodes from ZooKeeper... (0) -> (2)
   [junit4]   2> 13255 INFO  (jetty-launcher-15-thread-2) [n:127.0.0.1:53470_solr    ] o.a.s.c.s.i.ZkClientClusterStateProvider Cluster at 127.0.0.1:42693/solr ready
   [junit4]   2> 13256 INFO  (jetty-launcher-15-thread-2) [n:127.0.0.1:53470_solr    ] o.a.s.h.a.MetricsHistoryHandler No .system collection, keeping metrics history in memory.
   [junit4]   2> 13284 INFO  (jetty-launcher-15-thread-2) [n:127.0.0.1:53470_solr    ] o.a.s.m.r.SolrJmxReporter JMX monitoring for 'solr_53470.solr.node' (registry 'solr.node') enabled at server: com.sun.jmx.mbeanserver.JmxMBeanServer@60da2240
   [junit4]   2> 13294 INFO  (jetty-launcher-15-thread-2) [n:127.0.0.1:53470_solr    ] o.a.s.m.r.SolrJmxReporter JMX monitoring for 'solr_53470.solr.jvm' (registry 'solr.jvm') enabled at server: com.sun.jmx.mbeanserver.JmxMBeanServer@60da2240
   [junit4]   2> 13294 INFO  (jetty-launcher-15-thread-2) [n:127.0.0.1:53470_solr    ] o.a.s.m.r.SolrJmxReporter JMX monitoring for 'solr_53470.solr.jetty' (registry 'solr.jetty') enabled at server: com.sun.jmx.mbeanserver.JmxMBeanServer@60da2240
   [junit4]   2> 13296 INFO  (jetty-launcher-15-thread-2) [n:127.0.0.1:53470_solr    ] o.a.s.c.CorePropertiesLocator Found 0 core definitions underneath /export/home/jenkins/workspace/Lucene-Solr-master-Solaris/solr/build/solr-core/test/J0/temp/solr.cloud.TestWithCollection_D8F5F3B315FED680-001/tempDir-001/node2/.
   [junit4]   2> 13372 INFO  (zkConnectionManagerCallback-56-thread-1) [    ] o.a.s.c.c.ConnectionManager zkClient has connected
   [junit4]   2> 13380 INFO  (TEST-TestWithCollection.testMoveReplicaMainCollection-seed#[D8F5F3B315FED680]) [    ] o.a.s.c.c.ZkStateReader Updated live nodes from ZooKeeper... (0) -> (2)
   [junit4]   2> 13386 INFO  (TEST-TestWithCollection.testMoveReplicaMainCollection-seed#[D8F5F3B315FED680]) [    ] o.a.s.c.s.i.ZkClientClusterStateProvider Cluster at 127.0.0.1:42693/solr ready
   [junit4]   2> 13393 DEBUG (zkCallback-33-thread-1) [    ] o.a.s.c.a.OverseerTriggerThread Refreshing /autoscaling.json with znode version 2
   [junit4]   2> 13394 DEBUG (OverseerAutoScalingTriggerThread-72125099488903174-127.0.0.1:34061_solr-n_0000000000) [    ] o.a.s.c.a.OverseerTriggerThread Processed trigger updates upto znodeVersion 2
   [junit4]   2> 13400 DEBUG (OverseerAutoScalingTriggerThread-72125099488903174-127.0.0.1:34061_solr-n_0000000000) [    ] o.a.s.c.a.OverseerTriggerThread -- cleaning old nodeLost / nodeAdded markers
   [junit4]   2> 13403 DEBUG (OverseerAutoScalingTriggerThread-72125099488903174-127.0.0.1:34061_solr-n_0000000000) [    ] o.a.s.c.a.OverseerTriggerThread Current znodeVersion 2, lastZnodeVersion 2
   [junit4]   2> 13775 INFO  (qtp303235554-60) [n:127.0.0.1:53470_solr    ] o.a.s.s.HttpSolrCall [admin] webapp=null path=/admin/metrics params={prefix=CONTAINER.fs.usableSpace,CORE.coreName&wt=javabin&version=2&group=solr.node,solr.core} status=0 QTime=12
   [junit4]   2> 13826 INFO  (qtp303235554-62) [n:127.0.0.1:53470_solr    ] o.a.s.s.HttpSolrCall [admin] webapp=null path=/admin/metrics params={prefix=CONTAINER.fs.usableSpace,CORE.coreName&wt=javabin&version=2&group=solr.node,solr.core} status=0 QTime=1
   [junit4]   2> 13829 INFO  (qtp303235554-64) [n:127.0.0.1:53470_solr    ] o.a.s.s.HttpSolrCall [admin] webapp=null path=/admin/metrics params={prefix=CONTAINER.fs.usableSpace,CORE.coreName&wt=javabin&version=2&group=solr.node,solr.core} status=0 QTime=1
   [junit4]   2> 13837 INFO  (qtp303235554-61) [n:127.0.0.1:53470_solr    ] o.a.s.s.HttpSolrCall [admin] webapp=null path=/admin/metrics params={prefix=CONTAINER.fs.usableSpace,CORE.coreName&wt=javabin&version=2&group=solr.node,solr.core} status=0 QTime=6
   [junit4]   2> 13841 INFO  (qtp303235554-58) [n:127.0.0.1:53470_solr    ] o.a.s.s.HttpSolrCall [admin] webapp=null path=/admin/metrics params={prefix=CONTAINER.fs.usableSpace,CORE.coreName&wt=javabin&version=2&group=solr.node,solr.core} status=0 QTime=0
   [junit4]   2> 13845 INFO  (qtp126434414-55) [n:127.0.0.1:34061_solr    ] o.a.s.s.HttpSolrCall [admin] webapp=null path=/admin/metrics params={prefix=CONTAINER.fs.usableSpace,CORE.coreName&wt=javabin&version=2&group=solr.node,solr.core} status=0 QTime=0
   [junit4]   2> 13847 INFO  (qtp126434414-56) [n:127.0.0.1:34061_solr    ] o.a.s.s.HttpSolrCall [admin] webapp=null path=/admin/metrics params={prefix=CONTAINER.fs.usableSpace,CORE.coreName&wt=javabin&version=2&group=solr.node,solr.core} status=0 QTime=0
   [junit4]   2> 13849 INFO  (qtp126434414-51) [n:127.0.0.1:34061_solr    ] o.a.s.s.HttpSolrCall [admin] webapp=null path=/admin/metrics params={prefix=CONTAINER.fs.usableSpace,CORE.coreName&wt=javabin&version=2&group=solr.node,solr.core} status=0 QTime=0
   [junit4]   2> 13851 INFO  (qtp126434414-52) [n:127.0.0.1:34061_solr    ] o.a.s.s.HttpSolrCall [admin] webapp=null path=/admin/metrics params={prefix=CONTAINER.fs.usableSpace,CORE.coreName&wt=javabin&version=2&group=solr.node,solr.core} status=0 QTime=0
   [junit4]   2> 13853 INFO  (qtp126434414-54) [n:127.0.0.1:34061_solr    ] o.a.s.s.HttpSolrCall [admin] webapp=null path=/admin/metrics params={prefix=CONTAINER.fs.usableSpace,CORE.coreName&wt=javabin&version=2&group=solr.node,solr.core} status=0 QTime=0
   [junit4]   2> 13858 DEBUG (qtp303235554-63) [n:127.0.0.1:53470_solr    ] o.a.s.c.a.AutoScalingHandler Verified autoscaling configuration
   [junit4]   2> 13860 INFO  (qtp303235554-63) [n:127.0.0.1:53470_solr    ] o.a.s.s.HttpSolrCall [admin] webapp=null path=/cluster/autoscaling params={wt=javabin&version=2} status=0 QTime=165
   [junit4]   2> 13860 DEBUG (zkCallback-33-thread-1) [    ] o.a.s.c.a.OverseerTriggerThread Refreshing /autoscaling.json with znode version 3
   [junit4]   2> 13861 DEBUG (OverseerAutoScalingTriggerThread-72125099488903174-127.0.0.1:34061_solr-n_0000000000) [    ] o.a.s.c.a.OverseerTriggerThread Processed trigger updates upto znodeVersion 3
   [junit4]   2> 13861 DEBUG (OverseerAutoScalingTriggerThread-72125099488903174-127.0.0.1:34061_solr-n_0000000000) [    ] o.a.s.c.a.OverseerTriggerThread -- cleaning old nodeLost / nodeAdded markers
   [junit4]   2> 13861 DEBUG (OverseerAutoScalingTriggerThread-72125099488903174-127.0.0.1:34061_solr-n_0000000000) [    ] o.a.s.c.a.OverseerTriggerThread Current znodeVersion 3, lastZnodeVersion 3
   [junit4]   2> 13863 INFO  (TEST-TestWithCollection.testMoveReplicaMainCollection-seed#[D8F5F3B315FED680]) [    ] o.a.s.c.TestWithCollection Chosen node 127.0.0.1:53470_solr for collection testMoveReplicaMainCollection_abc
   [junit4]   2> 13867 INFO  (qtp303235554-63) [n:127.0.0.1:53470_solr    ] o.a.s.h.a.CollectionsHandler Invoked Collection Action :create with params pullReplicas=0&name=testMoveReplicaMainCollection_abc&nrtReplicas=1&action=CREATE&numShards=1&tlogReplicas=0&createNodeSet=127.0.0.1:53470_solr&wt=javabin&version=2 and sendToOCPQueue=true
   [junit4]   2> 13883 INFO  (OverseerThreadFactory-26-thread-1-processing-n:127.0.0.1:34061_solr) [n:127.0.0.1:34061_solr    ] o.a.s.c.a.c.CreateCollectionCmd Create collection testMoveReplicaMainCollection_abc
   [junit4]   2> 13884 INFO  (OverseerThreadFactory-26-thread-1-processing-n:127.0.0.1:34061_solr) [n:127.0.0.1:34061_solr    ] o.a.s.c.c.ZkConfigManager Copying zk node /configs/_default/managed-schema to /configs/testMoveReplicaMainCollection_abc.AUTOCREATED/managed-schema
   [junit4]   2> 13887 INFO  (OverseerThreadFactory-26-thread-1-processing-n:127.0.0.1:34061_solr) [n:127.0.0.1:34061_solr    ] o.a.s.c.c.ZkConfigManager Copying zk node /configs/_default/protwords.txt to /configs/testMoveReplicaMainCollection_abc.AUTOCREATED/protwords.txt
   [junit4]   2> 13889 INFO  (OverseerThreadFactory-26-thread-1-processing-n:127.0.0.1:34061_solr) [n:127.0.0.1:34061_solr    ] o.a.s.c.c.ZkConfigManager Copying zk node /configs/_default/solrconfig.xml to /configs/testMoveReplicaMainCollection_abc.AUTOCREATED/solrconfig.xml
   [junit4]   2> 13891 INFO  (OverseerThreadFactory-26-thread-1-processing-n:127.0.0.1:34061_solr) [n:127.0.0.1:34061_solr    ] o.a.s.c.c.ZkConfigManager Copying zk node /configs/_default/synonyms.txt to /configs/testMoveReplicaMainCollection_abc.AUTOCREATED/synonyms.txt
   [junit4]   2> 13894 INFO  (OverseerThreadFactory-26-thread-1-processing-n:127.0.0.1:34061_solr) [n:127.0.0.1:34061_solr    ] o.a.s.c.c.ZkConfigManager Copying zk node /configs/_default/stopwords.txt to /configs/testMoveReplicaMainCollection_abc.AUTOCREATED/stopwords.txt
   [junit4]   2> 13897 INFO  (OverseerThreadFactory-26-thread-1-processing-n:127.0.0.1:34061_solr) [n:127.0.0.1:34061_solr    ] o.a.s.c.c.ZkConfigManager Copying zk node /configs/_default/lang/contractions_it.txt to /configs/testMoveReplicaMainCollection_abc.AUTOCREATED/lang/contractions_it.txt
   [junit4]   2> 13900 INFO  (OverseerThreadFactory-26-thread-1-processing-n:127.0.0.1:34061_solr) [n:127.0.0.1:34061_solr    ] o.a.s.c.c.ZkConfigManager Copying zk node /configs/_default/lang/stopwords_no.txt to /configs/testMoveReplicaMainCollection_abc.AUTOCREATED/lang/stopwords_no.txt
   [junit4]   2> 13902 INFO  (OverseerThreadFactory-26-thread-1-processing-n:127.0.0.1:34061_solr) [n:127.0.0.1:34061_solr    ] o.a.s.c.c.ZkConfigManager Copying zk node /configs/_default/lang/stopwords_hy.txt to /configs/testMoveReplicaMainCollection_abc.AUTOCREATED/lang/stopwords_hy.txt
   [junit4]   2> 13906 INFO  (OverseerThreadFactory-26-thread-1-processing-n:127.0.0.1:34061_solr) [n:127.0.0.1:34061_solr    ] o.a.s.c.c.ZkConfigManager Copying zk node /configs/_default/lang/contractions_ca.txt to /configs/testMoveReplicaMainCollection_abc.AUTOCREATED/lang/contractions_ca.txt
   [junit4]   2> 13908 INFO  (OverseerThreadFactory-26-thread-1-processing-n:127.0.0.1:34061_solr) [n:127.0.0.1:34061_solr    ] o.a.s.c.c.ZkConfigManager Copying zk node /configs/_default/lang/stemdict_nl.txt to /configs/testMoveReplicaMainCollection_abc.AUTOCREATED/lang/stemdict_nl.txt
   [junit4]   2> 13911 INFO  (OverseerThreadFactory-26-thread-1-processing-n:127.0.0.1:34061_solr) [n:127.0.0.1:34061_solr    ] o.a.s.c.c.ZkConfigManager Copying zk node /configs/_default/lang/stopwords_id.txt to /configs/testMoveReplicaMainCollection_abc.AUTOCREATED/lang/stopwords_id.txt
   [junit4]   2> 13914 INFO  (OverseerThreadFactory-26-thread-1-processing-n:127.0.0.1:34061_solr) [n:127.0.0.1:34061_solr    ] o.a.s.c.c.ZkConfigManager Copying zk node /configs/_default/lang/stopwords_ga.txt to /configs/testMoveReplicaMainCollection_abc.AUTOCREATED/lang/stopwords_ga.txt
   [junit4]   2> 13916 INFO  (OverseerThreadFactory-26-thread-1-processing-n:127.0.0.1:34061_solr) [n:127.0.0.1:34061_solr    ] o.a.s.c.c.ZkConfigManager Copying zk node /configs/_default/lang/stopwords_hi.txt to /configs/testMoveReplicaMainCollection_abc.AUTOCREATED/lang/stopwords_hi.txt
   [junit4]   2> 13920 INFO  (OverseerThreadFactory-26-thread-1-processing-n:127.0.0.1:34061_solr) [n:127.0.0.1:34061_solr    ] o.a.s.c.c.ZkConfigManager Copying zk node /configs/_default/lang/stopwords_da.txt to /configs/testMoveReplicaMainCollection_abc.AUTOCREATED/lang/stopwords_da.txt
   [junit4]   2> 13923 INFO  (OverseerThreadFactory-26-thread-1-processing-n:127.0.0.1:34061_solr) [n:127.0.0.1:34061_solr    ] o.a.s.c.c.ZkConfigManager Copying zk node /configs/_default/lang/stopwords_ja.txt to /configs/testMoveReplicaMainCollection_abc.AUTOCREATED/lang/stopwords_ja.txt
   [junit4]   2> 13925 INFO  (OverseerThreadFactory-26-thread-1-processing-n:127.0.0.1:34061_solr) [n:127.0.0.1:34061_solr    ] o.a.s.c.c.ZkConfigManager Copying zk node /configs/_default/lang/stopwords_pt.txt to /configs/testMoveReplicaMainCollection_abc.AUTOCREATED/lang/stopwords_pt.txt
   [junit4]   2> 13932 INFO  (OverseerThreadFactory-26-thread-1-processing-n:127.0.0.1:34061_solr) [n:127.0.0.1:34061_solr    ] o.a.s.c.c.ZkConfigManager Copying zk node /configs/_default/lang/stopwords_hu.txt to /configs/testMoveReplicaMainCollection_abc.AUTOCREATED/lang/stopwords_hu.txt
   [junit4]   2> 13934 INFO  (OverseerThreadFactory-26-thread-1-processing-n:127.0.0.1:34061_solr) [n:127.0.0.1:34061_solr    ] o.a.s.c.c.ZkConfigManager Copying zk node /configs/_default/lang/stopwords_el.txt to /configs/testMoveReplicaMainCollection_abc.AUTOCREATED/lang/stopwords_el.txt
   [junit4]   2> 13936 INFO  (OverseerThreadFactory-26-thread-1-processing-n:127.0.0.1:34061_solr) [n:127.0.0.1:34061_solr    ] o.a.s.c.c.ZkConfigManager Copying zk node /configs/_default/lang/stopwords_ru.txt to /configs/testMoveReplicaMainCollection_abc.AUTOCREATED/lang/stopwords_ru.txt
   [junit4]   2> 13938 INFO  (OverseerThreadFactory-26-thread-1-processing-n:127.0.0.1:34061_solr) [n:127.0.0.1:34061_solr    ] o.a.s.c.c.ZkConfigManager Copying zk node /configs/_default/lang/stopwords_tr.txt to /configs/testMoveReplicaMainCollection_abc.AUTOCREATED/lang/stopwords_tr.txt
   [junit4]   2> 13941 INFO  (OverseerThreadFactory-26-thread-1-processing-n:127.0.0.1:34061_solr) [n:127.0.0.1:34061_solr    ] o.a.s.c.c.ZkConfigManager Copying zk node /configs/_default/lang/stopwords_ar.txt to /configs/testMoveReplicaMainCollection_abc.AUTOCREATED/lang/stopwords_ar.txt
   [junit4]   2> 13949 INFO  (OverseerThreadFactory-26-thread-1-processing-n:127.0.0.1:34061_solr) [n:127.0.0.1:34061_solr    ] o.a.s.c.c.ZkConfigManager Copying zk node /configs/_default/lang/userdict_ja.txt to /configs/testMoveReplicaMainCollection_abc.AUTOCREATED/lang/userdict_ja.txt
   [junit4]   2> 13952 INFO  (OverseerThreadFactory-26-thread-1-processing-n:127.0.0.1:34061_solr) [n:127.0.0.1:34061_solr    ] o.a.s.c.c.ZkConfigManager Copying zk node /configs/_default/lang/stopwords_it.txt to /configs/testMoveReplicaMainCollection_abc.AUTOCREATED/lang/stopwords_it.txt
   [junit4]   2> 13955 INFO  (OverseerThreadFactory-26-thread-1-processing-n:127.0.0.1:34061_solr) [n:127.0.0.1:34061_solr    ] o.a.s.c.c.ZkConfigManager Copying zk node /configs/_default/lang/stopwords_eu.txt to /configs/testMoveReplicaMainCollection_abc.AUTOCREATED/lang/stopwords_eu.txt
   [junit4]   2> 13960 INFO  (OverseerThreadFactory-26-thread-1-processing-n:127.0.0.1:34061_solr) [n:127.0.0.1:34061_solr    ] o.a.s.c.c.ZkConfigManager Copying zk node /configs/_default/lang/stopwords_cz.txt to /configs/testMoveReplicaMainCollection_abc.AUTOCREATED/lang/stopwords_cz.txt
   [junit4]   2> 13963 INFO  (OverseerThreadFactory-26-thread-1-processing-n:127.0.0.1:34061_solr) [n:127.0.0.1:34061_solr    ] o.a.s.c.c.ZkConfigManager Copying zk node /configs/_default/lang/stoptags_ja.txt to /configs/testMoveReplicaMainCollection_abc.AUTOCREATED/lang/stoptags_ja.txt
   [junit4]   2> 13967 INFO  (OverseerThreadFactory-26-thread-1-processing-n:127.0.0.1:34061_solr) [n:127.0.0.1:34061_solr    ] o.a.s.c.c.ZkConfigManager Copying zk node /configs/_default/lang/contractions_fr.txt to /configs/testMoveReplicaMainCollection_abc.AUTOCREATED/lang/contractions_fr.txt
   [junit4]   2> 13971 INFO  (OverseerThreadFactory-26-thread-1-processing-n:127.0.0.1:34061_solr) [n:127.0.0.1:34061_solr    ] o.a.s.c.c.ZkConfigManager Copying zk node /configs/_default/lang/stopwords_de.txt to /configs/testMoveReplicaMainCollection_abc.AUTOCREATED/lang/stopwords_de.txt
   [junit4]   2> 13975 INFO  (OverseerThreadFactory-26-thread-1-processing-n:127.0.0.1:34061_solr) [n:127.0.0.1:34061_solr    ] o.a.s.c.c.ZkConfigManager Copying zk node /configs/_default/lang/stopwords_fa.txt to /configs/testMoveReplicaMainCollection_abc.AUTOCREATED/lang/stopwords_fa.txt
   [junit4]   2> 13978 INFO  (OverseerThreadFactory-26-thread-1-processing-n:127.0.0.1:34061_solr) [n:127.0.0.1:34061_solr    ] o.a.s.c.c.ZkConfigManager Copying zk node /configs/_default/lang/contractions_ga.txt to /configs/testMoveReplicaMainCollection_abc.AUTOCREATED/lang/contractions_ga.txt
   [junit4]   2> 13992 INFO  (OverseerThreadFactory-26-thread-1-processing-n:127.0.0.1:34061_solr) [n:127.0.0.1:34061_solr    ] o.a.s.c.c.ZkConfigManager Copying zk node /configs/_default/lang/stopwords_ca.txt to /configs/testMoveReplicaMainCollection_abc.AUTOCREATED/lang/stopwords_ca.txt
   [junit4]   2> 13996 INFO  (OverseerThreadFactory-26-thread-1-processing-n:127.0.0.1:34061_solr) [n:127.0.0.1:34061_solr    ] o.a.s.c.c.ZkConfigManager Copying zk node /configs/_default/lang/stopwords_nl.txt to /configs/testMoveReplicaMainCollection_abc.AUTOCREATED/lang/stopwords_nl.txt
   [junit4]   2> 13999 INFO  (OverseerThreadFactory-26-thread-1-processing-n:127.0.0.1:34061_solr) [n:127.0.0.1:34061_solr    ] o.a.s.c.c.ZkConfigManager Copying zk node /configs/_default/lang/stopwords_bg.txt to /configs/testMoveReplicaMainCollection_abc.AUTOCREATED/lang/stopwords_bg.txt
   [junit4]   2> 14002 INFO  (OverseerThreadFactory-26-thread-1-processing-n:127.0.0.1:34061_solr) [n:127.0.0.1:34061_solr    ] o.a.s.c.c.ZkConfigManager Copying zk node /configs/_default/lang/stopwords_lv.txt to /configs/testMoveReplicaMainCollection_abc.AUTOCREATED/lang/stopwords_lv.txt
   [junit4]   2> 14008 INFO  (OverseerThreadFactory-26-thread-1-processing-n:127.0.0.1:34061_solr) [n:127.0.0.1:34061_solr    ] o.a.s.c.c.ZkConfigManager Copying zk node /configs/_default/lang/stopwords_es.txt to /configs/testMoveReplicaMainCollection_abc.AUTOCREATED/lang/stopwords_es.txt
   [junit4]   2> 14014 INFO  (OverseerThreadFactory-26-thread-1-processing-n:127.0.0.1:34061_solr) [n:127.0.0.1:34061_solr    ] o.a.s.c.c.ZkConfigManager Copying zk node /configs/_default/lang/stopwords_en.txt to /configs/testMoveReplicaMainCollection_abc.AUTOCREATED/lang/stopwords_en.txt
   [junit4]   2> 14017 INFO  (OverseerThreadFactory-26-thread-1-processing-n:127.0.0.1:34061_solr) [n:127.0.0.1:34061_solr    ] o.a.s.c.c.ZkConfigManager Copying zk node /configs/_default/lang/stopwords_ro.txt to /configs/testMoveReplicaMainCollection_abc.AUTOCREATED/lang/stopwords_ro.txt
   [junit4]   2> 14023 INFO  (OverseerThreadFactory-26-thread-1-processing-n:127.0.0.1:34061_solr) [n:127.0.0.1:34061_solr    ] o.a.s.c.c.ZkConfigManager Copying zk node /configs/_default/lang/stopwords_th.txt to /configs/testMoveReplicaMainCollection_abc.AUTOCREATED/lang/stopwords_th.txt
   [junit4]   2> 14033 INFO  (OverseerThreadFactory-26-thread-1-processing-n:127.0.0.1:34061_solr) [n:127.0.0.1:34061_solr    ] o.a.s.c.c.ZkConfigManager Copying zk node /configs/_default/lang/stopwords_fr.txt to /configs/testMoveReplicaMainCollection_abc.AUTOCREATED/lang/stopwords_fr.txt
   [junit4]   2> 14035 INFO  (OverseerThreadFactory-26-thread-1-processing-n:127.0.0.1:34061_solr) [n:127.0.0.1:34061_solr    ] o.a.s.c.c.ZkConfigManager Copying zk node /configs/_default/lang/stopwords_sv.txt to /configs/testMoveReplicaMainCollection_abc.AUTOCREATED/lang/stopwords_sv.txt
   [junit4]   2> 14037 INFO  (OverseerThreadFactory-26-thread-1-processing-n:127.0.0.1:34061_solr) [n:127.0.0.1:34061_solr    ] o.a.s.c.c.ZkConfigManager Copying zk node /configs/_default/lang/stopwords_fi.txt to /configs/testMoveReplicaMainCollection_abc.AUTOCREATED/lang/stopwords_fi.txt
   [junit4]   2> 14040 INFO  (OverseerThreadFactory-26-thread-1-processing-n:127.0.0.1:34061_solr) [n:127.0.0.1:34061_solr    ] o.a.s.c.c.ZkConfigManager Copying zk node /configs/_default/lang/hyphenations_ga.txt to /configs/testMoveReplicaMainCollection_abc.AUTOCREATED/lang/hyphenations_ga.txt
   [junit4]   2> 14043 INFO  (OverseerThreadFactory-26-thread-1-processing-n:127.0.0.1:34061_solr) [n:127.0.0.1:34061_solr    ] o.a.s.c.c.ZkConfigManager Copying zk node /configs/_default/lang/stopwords_gl.txt to /configs/testMoveReplicaMainCollection_abc.AUTOCREATED/lang/stopwords_gl.txt
   [junit4]   2> 14046 INFO  (OverseerThreadFactory-26-thread-1-processing-n:127.0.0.1:34061_solr) [n:127.0.0.1:34061_solr    ] o.a.s.c.c.ZkConfigManager Copying zk node /configs/_default/params.json to /configs/testMoveReplicaMainCollection_abc.AUTOCREATED/params.json
   [junit4]   2> 14065 DEBUG (OverseerStateUpdate-72125099488903174-127.0.0.1:34061_solr-n_0000000000) [n:127.0.0.1:34061_solr    ] o.a.s.c.o.ClusterStateMutator building a new cName: testMoveReplicaMainCollection_abc
   [junit4]   2> 14075 DEBUG (OverseerStateUpdate-72125099488903174-127.0.0.1:34061_solr-n_0000000000) [n:127.0.0.1:34061_solr    ] o.a.s.c.o.ZkStateWriter going to create_collection /collections/testMoveReplicaMainCollection_abc/state.json
   [junit4]   2> 14212 DEBUG (OverseerThreadFactory-26-thread-1-processing-n:127.0.0.1:34061_solr) [n:127.0.0.1:34061_solr    ] o.a.s.c.s.c.a.PolicyHelper Creating a new session
   [junit4]   2> 14222 INFO  (qtp303235554-62) [n:127.0.0.1:53470_solr    ] o.a.s.s.HttpSolrCall [admin] webapp=null path=/admin/metrics params={prefix=CONTAINER.fs.usableSpace,CONTAINER.fs.totalSpace,CORE.coreName&wt=javabin&version=2&group=solr.node,solr.core} status=0 QTime=1
   [junit4]   2> 14224 INFO  (qtp303235554-64) [n:127.0.0.1:53470_solr    ] o.a.s.s.HttpSolrCall [admin] webapp=null path=/admin/metrics params={prefix=CONTAINER.fs.usableSpace,CONTAINER.fs.totalSpace,CORE.coreName&wt=javabin&version=2&group=solr.node,solr.core} status=0 QTime=0
   [junit4]   2> 14229 INFO  (qtp303235554-61) [n:127.0.0.1:53470_solr    ] o.a.s.s.HttpSolrCall [admin] webapp=null path=/admin/metrics params={prefix=CONTAINER.fs.usableSpace,CONTAINER.fs.totalSpace,CORE.coreName&wt=javabin&version=2&group=solr.node,solr.core} status=0 QTime=0
   [junit4]   2> 14232 INFO  (qtp303235554-61) [n:127.0.0.1:53470_solr    ] o.a.s.s.HttpSolrCall [admin] webapp=null path=/admin/metrics params={prefix=CONTAINER.fs.usableSpace,CONTAINER.fs.totalSpace,CORE.coreName&wt=javabin&version=2&group=solr.node,solr.core} status=0 QTime=0
   [junit4]   2> 14234 INFO  (qtp303235554-61) [n:127.0.0.1:53470_solr    ] o.a.s.s.HttpSolrCall [admin] webapp=null path=/admin/metrics params={prefix=CONTAINER.fs.usableSpace,CONTAINER.fs.totalSpace,CORE.coreName&wt=javabin&version=2&group=solr.node,solr.core} status=0 QTime=0
   [junit4]   2> 14238 INFO  (qtp126434414-55) [n:127.0.0.1:34061_solr    ] o.a.s.s.HttpSolrCall [admin] webapp=null path=/admin/metrics params={prefix=CONTAINER.fs.usableSpace,CONTAINER.fs.totalSpace,CORE.coreName&wt=javabin&version=2&group=solr.node,solr.core} status=0 QTime=0
   [junit4]   2> 14241 INFO  (qtp126434414-56) [n:127.0.0.1:34061_solr    ] o.a.s.s.HttpSolrCall [admin] webapp=null path=/admin/metrics params={prefix=CONTAINER.fs.usableSpace,CONTAINER.fs.totalSpace,CORE.coreName&wt=javabin&version=2&group=solr.node,solr.core} status=0 QTime=0
   [junit4]   2> 14250 INFO  (qtp126434414-51) [n:127.0.0.1:34061_solr    ] o.a.s.s.HttpSolrCall [admin] webapp=null path=/admin/metrics params={prefix=CONTAINER.fs.usableSpace,CONTAINER.fs.totalSpace,CORE.coreName&wt=javabin&version=2&group=solr.node,solr.core} status=0 QTime=0
   [junit4]   2> 14259 INFO  (qtp126434414-52) [n:127.0.0.1:34061_solr    ] o.a.s.s.HttpSolrCall [admin] webapp=null path=/admin/metrics params={prefix=CONTAINER.fs.usableSpace,CONTAINER.fs.totalSpace,CORE.coreName&wt=javabin&version=2&group=solr.node,solr.core} status=0 QTime=0
   [junit4]   2> 14268 INFO  (qtp126434414-54) [n:127.0.0.1:34061_solr    ] o.a.s.s.HttpSolrCall [admin] webapp=null path=/admin/metrics params={prefix=CONTAINER.fs.usableSpace,CONTAINER.fs.totalSpace,CORE.coreName&wt=javabin&version=2&group=solr.node,solr.core} status=0 QTime=0
   [junit4]   2> 14271 DEBUG (OverseerThreadFactory-26-thread-1-processing-n:127.0.0.1:34061_solr) [n:127.0.0.1:34061_solr    ] o.a.s.c.s.c.a.PolicyHelper New session created 
   [junit4]   2> 14296 DEBUG (OverseerThreadFactory-26-thread-1-processing-n:127.0.0.1:34061_solr) [n:127.0.0.1:34061_solr    ] o.a.s.c.s.c.a.PolicyHelper returnSession, curr-time 1030055006 sessionWrapper.createTime 1030054981758147, this.sessionWrapper.createTime 1030054981758147 
   [junit4]   2> 14356 INFO  (OverseerStateUpdate-72125099488903174-127.0.0.1:34061_solr-n_0000000000) [n:127.0.0.1:34061_solr    ] o.a.s.c.o.SliceMutator createReplica() {
   [junit4]   2>   "operation":"ADDREPLICA",
   [junit4]   2>   "collection":"testMoveReplicaMainCollection_abc",
   [junit4]   2>   "shard":"shard1",
   [junit4]   2>   "core":"testMoveReplicaMainCollection_abc_shard1_replica_n1",
   [junit4]   2>   "state":"down",
   [junit4]   2>   "base_url":"http://127.0.0.1:53470/solr",
   [junit4]   2>   "type":"NRT",
   [junit4]   2>   "waitForFinalState":"false"} 
   [junit4]   2> 14402 DEBUG (OverseerStateUpdate-72125099488903174-127.0.0.1:34061_solr-n_0000000000) [n:127.0.0.1:34061_solr    ] o.a.s.c.o.SliceMutator Old Slice: shard1:{
   [junit4]   2>   "range":"80000000-7fffffff",
   [junit4]   2>   "state":"active",
   [junit4]   2>   "replicas":{}}
   [junit4]   2> 14402 DEBUG (OverseerStateUpdate-72125099488903174-127.0.0.1:34061_solr-n_0000000000) [n:127.0.0.1:34061_solr    ] o.a.s.c.o.SliceMutator New Slice: shard1:{
   [junit4]   2>   "range":"80000000-7fffffff",
   [junit4]   2>   "state":"active",
   [junit4]   2>   "replicas":{"core_node2":{
   [junit4]   2>       "core":"testMoveReplicaMainCollection_abc_shard1_replica_n1",
   [junit4]   2>       "base_url":"http://127.0.0.1:53470/solr",
   [junit4]   2>       "state":"down",
   [junit4]   2>       "node_name":null,
   [junit4]   2>       "type":"NRT"}}}
   [junit4]   2> 14504 DEBUG (OverseerStateUpdate-72125099488903174-127.0.0.1:34061_solr-n_0000000000) [n:127.0.0.1:34061_solr    ] o.a.s.c.o.ZkStateWriter going to update_collection /collections/testMoveReplicaMainCollection_abc/state.json version: 0
   [junit4]   2> 14609 INFO  (qtp303235554-58) [n:127.0.0.1:53470_solr    x:testMoveReplicaMainCollection_abc_shard1_replica_n1] o.a.s.h.a.CoreAdminOperation core create command qt=/admin/cores&coreNodeName=core_node2&collection.configName=testMoveReplicaMainCollection_abc.AUTOCREATED&newCollection=true&name=testMoveReplicaMainCollection_abc_shard1_replica_n1&action=CREATE&numShards=1&collection=testMoveReplicaMainCollection_abc&shard=shard1&wt=javabin&version=2&replicaType=NRT
   [junit4]   2> 14629 DEBUG (OverseerStateUpdate-72125099488903174-127.0.0.1:34061_solr-n_0000000000) [n:127.0.0.1:34061_solr    ] o.a.s.c.o.ReplicaMutator Update state numShards=1 message={
   [junit4]   2>   "core":"testMoveReplicaMainCollection_abc_shard1_replica_n1",
   [junit4]   2>   "core_node_name":"core_node2",
   [junit4]   2>   "roles":null,
   [junit4]   2>   "base_url":"http://127.0.0.1:53470/solr",
   [junit4]   2>   "node_name":"127.0.0.1:53470_solr",
   [junit4]   2>   "numShards":"1",
   [junit4]   2>   "state":"down",
   [junit4]   2>   "shard":"shard1",
   [junit4]   2>   "collection":"testMoveReplicaMainCollection_abc",
   [junit4]   2>   "type":"NRT",
   [junit4]   2>   "force_set_state":"false",
   [junit4]   2>   "operation":"state"}
   [junit4]   2> 14632 DEBUG (OverseerStateUpdate-72125099488903174-127.0.0.1:34061_solr-n_0000000000) [n:127.0.0.1:34061_solr    ] o.a.s.c.o.ReplicaMutator Will update state for replica: core_node2:{"core":"testMoveReplicaMainCollection_abc_shard1_replica_n1","base_url":"http://127.0.0.1:53470/solr","node_name":"127.0.0.1:53470_solr","state":"down","type":"NRT","force_set_state":"false"}
   [junit4]   2> 14632 DEBUG (OverseerStateUpdate-72125099488903174-127.0.0.1:34061_solr-n_0000000000) [n:127.0.0.1:34061_solr    ] o.a.s.c.o.ReplicaMutator Collection is now: DocCollection(testMoveReplicaMainCollection_abc//collections/testMoveReplicaMainCollection_abc/state.json/1)={
   [junit4]   2>   "pullReplicas":"0",
   [junit4]   2>   "replicationFactor":"1",
   [junit4]   2>   "router":{"name":"compositeId"},
   [junit4]   2>   "maxShardsPerNode":"1",
   [junit4]   2>   "autoAddReplicas":"false",
   [junit4]   2>   "nrtReplicas":"1",
   [junit4]   2>   "tlogReplicas":"0",
   [junit4]   2>   "shards":{"shard1":{
   [junit4]   2>       "range":"80000000-7fffffff",
   [junit4]   2>       "state":"active",
   [junit4]   2>       "replicas":{"core_node2":{
   [junit4]   2>           "core":"testMoveReplicaMainCollection_abc_shard1_replica_n1",
   [junit4]   2>           "base_url":"http://127.0.0.1:53470/solr",
   [junit4]   2>           "node_name":"127.0.0.1:53470_solr",
   [junit4]   2>           "state":"down",
   [junit4]   2>           "type":"NRT",
   [junit4]   2>           "force_set_state":"false"}}}}}
   [junit4]   2> 14733 DEBUG (OverseerStateUpdate-72125099488903174-127.0.0.1:34061_solr-n_0000000000) [n:127.0.0.1:34061_solr    ] o.a.s.c.o.ZkStateWriter going to update_collection /collections/testMoveReplicaMainCollection_abc/state.json version: 1
   [junit4]   2> 15676 INFO  (qtp303235554-58) [n:127.0.0.1:53470_solr c:testMoveReplicaMainCollection_abc s:shard1 r:core_node2 x:testMoveReplicaMainCollection_abc_shard1_replica_n1] o.a.s.c.RequestParams conf resource params.json loaded . version : 0 
   [junit4]   2> 15678 INFO  (qtp303235554-58) [n:127.0.0.1:53470_solr c:testMoveReplicaMainCollection_abc s:shard1 r:core_node2 x:testMoveReplicaMainCollection_abc_shard1_replica_n1] o.a.s.c.RequestParams request params refreshed to version 0
   [junit4]   2> 15721 WARN  (qtp303235554-58) [n:127.0.0.1:53470_solr c:testMoveReplicaMainCollection_abc s:shard1 r:core_node2 x:testMoveReplicaMainCollection_abc_shard1_replica_n1] o.a.s.c.SolrConfig Couldn't add files from /export/home/jenkins/workspace/Lucene-Solr-master-Solaris/solr/build/solr-core/test/J0/temp/solr.cloud.TestWithCollection_D8F5F3B315FED680-001/tempDir-001/node2/testMoveReplicaMainCollection_abc_shard1_replica_n1/../../../../contrib/extraction/lib filtered by .*\.jar to classpath: /export/home/jenkins/workspace/Lucene-Solr-master-Solaris/solr/build/solr-core/test/J0/temp/solr.cloud.TestWithCollection_D8F5F3B315FED680-001/tempDir-001/node2/testMoveReplicaMainCollection_abc_shard1_replica_n1/../../../../contrib/extraction/lib
   [junit4]   2> 15722 WARN  (qtp303235554-58) [n:127.0.0.1:53470_solr c:testMoveReplicaMainCollection_abc s:shard1 r:core_node2 x:testMoveReplicaMainCollection_abc_shard1_replica_n1] o.a.s.c.SolrConfig Couldn't add files from /export/home/jenkins/workspace/Lucene-Solr-master-Solaris/solr/build/solr-core/test/J0/temp/solr.cloud.TestWithCollection_D8F5F3B315FED680-001/tempDir-001/node2/testMoveReplicaMainCollection_abc_shard1_replica_n1/../../../../dist filtered by solr-cell-\d.*\.jar to classpath: /export/home/jenkins/workspace/Lucene-Solr-master-Solaris/solr/build/solr-core/test/J0/temp/solr.cloud.TestWithCollection_D8F5F3B315FED680-001/tempDir-001/node2/testMoveReplicaMainCollection_abc_shard1_replica_n1/../../../../dist
   [junit4]   2> 15722 WARN  (qtp303235554-58) [n:127.0.0.1:53470_solr c:testMoveReplicaMainCollection_abc s:shard1 r:core_node2 x:testMoveReplicaMainCollection_abc_shard1_replica_n1] o.a.s.c.SolrConfig Couldn't add files from /export/home/jenkins/workspace/Lucene-Solr-master-Solaris/solr/build/solr-core/test/J0/temp/solr.cloud.TestWithCollection_D8F5F3B315FED680-001/tempDir-001/node2/testMoveReplicaMainCollection_abc_shard1_replica_n1/../../../../contrib/clustering/lib filtered by .*\.jar to classpath: /export/home/jenkins/workspace/Lucene-Solr-master-Solaris/solr/build/solr-core/test/J0/temp/solr.cloud.TestWithCollection_D8F5F3B315FED680-001/tempDir-001/node2/testMoveReplicaMainCollection_abc_shard1_replica_n1/../../../../contrib/clustering/lib
   [junit4]   2> 15722 WARN  (qtp303235554-58) [n:127.0.0.1:53470_solr c:testMoveReplicaMainCollection_abc s:shard1 r:core_node2 x:testMoveReplicaMainCollection_abc_shard1_replica_n1] o.a.s.c.SolrConfig Couldn't add files from /export/home/jenkins/workspace/Lucene-Solr-master-Solaris/solr/build/solr-core/test/J0/temp/solr.cloud.TestWithCollection_D8F5F3B315FED680-001/tempDir-001/node2/testMoveReplicaMainCollection_abc_shard1_replica_n1/../../../../dist filtered by solr-clustering-\d.*\.jar to classpath: /export/home/jenkins/workspace/Lucene-Solr-master-Solaris/solr/build/solr-core/test/J0/temp/solr.cloud.TestWithCollection_D8F5F3B315FED680-001/tempDir-001/node2/testMoveReplicaMainCollection_abc_shard1_replica_n1/../../../../dist
   [junit4]   2> 15723 WARN  (qtp303235554-58) [n:127.0.0.1:53470_solr c:testMoveReplicaMainCollection_abc s:shard1 r:core_node2 x:testMoveReplicaMainCollection_abc_shard1_replica_n1] o.a.s.c.SolrConfig Couldn't add files from /export/home/jenkins/workspace/Lucene-Solr-master-Solaris/solr/build/solr-core/test/J0/temp/solr.cloud.TestWithCollection_D8F5F3B315FED680-001/tempDir-001/node2/testMoveReplicaMainCollection_abc_shard1_replica_n1/../../../../contrib/langid/lib filtered by .*\.jar to classpath: /export/home/jenkins/workspace/Lucene-Solr-master-Solaris/solr/build/solr-core/test/J0/temp/solr.cloud.TestWithCollection_D8F5F3B315FED680-001/tempDir-001/node2/testMoveReplicaMainCollection_abc_shard1_replica_n1/../../../../contrib/langid/lib
   [junit4]   2> 15723 WARN  (qtp303235554-58) [n:127.0.0.1:53470_solr c:testMoveReplicaMainCollection_abc s:shard1 r:core_node2 x:testMoveReplicaMainCollection_abc_shard1_replica_n1] o.a.s.c.SolrConfig Couldn't add files from /export/home/jenkins/workspace/Lucene-Solr-master-Solaris/solr/build/solr-core/test/J0/temp/solr.cloud.TestWithCollection_D8F5F3B315FED680-001/tempDir-001/node2/testMoveReplicaMainCollection_abc_shard1_replica_n1/../../../../dist filtered by solr-langid-\d.*\.jar to classpath: /export/home/jenkins/workspace/Lucene-Solr-master-Solaris/solr/build/solr-core/test/J0/temp/solr.cloud.TestWithCollection_D8F5F3B315FED680-001/tempDir-001/node2/testMoveReplicaMainCollection_abc_shard1_replica_n1/../../../../dist
   [junit4]   2> 15723 WARN  (qtp303235554-58) [n:127.0.0.1:53470_solr c:testMoveReplicaMainCollection_abc s:shard1 r:core_node2 x:testMoveReplicaMainCollection_abc_shard1_replica_n1] o.a.s.c.SolrConfig Couldn't add files from /export/home/jenkins/workspace/Lucene-Solr-master-Solaris/solr/build/solr-core/test/J0/temp/solr.cloud.TestWithCollection_D8F5F3B315FED680-001/tempDir-001/node2/testMoveReplicaMainCollection_abc_shard1_replica_n1/../../../../contrib/velocity/lib filtered by .*\.jar to classpath: /export/home/jenkins/workspace/Lucene-Solr-master-Solaris/solr/build/solr-core/test/J0/temp/solr.cloud.TestWithCollection_D8F5F3B315FED680-001/tempDir-001/node2/testMoveReplicaMainCollection_abc_shard1_replica_n1/../../../../contrib/velocity/lib
   [junit4]   2> 15723 WARN  (qtp303235554-58) [n:127.0.0.1:53470_solr c:testMoveReplicaMainCollection_abc s:shard1 r:core_node2 x:testMoveReplicaMainCollection_abc_shard1_replica_n1] o.a.s.c.SolrConfig Couldn't add files from /export/home/jenkins/workspace/Lucene-Solr-master-Solaris/solr/build/solr-core/test/J0/temp/solr.cloud.TestWithCollection_D8F5F3B315FED680-001/tempDir-001/node2/testMoveReplicaMainCollection_abc_shard1_replica_n1/../../../../dist filtered by solr-velocity-\d.*\.jar to classpath: /export/home/jenkins/workspace/Lucene-Solr-master-Solaris/solr/build/solr-core/test/J0/temp/solr.cloud.TestWithCollection_D8F5F3B315FED680-001/tempDir-001/node2/testMoveReplicaMainCollection_abc_shard1_replica_n1/../../../../dist
   [junit4]   2> 15724 WARN  (qtp303235554-58) [n:127.0.0.1:53470_solr c:testMoveReplicaMainCollection_abc s:shard1 r:core_node2 x:testMoveReplicaMainCollection_abc_shard1_replica_n1] o.a.s.c.SolrConfig Couldn't add files from /export/home/jenkins/workspace/Lucene-Solr-master-Solaris/solr/build/solr-core/test/J0/temp/solr.cloud.TestWithCollection_D8F5F3B315FED680-001/tempDir-001/node2/testMoveReplicaMainCollection_abc_shard1_replica_n1/../../../../dist filtered by solr-ltr-\d.*\.jar to classpath: /export/home/jenkins/workspace/Lucene-Solr-master-Solaris/solr/build/solr-core/test/J0/temp/solr.cloud.TestWithCollection_D8F5F3B315FED680-001/tempDir-001/node2/testMoveReplicaMainCollection_abc_shard1_replica_n1/../../../../dist
   [junit4]   2> 15749 INFO  (qtp303235554-58) [n:127.0.0.1:53470_solr c:testMoveReplicaMainCollection_abc s:shard1 r:core_node2 x:testMoveReplicaMainCollection_abc_shard1_replica_n1] o.a.s.c.SolrConfig Using Lucene MatchVersion: 9.0.0
   [junit4]   2> 15917 INFO  (qtp303235554-58) [n:127.0.0.1:53470_solr c:testMoveReplicaMainCollection_abc s:shard1 r:core_node2 x:testMoveReplicaMainCollection_abc_shard1_replica_n1] o.a.s.s.IndexSchema [testMoveReplicaMainCollection_abc_shard1_replica_n1] Schema name=default-config
   [junit4]   2> 16576 INFO  (qtp303235554-58) [n:127.0.0.1:53470_solr c:testMoveReplicaMainCollection_abc s:shard1 r:core_node2 x:testMoveReplicaMainCollection_abc_shard1_replica_n1] o.a.s.s.IndexSchema Loaded schema default-config/1.6 with uniqueid field id
   [junit4]   2> 16678 INFO  (qtp303235554-58) [n:127.0.0.1:53470_solr c:testMoveReplicaMainCollection_abc s:shard1 r:core_node2 x:testMoveReplicaMainCollection_abc_shard1_replica_n1] o.a.s.c.CoreContainer Creating SolrCore 'testMoveReplicaMainCollection_abc_shard1_replica_n1' using configuration from collection testMoveReplicaMainCollection_abc, trusted=true
   [junit4]   2> 16679 INFO  (qtp303235554-58) [n:127.0.0.1:53470_solr c:testMoveReplicaMainCollection_abc s:shard1 r:core_node2 x:testMoveReplicaMainCollection_abc_shard1_replica_n1] o.a.s.m.r.SolrJmxReporter JMX monitoring for 'solr_53470.solr.core.testMoveReplicaMainCollection_abc.shard1.replica_n1' (registry 'solr.core.testMoveReplicaMainCollection_abc.shard1.replica_n1') enabled at server: com.sun.jmx.mbeanserver.JmxMBeanServer@60da2240
   [junit4]   2> 16681 INFO  (qtp303235554-58) [n:127.0.0.1:53470_solr c:testMoveReplicaMainCollection_abc s:shard1 r:core_node2 x:testMoveReplicaMainCollection_abc_shard1_replica_n1] o.a.s.c.SolrCore [[testMoveReplicaMainCollection_abc_shard1_replica_n1] ] Opening new SolrCore at [/export/home/jenkins/workspace/Lucene-Solr-master-Solaris/solr/build/solr-core/test/J0/temp/solr.cloud.TestWithCollection_D8F5F3B315FED680-001/tempDir-001/node2/testMoveReplicaMainCollection_abc_shard1_replica_n1], dataDir=[/export/home/jenkins/workspace/Lucene-Solr-master-Solaris/solr/build/solr-core/test/J0/temp/solr.cloud.TestWithCollection_D8F5F3B315FED680-001/tempDir-001/node2/./testMoveReplicaMainCollection_abc_shard1_replica_n1/data/]
   [junit4]   2> 16805 INFO  (qtp303235554-58) [n:127.0.0.1:53470_solr c:testMoveReplicaMainCollection_abc s:shard1 r:core_node2 x:testMoveReplicaMainCollection_abc_shard1_replica_n1] o.a.s.r.XSLTResponseWriter xsltCacheLifetimeSeconds=5
   [junit4]   2> 17211 INFO  (qtp303235554-58) [n:127.0.0.1:53470_solr c:testMoveReplicaMainCollection_abc s:shard1 r:core_node2 x:testMoveReplicaMainCollection_abc_shard1_replica_n1] o.a.s.u.UpdateHandler Using UpdateLog implementation: org.apache.solr.update.UpdateLog
   [junit4]   2> 17211 INFO  (qtp303235554-58) [n:127.0.0.1:53470_solr c:testMoveReplicaMainCollection_abc s:shard1 r:core_node2 x:testMoveReplicaMainCollection_abc_shard1_replica_n1] o.a.s.u.UpdateLog Initializing UpdateLog: dataDir= defaultSyncLevel=FLUSH numRecordsToKeep=100 maxNumLogsToKeep=10 numVersionBuckets=65536
   [junit4]   2> 17242 INFO  (qtp303235554-58) [n:127.0.0.1:53470_solr c:testMoveReplicaMainCollection_abc s:shard1 r:core_node2 x:testMoveReplicaMainCollection_abc_shard1_replica_n1] o.a.s.u.CommitTracker Hard AutoCommit: if uncommitted for 15000ms; 
   [junit4]   2> 17243 INFO  (qtp303235554-58) [n:127.0.0.1:53470_solr c:testMoveReplicaMainCollection_abc s:shard1 r:core_node2 x:testMoveReplicaMainCollection_abc_shard1_replica_n1] o.a.s.u.CommitTracker Soft AutoCommit: disabled
   [junit4]   2> 17281 INFO  (qtp303235554-58) [n:127.0.0.1:53470_solr c:testMoveReplicaMainCollection_abc s:shard1 r:core_node2 x:testMoveReplicaMainCollection_abc_shard1_replica_n1] o.a.s.s.SolrIndexSearcher Opening [Searcher@2c7cd3dd[testMoveReplicaMainCollection_abc_shard1_replica_n1] main]
   [junit4]   2> 17285 INFO  (qtp303235554-58) [n:127.0.0.1:53470_solr c:testMoveReplicaMainCollection_abc s:shard1 r:core_node2 x:testMoveReplicaMainCollection_abc_shard1_replica_n1] o.a.s.r.ManagedResourceStorage Configured ZooKeeperStorageIO with znodeBase: /configs/testMoveReplicaMainCollection_abc.AUTOCREATED
   [junit4]   2> 17286 INFO  (qtp303235554-58) [n:127.0.0.1:53470_solr c:testMoveReplicaMainCollection_abc s:shard1 r:core_node2 x:testMoveReplicaMainCollection_abc_shard1_replica_n1] o.a.s.r.ManagedResourceStorage Loaded null at path _rest_managed.json using ZooKeeperStorageIO:path=/configs/testMoveReplicaMainCollection_abc.AUTOCREATED
   [junit4]   2> 17290 INFO  (qtp303235554-58) [n:127.0.0.1:53470_solr c:testMoveReplicaMainCollection_abc s:shard1 r:core_node2 x:testMoveReplicaMainCollection_abc_shard1_replica_n1] o.a.s.s.ZkIndexSchemaReader Creating ZooKeeper watch for the managed schema at /configs/testMoveReplicaMainCollection_abc.AUTOCREATED/managed-schema
   [junit4]   2> 17293 INFO  (qtp303235554-58) [n:127.0.0.1:53470_solr c:testMoveReplicaMainCollection_abc s:shard1 r:core_node2 x:testMoveReplicaMainCollection_abc_shard1_replica_n1] o.a.s.s.ZkIndexSchemaReader Current schema version 0 is already the latest
   [junit4]   2> 17294 INFO  (qtp303235554-58) [n:127.0.0.1:53470_solr c:testMoveReplicaMainCollection_abc s:shard1 r:core_node2 x:testMoveReplicaMainCollection_abc_shard1_replica_n1] o.a.s.h.c.SpellCheckComponent Initializing spell checkers
   [junit4]   2> 17311 INFO  (qtp303235554-58) [n:127.0.0.1:53470_solr c:testMoveReplicaMainCollection_abc s:shard1 r:core_node2 x:testMoveReplicaMainCollection_abc_shard1_replica_n1] o.a.s.s.DirectSolrSpellChecker init: {name=default,field=_text_,classname=solr.DirectSolrSpellChecker,distanceMeasure=internal,accuracy=0.5,maxEdits=2,minPrefix=1,maxInspections=5,minQueryLength=4,maxQueryFrequency=0.01}
   [junit4]   2> 17353 INFO  (qtp303235554-58) [n:127.0.0.1:53470_solr c:testMoveReplicaMainCollection_abc s:shard1 r:core_node2 x:testMoveReplicaMainCollection_abc_shard1_replica_n1] o.a.s.h.ReplicationHandler Commits will be reserved for 10000ms.
   [junit4]   2> 17363 INFO  (qtp303235554-58) [n:127.0.0.1:53470_solr c:testMoveReplicaMainCollection_abc s:shard1 r:core_node2 x:testMoveReplicaMainCollection_abc_shard1_replica_n1] o.a.s.u.UpdateLog Could not find max version in index or recent updates, using new clock 1623065025782480896
   [junit4]   2> 17440 INFO  (searcherExecutor-38-thread-1-processing-n:127.0.0.1:53470_solr x:testMoveReplicaMainCollection_abc_shard1_replica_n1 c:testMoveReplicaMainCollection_abc s:shard1 r:core_node2) [n:127.0.0.1:53470_solr c:testMoveReplicaMainCollection_abc s:shard1 r:core_node2 x:testMoveReplicaMainCollection_abc_shard1_replica_n1] o.a.s.c.QuerySenderListener QuerySenderListener sending requests to Searcher@2c7cd3dd[testMoveReplicaMainCollection_abc_shard1_replica_n1] main{ExitableDirectoryReader(UninvertingDirectoryReader())}
   [junit4]   2> 17440 INFO  (searcherExecutor-38-thread-1-processing-n:127.0.0.1:53470_solr x:testMoveReplicaMainCollection_abc_shard1_replica_n1 c:testMoveReplicaMainCollection_abc s:shard1 r:core_node2) [n:127.0.0.1:53470_solr c:testMoveReplicaMainCollection_abc s:shard1 r:core_node2 x:testMoveReplicaMainCollection_abc_shard1_replica_n1] o.a.s.c.QuerySenderListener QuerySenderListener done.
   [junit4]   2> 17440 INFO  (searcherExecutor-38-thread-1-processing-n:127.0.0.1:53470_solr x:testMoveReplicaMainCollection_abc_shard1_replica_n1 c:testMoveReplicaMainCollection_abc s:shard1 r:core_node2) [n:127.0.0.1:53470_solr c:testMoveReplicaMainCollection_abc s:shard1 r:core_node2 x:testMoveReplicaMainCollection_abc_shard1_replica_n1] o.a.s.h.c.SpellCheckComponent Loading spell index for spellchecker: default
   [junit4]   2> 17442 INFO  (searcherExecutor-38-thread-1-processing-n:127.0.0.1:53470_solr x:testMoveReplicaMainCollection_abc_shard1_replica_n1 c:testMoveReplicaMainCollection_abc s:shard1 r:core_node2) [n:127.0.0.1:53470_solr c:testMoveReplicaMainCollection_abc s:shard1 r:core_node2 x:testMoveReplicaMainCollection_abc_shard1_replica_n1] o.a.s.c.SolrCore [testMoveReplicaMainCollection_abc_shard1_replica_n1] Registered new searcher Searcher@2c7cd3dd[testMoveReplicaMainCollection_abc_shard1_replica_n1] main{ExitableDirectoryReader(UninvertingDirectoryReader())}
   [junit4]   2> 17596 INFO  (qtp303235554-58) [n:127.0.0.1:53470_solr c:testMoveReplicaMainCollection_abc s:shard1 r:core_node2 x:testMoveReplicaMainCollection_abc_shard1_replica_n1] o.a.s.c.ZkShardTerms Successful update of terms at /collections/testMoveReplicaMainCollection_abc/terms/shard1 to Terms{values={core_node2=0}, version=0}
   [junit4]   2> 17614 INFO  (qtp303235554-58) [n:127.0.0.1:53470_solr c:testMoveReplicaMainCollection_abc s:shard1 r:core_node2 x:testMoveReplicaMainCollection_abc_shard1_replica_n1] o.a.s.c.ShardLeaderElectionContextBase make sure parent is created /collections/testMoveReplicaMainCollection_abc/leaders/shard1
   [junit4]   2> 17648 INFO  (qtp303235554-58) [n:127.0.0.1:53470_solr c:testMoveReplicaMainCollection_abc s:shard1 r:core_node2 x:testMoveReplicaMainCollection_abc_shard1_replica_n1] o.a.s.c.ShardLeaderElectionContext Enough replicas found to continue.
   [junit4]   2> 17648 INFO  (qtp303235554-58) [n:127.0.0.1:53470_solr c:testMoveReplicaMainCollection_abc s:shard1 r:core_node2 x:testMoveReplicaMainCollection_abc_shard1_replica_n1] o.a.s.c.ShardLeaderElectionContext I may be the new leader - try and sync
   [junit4]   2> 17649 INFO  (qtp303235554-58) [n:127.0.0.1:53470_solr c:testMoveReplicaMainCollection_abc s:shard1 r:core_node2 x:testMoveReplicaMainCollection_abc_shard1_replica_n1] o.a.s.c.SyncStrategy Sync replicas to http://127.0.0.1:53470/solr/testMoveReplicaMainCollection_abc_shard1_replica_n1/
   [junit4]   2> 17650 INFO  (qtp303235554-58) [n:127.0.0.1:53470_solr c:testMoveReplicaMainCollection_abc s:shard1 r:core_node2 x:testMoveReplicaMainCollection_abc_shard1_replica_n1] o.a.s.c.SyncStrategy Sync Success - now sync replicas to me
   [junit4]   2> 17651 INFO  (qtp303235554-58) [n:127.0.0.1:53470_solr c:testMoveReplicaMainCollection_abc s:shard1 r:core_node2 x:testMoveReplicaMainCollection_abc_shard1_replica_n1] o.a.s.c.SyncStrategy http://127.0.0.1:53470/solr/testMoveReplicaMainCollection_abc_shard1_replica_n1/ has no replicas
   [junit4]   2> 17655 INFO  (qtp303235554-58) [n:127.0.0.1:53470_solr c:testMoveReplicaMainCollection_abc s:shard1 r:core_node2 x:testMoveReplicaMainCollection_abc_shard1_replica_n1] o.a.s.c.ShardLeaderElectionContextBase Creating leader registration node /collections/testMoveReplicaMainCollection_abc/leaders/shard1/leader after winning as /collections/testMoveReplicaMainCollection_abc/leader_elect/shard1/election/72125099488903177-core_node2-n_0000000000
   [junit4]   2> 17661 INFO  (qtp303235554-58) [n:127.0.0.1:53470_solr c:testMoveReplicaMainCollection_abc s:shard1 r:core_node2 x:testMoveReplicaMainCollection_abc_shard1_replica_n1] o.a.s.c.ShardLeaderElectionContext I am the new leader: http://127.0.0.1:53470/solr/testMoveReplicaMainCollection_abc_shard1_replica_n1/ shard1
   [junit4]   2> 17662 DEBUG (OverseerStateUpdate-72125099488903174-127.0.0.1:34061_solr-n_0000000000) [n:127.0.0.1:34061_solr    ] o.a.s.c.o.ZkStateWriter going to update_collection /collections/testMoveReplicaMainCollection_abc/state.json version: 2
   [junit4]   2> 17667 INFO  (qtp303235554-58) [n:127.0.0.1:53470_solr c:testMoveReplicaMainCollection_abc s:shard1 r:core_node2 x:testMoveReplicaMainCollection_abc_shard1_replica_n1] o.a.s.c.ZkController I am the leader, no recovery necessary
   [junit4]   2> 17668 DEBUG (OverseerStateUpdate-72125099488903174-127.0.0.1:34061_solr-n_0000000000) [n:127.0.0.1:34061_solr    ] o.a.s.c.o.ReplicaMutator Update state numShards=1 message={
   [junit4]   2>   "core":"testMoveReplicaMainCollection_abc_shard1_replica_n1",
   [junit4]   2>   "core_node_name":"core_node2",
   [junit4]   2>   "roles":null,
   [junit4]   2>   "base_url":"http://127.0.0.1:53470/solr",
   [junit4]   2>   "node_name":"127.0.0.1:53470_solr",
   [junit4]   2>   "numShards":"1",
   [junit4]   2>   "state":"active",
   [junit4]   2>   "shard":"shard1",
   [junit4]   2>   "collection":"testMoveReplicaMainCollection_abc",
   [junit4]   2>   "type":"NRT",
   [junit4]   2>   "force_set_state":"false",
   [junit4]   2>   "operation":"state"}
   [junit4]   2> 17669 DEBUG (OverseerStateUpdate-72125099488903174-127.0.0.1:34061_solr-n_0000000000) [n:127.0.0.1:34061_solr    ] o.a.s.c.o.ReplicaMutator Will update state for replica: core_node2:{"core":"testMoveReplicaMainCollection_abc_shard1_replica_n1","base_url":"http://127.0.0.1:53470/solr","node_name":"127.0.0.1:53470_solr","state":"active","type":"NRT","force_set_state":"false","leader":"true"}
   [junit4]   2> 17669 DEBUG (OverseerStateUpdate-72125099488903174-127.0.0.1:34061_solr-n_0000000000) [n:127.0.0.1:34061_solr    ] o.a.s.c.o.ReplicaMutator Collection is now: DocCollection(testMoveReplicaMainCollection_abc//collections/testMoveReplicaMainCollection_abc/state.json/3)={
   [junit4]   2>   "pullReplicas":"0",
   [junit4]   2>   "replicationFactor":"1",
   [junit4]   2>   "router":{"name":"compositeId"},
   [junit4]   2>   "maxShardsPerNode":"1",
   [junit4]   2>   "autoAddReplicas":"false",
   [junit4]   2>   "nrtReplicas":"1",
   [junit4]   2>   "tlogReplicas":"0",
   [junit4]   2>   "shards":{"shard1":{
   [junit4]   2>       "range":"80000000-7fffffff",
   [junit4]   2>       "state":"active",
   [junit4]   2>       "replicas":{"core_node2":{
   [junit4]   2>           "core":"testMoveReplicaMainCollection_abc_shard1_replica_n1",
   [junit4]   2>           "base_url":"http://127.0.0.1:53470/solr",
   [junit4]   2>           "node_name":"127.0.0.1:53470_solr",
   [junit4]   2>           "state":"active",
   [junit4]   2>           "type":"NRT",
   [junit4]   2>           "force_set_state":"false",
   [junit4]   2>           "leader":"true"}}}}}
   [junit4]   2> 17673 INFO  (qtp303235554-58) [n:127.0.0.1:53470_solr c:testMoveReplicaMainCollection_abc s:shard1 r:core_node2 x:testMoveReplicaMainCollection_abc_shard1_replica_n1] o.a.s.s.HttpSolrCall [admin] webapp=null path=/admin/cores params={qt=/admin/cores&coreNodeName=core_node2&collection.configName=testMoveReplicaMainCollection_abc.AUTOCREATED&newCollection=true&name=testMoveReplicaMainCollection_abc_shard1_replica_n1&action=CREATE&numShards=1&collection=testMoveReplicaMainCollection_abc&shard=shard1&wt=javabin&version=2&replicaType=NRT} status=0 QTime=3066
   [junit4]   2> 17674 DEBUG (OverseerThreadFactory-26-thread-1-processing-n:127.0.0.1:34061_solr) [n:127.0.0.1:34061_solr    ] o.a.s.c.s.c.a.PolicyHelper session set to NULL
   [junit4]   2> 17690 INFO  (qtp303235554-63) [n:127.0.0.1:53470_solr    ] o.a.s.h.a.CollectionsHandler Wait for new collection to be active for at most 45 seconds. Check all shard replicas
   [junit4]   2> 17769 DEBUG (OverseerStateUpdate-72125099488903174-127.0.0.1:34061_solr-n_0000000000) [n:127.0.0.1:34061_solr    ] o.a.s.c.o.ZkStateWriter going to update_collection /collections/testMoveReplicaMainCollection_abc/state.json version: 3
   [junit4]   2> 17771 INFO  (zkCallback-42-thread-2) [    ] o.a.s.c.c.ZkStateReader A cluster state change: [WatchedEvent state:SyncConnected type:NodeDataChanged path:/collections/testMoveReplicaMainCollection_abc/state.json] for collection [testMoveReplicaMainCollection_abc] has occurred - updating... (live nodes size: [2])
   [junit4]   2> 17771 INFO  (zkCallback-42-thread-1) [    ] o.a.s.c.c.ZkStateReader A cluster state change: [WatchedEvent state:SyncConnected type:NodeDataChanged path:/collections/testMoveReplicaMainCollection_abc/state.json] for collection [testMoveReplicaMainCollection_abc] has occurred - updating... (live nodes size: [2])
   [junit4]   2> 17772 INFO  (qtp303235554-63) [n:127.0.0.1:53470_solr    ] o.a.s.s.HttpSolrCall [admin] webapp=null path=/admin/collections params={pullReplicas=0&name=testMoveReplicaMainCollection_abc&nrtReplicas=1&action=CREATE&numShards=1&tlogReplicas=0&createNodeSet=127.0.0.1:53470_solr&wt=javabin&version=2} status=0 QTime=3906
   [junit4]   2> 17775 INFO  (qtp303235554-60) [n:127.0.0.1:53470_solr    ] o.a.s.h.a.CollectionsHandler Invoked Collection Action :create with params pullReplicas=0&withCollection=testMoveReplicaMainCollection_abc&name=testMoveReplicaMainCollection_xyz&nrtReplicas=1&action=CREATE&numShards=1&tlogReplicas=0&wt=javabin&version=2 and sendToOCPQueue=true
   [junit4]   2> 17779 INFO  (OverseerThreadFactory-26-thread-2-processing-n:127.0.0.1:34061_solr) [n:127.0.0.1:34061_solr    ] o.a.s.c.a.c.CreateCollectionCmd Create collection testMoveReplicaMainCollection_xyz
   [junit4]   2> 17781 INFO  (OverseerCollectionConfigSetProcessor-72125099488903174-127.0.0.1:34061_solr-n_0000000000) [n:127.0.0.1:34061_solr    ] o.a.s.c.OverseerTaskQueue Response ZK path: /overseer/collection-queue-work/qnr-0000000000 doesn't exist.  Requestor may have disconnected from ZooKeeper
   [junit4]   2> 17782 INFO  (OverseerThreadFactory-26-thread-2-processing-n:127.0.0.1:34061_solr) [n:127.0.0.1:34061_solr    ] o.a.s.c.c.ZkConfigManager Copying zk node /configs/_default/managed-schema to /configs/testMoveReplicaMainCollection_xyz.AUTOCREATED/managed-schema
   [junit4]   2> 17784 INFO  (OverseerThreadFactory-26-thread-2-processing-n:127.0.0.1:34061_solr) [n:127.0.0.1:34061_solr    ] o.a.s.c.c.ZkConfigManager Copying zk node /configs/_default/protwords.txt to /configs/testMoveReplicaMainCollection_xyz.AUTOCREATED/protwords.txt
   [junit4]   2> 17786 INFO  (OverseerThreadFactory-26-thread-2-processing-n:127.0.0.1:34061_solr) [n:127.0.0.1:34061_solr    ] o.a.s.c.c.ZkConfigManager Copying zk node /configs/_default/solrconfig.xml to /configs/testMoveReplicaMainCollection_xyz.AUTOCREATED/solrconfig.xml
   [junit4]   2> 17788 INFO  (OverseerThreadFactory-26-thread-2-processing-n:127.0.0.1:34061_solr) [n:127.0.0.1:34061_solr    ] o.a.s.c.c.ZkConfigManager Copying zk node /configs/_default/synonyms.txt to /configs/testMoveReplicaMainCollection_xyz.AUTOCREATED/synonyms.txt
   [junit4]   2> 17790 INFO  (OverseerThreadFactory-26-thread-2-processing-n:127.0.0.1:34061_solr) [n:127.0.0.1:34061_solr    ] o.a.s.c.c.ZkConfigManager Copying zk node /configs/_default/stopwords.txt to /configs/testMoveReplicaMainCollection_xyz.AUTOCREATED/stopwords.txt
   [junit4]   2> 17791 INFO  (OverseerThreadFactory-26-thread-2-processing-n:127.0.0.1:34061_solr) [n:127.0.0.1:34061_solr    ] o.a.s.c.c.ZkConfigManager Copying zk node /configs/_default/lang/contractions_it.txt to /configs/testMoveReplicaMainCollection_xyz.AUTOCREATED/lang/contractions_it.txt
   [junit4]   2> 17793 INFO  (OverseerThreadFactory-26-thread-2-processing-n:127.0.0.1:34061_solr) [n:127.0.0.1:34061_solr    ] o.a.s.c.c.ZkConfigManager Copying zk node /configs/_default/lang/stopwords_no.txt to /configs/testMoveReplicaMainCollection_xyz.AUTOCREATED/lang/stopwords_no.txt
   [junit4]   2> 17795 INFO  (OverseerThreadFactory-26-thread-2-processing-n:127.0.0.1:34061_solr) [n:127.0.0.1:34061_solr    ] o.a.s.c.c.ZkConfigManager Copying zk node /configs/_default/lang/stopwords_hy.txt to /configs/testMoveReplicaMainCollection_xyz.AUTOCREATED/lang/stopwords_hy.txt
   [junit4]   2> 17797 INFO  (OverseerThreadFactory-26-thread-2-processing-n:127.0.0.1:34061_solr) [n:127.0.0.1:34061_solr    ] o.a.s.c.c.ZkConfigManager Copying zk node /configs/_default/lang/contractions_ca.txt to /configs/testMoveReplicaMainCollection_xyz.AUTOCREATED/lang/contractions_ca.txt
   [junit4]   2> 17799 INFO  (OverseerThreadFactory-26-thread-2-processing-n:127.0.0.1:34061_solr) [n:127.0.0.1:34061_solr    ] o.a.s.c.c.ZkConfigManager Copying zk node /configs/_default/lang/stemdict_nl.txt to /configs/testMoveReplicaMainCollection_xyz.AUTOCREATED/lang/stemdict_nl.txt
   [junit4]   2> 17801 INFO  (OverseerThreadFactory-26-thread-2-processing-n:127.0.0.1:34061_solr) [n:127.0.0.1:34061_solr    ] o.a.s.c.c.ZkConfigManager Copying zk node /configs/_default/lang/stopwords_id.txt to /configs/testMoveReplicaMainCollection_xyz.AUTOCREATED/lang/stopwords_id.txt
   [junit4]   2> 17802 INFO  (OverseerThreadFactory-26-thread-2-processing-n:127.0.0.1:34061_solr) [n:127.0.0.1:34061_solr    ] o.a.s.c.c.ZkConfigManager Copying zk node /configs/_default/lang/stopwords_ga.txt to /configs/testMoveReplicaMainCollection_xyz.AUTOCREATED/lang/stopwords_ga.txt
   [junit4]   2> 17804 INFO  (OverseerThreadFactory-26-thread-2-processing-n:127.0.0.1:34061_solr) [n:127.0.0.1:34061_solr    ] o.a.s.c.c.ZkConfigManager Copying zk node /configs/_default/lang/stopwords_hi.txt to /configs/testMoveReplicaMainCollection_xyz.AUTOCREATED/lang/stopwords_hi.txt
   [junit4]   2> 17807 INFO  (OverseerThreadFactory-26-thread-2-processing-n:127.0.0.1:34061_solr) [n:127.0.0.1:34061_solr    ] o.a.s.c.c.ZkConfigManager Copying zk node /configs/_default/lang/stopwords_da.txt to /configs/testMoveReplicaMainCollection_xyz.AUTOCREATED/lang/stopwords_da.txt
   [junit4]   2> 17810 INFO  (OverseerThreadFactory-26-thread-2-processing-n:127.0.0.1:34061_solr) [n:127.0.0.1:34061_solr    ] o.a.s.c.c.ZkConfigManager Copying zk node /configs/_default/lang/stopwords_ja.txt to /configs/testMoveReplicaMainCollection_xyz.AUTOCREATED/lang/stopwords_ja.txt
   [junit4]   2> 17813 INFO  (OverseerThreadFactory-26-thread-2-processing-n:127.0.0.1:34061_solr) [n:127.0.0.1:34061_solr    ] o.a.s.c.c.ZkConfigManager Copying zk node /configs/_default/lang/stopwords_pt.txt to /configs/testMoveReplicaMainCollection_xyz.AUTOCREATED/lang/stopwords_pt.txt
   [junit4]   2> 17814 INFO  (OverseerThreadFactory-26-thread-2-processing-n:127.0.0.1:34061_solr) [n:127.0.0.1:34061_solr    ] o.a.s.c.c.ZkConfigManager Copying zk node /configs/_default/lang/stopwords_hu.txt to /configs/testMoveReplicaMainCollection_xyz.AUTOCREATED/lang/stopwords_hu.txt
   [junit4]   2> 17817 INFO  (OverseerThreadFactory-26-thread-2-processing-n:127.0.0.1:34061_solr) [n:127.0.0.1:34061_solr    ] o.a.s.c.c.ZkConfigManager Copying zk node /configs/_default/lang/stopwords_el.txt to /configs/testMoveReplicaMainCollection_xyz.AUTOCREATED/lang/stopwords_el.txt
   [junit4]   2> 17820 INFO  (OverseerThreadFactory-26-thread-2-processing-n:127.0.0.1:34061_solr) [n:127.0.0.1:34061_solr    ] o.a.s.c.c.ZkConfigManager Copying zk node /configs/_default/lang/stopwords_ru.txt to /configs/testMoveReplicaMainCollection_xyz.AUTOCREATED/lang/stopwords_ru.txt
   [junit4]   2> 17823 INFO  (OverseerThreadFactory-26-thread-2-processing-n:127.0.0.1:34061_solr) [n:127.0.0.1:34061_solr    ] o.a.s.c.c.ZkConfigManager Copying zk node /configs/_default/lang/stopwords_tr.txt to /configs/testMoveReplicaMainCollection_xyz.AUTOCREATED/lang/stopwords_tr.txt
   [junit4]   2> 17825 INFO  (OverseerThreadFactory-26-thread-2-processing-n:127.0.0.1:34061_solr) [n:127.0.0.1:34061_solr    ] o.a.s.c.c.ZkConfigManager Copying zk node /configs/_default/lang/stopwords_ar.txt to /configs/testMoveReplicaMainCollection_xyz.AUTOCREATED/lang/stopwords_ar.txt
   [junit4]   2> 17827 INFO  (OverseerThreadFactory-26-thread-2-processing-n:127.0.0.1:34061_solr) [n:127.0.0.1:34061_solr    ] o.a.s.c.c.ZkConfigManager Copying zk node /configs/_default/lang/userdict_ja.txt to /configs/testMoveReplicaMainCollection_xyz.AUTOCREATED/lang/userdict_ja.txt
   [junit4]   2> 17829 INFO  (OverseerThreadFactory-26-thread-2-processing-n:127.0.0.1:34061_solr) [n:127.0.0.1:34061_solr    ] o.a.s.c.c.ZkConfigManager Copying zk node /configs/_default/lang/stopwords_it.txt to /configs/testMoveReplicaMainCollection_xyz.AUTOCREATED/lang/stopwords_it.txt
   [junit4]   2> 17831 INFO  (OverseerThreadFactory-26-thread-2-processing-n:127.0.0.1:34061_solr) [n:127.0.0.1:34061_solr    ] o.a.s.c.c.ZkConfigManager Copying zk node /configs/_default/lang/stopwords_eu.txt to /configs/testMoveReplicaMainCollection_xyz.AUTOCREATED/lang/stopwords_eu.txt
   [junit4]   2> 17833 INFO  (OverseerThreadFactory-26-thread-2-processing-n:127.0.0.1:34061_solr) [n:127.0.0.1:34061_solr    ] o.a.s.c.c.ZkConfigManager Copying zk node /configs/_default/lang/stopwords_cz.txt to /configs/testMoveReplicaMainCollection_xyz.AUTOCREATED/lang/stopwords_cz.txt
   [junit4]   2> 17834 INFO  (OverseerThreadFactory-26-thread-2-processing-n:127.0.0.1:34061_solr) [n:127.0.0.1:34061_solr    ] o.a.s.c.c.ZkConfigManager Copying zk node /configs/_default/lang/stoptags_ja.txt to /configs/testMoveReplicaMainCollection_xyz.AUTOCREATED/lang/stoptags_ja.txt
   [junit4]   2> 17837 INFO  (OverseerThreadFactory-26-thread-2-processing-n:127.0.0.1:34061_solr) [n:127.0.0.1:34061_solr    ] o.a.s.c.c.ZkConfigManager Copying zk node /configs/_default/lang/contractions_fr.txt to /configs/testMoveReplicaMainCollection_xyz.AUTOCREATED/lang/contractions_fr.txt
   [junit4]   2> 17839 INFO  (OverseerThreadFactory-26-thread-2-processing-n:127.0.0.1:34061_solr) [n:127.0.0.1:34061_solr    ] o.a.s.c.c.ZkConfigManager Copying zk node /configs/_default/lang/stopwords_de.txt to /configs/testMoveReplicaMainCollection_xyz.AUTOCREATED/lang/stopwords_de.txt
   [junit4]   2> 17842 INFO  (OverseerThreadFactory-26-thread-2-processing-n:127.0.0.1:34061_solr) [n:127.0.0.1:34061_solr    ] o.a.s.c.c.ZkConfigManager Copying zk node /configs/_default/lang/stopwords_fa.txt to /configs/testMoveReplicaMainCollection_xyz.AUTOCREATED/lang/stopwords_fa.txt
   [junit4]   2> 17845 INFO  (OverseerThreadFactory-26-thread-2-processing-n:127.0.0.1:34061_solr) [n:127.0.0.1:34061_solr    ] o.a.s.c.c.ZkConfigManager Copying zk node /configs/_default/lang/contractions_ga.txt to /configs/testMoveReplicaMainCollection_xyz.AUTOCREATED/lang/contractions_ga.txt
   [junit4]   2> 17847 INFO  (OverseerThreadFactory-26-thread-2-processing-n:127.0.0.1:34061_solr) [n:127.0.0.1:34061_solr    ] o.a.s.c.c.ZkConfigManager Copying zk node /configs/_default/lang/stopwords_ca.txt to /configs/testMoveReplicaMainCollection_xyz.AUTOCREATED/lang/stopwords_ca.txt
   [junit4]   2> 17849 INFO  (OverseerThreadFactory-26-thread-2-processing-n:127.0.0.1:34061_solr) [n:127.0.0.1:34061_solr    ] o.a.s.c.c.ZkConfigManager Copying zk node /configs/_default/lang/stopwords_nl.txt to /configs/testMoveReplicaMainCollection_xyz.AUTOCREATED/lang/stopwords_nl.txt
   [junit4]   2> 17851 INFO  (OverseerThreadFactory-26-thread-2-processing-n:127.0.0.1:34061_solr) [n:127.0.0.1:34061_solr    ] o.a.s.c.c.ZkConfigManager Copying zk node /configs/_default/lang/stopwords_bg.txt to /configs/testMoveReplicaMainCollection_xyz.AUTOCREATED/lang/stopwords_bg.txt
   [junit4]   2> 17853 INFO  (OverseerThreadFactory-26-thread-2-processing-n:127.0.0.1:34061_solr) [n:127.0.0.1:34061_solr    ] o.a.s.c.c.ZkConfigManager Copying zk node /configs/_default/lang/stopwords_lv.txt to /configs/testMoveReplicaMainCollection_xyz.AUTOCREATED/lang/stopwords_lv.txt
   [junit4]   2> 17855 INFO  (OverseerThreadFactory-26-thread-2-processing-n:127.0.0.1:34061_solr) [n:127.0.0.1:34061_solr    ] o.a.s.c.c.ZkConfigManager Copying zk node /configs/_default/lang/stopwords_es.txt to /configs/testMoveReplicaMainCollection_xyz.AUTOCREATED/lang/stopwords_es.txt
   [junit4]   2> 17857 INFO  (OverseerThreadFactory-26-thread-2-processing-n:127.0.0.1:34061_solr) [n:127.0.0.1:34061_solr    ] o.a.s.c.c.ZkConfigManager Copying zk node /configs/_default/lang/stopwords_en.txt to /configs/testMoveReplicaMainCollection_xyz.AUTOCREATED/lang/stopwords_en.txt
   [junit4]   2> 17878 INFO  (OverseerThreadFactory-26-thread-2-processing-n:127.0.0.1:34061_solr) [n:127.0.0.1:34061_solr    ] o.a.s.c.c.ZkConfigManager Copying zk node /configs/_default/lang/stopwords_ro.txt to /configs/testMoveReplicaMainCollection_xyz.AUTOCREATED/lang/stopwords_ro.txt
   [junit4]   2> 17882 INFO  (OverseerThreadFactory-26-thread-2-processing-n:127.0.0.1:34061_solr) [n:127.0.0.1:34061_solr    ] o.a.s.c.c.ZkConfigManager Copying zk node /configs/_default/lang/stopwords_th.txt to /configs/testMoveReplicaMainCollection_xyz.AUTOCREATED/lang/stopwords_th.txt
   [junit4]   2> 17885 INFO  (OverseerThreadFactory-26-thread-2-processing-n:127.0.0.1:34061_solr) [n:127.0.0.1:34061_solr    ] o.a.s.c.c.ZkConfigManager Copying zk node /configs/_default/lang/stopwords_fr.txt to /configs/testMoveReplicaMainCollection_xyz.AUTOCREATED/lang/stopwords_fr.txt
   [junit4]   2> 17889 INFO  (OverseerThreadFactory-26-thread-2-processing-n:127.0.0.1:34061_solr) [n:127.0.0.1:34061_solr    ] o.a.s.c.c.ZkConfigManager Copying zk node /configs/_default/lang/stopwords_sv.txt to /configs/testMoveReplicaMainCollection_xyz.AUTOCREATED/lang/stopwords_sv.txt
   [junit4]   2> 17892 INFO  (OverseerThreadFactory-26-thread-2-processing-n:127.0.0.1:34061_solr) [n:127.0.0.1:34061_solr    ] o.a.s.c.c.ZkConfigManager Copying zk node /configs/_default/lang/stopwords_fi.txt to /configs/testMoveReplicaMainCollection_xyz.AUTOCREATED/lang/stopwords_fi.txt
   [junit4]   2> 17896 INFO  (OverseerThreadFactory-26-thread-2-processing-n:127.0.0.1:34061_solr) [n:127.0.0.1:34061_solr    ] o.a.s.c.c.ZkConfigManager Copying zk node /configs/_default/lang/hyphenations_ga.txt to /configs/testMoveReplicaMainCollection_xyz.AUTOCREATED/lang/hyphenations_ga.txt
   [junit4]   2> 17900 INFO  (OverseerThreadFactory-26-thread-2-processing-n:127.0.0.1:34061_solr) [n:127.0.0.1:34061_solr    ] o.a.s.c.c.ZkConfigManager Copying zk node /configs/_default/lang/stopwords_gl.txt to /configs/testMoveReplicaMainCollection_xyz.AUTOCREATED/lang/stopwords_gl.txt
   [junit4]   2> 17913 INFO  (OverseerThreadFactory-26-thread-2-processing-n:127.0.0.1:34061_solr) [n:127.0.0.1:34061_solr    ] o.a.s.c.c.ZkConfigManager Copying zk node /configs/_default/params.json to /configs/testMoveReplicaMainCollection_xyz.AUTOCREATED/params.json
   [junit4]   2> 17922 DEBUG (OverseerStateUpdate-72125099488903174-127.0.0.1:34061_solr-n_0000000000) [n:127.0.0.1:34061_solr    ] o.a.s.c.o.ClusterStateMutator building a new cName: testMoveReplicaMainCollection_xyz
   [junit4]   2> 18022 DEBUG (OverseerStateUpdate-72125099488903174-127.0.0.1:34061_solr-n_0000000000) [n:127.0.0.1:34061_solr    ] o.a.s.c.o.ZkStateWriter going to create_collection /collections/testMoveReplicaMainCollection_xyz/state.json
   [junit4]   2> 18123 DEBUG (OverseerThreadFactory-26-thread-2-processing-n:127.0.0.1:34061_solr) [n:127.0.0.1:34061_solr    ] o.a.s.c.s.c.a.PolicyHelper Creating a new session
   [junit4]   2> 18134 INFO  (qtp303235554-62) [n:127.0.0.1:53470_solr    ] o.a.s.s.HttpSolrCall [admin] webapp=null path=/admin/metrics params={wt=javabin&version=2&key=solr.core.testMoveReplicaMainCollection_abc.shard1.replica_n1:INDEX.sizeInBytes} status=0 QTime=1
   [junit4]   2> 18136 INFO  (qtp303235554-64) [n:127.0.0.1:53470_solr    ] o.a.s.s.HttpSolrCall [admin] webapp=null path=/admin/metrics par

[...truncated too long message...]

unit4] OK      5.64s J1 | TestWithCollection.testMoveReplicaWithCollection
   [junit4] OK      7.81s J1 | TestWithCollection.testAddReplicaSimple
   [junit4] OK      13.6s J1 | TestWithCollection.testNodeAdded
   [junit4] OK      15.7s J1 | TestWithCollection.testMultipleWithCollections
   [junit4] OK      12.0s J1 | TestWithCollection.testDeleteWithCollection
   [junit4] OK      5.27s J1 | TestWithCollection.testCreateCollection
   [junit4] OK      6.81s J1 | TestWithCollection.testAddReplicaWithPolicy
   [junit4] Completed [1/5] on J1 in 92.89s, 9 tests
   [junit4] 
   [junit4] Suite: org.apache.solr.cloud.TestWithCollection
   [junit4] OK      19.7s J0 | TestWithCollection.testMoveReplicaMainCollection
   [junit4] OK      5.95s J0 | TestWithCollection.testCreateCollectionNoWithCollection
   [junit4] OK      6.80s J0 | TestWithCollection.testMoveReplicaWithCollection
   [junit4] OK      11.3s J0 | TestWithCollection.testAddReplicaSimple
   [junit4] OK      12.0s J0 | TestWithCollection.testNodeAdded
   [junit4] OK      15.7s J0 | TestWithCollection.testMultipleWithCollections
   [junit4] OK      11.0s J0 | TestWithCollection.testDeleteWithCollection
   [junit4] OK      6.45s J0 | TestWithCollection.testCreateCollection
   [junit4] OK      7.55s J0 | TestWithCollection.testAddReplicaWithPolicy
   [junit4] Completed [2/5] on J0 in 99.72s, 9 tests
   [junit4] 
   [junit4] Suite: org.apache.solr.cloud.TestWithCollection
   [junit4] OK      10.5s J1 | TestWithCollection.testMoveReplicaMainCollection
   [junit4] OK      3.05s J1 | TestWithCollection.testCreateCollectionNoWithCollection
   [junit4] OK      5.47s J1 | TestWithCollection.testMoveReplicaWithCollection
   [junit4] OK      8.51s J1 | TestWithCollection.testAddReplicaSimple
   [junit4] OK      12.0s J1 | TestWithCollection.testNodeAdded
   [junit4] OK      15.2s J1 | TestWithCollection.testMultipleWithCollections
   [junit4] OK      9.97s J1 | TestWithCollection.testDeleteWithCollection
   [junit4] OK      4.74s J1 | TestWithCollection.testCreateCollection
   [junit4] OK      8.62s J1 | TestWithCollection.testAddReplicaWithPolicy
   [junit4] Completed [3/5] on J1 in 78.28s, 9 tests
   [junit4] 
   [junit4] Suite: org.apache.solr.cloud.TestWithCollection
   [junit4] OK      10.8s J0 | TestWithCollection.testMoveReplicaMainCollection
   [junit4] OK      3.76s J0 | TestWithCollection.testCreateCollectionNoWithCollection
   [junit4] OK      7.62s J0 | TestWithCollection.testMoveReplicaWithCollection
   [junit4] OK      7.84s J0 | TestWithCollection.testAddReplicaSimple
   [junit4] OK      11.5s J0 | TestWithCollection.testNodeAdded
   [junit4] OK      16.5s J0 | TestWithCollection.testMultipleWithCollections
   [junit4] OK      10.7s J0 | TestWithCollection.testDeleteWithCollection
   [junit4] OK      4.96s J0 | TestWithCollection.testCreateCollection
   [junit4] OK      7.27s J0 | TestWithCollection.testAddReplicaWithPolicy
   [junit4] Completed [4/5] on J0 in 82.06s, 9 tests
   [junit4] 
   [junit4] Suite: org.apache.solr.cloud.TestWithCollection
   [junit4] OK      10.2s J1 | TestWithCollection.testMoveReplicaMainCollection
   [junit4] OK      2.73s J1 | TestWithCollection.testCreateCollectionNoWithCollection
   [junit4] OK      4.93s J1 | TestWithCollection.testMoveReplicaWithCollection
   [junit4] OK      6.71s J1 | TestWithCollection.testAddReplicaSimple
   [junit4] OK      12.0s J1 | TestWithCollection.testNodeAdded
   [junit4] OK      14.3s J1 | TestWithCollection.testMultipleWithCollections
   [junit4] OK      9.93s J1 | TestWithCollection.testDeleteWithCollection
   [junit4] OK      5.11s J1 | TestWithCollection.testCreateCollection
   [junit4] OK      7.15s J1 | TestWithCollection.testAddReplicaWithPolicy
   [junit4] Completed [5/5] on J1 in 73.70s, 9 tests
   [junit4] 
   [junit4] JVM J0:     0.75 ..   183.51 =   182.76s
   [junit4] JVM J1:     0.74 ..   247.45 =   246.71s
   [junit4] Execution time total: 4 minutes 7 seconds
   [junit4] Tests summary: 5 suites, 45 tests
   [junit4] Could not remove temporary path: /export/home/jenkins/workspace/Lucene-Solr-master-Solaris/solr/build/solr-core/test/J0 (java.nio.file.DirectoryNotEmptyException: Remaining files: [/export/home/jenkins/workspace/Lucene-Solr-master-Solaris/solr/build/solr-core/test/J0/temp])
   [junit4] Could not remove temporary path: /export/home/jenkins/workspace/Lucene-Solr-master-Solaris/solr/build/solr-core/test/J1 (java.nio.file.DirectoryNotEmptyException: Remaining files: [/export/home/jenkins/workspace/Lucene-Solr-master-Solaris/solr/build/solr-core/test/J1/temp])
     [echo] 5 slowest tests:
[junit4:tophints] 209.40s | org.apache.solr.search.facet.TestJsonFacets
[junit4:tophints] 174.56s | org.apache.solr.cloud.api.collections.ShardSplitTest
[junit4:tophints] 118.52s | org.apache.solr.update.SoftAutoCommitTest
[junit4:tophints] 106.43s | org.apache.solr.index.hdfs.CheckHdfsIndexTest
[junit4:tophints] 106.25s | org.apache.solr.cloud.TestWithCollection

-check-totals:

test-nocompile:

BUILD SUCCESSFUL
Total time: 4 minutes 10 seconds
[repro] Failures:
[repro]   0/5 failed: org.apache.solr.cloud.TestWithCollection
[repro] Exiting with code 0
+ mv lucene/build lucene/build.repro
+ mv solr/build solr/build.repro
+ mv lucene/build.orig lucene/build
+ mv solr/build.orig solr/build
Archiving artifacts
Setting ANT_1_8_2_HOME=/export/home/jenkins/tools/hudson.tasks.Ant_AntInstallation/ANT_1.8.2
java.lang.InterruptedException: no matches found within 10000
	at hudson.FilePath$ValidateAntFileMask.hasMatch(FilePath.java:2847)
	at hudson.FilePath$ValidateAntFileMask.invoke(FilePath.java:2726)
	at hudson.FilePath$ValidateAntFileMask.invoke(FilePath.java:2707)
	at hudson.FilePath$FileCallableWrapper.call(FilePath.java:3086)
Also:   hudson.remoting.Channel$CallSiteStackTrace: Remote call to Solaris VBOX
		at hudson.remoting.Channel.attachCallSiteStackTrace(Channel.java:1743)
		at hudson.remoting.UserRequest$ExceptionResponse.retrieve(UserRequest.java:357)
		at hudson.remoting.Channel.call(Channel.java:957)
		at hudson.FilePath.act(FilePath.java:1072)
		at hudson.FilePath.act(FilePath.java:1061)
		at hudson.FilePath.validateAntFileMask(FilePath.java:2705)
		at hudson.tasks.ArtifactArchiver.perform(ArtifactArchiver.java:243)
		at hudson.tasks.BuildStepCompatibilityLayer.perform(BuildStepCompatibilityLayer.java:81)
		at hudson.tasks.BuildStepMonitor$1.perform(BuildStepMonitor.java:20)
		at hudson.model.AbstractBuild$AbstractBuildExecution.perform(AbstractBuild.java:744)
		at hudson.model.AbstractBuild$AbstractBuildExecution.performAllBuildSteps(AbstractBuild.java:690)
		at hudson.model.Build$BuildExecution.post2(Build.java:186)
		at hudson.model.AbstractBuild$AbstractBuildExecution.post(AbstractBuild.java:635)
		at hudson.model.Run.execute(Run.java:1835)
		at hudson.model.FreeStyleBuild.run(FreeStyleBuild.java:43)
		at hudson.model.ResourceController.execute(ResourceController.java:97)
		at hudson.model.Executor.run(Executor.java:429)
Caused: hudson.FilePath$TunneledInterruptedException
	at hudson.FilePath$FileCallableWrapper.call(FilePath.java:3088)
	at hudson.remoting.UserRequest.perform(UserRequest.java:212)
	at hudson.remoting.UserRequest.perform(UserRequest.java:54)
	at hudson.remoting.Request$2.run(Request.java:369)
	at hudson.remoting.InterceptingExecutorService$1.call(InterceptingExecutorService.java:72)
	at java.util.concurrent.FutureTask.run(FutureTask.java:266)
	at java.util.concurrent.ThreadPoolExecutor.runWorker(ThreadPoolExecutor.java:1149)
	at java.util.concurrent.ThreadPoolExecutor$Worker.run(ThreadPoolExecutor.java:624)
	at java.lang.Thread.run(Thread.java:748)
Caused: java.lang.InterruptedException: java.lang.InterruptedException: no matches found within 10000
	at hudson.FilePath.act(FilePath.java:1074)
	at hudson.FilePath.act(FilePath.java:1061)
	at hudson.FilePath.validateAntFileMask(FilePath.java:2705)
	at hudson.tasks.ArtifactArchiver.perform(ArtifactArchiver.java:243)
	at hudson.tasks.BuildStepCompatibilityLayer.perform(BuildStepCompatibilityLayer.java:81)
	at hudson.tasks.BuildStepMonitor$1.perform(BuildStepMonitor.java:20)
	at hudson.model.AbstractBuild$AbstractBuildExecution.perform(AbstractBuild.java:744)
	at hudson.model.AbstractBuild$AbstractBuildExecution.performAllBuildSteps(AbstractBuild.java:690)
	at hudson.model.Build$BuildExecution.post2(Build.java:186)
	at hudson.model.AbstractBuild$AbstractBuildExecution.post(AbstractBuild.java:635)
	at hudson.model.Run.execute(Run.java:1835)
	at hudson.model.FreeStyleBuild.run(FreeStyleBuild.java:43)
	at hudson.model.ResourceController.execute(ResourceController.java:97)
	at hudson.model.Executor.run(Executor.java:429)
No artifacts found that match the file pattern "**/*.events,heapdumps/**,**/*_pid*.log". Configuration error?
[WARNINGS] Parsing warnings in console log with parser Java Compiler (javac)
Setting ANT_1_8_2_HOME=/export/home/jenkins/tools/hudson.tasks.Ant_AntInstallation/ANT_1.8.2
Setting ANT_1_8_2_HOME=/export/home/jenkins/tools/hudson.tasks.Ant_AntInstallation/ANT_1.8.2
<Git Blamer> Using GitBlamer to create author and commit information for all warnings.
<Git Blamer> GIT_COMMIT=f140971bdffa0aa25d04bd43d74431938294d432, workspace=/export/home/jenkins/workspace/Lucene-Solr-master-Solaris
[WARNINGS] Computing warning deltas based on reference build #2264
Recording test results
Setting ANT_1_8_2_HOME=/export/home/jenkins/tools/hudson.tasks.Ant_AntInstallation/ANT_1.8.2
Build step 'Publish JUnit test result report' changed build result to UNSTABLE
Email was triggered for: Unstable (Test Failures)
Sending email for trigger: Unstable (Test Failures)
Setting ANT_1_8_2_HOME=/export/home/jenkins/tools/hudson.tasks.Ant_AntInstallation/ANT_1.8.2
Setting ANT_1_8_2_HOME=/export/home/jenkins/tools/hudson.tasks.Ant_AntInstallation/ANT_1.8.2
Setting ANT_1_8_2_HOME=/export/home/jenkins/tools/hudson.tasks.Ant_AntInstallation/ANT_1.8.2
Setting ANT_1_8_2_HOME=/export/home/jenkins/tools/hudson.tasks.Ant_AntInstallation/ANT_1.8.2

Mime
View raw message