lucene-dev mailing list archives

Site index · List index
Message view « Date » · « Thread »
Top « Date » · « Thread »
From Policeman Jenkins Server <jenk...@thetaphi.de>
Subject [JENKINS] Lucene-Solr-8.x-MacOSX (64bit/jdk1.8.0) - Build # 16 - Still Unstable!
Date Sun, 20 Jan 2019 15:26:07 GMT
Build: https://jenkins.thetaphi.de/job/Lucene-Solr-8.x-MacOSX/16/
Java: 64bit/jdk1.8.0 -XX:-UseCompressedOops -XX:+UseG1GC

1 tests failed.
FAILED:  junit.framework.TestSuite.org.apache.solr.handler.TestReplicationHandler

Error Message:
ObjectTracker found 4 object(s) that were not released!!! [SolrCore, InternalHttpClient, MockDirectoryWrapper, MockDirectoryWrapper] org.apache.solr.common.util.ObjectReleaseTracker$ObjectTrackerException: org.apache.solr.core.SolrCore  at org.apache.solr.common.util.ObjectReleaseTracker.track(ObjectReleaseTracker.java:42)  at org.apache.solr.core.SolrCore.<init>(SolrCore.java:1056)  at org.apache.solr.core.SolrCore.reload(SolrCore.java:668)  at org.apache.solr.core.CoreContainer.reload(CoreContainer.java:1450)  at org.apache.solr.handler.IndexFetcher.lambda$reloadCore$0(IndexFetcher.java:921)  at java.lang.Thread.run(Thread.java:748)  org.apache.solr.common.util.ObjectReleaseTracker$ObjectTrackerException: org.apache.http.impl.client.InternalHttpClient  at org.apache.solr.common.util.ObjectReleaseTracker.track(ObjectReleaseTracker.java:42)  at org.apache.solr.client.solrj.impl.HttpClientUtil.createClient(HttpClientUtil.java:321)  at org.apache.solr.client.solrj.impl.HttpClientUtil.createClient(HttpClientUtil.java:330)  at org.apache.solr.handler.IndexFetcher.createHttpClient(IndexFetcher.java:225)  at org.apache.solr.handler.IndexFetcher.<init>(IndexFetcher.java:267)  at org.apache.solr.handler.ReplicationHandler.inform(ReplicationHandler.java:1215)  at org.apache.solr.core.SolrResourceLoader.inform(SolrResourceLoader.java:696)  at org.apache.solr.core.SolrCore.<init>(SolrCore.java:1002)  at org.apache.solr.core.SolrCore.reload(SolrCore.java:668)  at org.apache.solr.core.CoreContainer.reload(CoreContainer.java:1450)  at org.apache.solr.handler.IndexFetcher.lambda$reloadCore$0(IndexFetcher.java:921)  at java.lang.Thread.run(Thread.java:748)  org.apache.solr.common.util.ObjectReleaseTracker$ObjectTrackerException: org.apache.lucene.store.MockDirectoryWrapper  at org.apache.solr.common.util.ObjectReleaseTracker.track(ObjectReleaseTracker.java:42)  at org.apache.solr.core.CachingDirectoryFactory.get(CachingDirectoryFactory.java:348)  at org.apache.solr.handler.IndexFetcher.fetchLatestIndex(IndexFetcher.java:503)  at org.apache.solr.handler.IndexFetcher.fetchLatestIndex(IndexFetcher.java:346)  at org.apache.solr.handler.ReplicationHandler.doFetch(ReplicationHandler.java:424)  at org.apache.solr.handler.ReplicationHandler.lambda$setupPolling$13(ReplicationHandler.java:1184)  at java.util.concurrent.Executors$RunnableAdapter.call(Executors.java:511)  at java.util.concurrent.FutureTask.runAndReset(FutureTask.java:308)  at java.util.concurrent.ScheduledThreadPoolExecutor$ScheduledFutureTask.access$301(ScheduledThreadPoolExecutor.java:180)  at java.util.concurrent.ScheduledThreadPoolExecutor$ScheduledFutureTask.run(ScheduledThreadPoolExecutor.java:294)  at java.util.concurrent.ThreadPoolExecutor.runWorker(ThreadPoolExecutor.java:1149)  at java.util.concurrent.ThreadPoolExecutor$Worker.run(ThreadPoolExecutor.java:624)  at java.lang.Thread.run(Thread.java:748)  org.apache.solr.common.util.ObjectReleaseTracker$ObjectTrackerException: org.apache.lucene.store.MockDirectoryWrapper  at org.apache.solr.common.util.ObjectReleaseTracker.track(ObjectReleaseTracker.java:42)  at org.apache.solr.core.CachingDirectoryFactory.get(CachingDirectoryFactory.java:348)  at org.apache.solr.core.SolrCore.initSnapshotMetaDataManager(SolrCore.java:510)  at org.apache.solr.core.SolrCore.<init>(SolrCore.java:961)  at org.apache.solr.core.SolrCore.<init>(SolrCore.java:876)  at org.apache.solr.core.CoreContainer.createFromDescriptor(CoreContainer.java:1189)  at org.apache.solr.core.CoreContainer.lambda$load$13(CoreContainer.java:695)  at com.codahale.metrics.InstrumentedExecutorService$InstrumentedCallable.call(InstrumentedExecutorService.java:197)  at java.util.concurrent.FutureTask.run(FutureTask.java:266)  at org.apache.solr.common.util.ExecutorUtil$MDCAwareThreadPoolExecutor.lambda$execute$0(ExecutorUtil.java:209)  at java.util.concurrent.ThreadPoolExecutor.runWorker(ThreadPoolExecutor.java:1149)  at java.util.concurrent.ThreadPoolExecutor$Worker.run(ThreadPoolExecutor.java:624)  at java.lang.Thread.run(Thread.java:748)   expected null, but was:<ObjectTracker found 4 object(s) that were not released!!! [SolrCore, InternalHttpClient, MockDirectoryWrapper, MockDirectoryWrapper] org.apache.solr.common.util.ObjectReleaseTracker$ObjectTrackerException: org.apache.solr.core.SolrCore  at org.apache.solr.common.util.ObjectReleaseTracker.track(ObjectReleaseTracker.java:42)  at org.apache.solr.core.SolrCore.<init>(SolrCore.java:1056)  at org.apache.solr.core.SolrCore.reload(SolrCore.java:668)  at org.apache.solr.core.CoreContainer.reload(CoreContainer.java:1450)  at org.apache.solr.handler.IndexFetcher.lambda$reloadCore$0(IndexFetcher.java:921)  at java.lang.Thread.run(Thread.java:748)  org.apache.solr.common.util.ObjectReleaseTracker$ObjectTrackerException: org.apache.http.impl.client.InternalHttpClient  at org.apache.solr.common.util.ObjectReleaseTracker.track(ObjectReleaseTracker.java:42)  at org.apache.solr.client.solrj.impl.HttpClientUtil.createClient(HttpClientUtil.java:321)  at org.apache.solr.client.solrj.impl.HttpClientUtil.createClient(HttpClientUtil.java:330)  at org.apache.solr.handler.IndexFetcher.createHttpClient(IndexFetcher.java:225)  at org.apache.solr.handler.IndexFetcher.<init>(IndexFetcher.java:267)  at org.apache.solr.handler.ReplicationHandler.inform(ReplicationHandler.java:1215)  at org.apache.solr.core.SolrResourceLoader.inform(SolrResourceLoader.java:696)  at org.apache.solr.core.SolrCore.<init>(SolrCore.java:1002)  at org.apache.solr.core.SolrCore.reload(SolrCore.java:668)  at org.apache.solr.core.CoreContainer.reload(CoreContainer.java:1450)  at org.apache.solr.handler.IndexFetcher.lambda$reloadCore$0(IndexFetcher.java:921)  at java.lang.Thread.run(Thread.java:748)  org.apache.solr.common.util.ObjectReleaseTracker$ObjectTrackerException: org.apache.lucene.store.MockDirectoryWrapper  at org.apache.solr.common.util.ObjectReleaseTracker.track(ObjectReleaseTracker.java:42)  at org.apache.solr.core.CachingDirectoryFactory.get(CachingDirectoryFactory.java:348)  at org.apache.solr.handler.IndexFetcher.fetchLatestIndex(IndexFetcher.java:503)  at org.apache.solr.handler.IndexFetcher.fetchLatestIndex(IndexFetcher.java:346)  at org.apache.solr.handler.ReplicationHandler.doFetch(ReplicationHandler.java:424)  at org.apache.solr.handler.ReplicationHandler.lambda$setupPolling$13(ReplicationHandler.java:1184)  at java.util.concurrent.Executors$RunnableAdapter.call(Executors.java:511)  at java.util.concurrent.FutureTask.runAndReset(FutureTask.java:308)  at java.util.concurrent.ScheduledThreadPoolExecutor$ScheduledFutureTask.access$301(ScheduledThreadPoolExecutor.java:180)  at java.util.concurrent.ScheduledThreadPoolExecutor$ScheduledFutureTask.run(ScheduledThreadPoolExecutor.java:294)  at java.util.concurrent.ThreadPoolExecutor.runWorker(ThreadPoolExecutor.java:1149)  at java.util.concurrent.ThreadPoolExecutor$Worker.run(ThreadPoolExecutor.java:624)  at java.lang.Thread.run(Thread.java:748)  org.apache.solr.common.util.ObjectReleaseTracker$ObjectTrackerException: org.apache.lucene.store.MockDirectoryWrapper  at org.apache.solr.common.util.ObjectReleaseTracker.track(ObjectReleaseTracker.java:42)  at org.apache.solr.core.CachingDirectoryFactory.get(CachingDirectoryFactory.java:348)  at org.apache.solr.core.SolrCore.initSnapshotMetaDataManager(SolrCore.java:510)  at org.apache.solr.core.SolrCore.<init>(SolrCore.java:961)  at org.apache.solr.core.SolrCore.<init>(SolrCore.java:876)  at org.apache.solr.core.CoreContainer.createFromDescriptor(CoreContainer.java:1189)  at org.apache.solr.core.CoreContainer.lambda$load$13(CoreContainer.java:695)  at com.codahale.metrics.InstrumentedExecutorService$InstrumentedCallable.call(InstrumentedExecutorService.java:197)  at java.util.concurrent.FutureTask.run(FutureTask.java:266)  at org.apache.solr.common.util.ExecutorUtil$MDCAwareThreadPoolExecutor.lambda$execute$0(ExecutorUtil.java:209)  at java.util.concurrent.ThreadPoolExecutor.runWorker(ThreadPoolExecutor.java:1149)  at java.util.concurrent.ThreadPoolExecutor$Worker.run(ThreadPoolExecutor.java:624)  at java.lang.Thread.run(Thread.java:748)  >

Stack Trace:
java.lang.AssertionError: ObjectTracker found 4 object(s) that were not released!!! [SolrCore, InternalHttpClient, MockDirectoryWrapper, MockDirectoryWrapper]
org.apache.solr.common.util.ObjectReleaseTracker$ObjectTrackerException: org.apache.solr.core.SolrCore
	at org.apache.solr.common.util.ObjectReleaseTracker.track(ObjectReleaseTracker.java:42)
	at org.apache.solr.core.SolrCore.<init>(SolrCore.java:1056)
	at org.apache.solr.core.SolrCore.reload(SolrCore.java:668)
	at org.apache.solr.core.CoreContainer.reload(CoreContainer.java:1450)
	at org.apache.solr.handler.IndexFetcher.lambda$reloadCore$0(IndexFetcher.java:921)
	at java.lang.Thread.run(Thread.java:748)

org.apache.solr.common.util.ObjectReleaseTracker$ObjectTrackerException: org.apache.http.impl.client.InternalHttpClient
	at org.apache.solr.common.util.ObjectReleaseTracker.track(ObjectReleaseTracker.java:42)
	at org.apache.solr.client.solrj.impl.HttpClientUtil.createClient(HttpClientUtil.java:321)
	at org.apache.solr.client.solrj.impl.HttpClientUtil.createClient(HttpClientUtil.java:330)
	at org.apache.solr.handler.IndexFetcher.createHttpClient(IndexFetcher.java:225)
	at org.apache.solr.handler.IndexFetcher.<init>(IndexFetcher.java:267)
	at org.apache.solr.handler.ReplicationHandler.inform(ReplicationHandler.java:1215)
	at org.apache.solr.core.SolrResourceLoader.inform(SolrResourceLoader.java:696)
	at org.apache.solr.core.SolrCore.<init>(SolrCore.java:1002)
	at org.apache.solr.core.SolrCore.reload(SolrCore.java:668)
	at org.apache.solr.core.CoreContainer.reload(CoreContainer.java:1450)
	at org.apache.solr.handler.IndexFetcher.lambda$reloadCore$0(IndexFetcher.java:921)
	at java.lang.Thread.run(Thread.java:748)

org.apache.solr.common.util.ObjectReleaseTracker$ObjectTrackerException: org.apache.lucene.store.MockDirectoryWrapper
	at org.apache.solr.common.util.ObjectReleaseTracker.track(ObjectReleaseTracker.java:42)
	at org.apache.solr.core.CachingDirectoryFactory.get(CachingDirectoryFactory.java:348)
	at org.apache.solr.handler.IndexFetcher.fetchLatestIndex(IndexFetcher.java:503)
	at org.apache.solr.handler.IndexFetcher.fetchLatestIndex(IndexFetcher.java:346)
	at org.apache.solr.handler.ReplicationHandler.doFetch(ReplicationHandler.java:424)
	at org.apache.solr.handler.ReplicationHandler.lambda$setupPolling$13(ReplicationHandler.java:1184)
	at java.util.concurrent.Executors$RunnableAdapter.call(Executors.java:511)
	at java.util.concurrent.FutureTask.runAndReset(FutureTask.java:308)
	at java.util.concurrent.ScheduledThreadPoolExecutor$ScheduledFutureTask.access$301(ScheduledThreadPoolExecutor.java:180)
	at java.util.concurrent.ScheduledThreadPoolExecutor$ScheduledFutureTask.run(ScheduledThreadPoolExecutor.java:294)
	at java.util.concurrent.ThreadPoolExecutor.runWorker(ThreadPoolExecutor.java:1149)
	at java.util.concurrent.ThreadPoolExecutor$Worker.run(ThreadPoolExecutor.java:624)
	at java.lang.Thread.run(Thread.java:748)

org.apache.solr.common.util.ObjectReleaseTracker$ObjectTrackerException: org.apache.lucene.store.MockDirectoryWrapper
	at org.apache.solr.common.util.ObjectReleaseTracker.track(ObjectReleaseTracker.java:42)
	at org.apache.solr.core.CachingDirectoryFactory.get(CachingDirectoryFactory.java:348)
	at org.apache.solr.core.SolrCore.initSnapshotMetaDataManager(SolrCore.java:510)
	at org.apache.solr.core.SolrCore.<init>(SolrCore.java:961)
	at org.apache.solr.core.SolrCore.<init>(SolrCore.java:876)
	at org.apache.solr.core.CoreContainer.createFromDescriptor(CoreContainer.java:1189)
	at org.apache.solr.core.CoreContainer.lambda$load$13(CoreContainer.java:695)
	at com.codahale.metrics.InstrumentedExecutorService$InstrumentedCallable.call(InstrumentedExecutorService.java:197)
	at java.util.concurrent.FutureTask.run(FutureTask.java:266)
	at org.apache.solr.common.util.ExecutorUtil$MDCAwareThreadPoolExecutor.lambda$execute$0(ExecutorUtil.java:209)
	at java.util.concurrent.ThreadPoolExecutor.runWorker(ThreadPoolExecutor.java:1149)
	at java.util.concurrent.ThreadPoolExecutor$Worker.run(ThreadPoolExecutor.java:624)
	at java.lang.Thread.run(Thread.java:748)

 expected null, but was:<ObjectTracker found 4 object(s) that were not released!!! [SolrCore, InternalHttpClient, MockDirectoryWrapper, MockDirectoryWrapper]
org.apache.solr.common.util.ObjectReleaseTracker$ObjectTrackerException: org.apache.solr.core.SolrCore
	at org.apache.solr.common.util.ObjectReleaseTracker.track(ObjectReleaseTracker.java:42)
	at org.apache.solr.core.SolrCore.<init>(SolrCore.java:1056)
	at org.apache.solr.core.SolrCore.reload(SolrCore.java:668)
	at org.apache.solr.core.CoreContainer.reload(CoreContainer.java:1450)
	at org.apache.solr.handler.IndexFetcher.lambda$reloadCore$0(IndexFetcher.java:921)
	at java.lang.Thread.run(Thread.java:748)

org.apache.solr.common.util.ObjectReleaseTracker$ObjectTrackerException: org.apache.http.impl.client.InternalHttpClient
	at org.apache.solr.common.util.ObjectReleaseTracker.track(ObjectReleaseTracker.java:42)
	at org.apache.solr.client.solrj.impl.HttpClientUtil.createClient(HttpClientUtil.java:321)
	at org.apache.solr.client.solrj.impl.HttpClientUtil.createClient(HttpClientUtil.java:330)
	at org.apache.solr.handler.IndexFetcher.createHttpClient(IndexFetcher.java:225)
	at org.apache.solr.handler.IndexFetcher.<init>(IndexFetcher.java:267)
	at org.apache.solr.handler.ReplicationHandler.inform(ReplicationHandler.java:1215)
	at org.apache.solr.core.SolrResourceLoader.inform(SolrResourceLoader.java:696)
	at org.apache.solr.core.SolrCore.<init>(SolrCore.java:1002)
	at org.apache.solr.core.SolrCore.reload(SolrCore.java:668)
	at org.apache.solr.core.CoreContainer.reload(CoreContainer.java:1450)
	at org.apache.solr.handler.IndexFetcher.lambda$reloadCore$0(IndexFetcher.java:921)
	at java.lang.Thread.run(Thread.java:748)

org.apache.solr.common.util.ObjectReleaseTracker$ObjectTrackerException: org.apache.lucene.store.MockDirectoryWrapper
	at org.apache.solr.common.util.ObjectReleaseTracker.track(ObjectReleaseTracker.java:42)
	at org.apache.solr.core.CachingDirectoryFactory.get(CachingDirectoryFactory.java:348)
	at org.apache.solr.handler.IndexFetcher.fetchLatestIndex(IndexFetcher.java:503)
	at org.apache.solr.handler.IndexFetcher.fetchLatestIndex(IndexFetcher.java:346)
	at org.apache.solr.handler.ReplicationHandler.doFetch(ReplicationHandler.java:424)
	at org.apache.solr.handler.ReplicationHandler.lambda$setupPolling$13(ReplicationHandler.java:1184)
	at java.util.concurrent.Executors$RunnableAdapter.call(Executors.java:511)
	at java.util.concurrent.FutureTask.runAndReset(FutureTask.java:308)
	at java.util.concurrent.ScheduledThreadPoolExecutor$ScheduledFutureTask.access$301(ScheduledThreadPoolExecutor.java:180)
	at java.util.concurrent.ScheduledThreadPoolExecutor$ScheduledFutureTask.run(ScheduledThreadPoolExecutor.java:294)
	at java.util.concurrent.ThreadPoolExecutor.runWorker(ThreadPoolExecutor.java:1149)
	at java.util.concurrent.ThreadPoolExecutor$Worker.run(ThreadPoolExecutor.java:624)
	at java.lang.Thread.run(Thread.java:748)

org.apache.solr.common.util.ObjectReleaseTracker$ObjectTrackerException: org.apache.lucene.store.MockDirectoryWrapper
	at org.apache.solr.common.util.ObjectReleaseTracker.track(ObjectReleaseTracker.java:42)
	at org.apache.solr.core.CachingDirectoryFactory.get(CachingDirectoryFactory.java:348)
	at org.apache.solr.core.SolrCore.initSnapshotMetaDataManager(SolrCore.java:510)
	at org.apache.solr.core.SolrCore.<init>(SolrCore.java:961)
	at org.apache.solr.core.SolrCore.<init>(SolrCore.java:876)
	at org.apache.solr.core.CoreContainer.createFromDescriptor(CoreContainer.java:1189)
	at org.apache.solr.core.CoreContainer.lambda$load$13(CoreContainer.java:695)
	at com.codahale.metrics.InstrumentedExecutorService$InstrumentedCallable.call(InstrumentedExecutorService.java:197)
	at java.util.concurrent.FutureTask.run(FutureTask.java:266)
	at org.apache.solr.common.util.ExecutorUtil$MDCAwareThreadPoolExecutor.lambda$execute$0(ExecutorUtil.java:209)
	at java.util.concurrent.ThreadPoolExecutor.runWorker(ThreadPoolExecutor.java:1149)
	at java.util.concurrent.ThreadPoolExecutor$Worker.run(ThreadPoolExecutor.java:624)
	at java.lang.Thread.run(Thread.java:748)

>
	at __randomizedtesting.SeedInfo.seed([33FD316434356EBB]:0)
	at org.junit.Assert.fail(Assert.java:88)
	at org.junit.Assert.failNotNull(Assert.java:755)
	at org.junit.Assert.assertNull(Assert.java:737)
	at org.apache.solr.SolrTestCaseJ4.teardownTestCases(SolrTestCaseJ4.java:322)
	at sun.reflect.NativeMethodAccessorImpl.invoke0(Native Method)
	at sun.reflect.NativeMethodAccessorImpl.invoke(NativeMethodAccessorImpl.java:62)
	at sun.reflect.DelegatingMethodAccessorImpl.invoke(DelegatingMethodAccessorImpl.java:43)
	at java.lang.reflect.Method.invoke(Method.java:498)
	at com.carrotsearch.randomizedtesting.RandomizedRunner.invoke(RandomizedRunner.java:1750)
	at com.carrotsearch.randomizedtesting.RandomizedRunner$7.evaluate(RandomizedRunner.java:901)
	at com.carrotsearch.randomizedtesting.rules.StatementAdapter.evaluate(StatementAdapter.java:36)
	at com.carrotsearch.randomizedtesting.rules.SystemPropertiesRestoreRule$1.evaluate(SystemPropertiesRestoreRule.java:57)
	at org.apache.lucene.util.AbstractBeforeAfterRule$1.evaluate(AbstractBeforeAfterRule.java:45)
	at com.carrotsearch.randomizedtesting.rules.StatementAdapter.evaluate(StatementAdapter.java:36)
	at org.apache.lucene.util.TestRuleStoreClassName$1.evaluate(TestRuleStoreClassName.java:41)
	at com.carrotsearch.randomizedtesting.rules.NoShadowingOrOverridesOnMethodsRule$1.evaluate(NoShadowingOrOverridesOnMethodsRule.java:40)
	at com.carrotsearch.randomizedtesting.rules.NoShadowingOrOverridesOnMethodsRule$1.evaluate(NoShadowingOrOverridesOnMethodsRule.java:40)
	at com.carrotsearch.randomizedtesting.rules.StatementAdapter.evaluate(StatementAdapter.java:36)
	at com.carrotsearch.randomizedtesting.rules.StatementAdapter.evaluate(StatementAdapter.java:36)
	at com.carrotsearch.randomizedtesting.rules.StatementAdapter.evaluate(StatementAdapter.java:36)
	at org.apache.lucene.util.TestRuleAssertionsRequired$1.evaluate(TestRuleAssertionsRequired.java:53)
	at org.apache.lucene.util.TestRuleMarkFailure$1.evaluate(TestRuleMarkFailure.java:47)
	at org.apache.lucene.util.TestRuleIgnoreAfterMaxFailures$1.evaluate(TestRuleIgnoreAfterMaxFailures.java:64)
	at org.apache.lucene.util.TestRuleIgnoreTestSuites$1.evaluate(TestRuleIgnoreTestSuites.java:54)
	at com.carrotsearch.randomizedtesting.rules.StatementAdapter.evaluate(StatementAdapter.java:36)
	at com.carrotsearch.randomizedtesting.ThreadLeakControl$StatementRunner.run(ThreadLeakControl.java:368)
	at java.lang.Thread.run(Thread.java:748)




Build Log:
[...truncated 12691 lines...]
   [junit4] Suite: org.apache.solr.handler.TestReplicationHandler
   [junit4]   2> Creating dataDir: /Users/jenkins/workspace/Lucene-Solr-8.x-MacOSX/solr/build/solr-core/test/J1/temp/solr.handler.TestReplicationHandler_33FD316434356EBB-001/init-core-data-001
   [junit4]   2> 198587 WARN  (SUITE-TestReplicationHandler-seed#[33FD316434356EBB]-worker) [    ] o.a.s.SolrTestCaseJ4 startTrackingSearchers: numOpens=3 numCloses=3
   [junit4]   2> 198587 INFO  (SUITE-TestReplicationHandler-seed#[33FD316434356EBB]-worker) [    ] o.a.s.SolrTestCaseJ4 Using PointFields (NUMERIC_POINTS_SYSPROP=true) w/NUMERIC_DOCVALUES_SYSPROP=true
   [junit4]   2> 198592 INFO  (SUITE-TestReplicationHandler-seed#[33FD316434356EBB]-worker) [    ] o.a.s.SolrTestCaseJ4 Randomized ssl (false) and clientAuth (false) via: @org.apache.solr.SolrTestCaseJ4$SuppressSSL(bugUrl=None) w/ MAC_OS_X supressed clientAuth
   [junit4]   2> 198592 INFO  (SUITE-TestReplicationHandler-seed#[33FD316434356EBB]-worker) [    ] o.a.s.SolrTestCaseJ4 SecureRandom sanity checks: test.solr.allowed.securerandom=null & java.security.egd=file:/dev/./urandom
   [junit4]   2> 198595 INFO  (TEST-TestReplicationHandler.doTestStressReplication-seed#[33FD316434356EBB]) [    ] o.a.s.SolrTestCaseJ4 ###Starting doTestStressReplication
   [junit4]   2> 198596 INFO  (TEST-TestReplicationHandler.doTestStressReplication-seed#[33FD316434356EBB]) [    ] o.a.s.SolrTestCaseJ4 Writing core.properties file to /Users/jenkins/workspace/Lucene-Solr-8.x-MacOSX/solr/build/solr-core/test/J1/temp/solr.handler.TestReplicationHandler_33FD316434356EBB-001/solr-instance-001/collection1
   [junit4]   2> 198609 WARN  (TEST-TestReplicationHandler.doTestStressReplication-seed#[33FD316434356EBB]) [    ] o.e.j.s.AbstractConnector Ignoring deprecated socket close linger time
   [junit4]   2> 198609 INFO  (TEST-TestReplicationHandler.doTestStressReplication-seed#[33FD316434356EBB]) [    ] o.a.s.c.s.e.JettySolrRunner Start Jetty (original configured port=0)
   [junit4]   2> 198609 INFO  (TEST-TestReplicationHandler.doTestStressReplication-seed#[33FD316434356EBB]) [    ] o.a.s.c.s.e.JettySolrRunner Trying to start Jetty on port 0 try number 1 ...
   [junit4]   2> 198610 INFO  (TEST-TestReplicationHandler.doTestStressReplication-seed#[33FD316434356EBB]) [    ] o.e.j.s.Server jetty-9.4.14.v20181114; built: 2018-11-14T21:20:31.478Z; git: c4550056e785fb5665914545889f21dc136ad9e6; jvm 1.8.0_172-b11
   [junit4]   2> 198611 INFO  (TEST-TestReplicationHandler.doTestStressReplication-seed#[33FD316434356EBB]) [    ] o.e.j.s.session DefaultSessionIdManager workerName=node0
   [junit4]   2> 198611 INFO  (TEST-TestReplicationHandler.doTestStressReplication-seed#[33FD316434356EBB]) [    ] o.e.j.s.session No SessionScavenger set, using defaults
   [junit4]   2> 198611 INFO  (TEST-TestReplicationHandler.doTestStressReplication-seed#[33FD316434356EBB]) [    ] o.e.j.s.session node0 Scavenging every 660000ms
   [junit4]   2> 198611 INFO  (TEST-TestReplicationHandler.doTestStressReplication-seed#[33FD316434356EBB]) [    ] o.e.j.s.h.ContextHandler Started o.e.j.s.ServletContextHandler@31ca79e{/solr,null,AVAILABLE}
   [junit4]   2> 198617 INFO  (TEST-TestReplicationHandler.doTestStressReplication-seed#[33FD316434356EBB]) [    ] o.e.j.s.AbstractConnector Started ServerConnector@1cf8bd9e{HTTP/1.1,[http/1.1, h2c]}{127.0.0.1:64281}
   [junit4]   2> 198617 INFO  (TEST-TestReplicationHandler.doTestStressReplication-seed#[33FD316434356EBB]) [    ] o.e.j.s.Server Started @198756ms
   [junit4]   2> 198617 INFO  (TEST-TestReplicationHandler.doTestStressReplication-seed#[33FD316434356EBB]) [    ] o.a.s.c.s.e.JettySolrRunner Jetty properties: {solr.data.dir=/Users/jenkins/workspace/Lucene-Solr-8.x-MacOSX/solr/build/solr-core/test/J1/temp/solr.handler.TestReplicationHandler_33FD316434356EBB-001/solr-instance-001/collection1/data, hostContext=/solr, hostPort=64281}
   [junit4]   2> 198617 ERROR (TEST-TestReplicationHandler.doTestStressReplication-seed#[33FD316434356EBB]) [    ] o.a.s.u.StartupLoggingUtils Missing Java Option solr.log.dir. Logging may be missing or incomplete.
   [junit4]   2> 198617 INFO  (TEST-TestReplicationHandler.doTestStressReplication-seed#[33FD316434356EBB]) [    ] o.a.s.s.SolrDispatchFilter Using logger factory org.apache.logging.slf4j.Log4jLoggerFactory
   [junit4]   2> 198617 INFO  (TEST-TestReplicationHandler.doTestStressReplication-seed#[33FD316434356EBB]) [    ] o.a.s.s.SolrDispatchFilter  ___      _       Welcome to Apache Solr? version 8.0.0
   [junit4]   2> 198617 INFO  (TEST-TestReplicationHandler.doTestStressReplication-seed#[33FD316434356EBB]) [    ] o.a.s.s.SolrDispatchFilter / __| ___| |_ _   Starting in standalone mode on port null
   [junit4]   2> 198618 INFO  (TEST-TestReplicationHandler.doTestStressReplication-seed#[33FD316434356EBB]) [    ] o.a.s.s.SolrDispatchFilter \__ \/ _ \ | '_|  Install dir: null
   [junit4]   2> 198618 INFO  (TEST-TestReplicationHandler.doTestStressReplication-seed#[33FD316434356EBB]) [    ] o.a.s.s.SolrDispatchFilter |___/\___/_|_|    Start time: 2019-01-20T14:04:17.055Z
   [junit4]   2> 198618 INFO  (TEST-TestReplicationHandler.doTestStressReplication-seed#[33FD316434356EBB]) [    ] o.a.s.c.SolrXmlConfig Loading container configuration from /Users/jenkins/workspace/Lucene-Solr-8.x-MacOSX/solr/build/solr-core/test/J1/temp/solr.handler.TestReplicationHandler_33FD316434356EBB-001/solr-instance-001/solr.xml
   [junit4]   2> 198624 INFO  (TEST-TestReplicationHandler.doTestStressReplication-seed#[33FD316434356EBB]) [    ] o.a.s.c.SolrXmlConfig Configuration parameter autoReplicaFailoverWorkLoopDelay is ignored
   [junit4]   2> 198624 INFO  (TEST-TestReplicationHandler.doTestStressReplication-seed#[33FD316434356EBB]) [    ] o.a.s.c.SolrXmlConfig Configuration parameter autoReplicaFailoverBadNodeExpiration is ignored
   [junit4]   2> 198626 INFO  (TEST-TestReplicationHandler.doTestStressReplication-seed#[33FD316434356EBB]) [    ] o.a.s.c.SolrXmlConfig MBean server found: com.sun.jmx.mbeanserver.JmxMBeanServer@42a7f1c5, but no JMX reporters were configured - adding default JMX reporter.
   [junit4]   2> 198772 INFO  (TEST-TestReplicationHandler.doTestStressReplication-seed#[33FD316434356EBB]) [    ] o.a.s.h.c.HttpShardHandlerFactory Host whitelist initialized: WhitelistHostChecker [whitelistHosts=null, whitelistHostCheckingEnabled=true]
   [junit4]   2> 198774 WARN  (TEST-TestReplicationHandler.doTestStressReplication-seed#[33FD316434356EBB]) [    ] o.e.j.u.s.S.config No Client EndPointIdentificationAlgorithm configured for SslContextFactory@5fd659a9[provider=null,keyStore=null,trustStore=null]
   [junit4]   2> 198780 WARN  (TEST-TestReplicationHandler.doTestStressReplication-seed#[33FD316434356EBB]) [    ] o.e.j.u.s.S.config No Client EndPointIdentificationAlgorithm configured for SslContextFactory@5733ffa[provider=null,keyStore=null,trustStore=null]
   [junit4]   2> 198825 INFO  (TEST-TestReplicationHandler.doTestStressReplication-seed#[33FD316434356EBB]) [    ] o.a.s.c.TransientSolrCoreCacheDefault Allocating transient cache for 4 transient cores
   [junit4]   2> 198825 INFO  (TEST-TestReplicationHandler.doTestStressReplication-seed#[33FD316434356EBB]) [    ] o.a.s.h.a.MetricsHistoryHandler No .system collection, keeping metrics history in memory.
   [junit4]   2> 198846 INFO  (TEST-TestReplicationHandler.doTestStressReplication-seed#[33FD316434356EBB]) [    ] o.a.s.m.r.SolrJmxReporter JMX monitoring for 'solr.node' (registry 'solr.node') enabled at server: com.sun.jmx.mbeanserver.JmxMBeanServer@42a7f1c5
   [junit4]   2> 198852 INFO  (TEST-TestReplicationHandler.doTestStressReplication-seed#[33FD316434356EBB]) [    ] o.a.s.m.r.SolrJmxReporter JMX monitoring for 'solr.jvm' (registry 'solr.jvm') enabled at server: com.sun.jmx.mbeanserver.JmxMBeanServer@42a7f1c5
   [junit4]   2> 198852 INFO  (TEST-TestReplicationHandler.doTestStressReplication-seed#[33FD316434356EBB]) [    ] o.a.s.m.r.SolrJmxReporter JMX monitoring for 'solr.jetty' (registry 'solr.jetty') enabled at server: com.sun.jmx.mbeanserver.JmxMBeanServer@42a7f1c5
   [junit4]   2> 198855 INFO  (TEST-TestReplicationHandler.doTestStressReplication-seed#[33FD316434356EBB]) [    ] o.a.s.c.CorePropertiesLocator Found 1 core definitions underneath /Users/jenkins/workspace/Lucene-Solr-8.x-MacOSX/solr/build/solr-core/test/J1/temp/solr.handler.TestReplicationHandler_33FD316434356EBB-001/solr-instance-001/.
   [junit4]   2> 198855 INFO  (TEST-TestReplicationHandler.doTestStressReplication-seed#[33FD316434356EBB]) [    ] o.a.s.c.CorePropertiesLocator Cores are: [collection1]
   [junit4]   2> 198877 INFO  (coreLoadExecutor-736-thread-1) [    x:collection1] o.a.s.c.SolrConfig Using Lucene MatchVersion: 8.0.0
   [junit4]   2> 198884 INFO  (coreLoadExecutor-736-thread-1) [    x:collection1] o.a.s.s.IndexSchema [collection1] Schema name=test
   [junit4]   2> 198887 INFO  (coreLoadExecutor-736-thread-1) [    x:collection1] o.a.s.s.IndexSchema Loaded schema test/1.2 with uniqueid field id
   [junit4]   2> 198887 INFO  (coreLoadExecutor-736-thread-1) [    x:collection1] o.a.s.c.CoreContainer Creating SolrCore 'collection1' using configuration from instancedir /Users/jenkins/workspace/Lucene-Solr-8.x-MacOSX/solr/build/solr-core/test/J1/temp/solr.handler.TestReplicationHandler_33FD316434356EBB-001/solr-instance-001/./collection1, trusted=true
   [junit4]   2> 198887 INFO  (coreLoadExecutor-736-thread-1) [    x:collection1] o.a.s.m.r.SolrJmxReporter JMX monitoring for 'solr.core.collection1' (registry 'solr.core.collection1') enabled at server: com.sun.jmx.mbeanserver.JmxMBeanServer@42a7f1c5
   [junit4]   2> 198887 INFO  (coreLoadExecutor-736-thread-1) [    x:collection1] o.a.s.c.SolrCore [[collection1] ] Opening new SolrCore at [/Users/jenkins/workspace/Lucene-Solr-8.x-MacOSX/solr/build/solr-core/test/J1/temp/solr.handler.TestReplicationHandler_33FD316434356EBB-001/solr-instance-001/collection1], dataDir=[/Users/jenkins/workspace/Lucene-Solr-8.x-MacOSX/solr/build/solr-core/test/J1/temp/solr.handler.TestReplicationHandler_33FD316434356EBB-001/solr-instance-001/./collection1/data/]
   [junit4]   2> 198888 INFO  (coreLoadExecutor-736-thread-1) [    x:collection1] o.a.s.u.RandomMergePolicy RandomMergePolicy wrapping class org.apache.lucene.index.TieredMergePolicy: [TieredMergePolicy: maxMergeAtOnce=17, maxMergeAtOnceExplicit=44, maxMergedSegmentMB=70.4990234375, floorSegmentMB=0.6357421875, forceMergeDeletesPctAllowed=27.008962051015658, segmentsPerTier=23.0, maxCFSSegmentSizeMB=8.796093022207999E12, noCFSRatio=0.6688885735463056, deletesPctAllowed=44.13332096369693
   [junit4]   2> 198951 INFO  (coreLoadExecutor-736-thread-1) [    x:collection1] o.a.s.u.CommitTracker Hard AutoCommit: disabled
   [junit4]   2> 198951 INFO  (coreLoadExecutor-736-thread-1) [    x:collection1] o.a.s.u.CommitTracker Soft AutoCommit: disabled
   [junit4]   2> 198952 INFO  (coreLoadExecutor-736-thread-1) [    x:collection1] o.a.s.u.RandomMergePolicy RandomMergePolicy wrapping class org.apache.lucene.index.AlcoholicMergePolicy: [AlcoholicMergePolicy: minMergeSize=0, mergeFactor=10, maxMergeSize=183660285, maxMergeSizeForForcedMerge=9223372036854775807, calibrateSizeByDeletes=true, maxMergeDocs=2147483647, maxCFSSegmentSizeMB=8.796093022207999E12, noCFSRatio=0.1]
   [junit4]   2> 198952 INFO  (coreLoadExecutor-736-thread-1) [    x:collection1] o.a.s.s.SolrIndexSearcher Opening [Searcher@60f1f68e[collection1] main]
   [junit4]   2> 198953 INFO  (coreLoadExecutor-736-thread-1) [    x:collection1] o.a.s.r.ManagedResourceStorage File-based storage initialized to use dir: /Users/jenkins/workspace/Lucene-Solr-8.x-MacOSX/solr/build/solr-core/test/J1/temp/solr.handler.TestReplicationHandler_33FD316434356EBB-001/solr-instance-001/collection1/conf
   [junit4]   2> 198953 INFO  (coreLoadExecutor-736-thread-1) [    x:collection1] o.a.s.h.ReplicationHandler Replication enabled for following config files: schema.xml,xslt/dummy.xsl
   [junit4]   2> 198953 INFO  (coreLoadExecutor-736-thread-1) [    x:collection1] o.a.s.h.ReplicationHandler Commits will be reserved for 10000ms.
   [junit4]   2> 198954 INFO  (searcherExecutor-737-thread-1-processing-x:collection1) [    x:collection1] o.a.s.c.SolrCore [collection1] Registered new searcher Searcher@60f1f68e[collection1] main{ExitableDirectoryReader(UninvertingDirectoryReader())}
   [junit4]   2> 198957 INFO  (TEST-TestReplicationHandler.doTestStressReplication-seed#[33FD316434356EBB]) [    ] o.a.s.SolrTestCaseJ4 Writing core.properties file to /Users/jenkins/workspace/Lucene-Solr-8.x-MacOSX/solr/build/solr-core/test/J1/temp/solr.handler.TestReplicationHandler_33FD316434356EBB-001/solr-instance-002/collection1
   [junit4]   2> 198963 WARN  (TEST-TestReplicationHandler.doTestStressReplication-seed#[33FD316434356EBB]) [    ] o.e.j.s.AbstractConnector Ignoring deprecated socket close linger time
   [junit4]   2> 198964 INFO  (TEST-TestReplicationHandler.doTestStressReplication-seed#[33FD316434356EBB]) [    ] o.a.s.c.s.e.JettySolrRunner Start Jetty (original configured port=0)
   [junit4]   2> 198964 INFO  (TEST-TestReplicationHandler.doTestStressReplication-seed#[33FD316434356EBB]) [    ] o.a.s.c.s.e.JettySolrRunner Trying to start Jetty on port 0 try number 1 ...
   [junit4]   2> 198964 INFO  (TEST-TestReplicationHandler.doTestStressReplication-seed#[33FD316434356EBB]) [    ] o.e.j.s.Server jetty-9.4.14.v20181114; built: 2018-11-14T21:20:31.478Z; git: c4550056e785fb5665914545889f21dc136ad9e6; jvm 1.8.0_172-b11
   [junit4]   2> 198965 INFO  (TEST-TestReplicationHandler.doTestStressReplication-seed#[33FD316434356EBB]) [    ] o.e.j.s.session DefaultSessionIdManager workerName=node0
   [junit4]   2> 198965 INFO  (TEST-TestReplicationHandler.doTestStressReplication-seed#[33FD316434356EBB]) [    ] o.e.j.s.session No SessionScavenger set, using defaults
   [junit4]   2> 198965 INFO  (TEST-TestReplicationHandler.doTestStressReplication-seed#[33FD316434356EBB]) [    ] o.e.j.s.session node0 Scavenging every 660000ms
   [junit4]   2> 198965 INFO  (TEST-TestReplicationHandler.doTestStressReplication-seed#[33FD316434356EBB]) [    ] o.e.j.s.h.ContextHandler Started o.e.j.s.ServletContextHandler@3b5c48cd{/solr,null,AVAILABLE}
   [junit4]   2> 198966 INFO  (TEST-TestReplicationHandler.doTestStressReplication-seed#[33FD316434356EBB]) [    ] o.e.j.s.AbstractConnector Started ServerConnector@3bd27105{HTTP/1.1,[http/1.1, h2c]}{127.0.0.1:64284}
   [junit4]   2> 198966 INFO  (TEST-TestReplicationHandler.doTestStressReplication-seed#[33FD316434356EBB]) [    ] o.e.j.s.Server Started @199105ms
   [junit4]   2> 198966 INFO  (TEST-TestReplicationHandler.doTestStressReplication-seed#[33FD316434356EBB]) [    ] o.a.s.c.s.e.JettySolrRunner Jetty properties: {solr.data.dir=/Users/jenkins/workspace/Lucene-Solr-8.x-MacOSX/solr/build/solr-core/test/J1/temp/solr.handler.TestReplicationHandler_33FD316434356EBB-001/solr-instance-002/collection1/data, hostContext=/solr, hostPort=64284}
   [junit4]   2> 198966 ERROR (TEST-TestReplicationHandler.doTestStressReplication-seed#[33FD316434356EBB]) [    ] o.a.s.u.StartupLoggingUtils Missing Java Option solr.log.dir. Logging may be missing or incomplete.
   [junit4]   2> 198966 INFO  (TEST-TestReplicationHandler.doTestStressReplication-seed#[33FD316434356EBB]) [    ] o.a.s.s.SolrDispatchFilter Using logger factory org.apache.logging.slf4j.Log4jLoggerFactory
   [junit4]   2> 198966 INFO  (TEST-TestReplicationHandler.doTestStressReplication-seed#[33FD316434356EBB]) [    ] o.a.s.s.SolrDispatchFilter  ___      _       Welcome to Apache Solr? version 8.0.0
   [junit4]   2> 198966 INFO  (TEST-TestReplicationHandler.doTestStressReplication-seed#[33FD316434356EBB]) [    ] o.a.s.s.SolrDispatchFilter / __| ___| |_ _   Starting in standalone mode on port null
   [junit4]   2> 198966 INFO  (TEST-TestReplicationHandler.doTestStressReplication-seed#[33FD316434356EBB]) [    ] o.a.s.s.SolrDispatchFilter \__ \/ _ \ | '_|  Install dir: null
   [junit4]   2> 198966 INFO  (TEST-TestReplicationHandler.doTestStressReplication-seed#[33FD316434356EBB]) [    ] o.a.s.s.SolrDispatchFilter |___/\___/_|_|    Start time: 2019-01-20T14:04:17.403Z
   [junit4]   2> 198967 INFO  (TEST-TestReplicationHandler.doTestStressReplication-seed#[33FD316434356EBB]) [    ] o.a.s.c.SolrXmlConfig Loading container configuration from /Users/jenkins/workspace/Lucene-Solr-8.x-MacOSX/solr/build/solr-core/test/J1/temp/solr.handler.TestReplicationHandler_33FD316434356EBB-001/solr-instance-002/solr.xml
   [junit4]   2> 198973 INFO  (TEST-TestReplicationHandler.doTestStressReplication-seed#[33FD316434356EBB]) [    ] o.a.s.c.SolrXmlConfig Configuration parameter autoReplicaFailoverWorkLoopDelay is ignored
   [junit4]   2> 198973 INFO  (TEST-TestReplicationHandler.doTestStressReplication-seed#[33FD316434356EBB]) [    ] o.a.s.c.SolrXmlConfig Configuration parameter autoReplicaFailoverBadNodeExpiration is ignored
   [junit4]   2> 198974 INFO  (TEST-TestReplicationHandler.doTestStressReplication-seed#[33FD316434356EBB]) [    ] o.a.s.c.SolrXmlConfig MBean server found: com.sun.jmx.mbeanserver.JmxMBeanServer@42a7f1c5, but no JMX reporters were configured - adding default JMX reporter.
   [junit4]   2> 199068 INFO  (TEST-TestReplicationHandler.doTestStressReplication-seed#[33FD316434356EBB]) [    ] o.a.s.h.c.HttpShardHandlerFactory Host whitelist initialized: WhitelistHostChecker [whitelistHosts=null, whitelistHostCheckingEnabled=true]
   [junit4]   2> 199070 WARN  (TEST-TestReplicationHandler.doTestStressReplication-seed#[33FD316434356EBB]) [    ] o.e.j.u.s.S.config No Client EndPointIdentificationAlgorithm configured for SslContextFactory@7bc4dde3[provider=null,keyStore=null,trustStore=null]
   [junit4]   2> 199073 WARN  (TEST-TestReplicationHandler.doTestStressReplication-seed#[33FD316434356EBB]) [    ] o.e.j.u.s.S.config No Client EndPointIdentificationAlgorithm configured for SslContextFactory@37206347[provider=null,keyStore=null,trustStore=null]
   [junit4]   2> 199110 INFO  (TEST-TestReplicationHandler.doTestStressReplication-seed#[33FD316434356EBB]) [    ] o.a.s.c.TransientSolrCoreCacheDefault Allocating transient cache for 4 transient cores
   [junit4]   2> 199110 INFO  (TEST-TestReplicationHandler.doTestStressReplication-seed#[33FD316434356EBB]) [    ] o.a.s.h.a.MetricsHistoryHandler No .system collection, keeping metrics history in memory.
   [junit4]   2> 199132 INFO  (TEST-TestReplicationHandler.doTestStressReplication-seed#[33FD316434356EBB]) [    ] o.a.s.m.r.SolrJmxReporter JMX monitoring for 'solr.node' (registry 'solr.node') enabled at server: com.sun.jmx.mbeanserver.JmxMBeanServer@42a7f1c5
   [junit4]   2> 199140 INFO  (TEST-TestReplicationHandler.doTestStressReplication-seed#[33FD316434356EBB]) [    ] o.a.s.m.r.SolrJmxReporter JMX monitoring for 'solr.jvm' (registry 'solr.jvm') enabled at server: com.sun.jmx.mbeanserver.JmxMBeanServer@42a7f1c5
   [junit4]   2> 199140 INFO  (TEST-TestReplicationHandler.doTestStressReplication-seed#[33FD316434356EBB]) [    ] o.a.s.m.r.SolrJmxReporter JMX monitoring for 'solr.jetty' (registry 'solr.jetty') enabled at server: com.sun.jmx.mbeanserver.JmxMBeanServer@42a7f1c5
   [junit4]   2> 199142 INFO  (TEST-TestReplicationHandler.doTestStressReplication-seed#[33FD316434356EBB]) [    ] o.a.s.c.CorePropertiesLocator Found 1 core definitions underneath /Users/jenkins/workspace/Lucene-Solr-8.x-MacOSX/solr/build/solr-core/test/J1/temp/solr.handler.TestReplicationHandler_33FD316434356EBB-001/solr-instance-002/.
   [junit4]   2> 199142 INFO  (TEST-TestReplicationHandler.doTestStressReplication-seed#[33FD316434356EBB]) [    ] o.a.s.c.CorePropertiesLocator Cores are: [collection1]
   [junit4]   2> 199186 INFO  (coreLoadExecutor-749-thread-1) [    x:collection1] o.a.s.c.SolrConfig Using Lucene MatchVersion: 8.0.0
   [junit4]   2> 199191 INFO  (coreLoadExecutor-749-thread-1) [    x:collection1] o.a.s.s.IndexSchema [collection1] Schema name=test
   [junit4]   2> 199195 INFO  (coreLoadExecutor-749-thread-1) [    x:collection1] o.a.s.s.IndexSchema Loaded schema test/1.2 with uniqueid field id
   [junit4]   2> 199195 INFO  (coreLoadExecutor-749-thread-1) [    x:collection1] o.a.s.c.CoreContainer Creating SolrCore 'collection1' using configuration from instancedir /Users/jenkins/workspace/Lucene-Solr-8.x-MacOSX/solr/build/solr-core/test/J1/temp/solr.handler.TestReplicationHandler_33FD316434356EBB-001/solr-instance-002/./collection1, trusted=true
   [junit4]   2> 199195 INFO  (coreLoadExecutor-749-thread-1) [    x:collection1] o.a.s.m.r.SolrJmxReporter JMX monitoring for 'solr.core.collection1' (registry 'solr.core.collection1') enabled at server: com.sun.jmx.mbeanserver.JmxMBeanServer@42a7f1c5
   [junit4]   2> 199195 INFO  (coreLoadExecutor-749-thread-1) [    x:collection1] o.a.s.c.SolrCore [[collection1] ] Opening new SolrCore at [/Users/jenkins/workspace/Lucene-Solr-8.x-MacOSX/solr/build/solr-core/test/J1/temp/solr.handler.TestReplicationHandler_33FD316434356EBB-001/solr-instance-002/collection1], dataDir=[/Users/jenkins/workspace/Lucene-Solr-8.x-MacOSX/solr/build/solr-core/test/J1/temp/solr.handler.TestReplicationHandler_33FD316434356EBB-001/solr-instance-002/./collection1/data/]
   [junit4]   2> 199197 INFO  (coreLoadExecutor-749-thread-1) [    x:collection1] o.a.s.u.RandomMergePolicy RandomMergePolicy wrapping class org.apache.lucene.index.TieredMergePolicy: [TieredMergePolicy: maxMergeAtOnce=17, maxMergeAtOnceExplicit=44, maxMergedSegmentMB=70.4990234375, floorSegmentMB=0.6357421875, forceMergeDeletesPctAllowed=27.008962051015658, segmentsPerTier=23.0, maxCFSSegmentSizeMB=8.796093022207999E12, noCFSRatio=0.6688885735463056, deletesPctAllowed=44.13332096369693
   [junit4]   2> 199261 INFO  (coreLoadExecutor-749-thread-1) [    x:collection1] o.a.s.u.CommitTracker Hard AutoCommit: disabled
   [junit4]   2> 199261 INFO  (coreLoadExecutor-749-thread-1) [    x:collection1] o.a.s.u.CommitTracker Soft AutoCommit: disabled
   [junit4]   2> 199261 INFO  (coreLoadExecutor-749-thread-1) [    x:collection1] o.a.s.u.RandomMergePolicy RandomMergePolicy wrapping class org.apache.lucene.index.AlcoholicMergePolicy: [AlcoholicMergePolicy: minMergeSize=0, mergeFactor=10, maxMergeSize=183660285, maxMergeSizeForForcedMerge=9223372036854775807, calibrateSizeByDeletes=true, maxMergeDocs=2147483647, maxCFSSegmentSizeMB=8.796093022207999E12, noCFSRatio=0.1]
   [junit4]   2> 199262 INFO  (coreLoadExecutor-749-thread-1) [    x:collection1] o.a.s.s.SolrIndexSearcher Opening [Searcher@5399b8df[collection1] main]
   [junit4]   2> 199262 INFO  (coreLoadExecutor-749-thread-1) [    x:collection1] o.a.s.r.ManagedResourceStorage File-based storage initialized to use dir: /Users/jenkins/workspace/Lucene-Solr-8.x-MacOSX/solr/build/solr-core/test/J1/temp/solr.handler.TestReplicationHandler_33FD316434356EBB-001/solr-instance-002/collection1/conf
   [junit4]   2> 199266 INFO  (coreLoadExecutor-749-thread-1) [    x:collection1] o.a.s.h.ReplicationHandler Poll scheduled at an interval of 1000ms
   [junit4]   2> 199266 INFO  (coreLoadExecutor-749-thread-1) [    x:collection1] o.a.s.h.ReplicationHandler Commits will be reserved for 10000ms.
   [junit4]   2> 199267 INFO  (searcherExecutor-750-thread-1-processing-x:collection1) [    x:collection1] o.a.s.c.SolrCore [collection1] Registered new searcher Searcher@5399b8df[collection1] main{ExitableDirectoryReader(UninvertingDirectoryReader())}
   [junit4]   2> 199269 INFO  (qtp1475646570-2279) [    x:collection1] o.a.s.c.S.Request [collection1]  webapp=/solr path=/replication params={qt=/replication&wt=javabin&version=2&command=indexversion} status=0 QTime=0
   [junit4]   2> 199269 INFO  (indexFetcher-754-thread-1) [    ] o.a.s.h.IndexFetcher Master's generation: 1
   [junit4]   2> 199269 INFO  (indexFetcher-754-thread-1) [    ] o.a.s.h.IndexFetcher Master's version: 0
   [junit4]   2> 199269 INFO  (indexFetcher-754-thread-1) [    ] o.a.s.h.IndexFetcher Slave's generation: 1
   [junit4]   2> 199269 INFO  (indexFetcher-754-thread-1) [    ] o.a.s.h.IndexFetcher Slave's version: 0
   [junit4]   2> 199269 INFO  (indexFetcher-754-thread-1) [    ] o.a.s.h.IndexFetcher New index in Master. Deleting mine...
   [junit4]   2> 199271 INFO  (indexFetcher-754-thread-1) [    ] o.a.s.s.SolrIndexSearcher Opening [Searcher@23ac1084[collection1] main]
   [junit4]   2> 199272 INFO  (searcherExecutor-750-thread-1) [    ] o.a.s.c.SolrCore [collection1] Registered new searcher Searcher@23ac1084[collection1] main{ExitableDirectoryReader(UninvertingDirectoryReader())}
   [junit4]   2> 199273 INFO  (TEST-TestReplicationHandler.doTestStressReplication-seed#[33FD316434356EBB]) [    ] o.a.s.c.CoreContainer Shutting down CoreContainer instance=1375699103
   [junit4]   2> 199273 INFO  (coreCloseExecutor-755-thread-1) [    x:collection1] o.a.s.c.SolrCore [collection1]  CLOSING SolrCore org.apache.solr.core.SolrCore@682a36f1
   [junit4]   2> 199273 INFO  (coreCloseExecutor-755-thread-1) [    x:collection1] o.a.s.m.SolrMetricManager Closing metric reporters for registry=solr.core.collection1, tag=682a36f1
   [junit4]   2> 199273 INFO  (coreCloseExecutor-755-thread-1) [    x:collection1] o.a.s.m.r.SolrJmxReporter Closing reporter [org.apache.solr.metrics.reporters.SolrJmxReporter@21d0c290: rootName = null, domain = solr.core.collection1, service url = null, agent id = null] for registry solr.core.collection1 / com.codahale.metrics.MetricRegistry@68aaa523
   [junit4]   2> 199286 INFO  (TEST-TestReplicationHandler.doTestStressReplication-seed#[33FD316434356EBB]) [    ] o.a.s.m.SolrMetricManager Closing metric reporters for registry=solr.node, tag=null
   [junit4]   2> 199286 INFO  (TEST-TestReplicationHandler.doTestStressReplication-seed#[33FD316434356EBB]) [    ] o.a.s.m.r.SolrJmxReporter Closing reporter [org.apache.solr.metrics.reporters.SolrJmxReporter@57d05b6c: rootName = null, domain = solr.node, service url = null, agent id = null] for registry solr.node / com.codahale.metrics.MetricRegistry@1af7290e
   [junit4]   2> 199292 INFO  (TEST-TestReplicationHandler.doTestStressReplication-seed#[33FD316434356EBB]) [    ] o.a.s.m.SolrMetricManager Closing metric reporters for registry=solr.jvm, tag=null
   [junit4]   2> 199292 INFO  (TEST-TestReplicationHandler.doTestStressReplication-seed#[33FD316434356EBB]) [    ] o.a.s.m.r.SolrJmxReporter Closing reporter [org.apache.solr.metrics.reporters.SolrJmxReporter@202aa3e9: rootName = null, domain = solr.jvm, service url = null, agent id = null] for registry solr.jvm / com.codahale.metrics.MetricRegistry@7fbe85e3
   [junit4]   2> 199294 INFO  (TEST-TestReplicationHandler.doTestStressReplication-seed#[33FD316434356EBB]) [    ] o.a.s.m.SolrMetricManager Closing metric reporters for registry=solr.jetty, tag=null
   [junit4]   2> 199295 INFO  (TEST-TestReplicationHandler.doTestStressReplication-seed#[33FD316434356EBB]) [    ] o.a.s.m.r.SolrJmxReporter Closing reporter [org.apache.solr.metrics.reporters.SolrJmxReporter@7a5509b9: rootName = null, domain = solr.jetty, service url = null, agent id = null] for registry solr.jetty / com.codahale.metrics.MetricRegistry@70fc1c98
   [junit4]   1> Done close org.apache.solr.common.util.ExecutorUtil$MDCAwareThreadPoolExecutor@3603f90a[Terminated, pool size = 0, active threads = 0, queued tasks = 0, completed tasks = 1]
   [junit4]   1> Done close org.apache.solr.common.util.ExecutorUtil$MDCAwareThreadPoolExecutor@35a45d38[Terminated, pool size = 0, active threads = 0, queued tasks = 0, completed tasks = 1]
   [junit4]   2> 199298 INFO  (TEST-TestReplicationHandler.doTestStressReplication-seed#[33FD316434356EBB]) [    ] o.e.j.s.AbstractConnector Stopped ServerConnector@3bd27105{HTTP/1.1,[http/1.1, h2c]}{127.0.0.1:0}
   [junit4]   2> 199298 INFO  (TEST-TestReplicationHandler.doTestStressReplication-seed#[33FD316434356EBB]) [    ] o.e.j.s.h.ContextHandler Stopped o.e.j.s.ServletContextHandler@3b5c48cd{/solr,null,UNAVAILABLE}
   [junit4]   2> 199298 INFO  (TEST-TestReplicationHandler.doTestStressReplication-seed#[33FD316434356EBB]) [    ] o.e.j.s.session node0 Stopped scavenging
   [junit4]   2> 199306 WARN  (TEST-TestReplicationHandler.doTestStressReplication-seed#[33FD316434356EBB]) [    ] o.e.j.s.AbstractConnector Ignoring deprecated socket close linger time
   [junit4]   2> 199307 INFO  (TEST-TestReplicationHandler.doTestStressReplication-seed#[33FD316434356EBB]) [    ] o.a.s.c.s.e.JettySolrRunner Start Jetty (original configured port=0)
   [junit4]   2> 199307 INFO  (TEST-TestReplicationHandler.doTestStressReplication-seed#[33FD316434356EBB]) [    ] o.a.s.c.s.e.JettySolrRunner Trying to start Jetty on port 0 try number 1 ...
   [junit4]   2> 199307 INFO  (TEST-TestReplicationHandler.doTestStressReplication-seed#[33FD316434356EBB]) [    ] o.e.j.s.Server jetty-9.4.14.v20181114; built: 2018-11-14T21:20:31.478Z; git: c4550056e785fb5665914545889f21dc136ad9e6; jvm 1.8.0_172-b11
   [junit4]   2> 199309 INFO  (TEST-TestReplicationHandler.doTestStressReplication-seed#[33FD316434356EBB]) [    ] o.e.j.s.session DefaultSessionIdManager workerName=node0
   [junit4]   2> 199309 INFO  (TEST-TestReplicationHandler.doTestStressReplication-seed#[33FD316434356EBB]) [    ] o.e.j.s.session No SessionScavenger set, using defaults
   [junit4]   2> 199309 INFO  (TEST-TestReplicationHandler.doTestStressReplication-seed#[33FD316434356EBB]) [    ] o.e.j.s.session node0 Scavenging every 660000ms
   [junit4]   2> 199309 INFO  (TEST-TestReplicationHandler.doTestStressReplication-seed#[33FD316434356EBB]) [    ] o.e.j.s.h.ContextHandler Started o.e.j.s.ServletContextHandler@5c504cfa{/solr,null,AVAILABLE}
   [junit4]   2> 199311 INFO  (TEST-TestReplicationHandler.doTestStressReplication-seed#[33FD316434356EBB]) [    ] o.e.j.s.AbstractConnector Started ServerConnector@30a2c1bc{HTTP/1.1,[http/1.1, h2c]}{127.0.0.1:64292}
   [junit4]   2> 199311 INFO  (TEST-TestReplicationHandler.doTestStressReplication-seed#[33FD316434356EBB]) [    ] o.e.j.s.Server Started @199450ms
   [junit4]   2> 199311 INFO  (TEST-TestReplicationHandler.doTestStressReplication-seed#[33FD316434356EBB]) [    ] o.a.s.c.s.e.JettySolrRunner Jetty properties: {solr.data.dir=/Users/jenkins/workspace/Lucene-Solr-8.x-MacOSX/solr/build/solr-core/test/J1/temp/solr.handler.TestReplicationHandler_33FD316434356EBB-001/solr-instance-002/collection1/data, hostContext=/solr, hostPort=64292}
   [junit4]   2> 199311 ERROR (TEST-TestReplicationHandler.doTestStressReplication-seed#[33FD316434356EBB]) [    ] o.a.s.u.StartupLoggingUtils Missing Java Option solr.log.dir. Logging may be missing or incomplete.
   [junit4]   2> 199311 INFO  (TEST-TestReplicationHandler.doTestStressReplication-seed#[33FD316434356EBB]) [    ] o.a.s.s.SolrDispatchFilter Using logger factory org.apache.logging.slf4j.Log4jLoggerFactory
   [junit4]   2> 199311 INFO  (TEST-TestReplicationHandler.doTestStressReplication-seed#[33FD316434356EBB]) [    ] o.a.s.s.SolrDispatchFilter  ___      _       Welcome to Apache Solr? version 8.0.0
   [junit4]   2> 199311 INFO  (TEST-TestReplicationHandler.doTestStressReplication-seed#[33FD316434356EBB]) [    ] o.a.s.s.SolrDispatchFilter / __| ___| |_ _   Starting in standalone mode on port null
   [junit4]   2> 199311 INFO  (TEST-TestReplicationHandler.doTestStressReplication-seed#[33FD316434356EBB]) [    ] o.a.s.s.SolrDispatchFilter \__ \/ _ \ | '_|  Install dir: null
   [junit4]   2> 199311 INFO  (TEST-TestReplicationHandler.doTestStressReplication-seed#[33FD316434356EBB]) [    ] o.a.s.s.SolrDispatchFilter |___/\___/_|_|    Start time: 2019-01-20T14:04:17.748Z
   [junit4]   2> 199312 INFO  (TEST-TestReplicationHandler.doTestStressReplication-seed#[33FD316434356EBB]) [    ] o.a.s.c.SolrXmlConfig Loading container configuration from /Users/jenkins/workspace/Lucene-Solr-8.x-MacOSX/solr/build/solr-core/test/J1/temp/solr.handler.TestReplicationHandler_33FD316434356EBB-001/solr-instance-002/solr.xml
   [junit4]   2> 199363 INFO  (TEST-TestReplicationHandler.doTestStressReplication-seed#[33FD316434356EBB]) [    ] o.a.s.c.SolrXmlConfig Configuration parameter autoReplicaFailoverWorkLoopDelay is ignored
   [junit4]   2> 199363 INFO  (TEST-TestReplicationHandler.doTestStressReplication-seed#[33FD316434356EBB]) [    ] o.a.s.c.SolrXmlConfig Configuration parameter autoReplicaFailoverBadNodeExpiration is ignored
   [junit4]   2> 199364 INFO  (TEST-TestReplicationHandler.doTestStressReplication-seed#[33FD316434356EBB]) [    ] o.a.s.c.SolrXmlConfig MBean server found: com.sun.jmx.mbeanserver.JmxMBeanServer@42a7f1c5, but no JMX reporters were configured - adding default JMX reporter.
   [junit4]   2> 199720 INFO  (TEST-TestReplicationHandler.doTestStressReplication-seed#[33FD316434356EBB]) [    ] o.a.s.h.c.HttpShardHandlerFactory Host whitelist initialized: WhitelistHostChecker [whitelistHosts=null, whitelistHostCheckingEnabled=true]
   [junit4]   2> 199721 WARN  (TEST-TestReplicationHandler.doTestStressReplication-seed#[33FD316434356EBB]) [    ] o.e.j.u.s.S.config No Client EndPointIdentificationAlgorithm configured for SslContextFactory@14c15e12[provider=null,keyStore=null,trustStore=null]
   [junit4]   2> 199726 WARN  (TEST-TestReplicationHandler.doTestStressReplication-seed#[33FD316434356EBB]) [    ] o.e.j.u.s.S.config No Client EndPointIdentificationAlgorithm configured for SslContextFactory@64689370[provider=null,keyStore=null,trustStore=null]
   [junit4]   2> 199780 INFO  (TEST-TestReplicationHandler.doTestStressReplication-seed#[33FD316434356EBB]) [    ] o.a.s.c.TransientSolrCoreCacheDefault Allocating transient cache for 4 transient cores
   [junit4]   2> 199780 INFO  (TEST-TestReplicationHandler.doTestStressReplication-seed#[33FD316434356EBB]) [    ] o.a.s.h.a.MetricsHistoryHandler No .system collection, keeping metrics history in memory.
   [junit4]   2> 199812 INFO  (TEST-TestReplicationHandler.doTestStressReplication-seed#[33FD316434356EBB]) [    ] o.a.s.m.r.SolrJmxReporter JMX monitoring for 'solr.node' (registry 'solr.node') enabled at server: com.sun.jmx.mbeanserver.JmxMBeanServer@42a7f1c5
   [junit4]   2> 199819 INFO  (TEST-TestReplicationHandler.doTestStressReplication-seed#[33FD316434356EBB]) [    ] o.a.s.m.r.SolrJmxReporter JMX monitoring for 'solr.jvm' (registry 'solr.jvm') enabled at server: com.sun.jmx.mbeanserver.JmxMBeanServer@42a7f1c5
   [junit4]   2> 199819 INFO  (TEST-TestReplicationHandler.doTestStressReplication-seed#[33FD316434356EBB]) [    ] o.a.s.m.r.SolrJmxReporter JMX monitoring for 'solr.jetty' (registry 'solr.jetty') enabled at server: com.sun.jmx.mbeanserver.JmxMBeanServer@42a7f1c5
   [junit4]   2> 199823 INFO  (TEST-TestReplicationHandler.doTestStressReplication-seed#[33FD316434356EBB]) [    ] o.a.s.c.CorePropertiesLocator Found 1 core definitions underneath /Users/jenkins/workspace/Lucene-Solr-8.x-MacOSX/solr/build/solr-core/test/J1/temp/solr.handler.TestReplicationHandler_33FD316434356EBB-001/solr-instance-002/.
   [junit4]   2> 199823 INFO  (TEST-TestReplicationHandler.doTestStressReplication-seed#[33FD316434356EBB]) [    ] o.a.s.c.CorePropertiesLocator Cores are: [collection1]
   [junit4]   2> 199851 INFO  (coreLoadExecutor-765-thread-1) [    x:collection1] o.a.s.c.SolrConfig Using Lucene MatchVersion: 8.0.0
   [junit4]   2> 199857 INFO  (coreLoadExecutor-765-thread-1) [    x:collection1] o.a.s.s.IndexSchema [collection1] Schema name=test
   [junit4]   2> 199860 INFO  (coreLoadExecutor-765-thread-1) [    x:collection1] o.a.s.s.IndexSchema Loaded schema test/1.2 with uniqueid field id
   [junit4]   2> 199860 INFO  (coreLoadExecutor-765-thread-1) [    x:collection1] o.a.s.c.CoreContainer Creating SolrCore 'collection1' using configuration from instancedir /Users/jenkins/workspace/Lucene-Solr-8.x-MacOSX/solr/build/solr-core/test/J1/temp/solr.handler.TestReplicationHandler_33FD316434356EBB-001/solr-instance-002/./collection1, trusted=true
   [junit4]   2> 199860 INFO  (coreLoadExecutor-765-thread-1) [    x:collection1] o.a.s.m.r.SolrJmxReporter JMX monitoring for 'solr.core.collection1' (registry 'solr.core.collection1') enabled at server: com.sun.jmx.mbeanserver.JmxMBeanServer@42a7f1c5
   [junit4]   2> 199916 INFO  (coreLoadExecutor-765-thread-1) [    x:collection1] o.a.s.c.SolrCore [[collection1] ] Opening new SolrCore at [/Users/jenkins/workspace/Lucene-Solr-8.x-MacOSX/solr/build/solr-core/test/J1/temp/solr.handler.TestReplicationHandler_33FD316434356EBB-001/solr-instance-002/collection1], dataDir=[/Users/jenkins/workspace/Lucene-Solr-8.x-MacOSX/solr/build/solr-core/test/J1/temp/solr.handler.TestReplicationHandler_33FD316434356EBB-001/solr-instance-002/./collection1/data/]
   [junit4]   2> 199923 INFO  (coreLoadExecutor-765-thread-1) [    x:collection1] o.a.s.u.RandomMergePolicy RandomMergePolicy wrapping class org.apache.lucene.index.LogDocMergePolicy: [LogDocMergePolicy: minMergeSize=1000, mergeFactor=39, maxMergeSize=9223372036854775807, maxMergeSizeForForcedMerge=9223372036854775807, calibrateSizeByDeletes=true, maxMergeDocs=2147483647, maxCFSSegmentSizeMB=8.796093022207999E12, noCFSRatio=0.22316888193068485]
   [junit4]   2> 200036 INFO  (coreLoadExecutor-765-thread-1) [    x:collection1] o.a.s.u.CommitTracker Hard AutoCommit: disabled
   [junit4]   2> 200036 INFO  (coreLoadExecutor-765-thread-1) [    x:collection1] o.a.s.u.CommitTracker Soft AutoCommit: disabled
   [junit4]   2> 200037 INFO  (coreLoadExecutor-765-thread-1) [    x:collection1] o.a.s.u.RandomMergePolicy RandomMergePolicy wrapping class org.apache.lucene.index.LogDocMergePolicy: [LogDocMergePolicy: minMergeSize=1000, mergeFactor=44, maxMergeSize=9223372036854775807, maxMergeSizeForForcedMerge=9223372036854775807, calibrateSizeByDeletes=false, maxMergeDocs=2147483647, maxCFSSegmentSizeMB=8.796093022207999E12, noCFSRatio=0.0]
   [junit4]   2> 200038 INFO  (coreLoadExecutor-765-thread-1) [    x:collection1] o.a.s.s.SolrIndexSearcher Opening [Searcher@4cbc9798[collection1] main]
   [junit4]   2> 200039 INFO  (coreLoadExecutor-765-thread-1) [    x:collection1] o.a.s.r.ManagedResourceStorage File-based storage initialized to use dir: /Users/jenkins/workspace/Lucene-Solr-8.x-MacOSX/solr/build/solr-core/test/J1/temp/solr.handler.TestReplicationHandler_33FD316434356EBB-001/solr-instance-002/collection1/conf
   [junit4]   2> 200039 INFO  (coreLoadExecutor-765-thread-1) [    x:collection1] o.a.s.h.ReplicationHandler Commits will be reserved for 10000ms.
   [junit4]   2> 200041 INFO  (searcherExecutor-766-thread-1-processing-x:collection1) [    x:collection1] o.a.s.c.SolrCore [collection1] Registered new searcher Searcher@4cbc9798[collection1] main{ExitableDirectoryReader(UninvertingDirectoryReader())}
   [junit4]   2> 200045 INFO  (TEST-TestReplicationHandler.doTestStressReplication-seed#[33FD316434356EBB]) [    ] o.a.s.c.CoreContainer Shutting down CoreContainer instance=1780791096
   [junit4]   2> 200047 INFO  (coreCloseExecutor-770-thread-1) [    x:collection1] o.a.s.c.SolrCore [collection1]  CLOSING SolrCore org.apache.solr.core.SolrCore@49efdb21
   [junit4]   2> 200047 INFO  (coreCloseExecutor-770-thread-1) [    x:collection1] o.a.s.m.SolrMetricManager Closing metric reporters for registry=solr.core.collection1, tag=49efdb21
   [junit4]   2> 200047 INFO  (coreCloseExecutor-770-thread-1) [    x:collection1] o.a.s.m.r.SolrJmxReporter Closing reporter [org.apache.solr.metrics.reporters.SolrJmxReporter@e910839: rootName = null, domain = solr.core.collection1, service url = null, agent id = null] for registry solr.core.collection1 / com.codahale.metrics.MetricRegistry@17040d01
   [junit4]   2> 200060 INFO  (TEST-TestReplicationHandler.doTestStressReplication-seed#[33FD316434356EBB]) [    ] o.a.s.m.SolrMetricManager Closing metric reporters for registry=solr.node, tag=null
   [junit4]   2> 200061 INFO  (TEST-TestReplicationHandler.doTestStressReplication-seed#[33FD316434356EBB]) [    ] o.a.s.m.r.SolrJmxReporter Closing reporter [org.apache.solr.metrics.reporters.SolrJmxReporter@405e569d: rootName = null, domain = solr.node, service url = null, agent id = null] for registry solr.node / com.codahale.metrics.MetricRegistry@1f54907e
   [junit4]   2> 200072 INFO  (TEST-TestReplicationHandler.doTestStressReplication-seed#[33FD316434356EBB]) [    ] o.a.s.m.SolrMetricManager Closing metric reporters for registry=solr.jvm, tag=null
   [junit4]   2> 200072 INFO  (TEST-TestReplicationHandler.doTestStressReplication-seed#[33FD316434356EBB]) [    ] o.a.s.m.r.SolrJmxReporter Closing reporter [org.apache.solr.metrics.reporters.SolrJmxReporter@2bd5f4b7: rootName = null, domain = solr.jvm, service url = null, agent id = null] for registry solr.jvm / com.codahale.metrics.MetricRegistry@7fbe85e3
   [junit4]   2> 200074 INFO  (TEST-TestReplicationHandler.doTestStressReplication-seed#[33FD316434356EBB]) [    ] o.a.s.m.SolrMetricManager Closing metric reporters for registry=solr.jetty, tag=null
   [junit4]   2> 200075 INFO  (TEST-TestReplicationHandler.doTestStressReplication-seed#[33FD316434356EBB]) [    ] o.a.s.m.r.SolrJmxReporter Closing reporter [org.apache.solr.metrics.reporters.SolrJmxReporter@2d26d4bd: rootName = null, domain = solr.jetty, service url = null, agent id = null] for registry solr.jetty / com.codahale.metrics.MetricRegistry@70fc1c98
   [junit4]   1> Done close org.apache.solr.common.util.ExecutorUtil$MDCAwareThreadPoolExecutor@68e63ea7[Terminated, pool size = 0, active threads = 0, queued tasks = 0, completed tasks = 1]
   [junit4]   1> Done close org.apache.solr.common.util.ExecutorUtil$MDCAwareThreadPoolExecutor@47ef00a[Terminated, pool size = 0, active threads = 0, queued tasks = 0, completed tasks = 1]
   [junit4]   2> 200077 INFO  (TEST-TestReplicationHandler.doTestStressReplication-seed#[33FD316434356EBB]) [    ] o.e.j.s.AbstractConnector Stopped ServerConnector@1cf8bd9e{HTTP/1.1,[http/1.1, h2c]}{127.0.0.1:0}
   [junit4]   2> 200077 INFO  (TEST-TestReplicationHandler.doTestStressReplication-seed#[33FD316434356EBB]) [    ] o.e.j.s.h.ContextHandler Stopped o.e.j.s.ServletContextHandler@31ca79e{/solr,null,UNAVAILABLE}
   [junit4]   2> 200077 INFO  (TEST-TestReplicationHandler.doTestStressReplication-seed#[33FD316434356EBB]) [    ] o.e.j.s.session node0 Stopped scavenging
   [junit4]   2> 200079 WARN  (TEST-TestReplicationHandler.doTestStressReplication-seed#[33FD316434356EBB]) [    ] o.e.j.s.AbstractConnector Ignoring deprecated socket close linger time
   [junit4]   2> 200080 INFO  (TEST-TestReplicationHandler.doTestStressReplication-seed#[33FD316434356EBB]) [    ] o.a.s.c.s.e.JettySolrRunner Start Jetty (original configured port=0)
   [junit4]   2> 200080 INFO  (TEST-TestReplicationHandler.doTestStressReplication-seed#[33FD316434356EBB]) [    ] o.a.s.c.s.e.JettySolrRunner Trying to start Jetty on port 0 try number 1 ...
   [junit4]   2> 200080 INFO  (TEST-TestReplicationHandler.doTestStressReplication-seed#[33FD316434356EBB]) [    ] o.e.j.s.Server jetty-9.4.14.v20181114; built: 2018-11-14T21:20:31.478Z; git: c4550056e785fb5665914545889f21dc136ad9e6; jvm 1.8.0_172-b11
   [junit4]   2> 200082 INFO  (TEST-TestReplicationHandler.doTestStressReplication-seed#[33FD316434356EBB]) [    ] o.e.j.s.session DefaultSessionIdManager workerName=node0
   [junit4]   2> 200082 INFO  (TEST-TestReplicationHandler.doTestStressReplication-seed#[33FD316434356EBB]) [    ] o.e.j.s.session No SessionScavenger set, using defaults
   [junit4]   2> 200082 INFO  (TEST-TestReplicationHandler.doTestStressReplication-seed#[33FD316434356EBB]) [    ] o.e.j.s.session node0 Scavenging every 600000ms
   [junit4]   2> 200082 INFO  (TEST-TestReplicationHandler.doTestStressReplication-seed#[33FD316434356EBB]) [    ] o.e.j.s.h.ContextHandler Started o.e.j.s.ServletContextHandler@431d9b73{/solr,null,AVAILABLE}
   [junit4]   2> 200086 INFO  (TEST-TestReplicationHandler.doTestStressReplication-seed#[33FD316434356EBB]) [    ] o.e.j.s.AbstractConnector Started ServerConnector@4367c6b3{HTTP/1.1,[http/1.1, h2c]}{127.0.0.1:64305}
   [junit4]   2> 200086 INFO  (TEST-TestReplicationHandler.doTestStressReplication-seed#[33FD316434356EBB]) [    ] o.e.j.s.Server Started @200225ms
   [junit4]   2> 200086 INFO  (TEST-TestReplicationHandler.doTestStressReplication-seed#[33FD316434356EBB]) [    ] o.a.s.c.s.e.JettySolrRunner Jetty properties: {solr.data.dir=/Users/jenkins/workspace/Lucene-Solr-8.x-MacOSX/solr/build/solr-core/test/J1/temp/solr.handler.TestReplicationHandler_33FD316434356EBB-001/solr-instance-001/collection1/data, hostContext=/solr, hostPort=64305}
   [junit4]   2> 200086 ERROR (TEST-TestReplicationHandler.doTestStressReplication-seed#[33FD316434356EBB]) [    ] o.a.s.u.StartupLoggingUtils Missing Java Option solr.log.dir. Logging may be missing or incomplete.
   [junit4]   2> 200086 INFO  (TEST-TestReplicationHandler.doTestStressReplication-seed#[33FD316434356EBB]) [    ] o.a.s.s.SolrDispatchFilter Using logger factory org.apache.logging.slf4j.Log4jLoggerFactory
   [junit4]   2> 200086 INFO  (TEST-TestReplicationHandler.doTestStressReplication-seed#[33FD316434356EBB]) [    ] o.a.s.s.SolrDispatchFilter  ___      _       Welcome to Apache Solr? version 8.0.0
   [junit4]   2> 200087 INFO  (TEST-TestReplicationHandler.doTestStressReplication-seed#[33FD316434356EBB]) [    ] o.a.s.s.SolrDispatchFilter / __| ___| |_ _   Starting in standalone mode on port null
   [junit4]   2> 200087 INFO  (TEST-TestReplicationHandler.doTestStressReplication-seed#[33FD316434356EBB]) [    ] o.a.s.s.SolrDispatchFilter \__ \/ _ \ | '_|  Install dir: null
   [junit4]   2> 200087 INFO  (TEST-TestReplicationHandler.doTestStressReplication-seed#[33FD316434356EBB]) [    ] o.a.s.s.SolrDispatchFilter |___/\___/_|_|    Start time: 2019-01-20T14:04:18.524Z
   [junit4]   2> 200087 INFO  (TEST-TestReplicationHandler.doTestStressReplication-seed#[33FD316434356EBB]) [    ] o.a.s.c.SolrXmlConfig Loading container configuration from /Users/jenkins/workspace/Lucene-Solr-8.x-MacOSX/solr/build/solr-core/test/J1/temp/solr.handler.TestReplicationHandler_33FD316434356EBB-001/solr-instance-001/solr.xml
   [junit4]   2> 200095 INFO  (TEST-TestReplicationHandler.doTestStressReplication-seed#[33FD316434356EBB]) [    ] o.a.s.c.SolrXmlConfig Configuration parameter autoReplicaFailoverWorkLoopDelay is ignored
   [junit4]   2> 200095 INFO  (TEST-TestReplicationHandler.doTestStressReplication-seed#[33FD316434356EBB]) [    ] o.a.s.c.SolrXmlConfig Configuration parameter autoReplicaFailoverBadNodeExpiration is ignored
   [junit4]   2> 200095 INFO  (TEST-TestReplicationHandler.doTestStressReplication-seed#[33FD316434356EBB]) [    ] o.a.s.c.SolrXmlConfig MBean server found: com.sun.jmx.mbeanserver.JmxMBeanServer@42a7f1c5, but no JMX reporters were configured - adding default JMX reporter.
   [junit4]   2> 200172 INFO  (TEST-TestReplicationHandler.doTestStressReplication-seed#[33FD316434356EBB]) [    ] o.a.s.h.c.HttpShardHandlerFactory Host whitelist initialized: WhitelistHostChecker [whitelistHosts=null, whitelistHostCheckingEnabled=true]
   [junit4]   2> 200175 WARN  (TEST-TestReplicationHandler.doTestStressReplication-seed#[33FD316434356EBB]) [    ] o.e.j.u.s.S.config No Client EndPointIdentificationAlgorithm configured for SslContextFactory@1a544e72[provider=null,keyStore=null,trustStore=null]
   [junit4]   2> 200179 WARN  (TEST-TestReplicationHandler.doTestStressReplication-seed#[33FD316434356EBB]) [    ] o.e.j.u.s.S.config No Client EndPointIdentificationAlgorithm configured for SslContextFactory@13a5a587[provider=null,keyStore=null,trustStore=null]
   [junit4]   2> 200253 INFO  (TEST-TestReplicationHandler.doTestStressReplication-seed#[33FD316434356EBB]) [    ] o.a.s.c.TransientSolrCoreCacheDefault Allocating transient cache for 4 transient cores
   [junit4]   2> 200253 INFO  (TEST-TestReplicationHandler.doTestStressReplication-seed#[33FD316434356EBB]) [    ] o.a.s.h.a.MetricsHistoryHandler No .system collection, keeping metrics history in memory.
   [junit4]   2> 200281 INFO  (TEST-TestReplicationHandler.doTestStressReplication-seed#[33FD316434356EBB]) [    ] o.a.s.m.r.SolrJmxReporter JMX monitoring for 'solr.node' (registry 'solr.node') enabled at server: com.sun.jmx.mbeanserver.JmxMBeanServer@42a7f1c5
   [junit4]   2> 200294 INFO  (TEST-TestReplicationHandler.doTestStressReplication-seed#[33FD316434356EBB]) [    ] o.a.s.m.r.SolrJmxReporter JMX monitoring for 'solr.jvm' (registry 'solr.jvm') enabled at server: com.sun.jmx.mbeanserver.JmxMBeanServer@42a7f1c5
   [junit4]   2> 200295 INFO  (TEST-TestReplicationHandler.doTestStressReplication-seed#[33FD316434356EBB]) [    ] o.a.s.m.r.SolrJmxReporter JMX monitoring for 'solr.jetty' (registry 'solr.jetty') enabled at server: com.sun.jmx.mbeanserver.JmxMBeanServer@42a7f1c5
   [junit4]   2> 200298 INFO  (TEST-TestReplicationHandler.doTestStressReplication-seed#[33FD316434356EBB]) [    ] o.a.s.c.CorePropertiesLocator Found 1 core definitions underneath /Users/jenkins/workspace/Lucene-Solr-8.x-MacOSX/solr/build/solr-core/test/J1/temp/solr.handler.TestReplicationHandler_33FD316434356EBB-001/solr-instance-001/.
   [junit4]   2> 200298 INFO  (TEST-TestReplicationHandler.doTestStressReplication-seed#[33FD316434356EBB]) [    ] o.a.s.c.CorePropertiesLocator Cores are: [collection1]
   [junit4]   2> 200341 INFO  (coreLoadExecutor-780-thread-1) [    x:collection1] o.a.s.c.SolrConfig Using Lucene MatchVersion: 8.0.0
   [junit4]   2> 200349 INFO  (coreLoadExecutor-780-thread-1) [    x:collection1] o.a.s.s.IndexSchema [collection1] Schema name=test
   [junit4]   2> 200353 INFO  (coreLoadExecutor-780-thread-1) [    x:collection1] o.a.s.s.IndexSchema Loaded schema test/1.2 with uniqueid field id
   [junit4]   2> 200353 INFO  (coreLoadExecutor-780-thread-1) [    x:collection1] o.a.s.c.CoreContainer Creating SolrCore 'collection1' using configuration from instancedir /Users/jenkins/workspace/Lucene-Solr-8.x-MacOSX/solr/build/solr-core/test/J1/temp/solr.handler.TestReplicationHandler_33FD316434356EBB-001/solr-instance-001/./collection1, trusted=true
   [junit4]   2> 200354 INFO  (coreLoadExecutor-780-thread-1) [    x:collection1] o.a.s.m.r.SolrJmxReporter JMX monitoring for 'solr.core.collection1' (registry 'solr.core.collection1') enabled at server: com.sun.jmx.mbeanserver.JmxMBeanServer@42a7f1c5
   [junit4]   2> 200354 INFO  (coreLoadExecutor-780-thread-1) [    x:collection1] o.a.s.c.SolrCore [[collection1] ] Opening new SolrCore at [/Users/jenkins/workspace/Lucene-Solr-8.x-MacOSX/solr/build/solr-core/test/J1/temp/solr.handler.TestReplicationHandler_33FD316434356EBB-001/solr-instance-001/collection1], dataDir=[/Users/jenkins/workspace/Lucene-Solr-8.x-MacOSX/solr/build/solr-core/test/J1/temp/solr.handler.TestReplicationHandler_33FD316434356EBB-001/solr-instance-001/./collection1/data/]
   [junit4]   2> 200358 INFO  (coreLoadExecutor-780-thread-1) [    x:collection1] o.a.s.u.RandomMergePolicy RandomMergePolicy wrapping class org.apache.lucene.index.LogDocMergePolicy: [LogDocMergePolicy: minMergeSize=1000, mergeFactor=39, maxMergeSize=9223372036854775807, maxMergeSizeForForcedMerge=9223372036854775807, calibrateSizeByDeletes=true, maxMergeDocs=2147483647, maxCFSSegmentSizeMB=8.796093022207999E12, noCFSRatio=0.22316888193068485]
   [junit4]   2> 200437 INFO  (coreLoadExecutor-780-thread-1) [    x:collection1] o.a.s.u.CommitTracker Hard AutoCommit: disabled
   [junit4]   2> 200437 INFO  (coreLoadExecutor-780-thread-1) [    x:collection1] o.a.s.u.CommitTracker Soft AutoCommit: disabled
   [junit4]   2> 200438 INFO  (coreLoadExecutor-780-thread-1) [    x:collection1] o.a.s.u.RandomMergePolicy RandomMergePolicy wrapping class org.apache.lucene.index.LogDocMergePolicy: [LogDocMergePolicy: minMergeSize=1000, mergeFactor=44, maxMergeSize=9223372036854775807, maxMergeSizeForForcedMerge=9223372036854775807, calibrateSizeByDeletes=false, maxMergeDocs=2147483647, maxCFSSegmentSizeMB=8.796093022207999E12, noCFSRatio=0.0]
   [junit4]   2> 200440 INFO  (coreLoadExecutor-780-thread-1) [    x:collection1] o.a.s.s.SolrIndexSearcher Opening [Searcher@30c36f0f[collection1] main]
   [junit4]   2> 200440 INFO  (coreLoadExecutor-780-thread-1) [    x:collection1] o.a.s.r.ManagedResourceStorage File-based storage initialized to use dir: /Users/jenkins/workspace/Lucene-Solr-8.x-MacOSX/solr/build/solr-core/test/J1/temp/solr.handler.TestReplicationHandler_33FD316434356EBB-001/solr-instance-001/collection1/conf
   [junit4]   2> 200441 INFO  (coreLoadExecutor-780-thread-1) [    x:collection1] o.a.s.h.ReplicationHandler Replication enabled for following config files: schema.xml
   [junit4]   2> 200441 INFO  (coreLoadExecutor-780-thread-1) [    x:collection1] o.a.s.h.ReplicationHandler Commits will be reserved for 10000ms.
   [junit4]   2> 200442 INFO  (searcherExecutor-781-thread-1-processing-x:collection1) [    x:collection1] o.a.s.c.SolrCore [collection1] Registered new searcher Searcher@30c36f0f[collection1] main{ExitableDirectoryReader(UninvertingDirectoryReader())}
   [junit4]   2> 200447 INFO  (qtp726560204-2352) [    x:collection1] o.a.s.u.DirectUpdateHandler2 [collection1] REMOVING ALL DOCUMENTS FROM INDEX
   [junit4]   2> 200448 INFO  (qtp726560204-2352) [    x:collection1] o.a.s.u.p.LogUpdateProcessorFactory [collection1]  webapp=/solr path=/update params={wt=javabin&version=2}{deleteByQuery=*:*} 0 1
   [junit4]   2> 200450 INFO  (qtp1748095835-2327) [    x:collection1] o.a.s.u.DirectUpdateHandler2 [collection1] REMOVING ALL DOCUMENTS FROM INDEX
   [junit4]   2> 200452 INFO  (qtp1748095835-2327) [    x:collection1] o.a.s.u.p.LogUpdateProcessorFactory [collection1]  webapp=/solr path=/update params={wt=javabin&version=2}{deleteByQuery=*:*} 0 1
   [junit4]   2> 200453 INFO  (qtp1748095835-2328) [    x:collection1] o.a.s.u.DirectUpdateHandler2 start commit{,optimize=false,openSearcher=true,waitSearcher=true,expungeDeletes=false,softCommit=false,prepareCommit=false}
   [junit4]   2> 200453 INFO  (qtp1748095835-2328) [    x:collection1] o.a.s.u.SolrIndexWriter Calling setCommitData with IW:org.apache.solr.update.SolrIndexWriter@a3a0042 commitCommandVersion:0
   [junit4]   2> 200458 INFO  (qtp1748095835-2328) [    x:collection1] o.a.s.s.SolrIndexSearcher Opening [Searcher@c26b32[collection1] main]
   [junit4]   2> 200458 INFO  (qtp1748095835-2328) [    x:collection1] o.a.s.u.DirectUpdateHandler2 end_commit_flush
   [junit4]   2> 200459 INFO  (searcherExecutor-766-thread-1-processing-x:collection1) [    x:collection1] o.a.s.c.SolrCore [collection1] Registered new searcher Searcher@c26b32[collection1] main{ExitableDirectoryReader(UninvertingDirectoryReader())}
   [junit4]   2> 200459 INFO  (qtp1748095835-2328) [    x:collection1] o.a.s.u.p.LogUpdateProcessorFactory [collection1]  webapp=/solr path=/update params={waitSearcher=true&commit=true&softCommit=false&wt=javabin&version=2}{commit=} 0 6
   [junit4]   2> 200463 INFO  (qtp726560204-2353) [    x:collection1] o.a.s.u.p.LogUpdateProcessorFactory [collection1]  webapp=/solr path=/update params={wt=javabin&version=2}{add=[0]} 0 2
   [junit4]   2> 200465 INFO  (qtp726560204-2354) [    x:collection1] o.a.s.u.p.LogUpdateProcessorFactory [collection1]  webapp=/solr path=/update params={wt=javabin&version=2}{add=[1]} 0 0
   [junit4]   2> 200466 INFO  (qtp726560204-2355) [    x:collection1] o.a.s.u.p.LogUpdateProcessorFactory [collection1]  webapp=/solr path=/update params={wt=javabin&version=2}{add=[2]} 0 0
   [junit4]   2> 200467 INFO  (qtp726560204-2356) [    x:collection1] o.a.s.u.p.LogUpdateProcessorFactory [collection1]  webapp=/solr path=/update params={wt=javabin&version=2}{add=[3]} 0 0
   [junit4]   2> 200468 INFO  (qtp726560204-2351) [    x:collection1] o.a.s.u.p.LogUpdateProcessorFactory [collection1]  webapp=/solr path=/update params={wt=javabin&version=2}{add=[4]} 0 0
   [junit4]   2> 200470 INFO  (qtp726560204-2352) [    x:collection1] o.a.s.u.p.LogUpdateProcessorFactory [collection1]  webapp=/solr path=/update params={wt=javabin&version=2}{add=[5]} 0 0
   [junit4]   2> 200471 INFO  (qtp726560204-2353) [    x:collection1] o.a.s.u.p.LogUpdateProcessorFactory [collection1]  webapp=/solr path=/update params={wt=javabin&version=2}{add=[6]} 0 0
   [junit4]   2> 200472 INFO  (qtp726560204-2354) [    x:collection1] o.a.s.u.p.LogUpdateProcessorFactory [collection1]  webapp=/solr path=/update params={wt=javabin&version=2}{add=[7]} 0 0
   [junit4]   2> 200473 INFO  (qtp726560204-2355) [    x:collection1] o.a.s.u.p.LogUpdateProcessorFactory [collection1]  webapp=/solr path=/update params={wt=javabin&version=2}{add=[8]} 0 0
   [junit4]   2> 200474 INFO  (qtp726560204-2356) [    x:collection1] o.a.s.u.p.LogUpdateProcessorFactory [collection1]  webapp=/solr path=/update params={wt=javabin&version=2}{add=[9]} 0 0
   [junit4]   2> 200475 INFO  (qtp726560204-2351) [    x:collection1] o.a.s.u.p.LogUpdateProcessorFactory [collection1]  webapp=/solr path=/update params={wt=javabin&version=2}{add=[10]} 0 0
   [junit4]   2> 200476 INFO  (qtp726560204-2352) [    x:collection1] o.a.s.u.p.LogUpdateProcessorFactory [collection1]  webapp=/solr path=/update params={wt=javabin&version=2}{add=[11]} 0 0
   [junit4]   2> 200477 INFO  (qtp726560204-2353) [    x:collection1] o.a.s.u.p.LogUpdateProcessorFactory [collection1]  webapp=/solr path=/update params={wt=javabin&version=2}{add=[12]} 0 0
   [junit4]   2> 200478 INFO  (qtp726560204-2354) [    x:collection1] o.a.s.u.p.LogUpdateProcessorFactory [collection1]  webapp=/solr path=/update params={wt=javabin&version=2}{add=[13]} 0 0
   [junit4]   2> 200479 INFO  (qtp726560204-2355) [    x:collection1] o.a.s.u.p.LogUpdateProcessorFactory [collection1]  webapp=/solr path=/update params={wt=javabin&version=2}{add=[14]} 0 0
   [junit4]   2> 200480 INFO  (qtp726560204-2356) [    x:collection1] o.a.s.u.p.LogUpdateProcessorFactory [collection1]  webapp=/solr path=/update params={wt=javabin&version=2}{add=[15]} 0 0
   [junit4]   2> 200481 INFO  (qtp726560204-2351) [    x:collection1] o.a.s.u.p.LogUpdateProcessorFactory [collection1]  webapp=/solr path=/update params={wt=javabin&version=2}{add=[16]} 0 0
   [junit4]   2> 200482 INFO  (qtp726560204-2352) [    x:collection1] o.a.s.u.p.LogUpdateProcessorFactory [collection1]  webapp=/solr path=/update params={wt=javabin&version=2}{add=[17]} 0 0
   [junit4]   2> 200483 INFO  (qtp726560204-2353) [    x:collection1] o.a.s.u.p.LogUpdateProcessorFactory [collection1]  webapp=/solr path=/update params={wt=javabin&version=2}{add=[18]} 0 0
   [junit4]   2> 200484 INFO  (qtp726560204-2354) [    x:collection1] o.a.s.u.p.LogUpdateProcessorFactory [collection1]  webapp=/solr path=/update params={wt=javabin&version=2}{add=[19]} 0 0
   [junit4]   2> 200485 INFO  (qtp726560204-2355) [    x:collection1] o.a.s.u.p.LogUpdateProcessorFactory [collection1]  webapp=/solr path=/update params={wt=javabin&version=2}{add=[20]} 0 0
   [junit4]   2> 200486 INFO  (qtp726560204-2356) [    x:collection1] o.a.s.u.p.LogUpdateProcessorFactory [collection1]  webapp=/solr path=/update params={wt=javabin&version=2}{add=[21]} 0 0
   [junit4]   2> 200487 INFO  (qtp726560204-2351) [    x:collection1] o.a.s.u.p.LogUpdateProcessorFactory [collection1]  webapp=/solr path=/update params={wt=javabin&version=2}{add=[22]} 0 0
   [junit4]   2> 200488 INFO  (qtp726560204-2352) [    x:collection1] o.a.s.u.p.LogUpdateProcessorFactory [collection1]  webapp=/solr path=/update params={wt=javabin&version=2}{add=[23]} 0 0
   [junit4]   2> 200489 INFO  (qtp726560204-2353) [    x:collection1] o.a.s.u.p.LogUpdateProcessorFactory [collection1]  webapp=/solr path=/update params={wt=javabin&version=2}{add=[24]} 0 0
   [junit4]   2> 200489 INFO  (qtp726560204-2354) [    x:collection1] o.a.s.u.p.LogUpdateProcessorFactory [collection1]  webapp=/solr path=/update params={wt=javabin&version=2}{add=[25]} 0 0
   [junit4]   2> 200490 INFO  (qtp726560204-2355) [    x:collection1] o.a.s.u.p.LogUpdateProcessorFactory [collection1]  webapp=/solr path=/update params={wt=javabin&version=2}{add=[26]} 0 0
   [junit4]   2> 200491 INFO  (qtp726560204-2356) [    x:collection1] o.a.s.u.p.LogUpdateProcessorFactory [collection1]  webapp=/solr path=/update params={wt=javabin&version=2}{add=[27]} 0 0
   [junit4]   2> 200491 INFO  (qtp726560204-2351) [    x:collection1] o.a.s.u.p.LogUpdateProcessorFactory [collection1]  webapp=/solr path=/update params={wt=javabin&version=2}{add=[28]} 0 0
   [junit4]   2> 200491 INFO  (qtp726560204-2352) [    x:collection1] o.a.s.u.p.LogUpdateProcessorFactory [collection1]  webapp=/solr path=/update params={wt=javabin&version=2}{add=[29]} 0 0
   [junit4]   2> 200496 INFO  (qtp726560204-2353) [    x:collection1] o.a.s.u.p.LogUpdateProcessorFactory [collection1]  webapp=/solr path=/update params={wt=javabin&version=2}{add=[30]} 0 4
   [junit4]   2> 200497 INFO  (qtp726560204-2354) [    x:collection1] o.a.s.u.p.LogUpdateProcessorFactory [collection1]  webapp=/solr path=/update params={wt=javabin&version=2}{add=[31]} 0 0
   [junit4]   2> 200497 INFO  (qtp726560204-2355) [    x:collection1] o.a.s.u.p.LogUpdateProcessorFactory [collection1]  webapp=/solr path=/update params={wt=javabin&version=2}{add=[32]} 0 0
   [junit4]   2> 200498 INFO  (qtp726560204-2356) [    x:collection1] o.a.s.u.p.LogUpdateProcessorFactory [collection1]  webapp=/solr path=/update params={wt=javabin&version=2}{add=[33]} 0 0
   [junit4]   2> 200499 INFO  (qtp726560204-2351) [    x:collection1] o.a.s.u.p.LogUpdateProcessorFactory [collection1]  webapp=/solr path=/update params={wt=javabin&version=2}{add=[34]} 0 0
   [junit4]   2> 200500 INFO  (qtp726560204-2352) [    x:collection1] o.a.s.u.p.LogUpdateProcessorFactory [collection1]  webapp=/solr path=/update params={wt=javabin&version=2}{add=[35]} 0 0
   [junit4]   2> 200504 INFO  (qtp726560204-2353) [    x:collection1] o.a.s.u.p.LogUpdateProcessorFactory [collection1]  webapp=/solr path=/update params={wt=javabin&version=2}{add=[36]} 0 0
   [junit4]   2> 200505 INFO  (qtp726560204-2354) [    x:collection1] o.a.s.u.p.LogUpdateProcessorFactory [collection1]  webapp=/solr path=/update params={wt=javabin&version=2}{add=[37]} 0 0
   [junit4]   2> 200506 INFO  (qtp726560204-2355) [    x:collection1] o.a.s.u.p.LogUpdateProcessorFactory [collection1]  webapp=/solr path=/update params={wt=javabin&version=2}{add=[38]} 0 0
   [junit4]   2> 200507 INFO  (qtp726560204-2356) [    x:collection1] o.a.s.u.p.LogUpdateProcessorFactory [collection1]  webapp=/solr path=/update params={wt=javabin&version=2}{add=[39]} 0 0
   [junit4]   2> 200507 INFO  (qtp726560204-2351) [    x:collection1] o.a.s.u.p.LogUpdateProcessorFactory [collection1]  webapp=/solr path=/update params={wt=javabin&version=2}{add=[40]} 0 0
   [junit4]   2> 200508 INFO  (qtp726560204-2352) [    x:collection1] o.a.s.u.p.LogUpdateProcessorFactory [collection1]  webapp=/solr path=/update params={wt=javabin&version=2}{add=[41]} 0 0
   [junit4]   2> 200509 INFO  (qtp726560204-2353) [    x:collection1] o.a.s.u.p.LogUpdateProcessorFactory [collection1]  webapp=/solr path=/update params={wt=javabin&version=2}{add=[42]} 0 0
   [junit4]   2> 200510 INFO  (qtp726560204-2354) [    x:collection1] o.a.s.u.p.LogUpdateProcessorFactory [collection1]  webapp=/solr path=/update params={wt=javabin&version=2}{add=[43]} 0 0
   [junit4]   2> 200511 INFO  (qtp726560204-2355) [    x:collection1] o.a.s.u.p.LogUpdateProcessorFactory [collection1]  webapp=/solr path=/update params={wt=javabin&version=2}{add=[44]} 0 0
   [junit4]   2> 200512 INFO  (qtp726560204-2356) [    x:collection1] o.a.s.u.p.LogUpdateProcessorFactory [collection1]  webapp=/solr path=/update params={wt=javabin&version=2}{add=[45]} 0 0
   [junit4]   2> 200512 INFO  (qtp726560204-2351) [    x:collection1] o.a.s.u.p.LogUpdateProcessorFactory [collection1]  webapp=/solr path=/update params={wt=javabin&version=2}{add=[46]} 0 0
   [junit4]   2> 200513 INFO  (qtp726560204-2352) [    x:collection1] o.a.s.u.p.LogUpdateProcessorFactory [collection1]  webapp=/solr path=/update params={wt=javabin&version=2}{add=[47]} 0 0
   [junit4]   2> 200514 INFO  (qtp726560204-2353) [    x:collection1] o.a.s.u.p.LogUpdateProcessorFactory [collection1]  webapp=/solr path=/update params={wt=javabin&version=2}{add=[48]} 0 0
   [junit4]   2> 200515 INFO  (qtp726560204-2354) [    x:collection1] o.a.s.u.p.LogUpdateProcessorFactory [collection1]  webapp=/solr path=/update params={wt=javabin&version=2}{add=[49]} 0 0
   [junit4]   2> 200516 INFO  (qtp726560204-2355) [    x:collection1] o.a.s.u.p.LogUpdateProcessorFactory [collection1]  webapp=/solr path=/update params={wt=javabin&version=2}{add=[50]} 0 0
   [junit4]   2> 200517 INFO  (qtp726560204-2356) [    x:collection1] o.a.s.u.p.LogUpdateProcessorFactory [collection1]  webapp=/solr path=/update params={wt=javabin&version=2}{add=[51]} 0 0
   [junit4]   2> 200517 INFO  (qtp726560204-2351) [    x:collection1] o.a.s.u.p.LogUpdateProcessorFactory [collection1]  webapp=/solr path=/update params={wt=javabin&version=2}{add=[52]} 0 0
   [junit4]   2> 200518 INFO  (qtp726560204-2352) [    x:collection1] o.a.s.u.p.LogUpdateProcessorFactory [collection1]  webapp=/solr path=/update params={wt=javabin&version=2}{add=[53]} 0 0
   [junit4]   2> 200519 INFO  (qtp726560204-2353) [    x:collection1] o.a.s.u.DirectUpdateHandler2 start commit{,optimize=false,openSearcher=true,waitSearcher=true,expungeDeletes=false,softCommit=false,prepareCommit=false}
   [junit4]   2> 200519 INFO  (qtp726560204-2353) [    x:collection1] o.a.s.u.SolrIndexWriter Calling setCommitData with IW:org.apache.solr.update.SolrIndexWriter@3ea1557f commitCommandVersion:0
   [junit4]   2> 200541 INFO  (qtp726560204-2353) [    x:collection1] o.a.s.s.SolrIndexSearcher Opening [Searcher@4d6c517b[collection1] main]
   [junit4]   2> 200541 INFO  (qtp726560204-2353) [    x:collection1] o.a.s.u.DirectUpdateHandler2 end_commit_flush
   [junit4]   2> 200543 INFO  (searcherExecutor-781-thread-1-processing-x:collection1) [    x:collection1] o.a.s.c.SolrCore [collection1] Registered new searcher Searcher@4d6c517b[collection1] main{ExitableDirectoryReader(UninvertingDirectoryReader(Uninverting(_0(8.0.0):C54:[diagnostics={os=Mac OS X, java.vendor=Oracle Corporation, java.version=1.8.0_172, java.vm.version=25.172-b11, lucene.version=8.0.0, os.arch=x86_64, java.runtime.version=1.8.0_172-b11, source=flush, os.version=10.11.6, timestamp=1547993058967}]:[attributes={Lucene50StoredFieldsFormat.mode=BEST_SPEED}])))}
   [junit4]   2> 200543 INFO  (qtp726560204-2353) [    x:collection1] o.a.s.u.p.LogUpdateProcessorFactory [collection1]  webapp=/solr path=/update params={waitSearcher=true&commit=true&softCommit=false&wt=javabin&version=2}{commit=} 0 24
   [junit4]   2> 200546 INFO  (qtp726560204-2354) [    x:collection1] o.a.s.c.S.Request [collection1]  webapp=/solr path=/select params={q=*:*&sort=id+desc&wt=javabin&version=2} hits=54 status=0 QTime=1
   [junit4]   2> 200548 INFO  (TEST-TestReplicationHandler.doTestStressReplication-seed#[33FD316434356EBB]) [    ] o.a.s.h.TestReplicationHandler Waited for 0ms and found 54 docs
   [junit4]   2> 200559 INFO  (qtp1748095835-2330) [    x:collection1] o.a.s.s.HttpSolrCall [admin] webapp=null path=/admin/cores params={core=collection1&action=status&wt=javabin&version=2} status=0 QTime=7
   [junit4]   2> 200587 WARN  (explicit-fetchindex-cmd) [    ] o.a.s.h.IndexFetcher 'masterUrl' must be specified without the /replication suffix
   [junit4]   2> 200589 INFO  (qtp726560204-2356) [    x:collection1] o.a.s.c.S.Request [collection1]  webapp=/solr path=/replication params={qt=/replication&wt=javabin&version=2&command=indexversion} status=0 QTime=0
   [junit4]   2> 200590 INFO  (explicit-fetchindex-cmd) [    ] o.a.s.h.IndexFetcher Master's generation: 2
   [junit4]   2> 200590 INFO  (explicit-fetchindex-cmd) [    ] o.a.s.h.IndexFetcher Master's version: 1547993058956
   [junit4]   2> 200590 INFO  (explicit-fetchindex-cmd) [    ] o.a.s.h.IndexFetcher Slave's generation: 2
   [junit4]   2> 200590 INFO  (explicit-fetchindex-cmd) [    ] o.a.s.h.IndexFetcher Slave's version: 1547993058890
   [junit4]   2> 200590 INFO  (explicit-fetchindex-cmd) [    ] o.a.s.h.IndexFetcher Starting replication process
   [junit4]   2> 200598 INFO  (qtp726560204-2351) [    x:collection1] o.a.s.c.S.Request [collection1]  webapp=/solr path=/replication params={generation=2&qt=/replication&tlogFiles=false&wt=javabin&version=2&command=filelist} status=0 QTime=7
   [junit4]   2> 200598 INFO  (explicit-fetchindex-cmd) [    ] o.a.s.h.IndexFetcher Number of files in latest index in master: 10
   [junit4]   2> 200600 INFO  (explicit-fetchindex-cmd) [    ] o.a.s.h.IndexFetcher Starting download (fullCopy=true) to MMapDirectory@/Users/jenkins/workspace/Lucene-Solr-8.x-MacOSX/solr/build/solr-core/test/J1/temp/solr.handler.TestReplicationHandler_33FD316434356EBB-001/solr-instance-002/collection1/data/index.20190121020419036 lockFactory=org.apache.lucene.store.SingleInstanceLockFactory@7a4eb740
   [junit4]   2> 200601 INFO  (qtp726560204-2352) [    x:collection1] o.a.s.c.S.Request [collection1]  webapp=/solr path=/replication params={generation=2&qt=/replication&file=_0.si&checksum=true&wt=filestream&command=filecontent} status=0 QTime=0
   [junit4]   2> 200604 INFO  (qtp726560204-2353) [    x:collection1] o.a.s.c.S.Request [collection1]  webapp=/solr path=/replication params={generation=2&qt=/replication&file=_0_LuceneVarGapDocFreqInterval_0.tiv&checksum=true&wt=filestream&command=filecontent} status=0 QTime=0
   [junit4]   2> 200607 INFO  (qtp726560204-2354) [    x:collection1] o.a.s.c.S.Request [collection1]  webapp=/solr path=/replication params={generation=2&qt=/replication&file=_0.nvd&checksum=true&wt=filestream&command=filecontent} status=0 QTime=0
   [junit4]   2> 200610 INFO  (qtp726560204-2355) [    x:collection1] o.a.s.c.S.Request [collection1]  webapp=/solr path=/replication params={generation=2&qt=/replication&file=_0_LuceneVarGapDocFreqInterval_0.tib&checksum=true&wt=filestream&command=filecontent} status=0 QTime=0
   [junit4]   2> 200613 INFO  (qtp726560204-2356) [    x:collection1] o.a.s.c.S.Request [collection1]  webapp=/solr path=/replication params={generation=2&qt=/replication&file=_0.fdx&checksum=true&wt=filestream&command=filecontent} status=0 QTime=0
   [junit4]   2> 200617 INFO  (qtp726560204-2351) [    x:collection1] o.a.s.c.S.Request [collection1]  webapp=/solr path=/replication params={generation=2&qt=/replication&file=_0.fdt&checksum=true&wt=filestream&command=filecontent} status=0 QTime=0
   [junit4]   2> 200620 INFO  (qtp726560204-2352) [    x:collection1] o.a.s.c.S.Request [collection1]  webapp=/solr path=/replication params={generation=2&qt=/replication&file=_0.fnm&checksum=true&wt=filestream&command=filecontent} status=0 QTime=0
   [junit4]   2> 200624 INFO  (qtp726560204-2353) [    x:collection1] o.a.s.c.S.Request [collection1]  webapp=/solr path=/replication params={generation=2&qt=/replication&file=_0.nvm&checksum=true&wt=filestream&command=filecontent} status=0 QTime=0
   [junit4]   2> 20

[...truncated too long message...]

ReplicationHandler.testShouldReportErrorWhenRequiredCommandArgMissing
   [junit4] OK      3.65s J0 | TestReplicationHandler.doTestIndexAndConfigAliasReplication
   [junit4] Completed [3/5] on J0 in 61.16s, 20 tests
   [junit4] 
   [junit4] Suite: org.apache.solr.handler.TestReplicationHandler
   [junit4] OK      2.76s J1 | TestReplicationHandler.doTestStressReplication
   [junit4] OK      3.47s J1 | TestReplicationHandler.doTestReplicateAfterCoreReload
   [junit4] OK      1.44s J1 | TestReplicationHandler.doTestReplicateAfterWrite2Slave
   [junit4] OK      0.65s J1 | TestReplicationHandler.testFileListShouldReportErrorsWhenTheyOccur
   [junit4] OK      12.8s J1 | TestReplicationHandler.doTestIndexFetchWithMasterUrl
   [junit4] OK      0.66s J1 | TestReplicationHandler.doTestIllegalFilePaths
   [junit4] OK      0.86s J1 | TestReplicationHandler.testShouldReportErrorWhenDeletingBackupButNameMissing
   [junit4] OK      2.54s J1 | TestReplicationHandler.doTestDetails
   [junit4] OK      3.95s J1 | TestReplicationHandler.doTestIndexAndConfigReplication
   [junit4] OK      12.1s J1 | TestReplicationHandler.testEmptyCommits
   [junit4] OK      0.80s J1 | TestReplicationHandler.testFetchIndexShouldReportErrorsWhenTheyOccur
   [junit4] OK      5.80s J1 | TestReplicationHandler.doTestStopPoll
   [junit4] OK      2.87s J1 | TestReplicationHandler.doTestReplicateAfterStartup
   [junit4] OK      1.83s J1 | TestReplicationHandler.doTestRepeater
   [junit4] OK      7.75s J1 | TestReplicationHandler.testRateLimitedReplication
   [junit4] OK      0.69s J1 | TestReplicationHandler.doTestHandlerPathUnchanged
   [junit4] OK      2.31s J1 | TestReplicationHandler.doTestReplicateAfterStartupWithNoActivity
   [junit4] OK      6.91s J1 | TestReplicationHandler.doTestIndexFetchOnMasterRestart
   [junit4] OK      0.83s J1 | TestReplicationHandler.testShouldReportErrorWhenRequiredCommandArgMissing
   [junit4] OK      3.67s J1 | TestReplicationHandler.doTestIndexAndConfigAliasReplication
   [junit4] Completed [4/5] on J1 in 74.89s, 20 tests
   [junit4] 
   [junit4] Suite: org.apache.solr.handler.TestReplicationHandler
   [junit4] OK      2.58s J0 | TestReplicationHandler.doTestStressReplication
   [junit4] OK      3.39s J0 | TestReplicationHandler.doTestReplicateAfterCoreReload
   [junit4] OK      1.01s J0 | TestReplicationHandler.doTestReplicateAfterWrite2Slave
   [junit4] OK      0.95s J0 | TestReplicationHandler.testFileListShouldReportErrorsWhenTheyOccur
   [junit4] OK      12.6s J0 | TestReplicationHandler.doTestIndexFetchWithMasterUrl
   [junit4] OK      0.79s J0 | TestReplicationHandler.doTestIllegalFilePaths
   [junit4] OK      0.76s J0 | TestReplicationHandler.testShouldReportErrorWhenDeletingBackupButNameMissing
   [junit4] OK      1.68s J0 | TestReplicationHandler.doTestDetails
   [junit4] OK      3.18s J0 | TestReplicationHandler.doTestIndexAndConfigReplication
   [junit4] OK      12.5s J0 | TestReplicationHandler.testEmptyCommits
   [junit4] OK      0.81s J0 | TestReplicationHandler.testFetchIndexShouldReportErrorsWhenTheyOccur
   [junit4] OK      5.88s J0 | TestReplicationHandler.doTestStopPoll
   [junit4] OK      1.99s J0 | TestReplicationHandler.doTestReplicateAfterStartup
   [junit4] OK      1.94s J0 | TestReplicationHandler.doTestRepeater
   [junit4] OK      7.76s J0 | TestReplicationHandler.testRateLimitedReplication
   [junit4] OK      0.66s J0 | TestReplicationHandler.doTestHandlerPathUnchanged
   [junit4] OK      2.92s J0 | TestReplicationHandler.doTestReplicateAfterStartupWithNoActivity
   [junit4] OK      6.15s J0 | TestReplicationHandler.doTestIndexFetchOnMasterRestart
   [junit4] OK      0.95s J0 | TestReplicationHandler.testShouldReportErrorWhenRequiredCommandArgMissing
   [junit4] OK      3.58s J0 | TestReplicationHandler.doTestIndexAndConfigAliasReplication
   [junit4] Completed [5/5] on J0 in 72.22s, 20 tests
   [junit4] 
   [junit4] JVM J0:     0.96 ..   234.78 =   233.81s
   [junit4] JVM J1:     0.72 ..   175.60 =   174.87s
   [junit4] Execution time total: 3 minutes 54 seconds
   [junit4] Tests summary: 5 suites, 100 tests
   [junit4] Could not remove temporary path: /Users/jenkins/workspace/Lucene-Solr-8.x-MacOSX/solr/build/solr-core/test/J0 (java.nio.file.DirectoryNotEmptyException: Remaining files: [/Users/jenkins/workspace/Lucene-Solr-8.x-MacOSX/solr/build/solr-core/test/J0/temp])
   [junit4] Could not remove temporary path: /Users/jenkins/workspace/Lucene-Solr-8.x-MacOSX/solr/build/solr-core/test/J1 (java.nio.file.DirectoryNotEmptyException: Remaining files: [/Users/jenkins/workspace/Lucene-Solr-8.x-MacOSX/solr/build/solr-core/test/J1/temp])
     [echo] 5 slowest tests:
[junit4:tophints] 181.88s | org.apache.solr.cloud.api.collections.ShardSplitTest
[junit4:tophints] 176.68s | org.apache.solr.search.facet.TestJsonFacets
[junit4:tophints] 118.65s | org.apache.solr.update.SoftAutoCommitTest
[junit4:tophints] 104.99s | org.apache.solr.cloud.HttpPartitionTest
[junit4:tophints]  94.30s | org.apache.solr.handler.TestReplicationHandler

-check-totals:

test-nocompile:

BUILD SUCCESSFUL
Total time: 3 minutes 57 seconds
[repro] Failures:
[repro]   0/5 failed: org.apache.solr.handler.TestReplicationHandler
[repro] Exiting with code 0
+ mv lucene/build lucene/build.repro
+ mv solr/build solr/build.repro
+ mv lucene/build.orig lucene/build
+ mv solr/build.orig solr/build
Archiving artifacts
Setting ANT_1_8_2_HOME=/Users/jenkins/tools/hudson.tasks.Ant_AntInstallation/ANT_1.8.2
java.lang.InterruptedException: no matches found within 10000
	at hudson.FilePath$ValidateAntFileMask.hasMatch(FilePath.java:2847)
	at hudson.FilePath$ValidateAntFileMask.invoke(FilePath.java:2726)
	at hudson.FilePath$ValidateAntFileMask.invoke(FilePath.java:2707)
	at hudson.FilePath$FileCallableWrapper.call(FilePath.java:3086)
Also:   hudson.remoting.Channel$CallSiteStackTrace: Remote call to MacOSX VBOX
		at hudson.remoting.Channel.attachCallSiteStackTrace(Channel.java:1743)
		at hudson.remoting.UserRequest$ExceptionResponse.retrieve(UserRequest.java:357)
		at hudson.remoting.Channel.call(Channel.java:957)
		at hudson.FilePath.act(FilePath.java:1072)
		at hudson.FilePath.act(FilePath.java:1061)
		at hudson.FilePath.validateAntFileMask(FilePath.java:2705)
		at hudson.tasks.ArtifactArchiver.perform(ArtifactArchiver.java:243)
		at hudson.tasks.BuildStepCompatibilityLayer.perform(BuildStepCompatibilityLayer.java:81)
		at hudson.tasks.BuildStepMonitor$1.perform(BuildStepMonitor.java:20)
		at hudson.model.AbstractBuild$AbstractBuildExecution.perform(AbstractBuild.java:744)
		at hudson.model.AbstractBuild$AbstractBuildExecution.performAllBuildSteps(AbstractBuild.java:690)
		at hudson.model.Build$BuildExecution.post2(Build.java:186)
		at hudson.model.AbstractBuild$AbstractBuildExecution.post(AbstractBuild.java:635)
		at hudson.model.Run.execute(Run.java:1835)
		at hudson.model.FreeStyleBuild.run(FreeStyleBuild.java:43)
		at hudson.model.ResourceController.execute(ResourceController.java:97)
		at hudson.model.Executor.run(Executor.java:429)
Caused: hudson.FilePath$TunneledInterruptedException
	at hudson.FilePath$FileCallableWrapper.call(FilePath.java:3088)
	at hudson.remoting.UserRequest.perform(UserRequest.java:212)
	at hudson.remoting.UserRequest.perform(UserRequest.java:54)
	at hudson.remoting.Request$2.run(Request.java:369)
	at hudson.remoting.InterceptingExecutorService$1.call(InterceptingExecutorService.java:72)
	at java.util.concurrent.FutureTask.run(FutureTask.java:266)
	at java.util.concurrent.ThreadPoolExecutor.runWorker(ThreadPoolExecutor.java:1149)
	at java.util.concurrent.ThreadPoolExecutor$Worker.run(ThreadPoolExecutor.java:624)
	at java.lang.Thread.run(Thread.java:748)
Caused: java.lang.InterruptedException: java.lang.InterruptedException: no matches found within 10000
	at hudson.FilePath.act(FilePath.java:1074)
	at hudson.FilePath.act(FilePath.java:1061)
	at hudson.FilePath.validateAntFileMask(FilePath.java:2705)
	at hudson.tasks.ArtifactArchiver.perform(ArtifactArchiver.java:243)
	at hudson.tasks.BuildStepCompatibilityLayer.perform(BuildStepCompatibilityLayer.java:81)
	at hudson.tasks.BuildStepMonitor$1.perform(BuildStepMonitor.java:20)
	at hudson.model.AbstractBuild$AbstractBuildExecution.perform(AbstractBuild.java:744)
	at hudson.model.AbstractBuild$AbstractBuildExecution.performAllBuildSteps(AbstractBuild.java:690)
	at hudson.model.Build$BuildExecution.post2(Build.java:186)
	at hudson.model.AbstractBuild$AbstractBuildExecution.post(AbstractBuild.java:635)
	at hudson.model.Run.execute(Run.java:1835)
	at hudson.model.FreeStyleBuild.run(FreeStyleBuild.java:43)
	at hudson.model.ResourceController.execute(ResourceController.java:97)
	at hudson.model.Executor.run(Executor.java:429)
No artifacts found that match the file pattern "**/*.events,heapdumps/**,**/*_pid*.log". Configuration error?
[WARNINGS] Parsing warnings in console log with parser Java Compiler (javac)
Setting ANT_1_8_2_HOME=/Users/jenkins/tools/hudson.tasks.Ant_AntInstallation/ANT_1.8.2
Setting ANT_1_8_2_HOME=/Users/jenkins/tools/hudson.tasks.Ant_AntInstallation/ANT_1.8.2
<Git Blamer> Using GitBlamer to create author and commit information for all warnings.
<Git Blamer> GIT_COMMIT=571ae2670a2435fb6e6bed2a6e9287cba6218a3e, workspace=/Users/jenkins/workspace/Lucene-Solr-8.x-MacOSX
[WARNINGS] Computing warning deltas based on reference build #15
Recording test results
Setting ANT_1_8_2_HOME=/Users/jenkins/tools/hudson.tasks.Ant_AntInstallation/ANT_1.8.2
Build step 'Publish JUnit test result report' changed build result to UNSTABLE
Email was triggered for: Unstable (Test Failures)
Sending email for trigger: Unstable (Test Failures)
Setting ANT_1_8_2_HOME=/Users/jenkins/tools/hudson.tasks.Ant_AntInstallation/ANT_1.8.2
Setting ANT_1_8_2_HOME=/Users/jenkins/tools/hudson.tasks.Ant_AntInstallation/ANT_1.8.2
Setting ANT_1_8_2_HOME=/Users/jenkins/tools/hudson.tasks.Ant_AntInstallation/ANT_1.8.2
Setting ANT_1_8_2_HOME=/Users/jenkins/tools/hudson.tasks.Ant_AntInstallation/ANT_1.8.2

Mime
View raw message