lucene-dev mailing list archives

Site index · List index
Message view « Date » · « Thread »
Top « Date » · « Thread »
From Apache Jenkins Server <jenk...@builds.apache.org>
Subject [JENKINS] Lucene-Solr-Tests-master - Build # 3110 - Still Unstable
Date Tue, 01 Jan 2019 20:58:40 GMT
Build: https://builds.apache.org/job/Lucene-Solr-Tests-master/3110/

1 tests failed.
FAILED:  org.apache.solr.cloud.autoscaling.sim.TestSimTriggerIntegration.testListeners

Error Message:
foo events: [CapturedEvent{timestamp=28706310421991774, stage=STARTED, actionName='null', event={   "id":"65fc36b581d702T52kjhwk84nabtnuo6gif38c0u",   "source":"node_added_trigger",   "eventTime":28706284551395074,   "eventType":"NODEADDED",   "properties":{     "eventTimes":[28706284551395074],     "preferredOperation":"movereplica",     "_enqueue_time_":28706286851248824,     "nodeNames":["127.0.0.1:10002_solr"]}}, context={}, config={   "trigger":"node_added_trigger",   "stage":[     "STARTED",     "ABORTED",     "SUCCEEDED",     "FAILED"],   "beforeAction":"test",   "afterAction":[     "test",     "test1"],   "class":"org.apache.solr.cloud.autoscaling.sim.TestSimTriggerIntegration$TestTriggerListener"}, message='null'}, CapturedEvent{timestamp=28706314848845024, stage=BEFORE_ACTION, actionName='test', event={   "id":"65fc36b581d702T52kjhwk84nabtnuo6gif38c0u",   "source":"node_added_trigger",   "eventTime":28706284551395074,   "eventType":"NODEADDED",   "properties":{     "eventTimes":[28706284551395074],     "preferredOperation":"movereplica",     "_enqueue_time_":28706286851248824,     "nodeNames":["127.0.0.1:10002_solr"]}}, context={properties.BEFORE_ACTION=[test, test1], source=node_added_trigger}, config={   "trigger":"node_added_trigger",   "stage":[     "STARTED",     "ABORTED",     "SUCCEEDED",     "FAILED"],   "beforeAction":"test",   "afterAction":[     "test",     "test1"],   "class":"org.apache.solr.cloud.autoscaling.sim.TestSimTriggerIntegration$TestTriggerListener"}, message='null'}, CapturedEvent{timestamp=28706318522692724, stage=AFTER_ACTION, actionName='test', event={   "id":"65fc36b581d702T52kjhwk84nabtnuo6gif38c0u",   "source":"node_added_trigger",   "eventTime":28706284551395074,   "eventType":"NODEADDED",   "properties":{     "eventTimes":[28706284551395074],     "preferredOperation":"movereplica",     "_enqueue_time_":28706286851248824,     "nodeNames":["127.0.0.1:10002_solr"]}}, context={properties.BEFORE_ACTION=[test, test1], source=node_added_trigger, properties.AFTER_ACTION=[test, test1]}, config={   "trigger":"node_added_trigger",   "stage":[     "STARTED",     "ABORTED",     "SUCCEEDED",     "FAILED"],   "beforeAction":"test",   "afterAction":[     "test",     "test1"],   "class":"org.apache.solr.cloud.autoscaling.sim.TestSimTriggerIntegration$TestTriggerListener"}, message='null'}, CapturedEvent{timestamp=28706318524674574, stage=AFTER_ACTION, actionName='test1', event={   "id":"65fc36b581d702T52kjhwk84nabtnuo6gif38c0u",   "source":"node_added_trigger",   "eventTime":28706284551395074,   "eventType":"NODEADDED",   "properties":{     "eventTimes":[28706284551395074],     "preferredOperation":"movereplica",     "_enqueue_time_":28706286851248824,     "nodeNames":["127.0.0.1:10002_solr"]}}, context={properties.BEFORE_ACTION=[test, test1], source=node_added_trigger, properties.AFTER_ACTION=[test, test1]}, config={   "trigger":"node_added_trigger",   "stage":[     "STARTED",     "ABORTED",     "SUCCEEDED",     "FAILED"],   "beforeAction":"test",   "afterAction":[     "test",     "test1"],   "class":"org.apache.solr.cloud.autoscaling.sim.TestSimTriggerIntegration$TestTriggerListener"}, message='null'}] expected:<5> but was:<4>

Stack Trace:
java.lang.AssertionError: foo events: [CapturedEvent{timestamp=28706310421991774, stage=STARTED, actionName='null', event={
  "id":"65fc36b581d702T52kjhwk84nabtnuo6gif38c0u",
  "source":"node_added_trigger",
  "eventTime":28706284551395074,
  "eventType":"NODEADDED",
  "properties":{
    "eventTimes":[28706284551395074],
    "preferredOperation":"movereplica",
    "_enqueue_time_":28706286851248824,
    "nodeNames":["127.0.0.1:10002_solr"]}}, context={}, config={
  "trigger":"node_added_trigger",
  "stage":[
    "STARTED",
    "ABORTED",
    "SUCCEEDED",
    "FAILED"],
  "beforeAction":"test",
  "afterAction":[
    "test",
    "test1"],
  "class":"org.apache.solr.cloud.autoscaling.sim.TestSimTriggerIntegration$TestTriggerListener"}, message='null'}, CapturedEvent{timestamp=28706314848845024, stage=BEFORE_ACTION, actionName='test', event={
  "id":"65fc36b581d702T52kjhwk84nabtnuo6gif38c0u",
  "source":"node_added_trigger",
  "eventTime":28706284551395074,
  "eventType":"NODEADDED",
  "properties":{
    "eventTimes":[28706284551395074],
    "preferredOperation":"movereplica",
    "_enqueue_time_":28706286851248824,
    "nodeNames":["127.0.0.1:10002_solr"]}}, context={properties.BEFORE_ACTION=[test, test1], source=node_added_trigger}, config={
  "trigger":"node_added_trigger",
  "stage":[
    "STARTED",
    "ABORTED",
    "SUCCEEDED",
    "FAILED"],
  "beforeAction":"test",
  "afterAction":[
    "test",
    "test1"],
  "class":"org.apache.solr.cloud.autoscaling.sim.TestSimTriggerIntegration$TestTriggerListener"}, message='null'}, CapturedEvent{timestamp=28706318522692724, stage=AFTER_ACTION, actionName='test', event={
  "id":"65fc36b581d702T52kjhwk84nabtnuo6gif38c0u",
  "source":"node_added_trigger",
  "eventTime":28706284551395074,
  "eventType":"NODEADDED",
  "properties":{
    "eventTimes":[28706284551395074],
    "preferredOperation":"movereplica",
    "_enqueue_time_":28706286851248824,
    "nodeNames":["127.0.0.1:10002_solr"]}}, context={properties.BEFORE_ACTION=[test, test1], source=node_added_trigger, properties.AFTER_ACTION=[test, test1]}, config={
  "trigger":"node_added_trigger",
  "stage":[
    "STARTED",
    "ABORTED",
    "SUCCEEDED",
    "FAILED"],
  "beforeAction":"test",
  "afterAction":[
    "test",
    "test1"],
  "class":"org.apache.solr.cloud.autoscaling.sim.TestSimTriggerIntegration$TestTriggerListener"}, message='null'}, CapturedEvent{timestamp=28706318524674574, stage=AFTER_ACTION, actionName='test1', event={
  "id":"65fc36b581d702T52kjhwk84nabtnuo6gif38c0u",
  "source":"node_added_trigger",
  "eventTime":28706284551395074,
  "eventType":"NODEADDED",
  "properties":{
    "eventTimes":[28706284551395074],
    "preferredOperation":"movereplica",
    "_enqueue_time_":28706286851248824,
    "nodeNames":["127.0.0.1:10002_solr"]}}, context={properties.BEFORE_ACTION=[test, test1], source=node_added_trigger, properties.AFTER_ACTION=[test, test1]}, config={
  "trigger":"node_added_trigger",
  "stage":[
    "STARTED",
    "ABORTED",
    "SUCCEEDED",
    "FAILED"],
  "beforeAction":"test",
  "afterAction":[
    "test",
    "test1"],
  "class":"org.apache.solr.cloud.autoscaling.sim.TestSimTriggerIntegration$TestTriggerListener"}, message='null'}] expected:<5> but was:<4>
	at __randomizedtesting.SeedInfo.seed([4B417783C94DB770:A681E09374212AA9]:0)
	at org.junit.Assert.fail(Assert.java:88)
	at org.junit.Assert.failNotEquals(Assert.java:834)
	at org.junit.Assert.assertEquals(Assert.java:645)
	at org.apache.solr.cloud.autoscaling.sim.TestSimTriggerIntegration.testListeners(TestSimTriggerIntegration.java:1016)
	at sun.reflect.NativeMethodAccessorImpl.invoke0(Native Method)
	at sun.reflect.NativeMethodAccessorImpl.invoke(NativeMethodAccessorImpl.java:62)
	at sun.reflect.DelegatingMethodAccessorImpl.invoke(DelegatingMethodAccessorImpl.java:43)
	at java.lang.reflect.Method.invoke(Method.java:498)
	at com.carrotsearch.randomizedtesting.RandomizedRunner.invoke(RandomizedRunner.java:1750)
	at com.carrotsearch.randomizedtesting.RandomizedRunner$8.evaluate(RandomizedRunner.java:938)
	at com.carrotsearch.randomizedtesting.RandomizedRunner$9.evaluate(RandomizedRunner.java:974)
	at com.carrotsearch.randomizedtesting.RandomizedRunner$10.evaluate(RandomizedRunner.java:988)
	at com.carrotsearch.randomizedtesting.rules.SystemPropertiesRestoreRule$1.evaluate(SystemPropertiesRestoreRule.java:57)
	at org.apache.lucene.util.TestRuleSetupTeardownChained$1.evaluate(TestRuleSetupTeardownChained.java:49)
	at org.apache.lucene.util.AbstractBeforeAfterRule$1.evaluate(AbstractBeforeAfterRule.java:45)
	at org.apache.lucene.util.TestRuleThreadAndTestName$1.evaluate(TestRuleThreadAndTestName.java:48)
	at org.apache.lucene.util.TestRuleIgnoreAfterMaxFailures$1.evaluate(TestRuleIgnoreAfterMaxFailures.java:64)
	at org.apache.lucene.util.TestRuleMarkFailure$1.evaluate(TestRuleMarkFailure.java:47)
	at com.carrotsearch.randomizedtesting.rules.StatementAdapter.evaluate(StatementAdapter.java:36)
	at com.carrotsearch.randomizedtesting.ThreadLeakControl$StatementRunner.run(ThreadLeakControl.java:368)
	at com.carrotsearch.randomizedtesting.ThreadLeakControl.forkTimeoutingTask(ThreadLeakControl.java:817)
	at com.carrotsearch.randomizedtesting.ThreadLeakControl$3.evaluate(ThreadLeakControl.java:468)
	at com.carrotsearch.randomizedtesting.RandomizedRunner.runSingleTest(RandomizedRunner.java:947)
	at com.carrotsearch.randomizedtesting.RandomizedRunner$5.evaluate(RandomizedRunner.java:832)
	at com.carrotsearch.randomizedtesting.RandomizedRunner$6.evaluate(RandomizedRunner.java:883)
	at com.carrotsearch.randomizedtesting.RandomizedRunner$7.evaluate(RandomizedRunner.java:894)
	at com.carrotsearch.randomizedtesting.rules.StatementAdapter.evaluate(StatementAdapter.java:36)
	at com.carrotsearch.randomizedtesting.rules.SystemPropertiesRestoreRule$1.evaluate(SystemPropertiesRestoreRule.java:57)
	at org.apache.lucene.util.AbstractBeforeAfterRule$1.evaluate(AbstractBeforeAfterRule.java:45)
	at com.carrotsearch.randomizedtesting.rules.StatementAdapter.evaluate(StatementAdapter.java:36)
	at org.apache.lucene.util.TestRuleStoreClassName$1.evaluate(TestRuleStoreClassName.java:41)
	at com.carrotsearch.randomizedtesting.rules.NoShadowingOrOverridesOnMethodsRule$1.evaluate(NoShadowingOrOverridesOnMethodsRule.java:40)
	at com.carrotsearch.randomizedtesting.rules.NoShadowingOrOverridesOnMethodsRule$1.evaluate(NoShadowingOrOverridesOnMethodsRule.java:40)
	at com.carrotsearch.randomizedtesting.rules.StatementAdapter.evaluate(StatementAdapter.java:36)
	at com.carrotsearch.randomizedtesting.rules.StatementAdapter.evaluate(StatementAdapter.java:36)
	at com.carrotsearch.randomizedtesting.rules.StatementAdapter.evaluate(StatementAdapter.java:36)
	at org.apache.lucene.util.TestRuleAssertionsRequired$1.evaluate(TestRuleAssertionsRequired.java:53)
	at org.apache.lucene.util.TestRuleMarkFailure$1.evaluate(TestRuleMarkFailure.java:47)
	at org.apache.lucene.util.TestRuleIgnoreAfterMaxFailures$1.evaluate(TestRuleIgnoreAfterMaxFailures.java:64)
	at org.apache.lucene.util.TestRuleIgnoreTestSuites$1.evaluate(TestRuleIgnoreTestSuites.java:54)
	at com.carrotsearch.randomizedtesting.rules.StatementAdapter.evaluate(StatementAdapter.java:36)
	at com.carrotsearch.randomizedtesting.ThreadLeakControl$StatementRunner.run(ThreadLeakControl.java:368)
	at java.lang.Thread.run(Thread.java:748)




Build Log:
[...truncated 12855 lines...]
   [junit4] Suite: org.apache.solr.cloud.autoscaling.sim.TestSimTriggerIntegration
   [junit4]   2> Creating dataDir: /home/jenkins/jenkins-slave/workspace/Lucene-Solr-Tests-master/solr/build/solr-core/test/J2/temp/solr.cloud.autoscaling.sim.TestSimTriggerIntegration_4B417783C94DB770-001/init-core-data-001
   [junit4]   2> 485473 WARN  (SUITE-TestSimTriggerIntegration-seed#[4B417783C94DB770]-worker) [    ] o.a.s.SolrTestCaseJ4 startTrackingSearchers: numOpens=277 numCloses=277
   [junit4]   2> 485473 INFO  (SUITE-TestSimTriggerIntegration-seed#[4B417783C94DB770]-worker) [    ] o.a.s.SolrTestCaseJ4 Using TrieFields (NUMERIC_POINTS_SYSPROP=false) w/NUMERIC_DOCVALUES_SYSPROP=true
   [junit4]   2> 485543 INFO  (SUITE-TestSimTriggerIntegration-seed#[4B417783C94DB770]-worker) [    ] o.a.s.SolrTestCaseJ4 Randomized ssl (true) and clientAuth (true) via: @org.apache.solr.util.RandomizeSSL(reason=, ssl=NaN, value=NaN, clientAuth=NaN)
   [junit4]   2> 485543 INFO  (SUITE-TestSimTriggerIntegration-seed#[4B417783C94DB770]-worker) [    ] o.a.s.SolrTestCaseJ4 SecureRandom sanity checks: test.solr.allowed.securerandom=null & java.security.egd=file:/dev/./urandom
   [junit4] IGNOR/A 0.04s J2 | TestSimTriggerIntegration.testEventFromRestoredState
   [junit4]    > Assumption #1: 'badapple' test group is disabled (@BadApple(bugUrl=https://issues.apache.org/jira/browse/SOLR-12028))
   [junit4] IGNOR/A 0.00s J2 | TestSimTriggerIntegration.testNodeMarkersRegistration
   [junit4]    > Assumption #1: 'badapple' test group is disabled (@BadApple(bugUrl=https://issues.apache.org/jira/browse/SOLR-12028))
   [junit4] IGNOR/A 0.00s J2 | TestSimTriggerIntegration.testNodeLostTrigger
   [junit4]    > Assumption #1: 'awaitsfix' test group is disabled (@AwaitsFix(bugUrl=https://issues.apache.org/jira/browse/SOLR-12028))
   [junit4] IGNOR/A 0.00s J2 | TestSimTriggerIntegration.testNodeAddedTrigger
   [junit4]    > Assumption #1: 'badapple' test group is disabled (@BadApple(bugUrl=https://issues.apache.org/jira/browse/SOLR-12028))
   [junit4] IGNOR/A 0.00s J2 | TestSimTriggerIntegration.testSearchRate
   [junit4]    > Assumption #1: 'awaitsfix' test group is disabled (@AwaitsFix(bugUrl=https://issues.apache.org/jira/browse/SOLR-12028))
   [junit4] IGNOR/A 0.05s J2 | TestSimTriggerIntegration.testNodeAddedTriggerRestoreState
   [junit4]    > Assumption #1: 'badapple' test group is disabled (@BadApple(bugUrl=https://issues.apache.org/jira/browse/SOLR-12028))
   [junit4] IGNOR/A 0.00s J2 | TestSimTriggerIntegration.testEventQueue
   [junit4]    > Assumption #1: 'awaitsfix' test group is disabled (@AwaitsFix(bugUrl=https://issues.apache.org/jira/browse/SOLR-12028))
   [junit4] IGNOR/A 0.00s J2 | TestSimTriggerIntegration.testCooldown
   [junit4]    > Assumption #1: 'badapple' test group is disabled (@BadApple(bugUrl=https://issues.apache.org/jira/browse/SOLR-12028))
   [junit4] IGNOR/A 0.00s J2 | TestSimTriggerIntegration.testTriggerThrottling
   [junit4]    > Assumption #1: 'badapple' test group is disabled (@BadApple(bugUrl=https://issues.apache.org/jira/browse/SOLR-12028))
   [junit4]   2> 485687 INFO  (TEST-TestSimTriggerIntegration.testListeners-seed#[4B417783C94DB770]) [    ] o.a.s.SolrTestCaseJ4 ###Starting testListeners
   [junit4]   2> 485981 DEBUG (TEST-TestSimTriggerIntegration.testListeners-seed#[4B417783C94DB770]) [    ] o.a.s.c.a.s.SimClusterStateProvider --- new Overseer leader: 127.0.0.1:10000_solr
   [junit4]   2> 485982 DEBUG (Simulated OverseerAutoScalingTriggerThread) [    ] o.a.s.c.a.OverseerTriggerThread Adding .auto_add_replicas and .scheduled_maintenance triggers
   [junit4]   2> 485983 DEBUG (Simulated OverseerAutoScalingTriggerThread) [    ] o.a.s.c.a.OverseerTriggerThread Refreshing /autoscaling.json with znode version 1
   [junit4]   2> 485983 DEBUG (Simulated OverseerAutoScalingTriggerThread) [    ] o.a.s.c.a.OverseerTriggerThread Current znodeVersion 1, lastZnodeVersion 0
   [junit4]   2> 485983 DEBUG (Simulated OverseerAutoScalingTriggerThread) [    ] o.a.s.c.a.OverseerTriggerThread Processed trigger updates upto znodeVersion 1
   [junit4]   2> 486016 DEBUG (TEST-TestSimTriggerIntegration.testListeners-seed#[4B417783C94DB770]) [    ] o.a.s.c.a.s.SimClusterStateProvider ** creating new collection states, currentVersion=0
   [junit4]   2> 486018 DEBUG (TEST-TestSimTriggerIntegration.testListeners-seed#[4B417783C94DB770]) [    ] o.a.s.c.a.s.SimClusterStateProvider ** saved cluster state version 0
   [junit4]   2> 486018 INFO  (TEST-TestSimTriggerIntegration.testListeners-seed#[4B417783C94DB770]) [    ] o.a.s.h.a.MetricsHistoryHandler No .system collection, keeping metrics history in memory.
   [junit4]   2> 486049 DEBUG (Simulated OverseerAutoScalingTriggerThread) [    ] o.a.s.c.a.NodeLostTrigger NodeLostTrigger .auto_add_replicas - Initial livenodes: [127.0.0.1:10001_solr, 127.0.0.1:10000_solr]
   [junit4]   2> 486085 DEBUG (Simulated OverseerAutoScalingTriggerThread) [    ] o.a.s.c.a.OverseerTriggerThread -- cleaning old nodeLost / nodeAdded markers
   [junit4]   2> 486085 DEBUG (Simulated OverseerAutoScalingTriggerThread) [    ] o.a.s.c.a.OverseerTriggerThread Current znodeVersion 1, lastZnodeVersion 1
   [junit4]   2> 486102 DEBUG (ScheduledTrigger-721-thread-2) [    ] o.a.s.c.a.NodeLostTrigger Running NodeLostTrigger: .auto_add_replicas with currently live nodes: 2 and last live nodes: 2
   [junit4]   2> 486325 DEBUG (ScheduledTrigger-721-thread-1) [    ] o.a.s.c.a.NodeLostTrigger Running NodeLostTrigger: .auto_add_replicas with currently live nodes: 2 and last live nodes: 2
   [junit4]   2> 486357 DEBUG (ScheduledTrigger-721-thread-1) [    ] o.a.s.c.a.NodeLostTrigger Running NodeLostTrigger: .auto_add_replicas with currently live nodes: 2 and last live nodes: 2
   [junit4]   2> 486377 DEBUG (ScheduledTrigger-721-thread-1) [    ] o.a.s.c.a.NodeLostTrigger Running NodeLostTrigger: .auto_add_replicas with currently live nodes: 2 and last live nodes: 2
   [junit4]   2> 486397 DEBUG (simCloudManagerPool-720-thread-2) [    ] o.a.s.c.a.AutoScalingHandler Verified autoscaling configuration
   [junit4]   2> 486397 DEBUG (simCloudManagerPool-720-thread-2) [    ] o.a.s.c.a.OverseerTriggerThread Refreshing /autoscaling.json with znode version 2
   [junit4]   2> 486413 DEBUG (ScheduledTrigger-721-thread-1) [    ] o.a.s.c.a.NodeLostTrigger Running NodeLostTrigger: .auto_add_replicas with currently live nodes: 2 and last live nodes: 2
   [junit4]   2> 486438 DEBUG (ScheduledTrigger-721-thread-1) [    ] o.a.s.c.a.NodeLostTrigger Running NodeLostTrigger: .auto_add_replicas with currently live nodes: 2 and last live nodes: 2
   [junit4]   2> 486450 DEBUG (Simulated OverseerAutoScalingTriggerThread) [    ] o.a.s.c.a.OverseerTriggerThread Processed trigger updates upto znodeVersion 2
   [junit4]   2> 486450 DEBUG (Simulated OverseerAutoScalingTriggerThread) [    ] o.a.s.c.a.OverseerTriggerThread -- cleaning old nodeLost / nodeAdded markers
   [junit4]   2> 486450 DEBUG (Simulated OverseerAutoScalingTriggerThread) [    ] o.a.s.c.a.OverseerTriggerThread Current znodeVersion 2, lastZnodeVersion 2
   [junit4]   2> 486474 DEBUG (ScheduledTrigger-721-thread-1) [    ] o.a.s.c.a.NodeLostTrigger Running NodeLostTrigger: .auto_add_replicas with currently live nodes: 2 and last live nodes: 2
   [junit4]   2> 486488 DEBUG (simCloudManagerPool-720-thread-3) [    ] o.a.s.c.a.AutoScalingHandler Verified autoscaling configuration
   [junit4]   2> 486489 DEBUG (simCloudManagerPool-720-thread-3) [    ] o.a.s.c.a.OverseerTriggerThread Refreshing /autoscaling.json with znode version 3
   [junit4]   2> 486489 DEBUG (Simulated OverseerAutoScalingTriggerThread) [    ] o.a.s.c.a.OverseerTriggerThread Processed trigger updates upto znodeVersion 3
   [junit4]   2> 486489 INFO  (Simulated OverseerAutoScalingTriggerThread) [    ] o.a.s.c.a.s.TestSimTriggerIntegration TestTriggerAction init
   [junit4]   2> 486490 DEBUG (Simulated OverseerAutoScalingTriggerThread) [    ] o.a.s.c.a.NodeAddedTrigger NodeAddedTrigger node_added_trigger - Initial livenodes: [127.0.0.1:10001_solr, 127.0.0.1:10000_solr]
   [junit4]   2> 486490 DEBUG (Simulated OverseerAutoScalingTriggerThread) [    ] o.a.s.c.a.NodeAddedTrigger NodeAddedTrigger node_added_trigger instantiated with properties: {event=nodeAdded, waitFor=2, actions=[{name=test, class=org.apache.solr.cloud.autoscaling.sim.TestSimTriggerIntegration$TestTriggerAction}, {name=test1, class=org.apache.solr.cloud.autoscaling.sim.TestSimTriggerIntegration$TestDummyAction}], enabled=true}
   [junit4]   2> 486490 DEBUG (Simulated OverseerAutoScalingTriggerThread) [    ] o.a.s.c.a.OverseerTriggerThread -- cleaning old nodeLost / nodeAdded markers
   [junit4]   2> 486490 DEBUG (Simulated OverseerAutoScalingTriggerThread) [    ] o.a.s.c.a.OverseerTriggerThread Current znodeVersion 3, lastZnodeVersion 3
   [junit4]   2> 486490 DEBUG (ScheduledTrigger-721-thread-3) [    ] o.a.s.c.a.NodeAddedTrigger Running NodeAddedTrigger node_added_trigger
   [junit4]   2> 486507 DEBUG (ScheduledTrigger-721-thread-2) [    ] o.a.s.c.a.NodeLostTrigger Running NodeLostTrigger: .auto_add_replicas with currently live nodes: 2 and last live nodes: 2
   [junit4]   2> 486509 DEBUG (simCloudManagerPool-720-thread-4) [    ] o.a.s.c.a.AutoScalingHandler Verified autoscaling configuration
   [junit4]   2> 486523 DEBUG (simCloudManagerPool-720-thread-4) [    ] o.a.s.c.a.OverseerTriggerThread Refreshing /autoscaling.json with znode version 4
   [junit4]   2> 486523 DEBUG (Simulated OverseerAutoScalingTriggerThread) [    ] o.a.s.c.a.OverseerTriggerThread Processed trigger updates upto znodeVersion 4
   [junit4]   2> 486524 DEBUG (Simulated OverseerAutoScalingTriggerThread) [    ] o.a.s.c.a.OverseerTriggerThread -- cleaning old nodeLost / nodeAdded markers
   [junit4]   2> 486524 DEBUG (Simulated OverseerAutoScalingTriggerThread) [    ] o.a.s.c.a.OverseerTriggerThread Current znodeVersion 4, lastZnodeVersion 4
   [junit4]   2> 486524 DEBUG (ScheduledTrigger-721-thread-3) [    ] o.a.s.c.a.NodeAddedTrigger Found livenodes: 2
   [junit4]   2> 486539 DEBUG (ScheduledTrigger-721-thread-2) [    ] o.a.s.c.a.NodeLostTrigger Running NodeLostTrigger: .auto_add_replicas with currently live nodes: 2 and last live nodes: 2
   [junit4]   2> 486540 DEBUG (simCloudManagerPool-720-thread-5) [    ] o.a.s.c.a.AutoScalingHandler Verified autoscaling configuration
   [junit4]   2> 486540 DEBUG (simCloudManagerPool-720-thread-5) [    ] o.a.s.c.a.OverseerTriggerThread Refreshing /autoscaling.json with znode version 5
   [junit4]   2> 486541 DEBUG (Simulated OverseerAutoScalingTriggerThread) [    ] o.a.s.c.a.OverseerTriggerThread Processed trigger updates upto znodeVersion 5
   [junit4]   2> 486541 DEBUG (Simulated OverseerAutoScalingTriggerThread) [    ] o.a.s.c.a.OverseerTriggerThread -- cleaning old nodeLost / nodeAdded markers
   [junit4]   2> 486541 DEBUG (Simulated OverseerAutoScalingTriggerThread) [    ] o.a.s.c.a.OverseerTriggerThread Current znodeVersion 5, lastZnodeVersion 5
   [junit4]   2> 486541 DEBUG (TEST-TestSimTriggerIntegration.testListeners-seed#[4B417783C94DB770]) [    ] o.a.s.c.a.s.SimClusterStateProvider -- creating marker: /autoscaling/nodeAdded/127.0.0.1:10002_solr
   [junit4]   2> 486563 DEBUG (ScheduledTrigger-721-thread-1) [    ] o.a.s.c.a.NodeLostTrigger Running NodeLostTrigger: .auto_add_replicas with currently live nodes: 3 and last live nodes: 2
   [junit4]   2> 486723 DEBUG (ScheduledTrigger-721-thread-4) [    ] o.a.s.c.a.NodeAddedTrigger Running NodeAddedTrigger node_added_trigger
   [junit4]   2> 486723 DEBUG (ScheduledTrigger-721-thread-4) [    ] o.a.s.c.a.NodeAddedTrigger Found livenodes: 3
   [junit4]   2> 486723 DEBUG (ScheduledTrigger-721-thread-4) [    ] o.a.s.c.a.NodeAddedTrigger Tracking new node: 127.0.0.1:10002_solr at time 28706284551395074
   [junit4]   2> 486766 DEBUG (ScheduledTrigger-721-thread-1) [    ] o.a.s.c.a.NodeLostTrigger Running NodeLostTrigger: .auto_add_replicas with currently live nodes: 3 and last live nodes: 3
   [junit4]   2> 486766 DEBUG (ScheduledTrigger-721-thread-1) [    ] o.a.s.c.a.NodeAddedTrigger Running NodeAddedTrigger node_added_trigger
   [junit4]   2> 486766 DEBUG (ScheduledTrigger-721-thread-1) [    ] o.a.s.c.a.NodeAddedTrigger Found livenodes: 3
   [junit4]   2> 486766 DEBUG (ScheduledTrigger-721-thread-1) [    ] o.a.s.c.a.NodeAddedTrigger NodeAddedTrigger node_added_trigger firing registered processor for nodes: [127.0.0.1:10002_solr] added at times [28706284551395074], now=28706286704909874
   [junit4]   2> 486769 DEBUG (ScheduledTrigger-721-thread-1) [    ] o.a.s.c.a.ScheduledTriggers ++++++++ Cooldown inactive - processing event: {
   [junit4]   2>   "id":"65fc36b581d702T52kjhwk84nabtnuo6gif38c0u",
   [junit4]   2>   "source":"node_added_trigger",
   [junit4]   2>   "eventTime":28706284551395074,
   [junit4]   2>   "eventType":"NODEADDED",
   [junit4]   2>   "properties":{
   [junit4]   2>     "eventTimes":[28706284551395074],
   [junit4]   2>     "preferredOperation":"movereplica",
   [junit4]   2>     "nodeNames":["127.0.0.1:10002_solr"]}}
   [junit4]   2> 486769 DEBUG (ScheduledTrigger-721-thread-1) [    ] o.a.s.c.a.ScheduledTriggers Pausing all triggers: [.auto_add_replicas, node_added_trigger]
   [junit4]   2> 486803 DEBUG (simCloudManagerPool-720-thread-6) [    ] o.a.s.c.a.s.SimClusterStateProvider -- simCreateCollection .system, currentVersion=1
   [junit4]   2> 486803 DEBUG (simCloudManagerPool-720-thread-6) [    ] o.a.s.c.a.s.SimClusterStateProvider ** creating new collection states, currentVersion=1
   [junit4]   2> 486803 DEBUG (simCloudManagerPool-720-thread-6) [    ] o.a.s.c.a.s.SimClusterStateProvider ** saved cluster state version 1
   [junit4]   2> 486819 DEBUG (simCloudManagerPool-720-thread-6) [    ] o.a.s.c.a.s.SimClusterStateProvider ** creating new collection states, currentVersion=2
   [junit4]   2> 486821 DEBUG (simCloudManagerPool-720-thread-6) [    ] o.a.s.c.a.s.SimClusterStateProvider ** saved cluster state version 2
   [junit4]   2> 486927 DEBUG (simCloudManagerPool-720-thread-7) [    ] o.a.s.c.a.s.SimClusterStateProvider ** creating new collection states, currentVersion=3
   [junit4]   2> 486928 DEBUG (simCloudManagerPool-720-thread-7) [    ] o.a.s.c.a.s.SimClusterStateProvider ** saved cluster state version 3
   [junit4]   2> 487013 DEBUG (simCloudManagerPool-720-thread-10) [    ] o.a.s.c.a.s.SimClusterStateProvider -- elected new leader for .system / shard1 (currentVersion=4): {"core_node1":{
   [junit4]   2>     "core":".system_shard1_replica_n1",
   [junit4]   2>     "shard":"shard1",
   [junit4]   2>     "collection":".system",
   [junit4]   2>     "node_name":"127.0.0.1:10002_solr",
   [junit4]   2>     "type":"NRT",
   [junit4]   2>     "leader":"true",
   [junit4]   2>     "SEARCHER.searcher.maxDoc":0,
   [junit4]   2>     "SEARCHER.searcher.deletedDocs":0,
   [junit4]   2>     "INDEX.sizeInBytes":10240,
   [junit4]   2>     "state":"active",
   [junit4]   2>     "INDEX.sizeInGB":9.5367431640625E-6,
   [junit4]   2>     "SEARCHER.searcher.numDocs":0}}
   [junit4]   2> 487033 DEBUG (simCloudManagerPool-720-thread-8) [    ] o.a.s.c.a.s.SimClusterStateProvider ** creating new collection states, currentVersion=4
   [junit4]   2> 487034 DEBUG (simCloudManagerPool-720-thread-8) [    ] o.a.s.c.a.s.SimClusterStateProvider ** saved cluster state version 4
   [junit4]   2> 487050 DEBUG (simCloudManagerPool-720-thread-9) [    ] o.a.s.c.a.s.SimClusterStateProvider ** creating new collection states, currentVersion=5
   [junit4]   2> 487086 DEBUG (simCloudManagerPool-720-thread-9) [    ] o.a.s.c.a.s.SimClusterStateProvider ** saved cluster state version 5
   [junit4]   2> 487086 DEBUG (simCloudManagerPool-720-thread-6) [    ] o.a.s.c.a.s.SimClusterStateProvider -- finished createCollection .system, currentVersion=6
   [junit4]   2> 487256 DEBUG (ScheduledTrigger-721-thread-1) [    ] o.a.s.c.a.NodeAddedTrigger Removing new node from tracking: 127.0.0.1:10002_solr
   [junit4]   2> 487257 DEBUG (AutoscalingActionExecutor-722-thread-1) [    ] o.a.s.c.a.ScheduledTriggers -- processing actions for {
   [junit4]   2>   "id":"65fc36b581d702T52kjhwk84nabtnuo6gif38c0u",
   [junit4]   2>   "source":"node_added_trigger",
   [junit4]   2>   "eventTime":28706284551395074,
   [junit4]   2>   "eventType":"NODEADDED",
   [junit4]   2>   "properties":{
   [junit4]   2>     "eventTimes":[28706284551395074],
   [junit4]   2>     "preferredOperation":"movereplica",
   [junit4]   2>     "_enqueue_time_":28706286851248824,
   [junit4]   2>     "nodeNames":["127.0.0.1:10002_solr"]}}
   [junit4]   2> 487477 DEBUG (AutoscalingActionExecutor-722-thread-1) [    ] o.a.s.c.a.ScheduledTriggers Resuming trigger: .auto_add_replicas after 100ms
   [junit4]   2> 487477 DEBUG (AutoscalingActionExecutor-722-thread-1) [    ] o.a.s.c.a.ScheduledTriggers Resuming trigger: node_added_trigger after 100ms
   [junit4]   2> 487477 DEBUG (AutoscalingActionExecutor-722-thread-1) [    ] o.a.s.c.a.ScheduledTriggers -- processing took 11025 ms for event id=65fc36b581d702T52kjhwk84nabtnuo6gif38c0u
   [junit4]   2> 487577 DEBUG (ScheduledTrigger-721-thread-3) [    ] o.a.s.c.a.NodeLostTrigger Running NodeLostTrigger: .auto_add_replicas with currently live nodes: 3 and last live nodes: 3
   [junit4]   2> 487578 DEBUG (ScheduledTrigger-721-thread-3) [    ] o.a.s.c.a.NodeAddedTrigger Running NodeAddedTrigger node_added_trigger
   [junit4]   2> 487578 DEBUG (ScheduledTrigger-721-thread-3) [    ] o.a.s.c.a.NodeAddedTrigger Found livenodes: 3
   [junit4]   2> 487611 DEBUG (ScheduledTrigger-721-thread-3) [    ] o.a.s.c.a.NodeLostTrigger Running NodeLostTrigger: .auto_add_replicas with currently live nodes: 3 and last live nodes: 3
   [junit4]   2> 487611 DEBUG (ScheduledTrigger-721-thread-3) [    ] o.a.s.c.a.NodeAddedTrigger Running NodeAddedTrigger node_added_trigger
   [junit4]   2> 487611 DEBUG (ScheduledTrigger-721-thread-3) [    ] o.a.s.c.a.NodeAddedTrigger Found livenodes: 3
   [junit4]   2> 487631 DEBUG (ScheduledTrigger-721-thread-3) [    ] o.a.s.c.a.NodeLostTrigger Running NodeLostTrigger: .auto_add_replicas with currently live nodes: 3 and last live nodes: 3
   [junit4]   2> 487631 DEBUG (ScheduledTrigger-721-thread-3) [    ] o.a.s.c.a.NodeAddedTrigger Running NodeAddedTrigger node_added_trigger
   [junit4]   2> 487631 DEBUG (ScheduledTrigger-721-thread-3) [    ] o.a.s.c.a.NodeAddedTrigger Found livenodes: 3
   [junit4]   2> 487666 DEBUG (ScheduledTrigger-721-thread-3) [    ] o.a.s.c.a.NodeLostTrigger Running NodeLostTrigger: .auto_add_replicas with currently live nodes: 3 and last live nodes: 3
   [junit4]   2> 487666 DEBUG (ScheduledTrigger-721-thread-3) [    ] o.a.s.c.a.NodeAddedTrigger Running NodeAddedTrigger node_added_trigger
   [junit4]   2> 487666 DEBUG (ScheduledTrigger-721-thread-3) [    ] o.a.s.c.a.NodeAddedTrigger Found livenodes: 3
   [junit4]   2> 487702 DEBUG (ScheduledTrigger-721-thread-3) [    ] o.a.s.c.a.NodeLostTrigger Running NodeLostTrigger: .auto_add_replicas with currently live nodes: 3 and last live nodes: 3
   [junit4]   2> 487702 DEBUG (ScheduledTrigger-721-thread-1) [    ] o.a.s.c.a.NodeAddedTrigger Running NodeAddedTrigger node_added_trigger
   [junit4]   2> 487702 DEBUG (ScheduledTrigger-721-thread-1) [    ] o.a.s.c.a.NodeAddedTrigger Found livenodes: 3
   [junit4]   2> 487729 DEBUG (TEST-TestSimTriggerIntegration.testListeners-seed#[4B417783C94DB770]) [    ] o.a.s.c.a.ScheduledTriggers Shutting down scheduled thread pool executor now
   [junit4]   2> 487729 DEBUG (TEST-TestSimTriggerIntegration.testListeners-seed#[4B417783C94DB770]) [    ] o.a.s.c.a.ScheduledTriggers Shutting down action executor now
   [junit4]   2> 487729 DEBUG (TEST-TestSimTriggerIntegration.testListeners-seed#[4B417783C94DB770]) [    ] o.a.s.c.a.ScheduledTriggers Awaiting termination for action executor
   [junit4]   2> 487738 DEBUG (TEST-TestSimTriggerIntegration.testListeners-seed#[4B417783C94DB770]) [    ] o.a.s.c.a.ScheduledTriggers Awaiting termination for scheduled thread pool executor
   [junit4]   2> 487742 INFO  (Simulated OverseerAutoScalingTriggerThread) [    ] o.a.s.c.a.OverseerTriggerThread OverseerTriggerThread woken up but we are closed, exiting.
   [junit4]   2> 487816 DEBUG (TEST-TestSimTriggerIntegration.testListeners-seed#[4B417783C94DB770]) [    ] o.a.s.c.a.ScheduledTriggers ScheduledTriggers closed completely
   [junit4]   2> 487816 DEBUG (TEST-TestSimTriggerIntegration.testListeners-seed#[4B417783C94DB770]) [    ] o.a.s.c.a.OverseerTriggerThread OverseerTriggerThread has been closed explicitly
   [junit4]   2> 487818 INFO  (TEST-TestSimTriggerIntegration.testListeners-seed#[4B417783C94DB770]) [    ] o.a.s.SolrTestCaseJ4 ###Ending testListeners
   [junit4]   2> NOTE: reproduce with: ant test  -Dtestcase=TestSimTriggerIntegration -Dtests.method=testListeners -Dtests.seed=4B417783C94DB770 -Dtests.multiplier=2 -Dtests.slow=true -Dtests.locale=hi-IN -Dtests.timezone=Asia/Chongqing -Dtests.asserts=true -Dtests.file.encoding=UTF-8
   [junit4] FAILURE 2.34s J2 | TestSimTriggerIntegration.testListeners <<<
   [junit4]    > Throwable #1: java.lang.AssertionError: foo events: [CapturedEvent{timestamp=28706310421991774, stage=STARTED, actionName='null', event={
   [junit4]    >   "id":"65fc36b581d702T52kjhwk84nabtnuo6gif38c0u",
   [junit4]    >   "source":"node_added_trigger",
   [junit4]    >   "eventTime":28706284551395074,
   [junit4]    >   "eventType":"NODEADDED",
   [junit4]    >   "properties":{
   [junit4]    >     "eventTimes":[28706284551395074],
   [junit4]    >     "preferredOperation":"movereplica",
   [junit4]    >     "_enqueue_time_":28706286851248824,
   [junit4]    >     "nodeNames":["127.0.0.1:10002_solr"]}}, context={}, config={
   [junit4]    >   "trigger":"node_added_trigger",
   [junit4]    >   "stage":[
   [junit4]    >     "STARTED",
   [junit4]    >     "ABORTED",
   [junit4]    >     "SUCCEEDED",
   [junit4]    >     "FAILED"],
   [junit4]    >   "beforeAction":"test",
   [junit4]    >   "afterAction":[
   [junit4]    >     "test",
   [junit4]    >     "test1"],
   [junit4]    >   "class":"org.apache.solr.cloud.autoscaling.sim.TestSimTriggerIntegration$TestTriggerListener"}, message='null'}, CapturedEvent{timestamp=28706314848845024, stage=BEFORE_ACTION, actionName='test', event={
   [junit4]    >   "id":"65fc36b581d702T52kjhwk84nabtnuo6gif38c0u",
   [junit4]    >   "source":"node_added_trigger",
   [junit4]    >   "eventTime":28706284551395074,
   [junit4]    >   "eventType":"NODEADDED",
   [junit4]    >   "properties":{
   [junit4]    >     "eventTimes":[28706284551395074],
   [junit4]    >     "preferredOperation":"movereplica",
   [junit4]    >     "_enqueue_time_":28706286851248824,
   [junit4]    >     "nodeNames":["127.0.0.1:10002_solr"]}}, context={properties.BEFORE_ACTION=[test, test1], source=node_added_trigger}, config={
   [junit4]    >   "trigger":"node_added_trigger",
   [junit4]    >   "stage":[
   [junit4]    >     "STARTED",
   [junit4]    >     "ABORTED",
   [junit4]    >     "SUCCEEDED",
   [junit4]    >     "FAILED"],
   [junit4]    >   "beforeAction":"test",
   [junit4]    >   "afterAction":[
   [junit4]    >     "test",
   [junit4]    >     "test1"],
   [junit4]    >   "class":"org.apache.solr.cloud.autoscaling.sim.TestSimTriggerIntegration$TestTriggerListener"}, message='null'}, CapturedEvent{timestamp=28706318522692724, stage=AFTER_ACTION, actionName='test', event={
   [junit4]    >   "id":"65fc36b581d702T52kjhwk84nabtnuo6gif38c0u",
   [junit4]    >   "source":"node_added_trigger",
   [junit4]    >   "eventTime":28706284551395074,
   [junit4]    >   "eventType":"NODEADDED",
   [junit4]    >   "properties":{
   [junit4]    >     "eventTimes":[28706284551395074],
   [junit4]    >     "preferredOperation":"movereplica",
   [junit4]    >     "_enqueue_time_":28706286851248824,
   [junit4]    >     "nodeNames":["127.0.0.1:10002_solr"]}}, context={properties.BEFORE_ACTION=[test, test1], source=node_added_trigger, properties.AFTER_ACTION=[test, test1]}, config={
   [junit4]    >   "trigger":"node_added_trigger",
   [junit4]    >   "stage":[
   [junit4]    >     "STARTED",
   [junit4]    >     "ABORTED",
   [junit4]    >     "SUCCEEDED",
   [junit4]    >     "FAILED"],
   [junit4]    >   "beforeAction":"test",
   [junit4]    >   "afterAction":[
   [junit4]    >     "test",
   [junit4]    >     "test1"],
   [junit4]    >   "class":"org.apache.solr.cloud.autoscaling.sim.TestSimTriggerIntegration$TestTriggerListener"}, message='null'}, CapturedEvent{timestamp=28706318524674574, stage=AFTER_ACTION, actionName='test1', event={
   [junit4]    >   "id":"65fc36b581d702T52kjhwk84nabtnuo6gif38c0u",
   [junit4]    >   "source":"node_added_trigger",
   [junit4]    >   "eventTime":28706284551395074,
   [junit4]    >   "eventType":"NODEADDED",
   [junit4]    >   "properties":{
   [junit4]    >     "eventTimes":[28706284551395074],
   [junit4]    >     "preferredOperation":"movereplica",
   [junit4]    >     "_enqueue_time_":28706286851248824,
   [junit4]    >     "nodeNames":["127.0.0.1:10002_solr"]}}, context={properties.BEFORE_ACTION=[test, test1], source=node_added_trigger, properties.AFTER_ACTION=[test, test1]}, config={
   [junit4]    >   "trigger":"node_added_trigger",
   [junit4]    >   "stage":[
   [junit4]    >     "STARTED",
   [junit4]    >     "ABORTED",
   [junit4]    >     "SUCCEEDED",
   [junit4]    >     "FAILED"],
   [junit4]    >   "beforeAction":"test",
   [junit4]    >   "afterAction":[
   [junit4]    >     "test",
   [junit4]    >     "test1"],
   [junit4]    >   "class":"org.apache.solr.cloud.autoscaling.sim.TestSimTriggerIntegration$TestTriggerListener"}, message='null'}] expected:<5> but was:<4>
   [junit4]    > 	at __randomizedtesting.SeedInfo.seed([4B417783C94DB770:A681E09374212AA9]:0)
   [junit4]    > 	at org.apache.solr.cloud.autoscaling.sim.TestSimTriggerIntegration.testListeners(TestSimTriggerIntegration.java:1016)
   [junit4]    > 	at java.lang.Thread.run(Thread.java:748)
   [junit4]   2> 488330 INFO  (TEST-TestSimTriggerIntegration.testNodeLostTriggerRestoreState-seed#[4B417783C94DB770]) [    ] o.a.s.SolrTestCaseJ4 ###Starting testNodeLostTriggerRestoreState
   [junit4]   2> 488382 DEBUG (TEST-TestSimTriggerIntegration.testNodeLostTriggerRestoreState-seed#[4B417783C94DB770]) [    ] o.a.s.c.a.s.SimClusterStateProvider --- new Overseer leader: 127.0.0.1:10003_solr
   [junit4]   2> 488399 DEBUG (TEST-TestSimTriggerIntegration.testNodeLostTriggerRestoreState-seed#[4B417783C94DB770]) [    ] o.a.s.c.a.s.SimClusterStateProvider ** creating new collection states, currentVersion=0
   [junit4]   2> 488399 DEBUG (TEST-TestSimTriggerIntegration.testNodeLostTriggerRestoreState-seed#[4B417783C94DB770]) [    ] o.a.s.c.a.s.SimClusterStateProvider ** saved cluster state version 0
   [junit4]   2> 488399 INFO  (TEST-TestSimTriggerIntegration.testNodeLostTriggerRestoreState-seed#[4B417783C94DB770]) [    ] o.a.s.h.a.MetricsHistoryHandler No .system collection, keeping metrics history in memory.
   [junit4]   2> 488399 DEBUG (Simulated OverseerAutoScalingTriggerThread) [    ] o.a.s.c.a.OverseerTriggerThread Adding .auto_add_replicas and .scheduled_maintenance triggers
   [junit4]   2> 488399 DEBUG (Simulated OverseerAutoScalingTriggerThread) [    ] o.a.s.c.a.OverseerTriggerThread Refreshing /autoscaling.json with znode version 1
   [junit4]   2> 488400 DEBUG (Simulated OverseerAutoScalingTriggerThread) [    ] o.a.s.c.a.OverseerTriggerThread Current znodeVersion 1, lastZnodeVersion 0
   [junit4]   2> 488400 DEBUG (Simulated OverseerAutoScalingTriggerThread) [    ] o.a.s.c.a.OverseerTriggerThread Processed trigger updates upto znodeVersion 1
   [junit4]   2> 488419 DEBUG (Simulated OverseerAutoScalingTriggerThread) [    ] o.a.s.c.a.NodeLostTrigger NodeLostTrigger .auto_add_replicas - Initial livenodes: [127.0.0.1:10004_solr, 127.0.0.1:10003_solr]
   [junit4]   2> 488420 DEBUG (Simulated OverseerAutoScalingTriggerThread) [    ] o.a.s.c.a.OverseerTriggerThread -- cleaning old nodeLost / nodeAdded markers
   [junit4]   2> 488420 DEBUG (Simulated OverseerAutoScalingTriggerThread) [    ] o.a.s.c.a.OverseerTriggerThread Current znodeVersion 1, lastZnodeVersion 1
   [junit4]   2> 488420 DEBUG (ScheduledTrigger-727-thread-2) [    ] o.a.s.c.a.NodeLostTrigger Running NodeLostTrigger: .auto_add_replicas with currently live nodes: 2 and last live nodes: 2
   [junit4]   2> 488422 DEBUG (simCloudManagerPool-726-thread-3) [    ] o.a.s.c.a.AutoScalingHandler Verified autoscaling configuration
   [junit4]   2> 488422 DEBUG (simCloudManagerPool-726-thread-3) [    ] o.a.s.c.a.OverseerTriggerThread Refreshing /autoscaling.json with znode version 2
   [junit4]   2> 488459 DEBUG (Simulated OverseerAutoScalingTriggerThread) [    ] o.a.s.c.a.OverseerTriggerThread Processed trigger updates upto znodeVersion 2
   [junit4]   2> 488475 DEBUG (Simulated OverseerAutoScalingTriggerThread) [    ] o.a.s.c.a.OverseerTriggerThread -- cleaning old nodeLost / nodeAdded markers
   [junit4]   2> 488475 DEBUG (Simulated OverseerAutoScalingTriggerThread) [    ] o.a.s.c.a.OverseerTriggerThread Current znodeVersion 2, lastZnodeVersion 2
   [junit4]   2> 488475 DEBUG (ScheduledTrigger-727-thread-1) [    ] o.a.s.c.a.NodeLostTrigger Running NodeLostTrigger: .auto_add_replicas with currently live nodes: 3 and last live nodes: 2
   [junit4]   2> 488493 DEBUG (simCloudManagerPool-726-thread-4) [    ] o.a.s.c.a.AutoScalingHandler Verified autoscaling configuration
   [junit4]   2> 488493 DEBUG (simCloudManagerPool-726-thread-4) [    ] o.a.s.c.a.OverseerTriggerThread Refreshing /autoscaling.json with znode version 3
   [junit4]   2> 488494 DEBUG (Simulated OverseerAutoScalingTriggerThread) [    ] o.a.s.c.a.OverseerTriggerThread Processed trigger updates upto znodeVersion 3
   [junit4]   2> 488494 INFO  (Simulated OverseerAutoScalingTriggerThread) [    ] o.a.s.c.a.s.TestSimTriggerIntegration TestTriggerAction init
   [junit4]   2> 488494 DEBUG (Simulated OverseerAutoScalingTriggerThread) [    ] o.a.s.c.a.NodeLostTrigger NodeLostTrigger node_lost_restore_trigger - Initial livenodes: [127.0.0.1:10004_solr, 127.0.0.1:10005_solr, 127.0.0.1:10003_solr]
   [junit4]   2> 488494 DEBUG (Simulated OverseerAutoScalingTriggerThread) [    ] o.a.s.c.a.OverseerTriggerThread -- cleaning old nodeLost / nodeAdded markers
   [junit4]   2> 488494 DEBUG (Simulated OverseerAutoScalingTriggerThread) [    ] o.a.s.c.a.OverseerTriggerThread Current znodeVersion 3, lastZnodeVersion 3
   [junit4]   2> 488495 DEBUG (ScheduledTrigger-727-thread-2) [    ] o.a.s.c.a.NodeLostTrigger Running NodeLostTrigger: node_lost_restore_trigger with currently live nodes: 3 and last live nodes: 3
   [junit4]   2> 488509 DEBUG (TEST-TestSimTriggerIntegration.testNodeLostTriggerRestoreState-seed#[4B417783C94DB770]) [    ] o.a.s.c.a.s.SimClusterStateProvider  -- created marker: /autoscaling/nodeLost/127.0.0.1:10005_solr
   [junit4]   2> 488528 DEBUG (ScheduledTrigger-727-thread-2) [    ] o.a.s.c.a.NodeLostTrigger Running NodeLostTrigger: node_lost_restore_trigger with currently live nodes: 2 and last live nodes: 3
   [junit4]   2> 488528 DEBUG (ScheduledTrigger-727-thread-2) [    ] o.a.s.c.a.NodeLostTrigger Tracking lost node: 127.0.0.1:10005_solr
   [junit4]   2> 488529 DEBUG (ScheduledTrigger-727-thread-4) [    ] o.a.s.c.a.NodeLostTrigger Running NodeLostTrigger: .auto_add_replicas with currently live nodes: 2 and last live nodes: 3
   [junit4]   2> 488529 DEBUG (ScheduledTrigger-727-thread-4) [    ] o.a.s.c.a.NodeLostTrigger Tracking lost node: 127.0.0.1:10005_solr
   [junit4]   2> 488565 DEBUG (ScheduledTrigger-727-thread-2) [    ] o.a.s.c.a.NodeLostTrigger Running NodeLostTrigger: node_lost_restore_trigger with currently live nodes: 2 and last live nodes: 2
   [junit4]   2> 488565 DEBUG (ScheduledTrigger-727-thread-3) [    ] o.a.s.c.a.NodeLostTrigger Running NodeLostTrigger: .auto_add_replicas with currently live nodes: 2 and last live nodes: 2
   [junit4]   2> 488585 DEBUG (ScheduledTrigger-727-thread-2) [    ] o.a.s.c.a.NodeLostTrigger Running NodeLostTrigger: node_lost_restore_trigger with currently live nodes: 2 and last live nodes: 2
   [junit4]   2> 488585 DEBUG (ScheduledTrigger-727-thread-2) [    ] o.a.s.c.a.NodeLostTrigger Running NodeLostTrigger: .auto_add_replicas with currently live nodes: 2 and last live nodes: 2
   [junit4]   2> 488605 DEBUG (ScheduledTrigger-727-thread-2) [    ] o.a.s.c.a.NodeLostTrigger Running NodeLostTrigger: node_lost_restore_trigger with currently live nodes: 2 and last live nodes: 2
   [junit4]   2> 488605 DEBUG (ScheduledTrigger-727-thread-2) [    ] o.a.s.c.a.NodeLostTrigger Running NodeLostTrigger: .auto_add_replicas with currently live nodes: 2 and last live nodes: 2
   [junit4]   2> 488618 DEBUG (simCloudManagerPool-726-thread-5) [    ] o.a.s.c.a.AutoScalingHandler Verified autoscaling configuration
   [junit4]   2> 488618 DEBUG (simCloudManagerPool-726-thread-5) [    ] o.a.s.c.a.OverseerTriggerThread Refreshing /autoscaling.json with znode version 4
   [junit4]   2> 488620 DEBUG (Simulated OverseerAutoScalingTriggerThread) [    ] o.a.s.c.a.OverseerTriggerThread Processed trigger updates upto znodeVersion 4
   [junit4]   2> 488621 INFO  (Simulated OverseerAutoScalingTriggerThread) [    ] o.a.s.c.a.s.TestSimTriggerIntegration TestTriggerAction init
   [junit4]   2> 488621 DEBUG (Simulated OverseerAutoScalingTriggerThread) [    ] o.a.s.c.a.NodeLostTrigger NodeLostTrigger node_lost_restore_trigger - Initial livenodes: [127.0.0.1:10004_solr, 127.0.0.1:10003_solr]
   [junit4]   2> 488621 DEBUG (Simulated OverseerAutoScalingTriggerThread) [    ] o.a.s.c.a.OverseerTriggerThread -- cleaning old nodeLost / nodeAdded markers
   [junit4]   2> 488621 DEBUG (Simulated OverseerAutoScalingTriggerThread) [    ] o.a.s.c.a.OverseerTriggerThread Current znodeVersion 4, lastZnodeVersion 4
   [junit4]   2> 488621 DEBUG (ScheduledTrigger-727-thread-3) [    ] o.a.s.c.a.NodeLostTrigger Running NodeLostTrigger: node_lost_restore_trigger with currently live nodes: 2 and last live nodes: 2
   [junit4]   2> 488638 DEBUG (ScheduledTrigger-727-thread-3) [    ] o.a.s.c.a.NodeLostTrigger NodeLostTrigger firing registered processor for lost nodes: [127.0.0.1:10005_solr]
   [junit4]   2> 488638 DEBUG (ScheduledTrigger-727-thread-2) [    ] o.a.s.c.a.NodeLostTrigger Running NodeLostTrigger: .auto_add_replicas with currently live nodes: 2 and last live nodes: 2
   [junit4]   2> 488638 DEBUG (ScheduledTrigger-727-thread-3) [    ] o.a.s.c.a.ScheduledTriggers ++++++++ Cooldown inactive - processing event: {
   [junit4]   2>   "id":"65fc4bb9469688T52kjhwk84nabtnuo6gif38c0y",
   [junit4]   2>   "source":"node_lost_restore_trigger",
   [junit4]   2>   "eventTime":28706374808934024,
   [junit4]   2>   "eventType":"NODELOST",
   [junit4]   2>   "properties":{
   [junit4]   2>     "eventTimes":[28706374808934024],
   [junit4]   2>     "preferredOperation":"movereplica",
   [junit4]   2>     "nodeNames":["127.0.0.1:10005_solr"]}}
   [junit4]   2> 488638 DEBUG (ScheduledTrigger-727-thread-3) [    ] o.a.s.c.a.ScheduledTriggers Pausing all triggers: [.auto_add_replicas, node_lost_restore_trigger]
   [junit4]   2> 488639 DEBUG (simCloudManagerPool-726-thread-6) [    ] o.a.s.c.a.s.SimClusterStateProvider -- simCreateCollection .system, currentVersion=1
   [junit4]   2> 488639 DEBUG (simCloudManagerPool-726-thread-6) [    ] o.a.s.c.a.s.SimClusterStateProvider ** creating new collection states, currentVersion=1
   [junit4]   2> 488639 DEBUG (simCloudManagerPool-726-thread-6) [    ] o.a.s.c.a.s.SimClusterStateProvider ** saved cluster state version 1
   [junit4]   2> 488650 DEBUG (simCloudManagerPool-726-thread-6) [    ] o.a.s.c.a.s.SimClusterStateProvider ** creating new collection states, currentVersion=2
   [junit4]   2> 488650 DEBUG (simCloudManagerPool-726-thread-6) [    ] o.a.s.c.a.s.SimClusterStateProvider ** saved cluster state version 2
   [junit4]   2> 488666 DEBUG (simCloudManagerPool-726-thread-7) [    ] o.a.s.c.a.s.SimClusterStateProvider ** creating new collection states, currentVersion=3
   [junit4]   2> 488666 DEBUG (simCloudManagerPool-726-thread-7) [    ] o.a.s.c.a.s.SimClusterStateProvider ** saved cluster state version 3
   [junit4]   2> 488671 DEBUG (simCloudManagerPool-726-thread-9) [    ] o.a.s.c.a.s.SimClusterStateProvider -- elected new leader for .system / shard1 (currentVersion=4): {"core_node1":{
   [junit4]   2>     "core":".system_shard1_replica_n1",
   [junit4]   2>     "shard":"shard1",
   [junit4]   2>     "collection":".system",
   [junit4]   2>     "node_name":"127.0.0.1:10003_solr",
   [junit4]   2>     "type":"NRT",
   [junit4]   2>     "leader":"true",
   [junit4]   2>     "SEARCHER.searcher.maxDoc":0,
   [junit4]   2>     "SEARCHER.searcher.deletedDocs":0,
   [junit4]   2>     "INDEX.sizeInBytes":10240,
   [junit4]   2>     "state":"active",
   [junit4]   2>     "INDEX.sizeInGB":9.5367431640625E-6,
   [junit4]   2>     "SEARCHER.searcher.numDocs":0}}
   [junit4]   2> 488690 DEBUG (simCloudManagerPool-726-thread-8) [    ] o.a.s.c.a.s.SimClusterStateProvider ** creating new collection states, currentVersion=4
   [junit4]   2> 488690 DEBUG (simCloudManagerPool-726-thread-8) [    ] o.a.s.c.a.s.SimClusterStateProvider ** saved cluster state version 4
   [junit4]   2> 488691 DEBUG (simCloudManagerPool-726-thread-6) [    ] o.a.s.c.a.s.SimClusterStateProvider -- finished createCollection .system, currentVersion=5
   [junit4]   2> 488708 DEBUG (AutoscalingActionExecutor-728-thread-1) [    ] o.a.s.c.a.ScheduledTriggers -- processing actions for {
   [junit4]   2>   "id":"65fc4bb9469688T52kjhwk84nabtnuo6gif38c0y",
   [junit4]   2>   "source":"node_lost_restore_trigger",
   [junit4]   2>   "eventTime":28706374808934024,
   [junit4]   2>   "eventType":"NODELOST",
   [junit4]   2>   "properties":{
   [junit4]   2>     "eventTimes":[28706374808934024],
   [junit4]   2>     "preferredOperation":"movereplica",
   [junit4]   2>     "_enqueue_time_":28706380295458174,
   [junit4]   2>     "nodeNames":["127.0.0.1:10005_solr"]}}
   [junit4]   2> 488708 DEBUG (AutoscalingActionExecutor-728-thread-1) [    ] o.a.s.c.a.ScheduledTriggers Resuming trigger: .auto_add_replicas after 100ms
   [junit4]   2> 488709 DEBUG (AutoscalingActionExecutor-728-thread-1) [    ] o.a.s.c.a.ScheduledTriggers Resuming trigger: node_lost_restore_trigger after 100ms
   [junit4]   2> 488709 DEBUG (AutoscalingActionExecutor-728-thread-1) [    ] o.a.s.c.a.ScheduledTriggers -- processing took 48 ms for event id=65fc4bb9469688T52kjhwk84nabtnuo6gif38c0y
   [junit4]   2> 488727 INFO  (Simulated OverseerAutoScalingTriggerThread) [    ] o.a.s.c.a.OverseerTriggerThread OverseerTriggerThread woken up but we are closed, exiting.
   [junit4]   2> 488727 DEBUG (TEST-TestSimTriggerIntegration.testNodeLostTriggerRestoreState-seed#[4B417783C94DB770]) [    ] o.a.s.c.a.ScheduledTriggers Shutting down scheduled thread pool executor now
   [junit4]   2> 488727 DEBUG (TEST-TestSimTriggerIntegration.testNodeLostTriggerRestoreState-seed#[4B417783C94DB770]) [    ] o.a.s.c.a.ScheduledTriggers Shutting down action executor now
   [junit4]   2> 488727 DEBUG (TEST-TestSimTriggerIntegration.testNodeLostTriggerRestoreState-seed#[4B417783C94DB770]) [    ] o.a.s.c.a.ScheduledTriggers Awaiting termination for action executor
   [junit4]   2> 488727 DEBUG (TEST-TestSimTriggerIntegration.testNodeLostTriggerRestoreState-seed#[4B417783C94DB770]) [    ] o.a.s.c.a.ScheduledTriggers Awaiting termination for scheduled thread pool executor
   [junit4]   2> 488728 DEBUG (TEST-TestSimTriggerIntegration.testNodeLostTriggerRestoreState-seed#[4B417783C94DB770]) [    ] o.a.s.c.a.ScheduledTriggers ScheduledTriggers closed completely
   [junit4]   2> 488728 DEBUG (TEST-TestSimTriggerIntegration.testNodeLostTriggerRestoreState-seed#[4B417783C94DB770]) [    ] o.a.s.c.a.OverseerTriggerThread OverseerTriggerThread has been closed explicitly
   [junit4]   2> 488728 INFO  (TEST-TestSimTriggerIntegration.testNodeLostTriggerRestoreState-seed#[4B417783C94DB770]) [    ] o.a.s.SolrTestCaseJ4 ###Ending testNodeLostTriggerRestoreState
   [junit4]   2> NOTE: leaving temporary files on disk at: /home/jenkins/jenkins-slave/workspace/Lucene-Solr-Tests-master/solr/build/solr-core/test/J2/temp/solr.cloud.autoscaling.sim.TestSimTriggerIntegration_4B417783C94DB770-001
   [junit4]   2> NOTE: test params are: codec=CheapBastard, sim=Asserting(org.apache.lucene.search.similarities.AssertingSimilarity@63757c22), locale=hi-IN, timezone=Asia/Chongqing
   [junit4]   2> NOTE: Linux 4.4.0-112-generic amd64/Oracle Corporation 1.8.0_191 (64-bit)/cpus=4,threads=1,free=175961968,total=533725184
   [junit4]   2> NOTE: All tests run in this JVM: [TestBM25SimilarityFactory, TestNestedUpdateProcessor, TestRetrieveFieldsOptimizer, TestNestedDocsSort, CollectionStateFormat2Test, SpellingQueryConverterTest, TestTrie, MigrateRouteKeyTest, TestSchemaVersionResource, TestCloudInspectUtil, DistributedMLTComponentTest, TestSizeLimitedDistributedMap, TestLeaderElectionWithEmptyReplica, TestFieldResource, TestHttpShardHandlerFactory, ExternalFileFieldSortTest, TestDFRSimilarityFactory, CoreAdminRequestStatusTest, DeleteNodeTest, CollectionsAPIAsyncDistributedZkTest, TestNumericRangeQuery32, QueryResultKeyTest, TestPerFieldSimilarity, TestLegacyNumericUtils, TestHashQParserPlugin, TestJoin, TestSimTriggerIntegration]
   [junit4] Completed [70/837 (1!)] on J2 in 3.79s, 11 tests, 1 failure, 9 skipped <<< FAILURES!

[...truncated 51686 lines...]
[asciidoctor:convert] asciidoctor: ERROR: about-this-guide.adoc: line 1: invalid part, must have at least one section (e.g., chapter, appendix, etc.)
[asciidoctor:convert] asciidoctor: ERROR: solr-glossary.adoc: line 1: invalid part, must have at least one section (e.g., chapter, appendix, etc.)
     [java] Processed 2464 links (2015 relative) to 3226 anchors in 248 files
     [echo] Validated Links & Anchors via: /home/jenkins/jenkins-slave/workspace/Lucene-Solr-Tests-master/solr/build/solr-ref-guide/bare-bones-html/

-documentation-lint:
    [jtidy] Checking for broken html (such as invalid tags)...
   [delete] Deleting directory /home/jenkins/jenkins-slave/workspace/Lucene-Solr-Tests-master/lucene/build/jtidy_tmp
     [echo] Checking for broken links...
     [exec] 
     [exec] Crawl/parse...
     [exec] 
     [exec] Verify...
     [echo] Checking for malformed docs...

jar-checksums:

resolve:

ivy-availability-check:
[loadresource] Do not set property disallowed.ivy.jars.list as its length is 0.

-ivy-fail-disallowed-ivy-version:

ivy-fail:

ivy-configure:
[ivy:configure] :: loading settings :: file = /home/jenkins/jenkins-slave/workspace/Lucene-Solr-Tests-master/lucene/top-level-ivy-settings.xml

resolve:

ivy-availability-check:
[loadresource] Do not set property disallowed.ivy.jars.list as its length is 0.

-ivy-fail-disallowed-ivy-version:

ivy-fail:

ivy-configure:
[ivy:configure] :: loading settings :: file = /home/jenkins/jenkins-slave/workspace/Lucene-Solr-Tests-master/lucene/top-level-ivy-settings.xml

resolve:

resolve:

ivy-availability-check:
[loadresource] Do not set property disallowed.ivy.jars.list as its length is 0.

-ivy-fail-disallowed-ivy-version:

ivy-fail:

ivy-configure:
[ivy:configure] :: loading settings :: file = /home/jenkins/jenkins-slave/workspace/Lucene-Solr-Tests-master/lucene/top-level-ivy-settings.xml

resolve:

ivy-availability-check:
[loadresource] Do not set property disallowed.ivy.jars.list as its length is 0.

-ivy-fail-disallowed-ivy-version:

ivy-fail:

ivy-configure:
[ivy:configure] :: loading settings :: file = /home/jenkins/jenkins-slave/workspace/Lucene-Solr-Tests-master/lucene/top-level-ivy-settings.xml

resolve:

ivy-availability-check:
[loadresource] Do not set property disallowed.ivy.jars.list as its length is 0.

-ivy-fail-disallowed-ivy-version:

ivy-fail:

ivy-configure:
[ivy:configure] :: loading settings :: file = /home/jenkins/jenkins-slave/workspace/Lucene-Solr-Tests-master/lucene/top-level-ivy-settings.xml

resolve:

ivy-availability-check:
[loadresource] Do not set property disallowed.ivy.jars.list as its length is 0.

-ivy-fail-disallowed-ivy-version:

ivy-fail:

ivy-configure:
[ivy:configure] :: loading settings :: file = /home/jenkins/jenkins-slave/workspace/Lucene-Solr-Tests-master/lucene/top-level-ivy-settings.xml

resolve:

ivy-availability-check:
[loadresource] Do not set property disallowed.ivy.jars.list as its length is 0.

-ivy-fail-disallowed-ivy-version:

ivy-fail:

ivy-configure:
[ivy:configure] :: loading settings :: file = /home/jenkins/jenkins-slave/workspace/Lucene-Solr-Tests-master/lucene/top-level-ivy-settings.xml

resolve:

ivy-availability-check:
[loadresource] Do not set property disallowed.ivy.jars.list as its length is 0.

-ivy-fail-disallowed-ivy-version:

ivy-fail:

ivy-configure:
[ivy:configure] :: loading settings :: file = /home/jenkins/jenkins-slave/workspace/Lucene-Solr-Tests-master/lucene/top-level-ivy-settings.xml

resolve:

ivy-availability-check:
[loadresource] Do not set property disallowed.ivy.jars.list as its length is 0.

-ivy-fail-disallowed-ivy-version:

ivy-fail:

ivy-configure:
[ivy:configure] :: loading settings :: file = /home/jenkins/jenkins-slave/workspace/Lucene-Solr-Tests-master/lucene/top-level-ivy-settings.xml

resolve:

ivy-availability-check:
[loadresource] Do not set property disallowed.ivy.jars.list as its length is 0.

-ivy-fail-disallowed-ivy-version:

ivy-fail:

ivy-configure:
[ivy:configure] :: loading settings :: file = /home/jenkins/jenkins-slave/workspace/Lucene-Solr-Tests-master/lucene/top-level-ivy-settings.xml

resolve:

ivy-availability-check:
[loadresource] Do not set property disallowed.ivy.jars.list as its length is 0.

-ivy-fail-disallowed-ivy-version:

ivy-fail:

ivy-configure:
[ivy:configure] :: loading settings :: file = /home/jenkins/jenkins-slave/workspace/Lucene-Solr-Tests-master/lucene/top-level-ivy-settings.xml

resolve:

ivy-availability-check:
[loadresource] Do not set property disallowed.ivy.jars.list as its length is 0.

-ivy-fail-disallowed-ivy-version:

ivy-fail:

ivy-configure:
[ivy:configure] :: loading settings :: file = /home/jenkins/jenkins-slave/workspace/Lucene-Solr-Tests-master/lucene/top-level-ivy-settings.xml

resolve:

ivy-availability-check:
[loadresource] Do not set property disallowed.ivy.jars.list as its length is 0.

-ivy-fail-disallowed-ivy-version:

ivy-fail:

ivy-configure:
[ivy:configure] :: loading settings :: file = /home/jenkins/jenkins-slave/workspace/Lucene-Solr-Tests-master/lucene/top-level-ivy-settings.xml

resolve:

ivy-availability-check:
[loadresource] Do not set property disallowed.ivy.jars.list as its length is 0.

-ivy-fail-disallowed-ivy-version:

ivy-fail:

ivy-configure:
[ivy:configure] :: loading settings :: file = /home/jenkins/jenkins-slave/workspace/Lucene-Solr-Tests-master/lucene/top-level-ivy-settings.xml

resolve:

ivy-availability-check:
[loadresource] Do not set property disallowed.ivy.jars.list as its length is 0.

-ivy-fail-disallowed-ivy-version:

ivy-fail:

ivy-configure:
[ivy:configure] :: loading settings :: file = /home/jenkins/jenkins-slave/workspace/Lucene-Solr-Tests-master/lucene/top-level-ivy-settings.xml

resolve:

ivy-availability-check:
[loadresource] Do not set property disallowed.ivy.jars.list as its length is 0.

-ivy-fail-disallowed-ivy-version:

ivy-fail:

ivy-configure:
[ivy:configure] :: loading settings :: file = /home/jenkins/jenkins-slave/workspace/Lucene-Solr-Tests-master/lucene/top-level-ivy-settings.xml

resolve:

ivy-availability-check:
[loadresource] Do not set property disallowed.ivy.jars.list as its length is 0.

-ivy-fail-disallowed-ivy-version:

ivy-fail:

ivy-configure:
[ivy:configure] :: loading settings :: file = /home/jenkins/jenkins-slave/workspace/Lucene-Solr-Tests-master/lucene/top-level-ivy-settings.xml

resolve:

ivy-availability-check:
[loadresource] Do not set property disallowed.ivy.jars.list as its length is 0.

-ivy-fail-disallowed-ivy-version:

ivy-fail:

ivy-configure:
[ivy:configure] :: loading settings :: file = /home/jenkins/jenkins-slave/workspace/Lucene-Solr-Tests-master/lucene/top-level-ivy-settings.xml

resolve:

ivy-availability-check:
[loadresource] Do not set property disallowed.ivy.jars.list as its length is 0.

-ivy-fail-disallowed-ivy-version:

ivy-fail:

ivy-configure:
[ivy:configure] :: loading settings :: file = /home/jenkins/jenkins-slave/workspace/Lucene-Solr-Tests-master/lucene/top-level-ivy-settings.xml

resolve:

ivy-availability-check:
[loadresource] Do not set property disallowed.ivy.jars.list as its length is 0.

-ivy-fail-disallowed-ivy-version:

ivy-fail:

ivy-configure:
[ivy:configure] :: loading settings :: file = /home/jenkins/jenkins-slave/workspace/Lucene-Solr-Tests-master/lucene/top-level-ivy-settings.xml

resolve:

ivy-availability-check:
[loadresource] Do not set property disallowed.ivy.jars.list as its length is 0.

-ivy-fail-disallowed-ivy-version:

ivy-fail:

ivy-configure:
[ivy:configure] :: loading settings :: file = /home/jenkins/jenkins-slave/workspace/Lucene-Solr-Tests-master/lucene/top-level-ivy-settings.xml

resolve:

ivy-availability-check:
[loadresource] Do not set property disallowed.ivy.jars.list as its length is 0.

-ivy-fail-disallowed-ivy-version:

ivy-fail:

ivy-configure:
[ivy:configure] :: loading settings :: file = /home/jenkins/jenkins-slave/workspace/Lucene-Solr-Tests-master/lucene/top-level-ivy-settings.xml

resolve:

ivy-availability-check:
[loadresource] Do not set property disallowed.ivy.jars.list as its length is 0.

-ivy-fail-disallowed-ivy-version:

ivy-fail:

ivy-configure:
[ivy:configure] :: loading settings :: file = /home/jenkins/jenkins-slave/workspace/Lucene-Solr-Tests-master/lucene/top-level-ivy-settings.xml

resolve:

ivy-availability-check:
[loadresource] Do not set property disallowed.ivy.jars.list as its length is 0.

-ivy-fail-disallowed-ivy-version:

ivy-fail:

ivy-configure:
[ivy:configure] :: loading settings :: file = /home/jenkins/jenkins-slave/workspace/Lucene-Solr-Tests-master/lucene/top-level-ivy-settings.xml

resolve:

ivy-availability-check:
[loadresource] Do not set property disallowed.ivy.jars.list as its length is 0.

-ivy-fail-disallowed-ivy-version:

ivy-fail:

ivy-configure:
[ivy:configure] :: loading settings :: file = /home/jenkins/jenkins-slave/workspace/Lucene-Solr-Tests-master/lucene/top-level-ivy-settings.xml

resolve:

ivy-availability-check:
[loadresource] Do not set property disallowed.ivy.jars.list as its length is 0.

-ivy-fail-disallowed-ivy-version:

ivy-fail:

ivy-configure:
[ivy:configure] :: loading settings :: file = /home/jenkins/jenkins-slave/workspace/Lucene-Solr-Tests-master/lucene/top-level-ivy-settings.xml

common.resolve:

resolve:

ivy-availability-check:
[loadresource] Do not set property disallowed.ivy.jars.list as its length is 0.

-ivy-fail-disallowed-ivy-version:

ivy-fail:

ivy-configure:
[ivy:configure] :: loading settings :: file = /home/jenkins/jenkins-slave/workspace/Lucene-Solr-Tests-master/lucene/top-level-ivy-settings.xml

resolve:

ivy-availability-check:
[loadresource] Do not set property disallowed.ivy.jars.list as its length is 0.

-ivy-fail-disallowed-ivy-version:

ivy-fail:

ivy-configure:
[ivy:configure] :: loading settings :: file = /home/jenkins/jenkins-slave/workspace/Lucene-Solr-Tests-master/lucene/top-level-ivy-settings.xml

resolve:

ivy-availability-check:
[loadresource] Do not set property disallowed.ivy.jars.list as its length is 0.

-ivy-fail-disallowed-ivy-version:

ivy-fail:

ivy-configure:
[ivy:configure] :: loading settings :: file = /home/jenkins/jenkins-slave/workspace/Lucene-Solr-Tests-master/lucene/top-level-ivy-settings.xml

resolve:

ivy-availability-check:
[loadresource] Do not set property disallowed.ivy.jars.list as its length is 0.

-ivy-fail-disallowed-ivy-version:

ivy-fail:

ivy-configure:
[ivy:configure] :: loading settings :: file = /home/jenkins/jenkins-slave/workspace/Lucene-Solr-Tests-master/lucene/top-level-ivy-settings.xml

resolve:

ivy-availability-check:
[loadresource] Do not set property disallowed.ivy.jars.list as its length is 0.

-ivy-fail-disallowed-ivy-version:

ivy-fail:

ivy-configure:
[ivy:configure] :: loading settings :: file = /home/jenkins/jenkins-slave/workspace/Lucene-Solr-Tests-master/lucene/top-level-ivy-settings.xml

resolve:

jar-checksums:
    [mkdir] Created dir: /home/jenkins/jenkins-slave/workspace/Lucene-Solr-Tests-master/lucene/null755413207
     [copy] Copying 36 files to /home/jenkins/jenkins-slave/workspace/Lucene-Solr-Tests-master/lucene/null755413207
   [delete] Deleting directory /home/jenkins/jenkins-slave/workspace/Lucene-Solr-Tests-master/lucene/null755413207

resolve-example:

ivy-availability-check:
[loadresource] Do not set property disallowed.ivy.jars.list as its length is 0.

-ivy-fail-disallowed-ivy-version:

ivy-fail:

ivy-configure:
[ivy:configure] :: loading settings :: file = /home/jenkins/jenkins-slave/workspace/Lucene-Solr-Tests-master/lucene/top-level-ivy-settings.xml

resolve:

resolve-server:

ivy-availability-check:
[loadresource] Do not set property disallowed.ivy.jars.list as its length is 0.

-ivy-fail-disallowed-ivy-version:

ivy-fail:

ivy-fail:

ivy-configure:
[ivy:configure] :: loading settings :: file = /home/jenkins/jenkins-slave/workspace/Lucene-Solr-Tests-master/lucene/top-level-ivy-settings.xml

resolve:

resolve:

ivy-availability-check:
[loadresource] Do not set property disallowed.ivy.jars.list as its length is 0.

-ivy-fail-disallowed-ivy-version:

ivy-fail:

ivy-fail:

ivy-configure:
[ivy:configure] :: loading settings :: file = /home/jenkins/jenkins-slave/workspace/Lucene-Solr-Tests-master/lucene/top-level-ivy-settings.xml

resolve:

ivy-availability-check:
[loadresource] Do not set property disallowed.ivy.jars.list as its length is 0.

-ivy-fail-disallowed-ivy-version:

ivy-fail:

ivy-fail:

ivy-configure:
[ivy:configure] :: loading settings :: file = /home/jenkins/jenkins-slave/workspace/Lucene-Solr-Tests-master/lucene/top-level-ivy-settings.xml

resolve:

ivy-availability-check:
[loadresource] Do not set property disallowed.ivy.jars.list as its length is 0.

-ivy-fail-disallowed-ivy-version:

ivy-fail:

ivy-configure:
[ivy:configure] :: loading settings :: file = /home/jenkins/jenkins-slave/workspace/Lucene-Solr-Tests-master/lucene/top-level-ivy-settings.xml

resolve:

ivy-availability-check:
[loadresource] Do not set property disallowed.ivy.jars.list as its length is 0.

-ivy-fail-disallowed-ivy-version:

ivy-fail:

ivy-fail:

ivy-configure:
[ivy:configure] :: loading settings :: file = /home/jenkins/jenkins-slave/workspace/Lucene-Solr-Tests-master/lucene/top-level-ivy-settings.xml

resolve:

ivy-availability-check:
[loadresource] Do not set property disallowed.ivy.jars.list as its length is 0.

-ivy-fail-disallowed-ivy-version:

ivy-fail:

ivy-configure:
[ivy:configure] :: loading settings :: file = /home/jenkins/jenkins-slave/workspace/Lucene-Solr-Tests-master/lucene/top-level-ivy-settings.xml

resolve:

ivy-availability-check:
[loadresource] Do not set property disallowed.ivy.jars.list as its length is 0.

-ivy-fail-disallowed-ivy-version:

ivy-fail:

ivy-fail:

ivy-configure:
[ivy:configure] :: loading settings :: file = /home/jenkins/jenkins-slave/workspace/Lucene-Solr-Tests-master/lucene/top-level-ivy-settings.xml

resolve:

ivy-availability-check:
[loadresource] Do not set property disallowed.ivy.jars.list as its length is 0.

-ivy-fail-disallowed-ivy-version:

ivy-fail:

ivy-fail:

ivy-configure:
[ivy:configure] :: loading settings :: file = /home/jenkins/jenkins-slave/workspace/Lucene-Solr-Tests-master/lucene/top-level-ivy-settings.xml

resolve:

ivy-availability-check:
[loadresource] Do not set property disallowed.ivy.jars.list as its length is 0.

-ivy-fail-disallowed-ivy-version:

ivy-fail:

ivy-fail:

ivy-configure:
[ivy:configure] :: loading settings :: file = /home/jenkins/jenkins-slave/workspace/Lucene-Solr-Tests-master/lucene/top-level-ivy-settings.xml

resolve:

ivy-availability-check:
[loadresource] Do not set property disallowed.ivy.jars.list as its length is 0.

-ivy-fail-disallowed-ivy-version:

ivy-fail:

ivy-fail:

ivy-configure:
[ivy:configure] :: loading settings :: file = /home/jenkins/jenkins-slave/workspace/Lucene-Solr-Tests-master/lucene/top-level-ivy-settings.xml

resolve:

ivy-availability-check:
[loadresource] Do not set property disallowed.ivy.jars.list as its length is 0.

-ivy-fail-disallowed-ivy-version:

ivy-fail:

ivy-fail:

ivy-configure:
[ivy:configure] :: loading settings :: file = /home/jenkins/jenkins-slave/workspace/Lucene-Solr-Tests-master/lucene/top-level-ivy-settings.xml

resolve:

ivy-availability-check:
[loadresource] Do not set property disallowed.ivy.jars.list as its length is 0.

-ivy-fail-disallowed-ivy-version:

ivy-fail:

ivy-fail:

ivy-configure:
[ivy:configure] :: loading settings :: file = /home/jenkins/jenkins-slave/workspace/Lucene-Solr-Tests-master/lucene/top-level-ivy-settings.xml

resolve:

ivy-availability-check:
[loadresource] Do not set property disallowed.ivy.jars.list as its length is 0.

-ivy-fail-disallowed-ivy-version:

ivy-fail:

ivy-fail:

ivy-configure:
[ivy:configure] :: loading settings :: file = /home/jenkins/jenkins-slave/workspace/Lucene-Solr-Tests-master/lucene/top-level-ivy-settings.xml

resolve:

ivy-availability-check:
[loadresource] Do not set property disallowed.ivy.jars.list as its length is 0.

-ivy-fail-disallowed-ivy-version:

ivy-fail:

ivy-fail:

ivy-configure:
[ivy:configure] :: loading settings :: file = /home/jenkins/jenkins-slave/workspace/Lucene-Solr-Tests-master/lucene/top-level-ivy-settings.xml

resolve:

ivy-availability-check:
[loadresource] Do not set property disallowed.ivy.jars.list as its length is 0.

-ivy-fail-disallowed-ivy-version:

ivy-fail:

ivy-fail:

ivy-configure:
[ivy:configure] :: loading settings :: file = /home/jenkins/jenkins-slave/workspace/Lucene-Solr-Tests-master/lucene/top-level-ivy-settings.xml

resolve:

ivy-availability-check:
[loadresource] Do not set property disallowed.ivy.jars.list as its length is 0.

-ivy-fail-disallowed-ivy-version:

ivy-fail:

ivy-fail:

ivy-configure:
[ivy:configure] :: loading settings :: file = /home/jenkins/jenkins-slave/workspace/Lucene-Solr-Tests-master/lucene/top-level-ivy-settings.xml

resolve:

jar-checksums:
    [mkdir] Created dir: /home/jenkins/jenkins-slave/workspace/Lucene-Solr-Tests-master/solr/null1159299881
     [copy] Copying 256 files to /home/jenkins/jenkins-slave/workspace/Lucene-Solr-Tests-master/solr/null1159299881
   [delete] Deleting directory /home/jenkins/jenkins-slave/workspace/Lucene-Solr-Tests-master/solr/null1159299881

check-working-copy:
[ivy:cachepath] :: resolving dependencies :: org.eclipse.jgit#org.eclipse.jgit-caller;working
[ivy:cachepath] 	confs: [default]
[ivy:cachepath] 	found org.eclipse.jgit#org.eclipse.jgit;4.6.0.201612231935-r in public
[ivy:cachepath] 	found com.jcraft#jsch;0.1.53 in public
[ivy:cachepath] 	found com.googlecode.javaewah#JavaEWAH;1.1.6 in public
[ivy:cachepath] 	found org.apache.httpcomponents#httpclient;4.3.6 in public
[ivy:cachepath] 	found org.apache.httpcomponents#httpcore;4.3.3 in public
[ivy:cachepath] 	found commons-logging#commons-logging;1.1.3 in public
[ivy:cachepath] 	found commons-codec#commons-codec;1.6 in public
[ivy:cachepath] 	found org.slf4j#slf4j-api;1.7.2 in public
[ivy:cachepath] :: resolution report :: resolve 60ms :: artifacts dl 1ms
	---------------------------------------------------------------------
	|                  |            modules            ||   artifacts   |
	|       conf       | number| search|dwnlded|evicted|| number|dwnlded|
	---------------------------------------------------------------------
	|      default     |   8   |   0   |   0   |   0   ||   8   |   0   |
	---------------------------------------------------------------------
[wc-checker] Initializing working copy...
[wc-checker] SLF4J: Failed to load class "org.slf4j.impl.StaticLoggerBinder".
[wc-checker] SLF4J: Defaulting to no-operation (NOP) logger implementation
[wc-checker] SLF4J: See http://www.slf4j.org/codes.html#StaticLoggerBinder for further details.
[wc-checker] Checking working copy status...

-jenkins-base:

BUILD SUCCESSFUL
Total time: 222 minutes 20 seconds
Archiving artifacts
java.lang.InterruptedException: no matches found within 10000
	at hudson.FilePath$ValidateAntFileMask.hasMatch(FilePath.java:2847)
	at hudson.FilePath$ValidateAntFileMask.invoke(FilePath.java:2726)
	at hudson.FilePath$ValidateAntFileMask.invoke(FilePath.java:2707)
	at hudson.FilePath$FileCallableWrapper.call(FilePath.java:3086)
Also:   hudson.remoting.Channel$CallSiteStackTrace: Remote call to lucene2
		at hudson.remoting.Channel.attachCallSiteStackTrace(Channel.java:1741)
		at hudson.remoting.UserRequest$ExceptionResponse.retrieve(UserRequest.java:357)
		at hudson.remoting.Channel.call(Channel.java:955)
		at hudson.FilePath.act(FilePath.java:1072)
		at hudson.FilePath.act(FilePath.java:1061)
		at hudson.FilePath.validateAntFileMask(FilePath.java:2705)
		at hudson.tasks.ArtifactArchiver.perform(ArtifactArchiver.java:243)
		at hudson.tasks.BuildStepCompatibilityLayer.perform(BuildStepCompatibilityLayer.java:81)
		at hudson.tasks.BuildStepMonitor$1.perform(BuildStepMonitor.java:20)
		at hudson.model.AbstractBuild$AbstractBuildExecution.perform(AbstractBuild.java:744)
		at hudson.model.AbstractBuild$AbstractBuildExecution.performAllBuildSteps(AbstractBuild.java:690)
		at hudson.model.Build$BuildExecution.post2(Build.java:186)
		at hudson.model.AbstractBuild$AbstractBuildExecution.post(AbstractBuild.java:635)
		at hudson.model.Run.execute(Run.java:1835)
		at hudson.model.FreeStyleBuild.run(FreeStyleBuild.java:43)
		at hudson.model.ResourceController.execute(ResourceController.java:97)
		at hudson.model.Executor.run(Executor.java:429)
Caused: hudson.FilePath$TunneledInterruptedException
	at hudson.FilePath$FileCallableWrapper.call(FilePath.java:3088)
	at hudson.remoting.UserRequest.perform(UserRequest.java:212)
	at hudson.remoting.UserRequest.perform(UserRequest.java:54)
	at hudson.remoting.Request$2.run(Request.java:369)
	at hudson.remoting.InterceptingExecutorService$1.call(InterceptingExecutorService.java:72)
	at java.util.concurrent.FutureTask.run(FutureTask.java:266)
	at java.util.concurrent.ThreadPoolExecutor.runWorker(ThreadPoolExecutor.java:1142)
	at java.util.concurrent.ThreadPoolExecutor$Worker.run(ThreadPoolExecutor.java:617)
	at java.lang.Thread.run(Thread.java:748)
Caused: java.lang.InterruptedException: java.lang.InterruptedException: no matches found within 10000
	at hudson.FilePath.act(FilePath.java:1074)
	at hudson.FilePath.act(FilePath.java:1061)
	at hudson.FilePath.validateAntFileMask(FilePath.java:2705)
	at hudson.tasks.ArtifactArchiver.perform(ArtifactArchiver.java:243)
	at hudson.tasks.BuildStepCompatibilityLayer.perform(BuildStepCompatibilityLayer.java:81)
	at hudson.tasks.BuildStepMonitor$1.perform(BuildStepMonitor.java:20)
	at hudson.model.AbstractBuild$AbstractBuildExecution.perform(AbstractBuild.java:744)
	at hudson.model.AbstractBuild$AbstractBuildExecution.performAllBuildSteps(AbstractBuild.java:690)
	at hudson.model.Build$BuildExecution.post2(Build.java:186)
	at hudson.model.AbstractBuild$AbstractBuildExecution.post(AbstractBuild.java:635)
	at hudson.model.Run.execute(Run.java:1835)
	at hudson.model.FreeStyleBuild.run(FreeStyleBuild.java:43)
	at hudson.model.ResourceController.execute(ResourceController.java:97)
	at hudson.model.Executor.run(Executor.java:429)
No artifacts found that match the file pattern "**/*.events,heapdumps/**,**/hs_err_pid*". Configuration error?
Recording test results
Build step 'Publish JUnit test result report' changed build result to UNSTABLE
Email was triggered for: Unstable (Test Failures)
Sending email for trigger: Unstable (Test Failures)

Mime
View raw message