lucene-dev mailing list archives

Site index · List index
Message view « Date » · « Thread »
Top « Date » · « Thread »
From Policeman Jenkins Server <jenk...@thetaphi.de>
Subject [JENKINS] Lucene-Solr-7.x-Windows (32bit/jdk1.8.0_172) - Build # 937 - Unstable!
Date Wed, 02 Jan 2019 06:19:28 GMT
Build: https://jenkins.thetaphi.de/job/Lucene-Solr-7.x-Windows/937/
Java: 32bit/jdk1.8.0_172 -server -XX:+UseParallelGC

5 tests failed.
FAILED:  junit.framework.TestSuite.org.apache.solr.core.TestNRTOpen

Error Message:
Could not remove the following files (in the order of attempts):    C:\Users\jenkins\workspace\Lucene-Solr-7.x-Windows\solr\build\solr-core\test\J0\temp\solr.core.TestNRTOpen_186C55E95182C85C-001\init-core-data-001: java.nio.file.AccessDeniedException: C:\Users\jenkins\workspace\Lucene-Solr-7.x-Windows\solr\build\solr-core\test\J0\temp\solr.core.TestNRTOpen_186C55E95182C85C-001\init-core-data-001    C:\Users\jenkins\workspace\Lucene-Solr-7.x-Windows\solr\build\solr-core\test\J0\temp\solr.core.TestNRTOpen_186C55E95182C85C-001: java.nio.file.DirectoryNotEmptyException: C:\Users\jenkins\workspace\Lucene-Solr-7.x-Windows\solr\build\solr-core\test\J0\temp\solr.core.TestNRTOpen_186C55E95182C85C-001 

Stack Trace:
java.io.IOException: Could not remove the following files (in the order of attempts):
   C:\Users\jenkins\workspace\Lucene-Solr-7.x-Windows\solr\build\solr-core\test\J0\temp\solr.core.TestNRTOpen_186C55E95182C85C-001\init-core-data-001: java.nio.file.AccessDeniedException: C:\Users\jenkins\workspace\Lucene-Solr-7.x-Windows\solr\build\solr-core\test\J0\temp\solr.core.TestNRTOpen_186C55E95182C85C-001\init-core-data-001
   C:\Users\jenkins\workspace\Lucene-Solr-7.x-Windows\solr\build\solr-core\test\J0\temp\solr.core.TestNRTOpen_186C55E95182C85C-001: java.nio.file.DirectoryNotEmptyException: C:\Users\jenkins\workspace\Lucene-Solr-7.x-Windows\solr\build\solr-core\test\J0\temp\solr.core.TestNRTOpen_186C55E95182C85C-001

	at __randomizedtesting.SeedInfo.seed([186C55E95182C85C]:0)
	at org.apache.lucene.util.IOUtils.rm(IOUtils.java:318)
	at org.apache.lucene.util.TestRuleTemporaryFilesCleanup.afterAlways(TestRuleTemporaryFilesCleanup.java:216)
	at com.carrotsearch.randomizedtesting.rules.TestRuleAdapter$1.afterAlways(TestRuleAdapter.java:31)
	at com.carrotsearch.randomizedtesting.rules.StatementAdapter.evaluate(StatementAdapter.java:43)
	at com.carrotsearch.randomizedtesting.rules.StatementAdapter.evaluate(StatementAdapter.java:36)
	at org.apache.lucene.util.TestRuleAssertionsRequired$1.evaluate(TestRuleAssertionsRequired.java:53)
	at org.apache.lucene.util.TestRuleMarkFailure$1.evaluate(TestRuleMarkFailure.java:47)
	at org.apache.lucene.util.TestRuleIgnoreAfterMaxFailures$1.evaluate(TestRuleIgnoreAfterMaxFailures.java:64)
	at org.apache.lucene.util.TestRuleIgnoreTestSuites$1.evaluate(TestRuleIgnoreTestSuites.java:54)
	at com.carrotsearch.randomizedtesting.rules.StatementAdapter.evaluate(StatementAdapter.java:36)
	at com.carrotsearch.randomizedtesting.ThreadLeakControl$StatementRunner.run(ThreadLeakControl.java:368)
	at java.lang.Thread.run(Thread.java:748)


FAILED:  org.apache.solr.handler.TestSQLHandler.doTest

Error Message:
--> http://127.0.0.1:64682/g_roe/collection1_shard2_replica_n6:Failed to execute sqlQuery 'select id, field_i, str_s, field_i_p, field_f_p, field_d_p, field_l_p from collection1 where (text='(XXXX)' OR text='XXXX') AND text='XXXX' order by field_i desc' against JDBC connection 'jdbc:calcitesolr:'. Error while executing SQL "select id, field_i, str_s, field_i_p, field_f_p, field_d_p, field_l_p from collection1 where (text='(XXXX)' OR text='XXXX') AND text='XXXX' order by field_i desc": java.io.IOException: java.util.concurrent.ExecutionException: java.io.IOException: --> http://127.0.0.1:64682/g_roe/collection1_shard2_replica_n6/:id{type=string,properties=indexed,stored,sortMissingLast,uninvertible} must have DocValues to use this feature.

Stack Trace:
java.io.IOException: --> http://127.0.0.1:64682/g_roe/collection1_shard2_replica_n6:Failed to execute sqlQuery 'select id, field_i, str_s, field_i_p, field_f_p, field_d_p, field_l_p from collection1 where (text='(XXXX)' OR text='XXXX') AND text='XXXX' order by field_i desc' against JDBC connection 'jdbc:calcitesolr:'.
Error while executing SQL "select id, field_i, str_s, field_i_p, field_f_p, field_d_p, field_l_p from collection1 where (text='(XXXX)' OR text='XXXX') AND text='XXXX' order by field_i desc": java.io.IOException: java.util.concurrent.ExecutionException: java.io.IOException: --> http://127.0.0.1:64682/g_roe/collection1_shard2_replica_n6/:id{type=string,properties=indexed,stored,sortMissingLast,uninvertible} must have DocValues to use this feature.
	at __randomizedtesting.SeedInfo.seed([186C55E95182C85C:BF28ED4D3C39DBE5]:0)
	at org.apache.solr.client.solrj.io.stream.SolrStream.read(SolrStream.java:215)
	at org.apache.solr.handler.TestSQLHandler.getTuples(TestSQLHandler.java:2617)
	at org.apache.solr.handler.TestSQLHandler.testBasicSelect(TestSQLHandler.java:145)
	at org.apache.solr.handler.TestSQLHandler.doTest(TestSQLHandler.java:93)
	at sun.reflect.NativeMethodAccessorImpl.invoke0(Native Method)
	at sun.reflect.NativeMethodAccessorImpl.invoke(NativeMethodAccessorImpl.java:62)
	at sun.reflect.DelegatingMethodAccessorImpl.invoke(DelegatingMethodAccessorImpl.java:43)
	at java.lang.reflect.Method.invoke(Method.java:498)
	at com.carrotsearch.randomizedtesting.RandomizedRunner.invoke(RandomizedRunner.java:1750)
	at com.carrotsearch.randomizedtesting.RandomizedRunner$8.evaluate(RandomizedRunner.java:938)
	at com.carrotsearch.randomizedtesting.RandomizedRunner$9.evaluate(RandomizedRunner.java:974)
	at com.carrotsearch.randomizedtesting.RandomizedRunner$10.evaluate(RandomizedRunner.java:988)
	at org.apache.solr.BaseDistributedSearchTestCase$ShardsRepeatRule$ShardsFixedStatement.callStatement(BaseDistributedSearchTestCase.java:1063)
	at org.apache.solr.BaseDistributedSearchTestCase$ShardsRepeatRule$ShardsStatement.evaluate(BaseDistributedSearchTestCase.java:1035)
	at com.carrotsearch.randomizedtesting.rules.SystemPropertiesRestoreRule$1.evaluate(SystemPropertiesRestoreRule.java:57)
	at org.apache.lucene.util.TestRuleSetupTeardownChained$1.evaluate(TestRuleSetupTeardownChained.java:49)
	at org.apache.lucene.util.AbstractBeforeAfterRule$1.evaluate(AbstractBeforeAfterRule.java:45)
	at org.apache.lucene.util.TestRuleThreadAndTestName$1.evaluate(TestRuleThreadAndTestName.java:48)
	at org.apache.lucene.util.TestRuleIgnoreAfterMaxFailures$1.evaluate(TestRuleIgnoreAfterMaxFailures.java:64)
	at org.apache.lucene.util.TestRuleMarkFailure$1.evaluate(TestRuleMarkFailure.java:47)
	at com.carrotsearch.randomizedtesting.rules.StatementAdapter.evaluate(StatementAdapter.java:36)
	at com.carrotsearch.randomizedtesting.ThreadLeakControl$StatementRunner.run(ThreadLeakControl.java:368)
	at com.carrotsearch.randomizedtesting.ThreadLeakControl.forkTimeoutingTask(ThreadLeakControl.java:817)
	at com.carrotsearch.randomizedtesting.ThreadLeakControl$3.evaluate(ThreadLeakControl.java:468)
	at com.carrotsearch.randomizedtesting.RandomizedRunner.runSingleTest(RandomizedRunner.java:947)
	at com.carrotsearch.randomizedtesting.RandomizedRunner$5.evaluate(RandomizedRunner.java:832)
	at com.carrotsearch.randomizedtesting.RandomizedRunner$6.evaluate(RandomizedRunner.java:883)
	at com.carrotsearch.randomizedtesting.RandomizedRunner$7.evaluate(RandomizedRunner.java:894)
	at com.carrotsearch.randomizedtesting.rules.StatementAdapter.evaluate(StatementAdapter.java:36)
	at com.carrotsearch.randomizedtesting.rules.SystemPropertiesRestoreRule$1.evaluate(SystemPropertiesRestoreRule.java:57)
	at org.apache.lucene.util.AbstractBeforeAfterRule$1.evaluate(AbstractBeforeAfterRule.java:45)
	at com.carrotsearch.randomizedtesting.rules.StatementAdapter.evaluate(StatementAdapter.java:36)
	at org.apache.lucene.util.TestRuleStoreClassName$1.evaluate(TestRuleStoreClassName.java:41)
	at com.carrotsearch.randomizedtesting.rules.NoShadowingOrOverridesOnMethodsRule$1.evaluate(NoShadowingOrOverridesOnMethodsRule.java:40)
	at com.carrotsearch.randomizedtesting.rules.NoShadowingOrOverridesOnMethodsRule$1.evaluate(NoShadowingOrOverridesOnMethodsRule.java:40)
	at com.carrotsearch.randomizedtesting.rules.StatementAdapter.evaluate(StatementAdapter.java:36)
	at com.carrotsearch.randomizedtesting.rules.StatementAdapter.evaluate(StatementAdapter.java:36)
	at com.carrotsearch.randomizedtesting.rules.StatementAdapter.evaluate(StatementAdapter.java:36)
	at org.apache.lucene.util.TestRuleAssertionsRequired$1.evaluate(TestRuleAssertionsRequired.java:53)
	at org.apache.lucene.util.TestRuleMarkFailure$1.evaluate(TestRuleMarkFailure.java:47)
	at org.apache.lucene.util.TestRuleIgnoreAfterMaxFailures$1.evaluate(TestRuleIgnoreAfterMaxFailures.java:64)
	at org.apache.lucene.util.TestRuleIgnoreTestSuites$1.evaluate(TestRuleIgnoreTestSuites.java:54)
	at com.carrotsearch.randomizedtesting.rules.StatementAdapter.evaluate(StatementAdapter.java:36)
	at com.carrotsearch.randomizedtesting.ThreadLeakControl$StatementRunner.run(ThreadLeakControl.java:368)
	at java.lang.Thread.run(Thread.java:748)


FAILED:  org.apache.solr.handler.TestSQLHandler.doTest

Error Message:
--> http://127.0.0.1:64822/g_roe/collection1_shard2_replica_n1:Failed to execute sqlQuery 'select id, field_i, str_s, field_i_p, field_f_p, field_d_p, field_l_p from collection1 where (text='(XXXX)' OR text='XXXX') AND text='XXXX' order by field_i desc' against JDBC connection 'jdbc:calcitesolr:'. Error while executing SQL "select id, field_i, str_s, field_i_p, field_f_p, field_d_p, field_l_p from collection1 where (text='(XXXX)' OR text='XXXX') AND text='XXXX' order by field_i desc": java.io.IOException: java.util.concurrent.ExecutionException: java.io.IOException: --> http://127.0.0.1:64844/g_roe/collection1_shard2_replica_n6/:id{type=string,properties=indexed,stored,sortMissingLast,uninvertible} must have DocValues to use this feature.

Stack Trace:
java.io.IOException: --> http://127.0.0.1:64822/g_roe/collection1_shard2_replica_n1:Failed to execute sqlQuery 'select id, field_i, str_s, field_i_p, field_f_p, field_d_p, field_l_p from collection1 where (text='(XXXX)' OR text='XXXX') AND text='XXXX' order by field_i desc' against JDBC connection 'jdbc:calcitesolr:'.
Error while executing SQL "select id, field_i, str_s, field_i_p, field_f_p, field_d_p, field_l_p from collection1 where (text='(XXXX)' OR text='XXXX') AND text='XXXX' order by field_i desc": java.io.IOException: java.util.concurrent.ExecutionException: java.io.IOException: --> http://127.0.0.1:64844/g_roe/collection1_shard2_replica_n6/:id{type=string,properties=indexed,stored,sortMissingLast,uninvertible} must have DocValues to use this feature.
	at __randomizedtesting.SeedInfo.seed([186C55E95182C85C:BF28ED4D3C39DBE5]:0)
	at org.apache.solr.client.solrj.io.stream.SolrStream.read(SolrStream.java:215)
	at org.apache.solr.handler.TestSQLHandler.getTuples(TestSQLHandler.java:2617)
	at org.apache.solr.handler.TestSQLHandler.testBasicSelect(TestSQLHandler.java:145)
	at org.apache.solr.handler.TestSQLHandler.doTest(TestSQLHandler.java:93)
	at sun.reflect.NativeMethodAccessorImpl.invoke0(Native Method)
	at sun.reflect.NativeMethodAccessorImpl.invoke(NativeMethodAccessorImpl.java:62)
	at sun.reflect.DelegatingMethodAccessorImpl.invoke(DelegatingMethodAccessorImpl.java:43)
	at java.lang.reflect.Method.invoke(Method.java:498)
	at com.carrotsearch.randomizedtesting.RandomizedRunner.invoke(RandomizedRunner.java:1750)
	at com.carrotsearch.randomizedtesting.RandomizedRunner$8.evaluate(RandomizedRunner.java:938)
	at com.carrotsearch.randomizedtesting.RandomizedRunner$9.evaluate(RandomizedRunner.java:974)
	at com.carrotsearch.randomizedtesting.RandomizedRunner$10.evaluate(RandomizedRunner.java:988)
	at org.apache.solr.BaseDistributedSearchTestCase$ShardsRepeatRule$ShardsFixedStatement.callStatement(BaseDistributedSearchTestCase.java:1063)
	at org.apache.solr.BaseDistributedSearchTestCase$ShardsRepeatRule$ShardsStatement.evaluate(BaseDistributedSearchTestCase.java:1035)
	at com.carrotsearch.randomizedtesting.rules.SystemPropertiesRestoreRule$1.evaluate(SystemPropertiesRestoreRule.java:57)
	at org.apache.lucene.util.TestRuleSetupTeardownChained$1.evaluate(TestRuleSetupTeardownChained.java:49)
	at org.apache.lucene.util.AbstractBeforeAfterRule$1.evaluate(AbstractBeforeAfterRule.java:45)
	at org.apache.lucene.util.TestRuleThreadAndTestName$1.evaluate(TestRuleThreadAndTestName.java:48)
	at org.apache.lucene.util.TestRuleIgnoreAfterMaxFailures$1.evaluate(TestRuleIgnoreAfterMaxFailures.java:64)
	at org.apache.lucene.util.TestRuleMarkFailure$1.evaluate(TestRuleMarkFailure.java:47)
	at com.carrotsearch.randomizedtesting.rules.StatementAdapter.evaluate(StatementAdapter.java:36)
	at com.carrotsearch.randomizedtesting.ThreadLeakControl$StatementRunner.run(ThreadLeakControl.java:368)
	at com.carrotsearch.randomizedtesting.ThreadLeakControl.forkTimeoutingTask(ThreadLeakControl.java:817)
	at com.carrotsearch.randomizedtesting.ThreadLeakControl$3.evaluate(ThreadLeakControl.java:468)
	at com.carrotsearch.randomizedtesting.RandomizedRunner.runSingleTest(RandomizedRunner.java:947)
	at com.carrotsearch.randomizedtesting.RandomizedRunner$5.evaluate(RandomizedRunner.java:832)
	at com.carrotsearch.randomizedtesting.RandomizedRunner$6.evaluate(RandomizedRunner.java:883)
	at com.carrotsearch.randomizedtesting.RandomizedRunner$7.evaluate(RandomizedRunner.java:894)
	at com.carrotsearch.randomizedtesting.rules.StatementAdapter.evaluate(StatementAdapter.java:36)
	at com.carrotsearch.randomizedtesting.rules.SystemPropertiesRestoreRule$1.evaluate(SystemPropertiesRestoreRule.java:57)
	at org.apache.lucene.util.AbstractBeforeAfterRule$1.evaluate(AbstractBeforeAfterRule.java:45)
	at com.carrotsearch.randomizedtesting.rules.StatementAdapter.evaluate(StatementAdapter.java:36)
	at org.apache.lucene.util.TestRuleStoreClassName$1.evaluate(TestRuleStoreClassName.java:41)
	at com.carrotsearch.randomizedtesting.rules.NoShadowingOrOverridesOnMethodsRule$1.evaluate(NoShadowingOrOverridesOnMethodsRule.java:40)
	at com.carrotsearch.randomizedtesting.rules.NoShadowingOrOverridesOnMethodsRule$1.evaluate(NoShadowingOrOverridesOnMethodsRule.java:40)
	at com.carrotsearch.randomizedtesting.rules.StatementAdapter.evaluate(StatementAdapter.java:36)
	at com.carrotsearch.randomizedtesting.rules.StatementAdapter.evaluate(StatementAdapter.java:36)
	at com.carrotsearch.randomizedtesting.rules.StatementAdapter.evaluate(StatementAdapter.java:36)
	at org.apache.lucene.util.TestRuleAssertionsRequired$1.evaluate(TestRuleAssertionsRequired.java:53)
	at org.apache.lucene.util.TestRuleMarkFailure$1.evaluate(TestRuleMarkFailure.java:47)
	at org.apache.lucene.util.TestRuleIgnoreAfterMaxFailures$1.evaluate(TestRuleIgnoreAfterMaxFailures.java:64)
	at org.apache.lucene.util.TestRuleIgnoreTestSuites$1.evaluate(TestRuleIgnoreTestSuites.java:54)
	at com.carrotsearch.randomizedtesting.rules.StatementAdapter.evaluate(StatementAdapter.java:36)
	at com.carrotsearch.randomizedtesting.ThreadLeakControl$StatementRunner.run(ThreadLeakControl.java:368)
	at java.lang.Thread.run(Thread.java:748)


FAILED:  org.apache.solr.handler.TestSQLHandler.doTest

Error Message:
--> http://127.0.0.1:64928/g_roe/collection1_shard2_replica_n1:Failed to execute sqlQuery 'select id, field_i, str_s, field_i_p, field_f_p, field_d_p, field_l_p from collection1 where (text='(XXXX)' OR text='XXXX') AND text='XXXX' order by field_i desc' against JDBC connection 'jdbc:calcitesolr:'. Error while executing SQL "select id, field_i, str_s, field_i_p, field_f_p, field_d_p, field_l_p from collection1 where (text='(XXXX)' OR text='XXXX') AND text='XXXX' order by field_i desc": java.io.IOException: java.util.concurrent.ExecutionException: java.io.IOException: --> http://127.0.0.1:64928/g_roe/collection1_shard2_replica_n1/:id{type=string,properties=indexed,stored,sortMissingLast,uninvertible} must have DocValues to use this feature.

Stack Trace:
java.io.IOException: --> http://127.0.0.1:64928/g_roe/collection1_shard2_replica_n1:Failed to execute sqlQuery 'select id, field_i, str_s, field_i_p, field_f_p, field_d_p, field_l_p from collection1 where (text='(XXXX)' OR text='XXXX') AND text='XXXX' order by field_i desc' against JDBC connection 'jdbc:calcitesolr:'.
Error while executing SQL "select id, field_i, str_s, field_i_p, field_f_p, field_d_p, field_l_p from collection1 where (text='(XXXX)' OR text='XXXX') AND text='XXXX' order by field_i desc": java.io.IOException: java.util.concurrent.ExecutionException: java.io.IOException: --> http://127.0.0.1:64928/g_roe/collection1_shard2_replica_n1/:id{type=string,properties=indexed,stored,sortMissingLast,uninvertible} must have DocValues to use this feature.
	at __randomizedtesting.SeedInfo.seed([186C55E95182C85C:BF28ED4D3C39DBE5]:0)
	at org.apache.solr.client.solrj.io.stream.SolrStream.read(SolrStream.java:215)
	at org.apache.solr.handler.TestSQLHandler.getTuples(TestSQLHandler.java:2617)
	at org.apache.solr.handler.TestSQLHandler.testBasicSelect(TestSQLHandler.java:145)
	at org.apache.solr.handler.TestSQLHandler.doTest(TestSQLHandler.java:93)
	at sun.reflect.NativeMethodAccessorImpl.invoke0(Native Method)
	at sun.reflect.NativeMethodAccessorImpl.invoke(NativeMethodAccessorImpl.java:62)
	at sun.reflect.DelegatingMethodAccessorImpl.invoke(DelegatingMethodAccessorImpl.java:43)
	at java.lang.reflect.Method.invoke(Method.java:498)
	at com.carrotsearch.randomizedtesting.RandomizedRunner.invoke(RandomizedRunner.java:1750)
	at com.carrotsearch.randomizedtesting.RandomizedRunner$8.evaluate(RandomizedRunner.java:938)
	at com.carrotsearch.randomizedtesting.RandomizedRunner$9.evaluate(RandomizedRunner.java:974)
	at com.carrotsearch.randomizedtesting.RandomizedRunner$10.evaluate(RandomizedRunner.java:988)
	at org.apache.solr.BaseDistributedSearchTestCase$ShardsRepeatRule$ShardsFixedStatement.callStatement(BaseDistributedSearchTestCase.java:1063)
	at org.apache.solr.BaseDistributedSearchTestCase$ShardsRepeatRule$ShardsStatement.evaluate(BaseDistributedSearchTestCase.java:1035)
	at com.carrotsearch.randomizedtesting.rules.SystemPropertiesRestoreRule$1.evaluate(SystemPropertiesRestoreRule.java:57)
	at org.apache.lucene.util.TestRuleSetupTeardownChained$1.evaluate(TestRuleSetupTeardownChained.java:49)
	at org.apache.lucene.util.AbstractBeforeAfterRule$1.evaluate(AbstractBeforeAfterRule.java:45)
	at org.apache.lucene.util.TestRuleThreadAndTestName$1.evaluate(TestRuleThreadAndTestName.java:48)
	at org.apache.lucene.util.TestRuleIgnoreAfterMaxFailures$1.evaluate(TestRuleIgnoreAfterMaxFailures.java:64)
	at org.apache.lucene.util.TestRuleMarkFailure$1.evaluate(TestRuleMarkFailure.java:47)
	at com.carrotsearch.randomizedtesting.rules.StatementAdapter.evaluate(StatementAdapter.java:36)
	at com.carrotsearch.randomizedtesting.ThreadLeakControl$StatementRunner.run(ThreadLeakControl.java:368)
	at com.carrotsearch.randomizedtesting.ThreadLeakControl.forkTimeoutingTask(ThreadLeakControl.java:817)
	at com.carrotsearch.randomizedtesting.ThreadLeakControl$3.evaluate(ThreadLeakControl.java:468)
	at com.carrotsearch.randomizedtesting.RandomizedRunner.runSingleTest(RandomizedRunner.java:947)
	at com.carrotsearch.randomizedtesting.RandomizedRunner$5.evaluate(RandomizedRunner.java:832)
	at com.carrotsearch.randomizedtesting.RandomizedRunner$6.evaluate(RandomizedRunner.java:883)
	at com.carrotsearch.randomizedtesting.RandomizedRunner$7.evaluate(RandomizedRunner.java:894)
	at com.carrotsearch.randomizedtesting.rules.StatementAdapter.evaluate(StatementAdapter.java:36)
	at com.carrotsearch.randomizedtesting.rules.SystemPropertiesRestoreRule$1.evaluate(SystemPropertiesRestoreRule.java:57)
	at org.apache.lucene.util.AbstractBeforeAfterRule$1.evaluate(AbstractBeforeAfterRule.java:45)
	at com.carrotsearch.randomizedtesting.rules.StatementAdapter.evaluate(StatementAdapter.java:36)
	at org.apache.lucene.util.TestRuleStoreClassName$1.evaluate(TestRuleStoreClassName.java:41)
	at com.carrotsearch.randomizedtesting.rules.NoShadowingOrOverridesOnMethodsRule$1.evaluate(NoShadowingOrOverridesOnMethodsRule.java:40)
	at com.carrotsearch.randomizedtesting.rules.NoShadowingOrOverridesOnMethodsRule$1.evaluate(NoShadowingOrOverridesOnMethodsRule.java:40)
	at com.carrotsearch.randomizedtesting.rules.StatementAdapter.evaluate(StatementAdapter.java:36)
	at com.carrotsearch.randomizedtesting.rules.StatementAdapter.evaluate(StatementAdapter.java:36)
	at com.carrotsearch.randomizedtesting.rules.StatementAdapter.evaluate(StatementAdapter.java:36)
	at org.apache.lucene.util.TestRuleAssertionsRequired$1.evaluate(TestRuleAssertionsRequired.java:53)
	at org.apache.lucene.util.TestRuleMarkFailure$1.evaluate(TestRuleMarkFailure.java:47)
	at org.apache.lucene.util.TestRuleIgnoreAfterMaxFailures$1.evaluate(TestRuleIgnoreAfterMaxFailures.java:64)
	at org.apache.lucene.util.TestRuleIgnoreTestSuites$1.evaluate(TestRuleIgnoreTestSuites.java:54)
	at com.carrotsearch.randomizedtesting.rules.StatementAdapter.evaluate(StatementAdapter.java:36)
	at com.carrotsearch.randomizedtesting.ThreadLeakControl$StatementRunner.run(ThreadLeakControl.java:368)
	at java.lang.Thread.run(Thread.java:748)


FAILED:  org.apache.solr.handler.TestSQLHandler.doTest

Error Message:


Stack Trace:
java.lang.AssertionError
	at __randomizedtesting.SeedInfo.seed([186C55E95182C85C:BF28ED4D3C39DBE5]:0)
	at org.apache.solr.handler.TestSQLHandler.testBasicSelect(TestSQLHandler.java:236)
	at org.apache.solr.handler.TestSQLHandler.doTest(TestSQLHandler.java:93)
	at sun.reflect.NativeMethodAccessorImpl.invoke0(Native Method)
	at sun.reflect.NativeMethodAccessorImpl.invoke(NativeMethodAccessorImpl.java:62)
	at sun.reflect.DelegatingMethodAccessorImpl.invoke(DelegatingMethodAccessorImpl.java:43)
	at java.lang.reflect.Method.invoke(Method.java:498)
	at com.carrotsearch.randomizedtesting.RandomizedRunner.invoke(RandomizedRunner.java:1750)
	at com.carrotsearch.randomizedtesting.RandomizedRunner$8.evaluate(RandomizedRunner.java:938)
	at com.carrotsearch.randomizedtesting.RandomizedRunner$9.evaluate(RandomizedRunner.java:974)
	at com.carrotsearch.randomizedtesting.RandomizedRunner$10.evaluate(RandomizedRunner.java:988)
	at org.apache.solr.BaseDistributedSearchTestCase$ShardsRepeatRule$ShardsFixedStatement.callStatement(BaseDistributedSearchTestCase.java:1063)
	at org.apache.solr.BaseDistributedSearchTestCase$ShardsRepeatRule$ShardsStatement.evaluate(BaseDistributedSearchTestCase.java:1035)
	at com.carrotsearch.randomizedtesting.rules.SystemPropertiesRestoreRule$1.evaluate(SystemPropertiesRestoreRule.java:57)
	at org.apache.lucene.util.TestRuleSetupTeardownChained$1.evaluate(TestRuleSetupTeardownChained.java:49)
	at org.apache.lucene.util.AbstractBeforeAfterRule$1.evaluate(AbstractBeforeAfterRule.java:45)
	at org.apache.lucene.util.TestRuleThreadAndTestName$1.evaluate(TestRuleThreadAndTestName.java:48)
	at org.apache.lucene.util.TestRuleIgnoreAfterMaxFailures$1.evaluate(TestRuleIgnoreAfterMaxFailures.java:64)
	at org.apache.lucene.util.TestRuleMarkFailure$1.evaluate(TestRuleMarkFailure.java:47)
	at com.carrotsearch.randomizedtesting.rules.StatementAdapter.evaluate(StatementAdapter.java:36)
	at com.carrotsearch.randomizedtesting.ThreadLeakControl$StatementRunner.run(ThreadLeakControl.java:368)
	at com.carrotsearch.randomizedtesting.ThreadLeakControl.forkTimeoutingTask(ThreadLeakControl.java:817)
	at com.carrotsearch.randomizedtesting.ThreadLeakControl$3.evaluate(ThreadLeakControl.java:468)
	at com.carrotsearch.randomizedtesting.RandomizedRunner.runSingleTest(RandomizedRunner.java:947)
	at com.carrotsearch.randomizedtesting.RandomizedRunner$5.evaluate(RandomizedRunner.java:832)
	at com.carrotsearch.randomizedtesting.RandomizedRunner$6.evaluate(RandomizedRunner.java:883)
	at com.carrotsearch.randomizedtesting.RandomizedRunner$7.evaluate(RandomizedRunner.java:894)
	at com.carrotsearch.randomizedtesting.rules.StatementAdapter.evaluate(StatementAdapter.java:36)
	at com.carrotsearch.randomizedtesting.rules.SystemPropertiesRestoreRule$1.evaluate(SystemPropertiesRestoreRule.java:57)
	at org.apache.lucene.util.AbstractBeforeAfterRule$1.evaluate(AbstractBeforeAfterRule.java:45)
	at com.carrotsearch.randomizedtesting.rules.StatementAdapter.evaluate(StatementAdapter.java:36)
	at org.apache.lucene.util.TestRuleStoreClassName$1.evaluate(TestRuleStoreClassName.java:41)
	at com.carrotsearch.randomizedtesting.rules.NoShadowingOrOverridesOnMethodsRule$1.evaluate(NoShadowingOrOverridesOnMethodsRule.java:40)
	at com.carrotsearch.randomizedtesting.rules.NoShadowingOrOverridesOnMethodsRule$1.evaluate(NoShadowingOrOverridesOnMethodsRule.java:40)
	at com.carrotsearch.randomizedtesting.rules.StatementAdapter.evaluate(StatementAdapter.java:36)
	at com.carrotsearch.randomizedtesting.rules.StatementAdapter.evaluate(StatementAdapter.java:36)
	at com.carrotsearch.randomizedtesting.rules.StatementAdapter.evaluate(StatementAdapter.java:36)
	at org.apache.lucene.util.TestRuleAssertionsRequired$1.evaluate(TestRuleAssertionsRequired.java:53)
	at org.apache.lucene.util.TestRuleMarkFailure$1.evaluate(TestRuleMarkFailure.java:47)
	at org.apache.lucene.util.TestRuleIgnoreAfterMaxFailures$1.evaluate(TestRuleIgnoreAfterMaxFailures.java:64)
	at org.apache.lucene.util.TestRuleIgnoreTestSuites$1.evaluate(TestRuleIgnoreTestSuites.java:54)
	at com.carrotsearch.randomizedtesting.rules.StatementAdapter.evaluate(StatementAdapter.java:36)
	at com.carrotsearch.randomizedtesting.ThreadLeakControl$StatementRunner.run(ThreadLeakControl.java:368)
	at java.lang.Thread.run(Thread.java:748)




Build Log:
[...truncated 13018 lines...]
   [junit4] Suite: org.apache.solr.core.TestNRTOpen
   [junit4]   2> Creating dataDir: C:\Users\jenkins\workspace\Lucene-Solr-7.x-Windows\solr\build\solr-core\test\J0\temp\solr.core.TestNRTOpen_186C55E95182C85C-001\init-core-data-001
   [junit4]   2> 595381 WARN  (SUITE-TestNRTOpen-seed#[186C55E95182C85C]-worker) [    ] o.a.s.SolrTestCaseJ4 startTrackingSearchers: numOpens=2 numCloses=2
   [junit4]   2> 595381 INFO  (SUITE-TestNRTOpen-seed#[186C55E95182C85C]-worker) [    ] o.a.s.SolrTestCaseJ4 Using TrieFields (NUMERIC_POINTS_SYSPROP=false) w/NUMERIC_DOCVALUES_SYSPROP=false
   [junit4]   2> 595387 INFO  (SUITE-TestNRTOpen-seed#[186C55E95182C85C]-worker) [    ] o.a.s.SolrTestCaseJ4 Randomized ssl (false) and clientAuth (false) via: @org.apache.solr.util.RandomizeSSL(reason=, value=NaN, ssl=NaN, clientAuth=NaN)
   [junit4]   2> 595387 INFO  (SUITE-TestNRTOpen-seed#[186C55E95182C85C]-worker) [    ] o.a.s.SolrTestCaseJ4 SecureRandom sanity checks: test.solr.allowed.securerandom=null & java.security.egd=file:/dev/./urandom
   [junit4]   2> 595396 INFO  (SUITE-TestNRTOpen-seed#[186C55E95182C85C]-worker) [    ] o.a.s.SolrTestCaseJ4 ####initCore
   [junit4]   2> 595405 INFO  (SUITE-TestNRTOpen-seed#[186C55E95182C85C]-worker) [    ] o.a.s.c.SolrResourceLoader [null] Added 2 libs to classloader, from paths: [/C:/Users/jenkins/workspace/Lucene-Solr-7.x-Windows/solr/core/src/test-files/solr/collection1/lib, /C:/Users/jenkins/workspace/Lucene-Solr-7.x-Windows/solr/core/src/test-files/solr/collection1/lib/classes]
   [junit4]   2> 595464 INFO  (SUITE-TestNRTOpen-seed#[186C55E95182C85C]-worker) [    ] o.a.s.c.SolrConfig Using Lucene MatchVersion: 7.7.0
   [junit4]   2> 595471 INFO  (SUITE-TestNRTOpen-seed#[186C55E95182C85C]-worker) [    ] o.a.s.s.IndexSchema [null] Schema name=minimal
   [junit4]   2> 595474 WARN  (SUITE-TestNRTOpen-seed#[186C55E95182C85C]-worker) [    ] o.a.s.s.IndexSchema no uniqueKey specified in schema.
   [junit4]   2> 595474 INFO  (SUITE-TestNRTOpen-seed#[186C55E95182C85C]-worker) [    ] o.a.s.s.IndexSchema Loaded schema minimal/1.1 with uniqueid field null
   [junit4]   2> 596017 INFO  (SUITE-TestNRTOpen-seed#[186C55E95182C85C]-worker) [    ] o.a.s.c.TransientSolrCoreCacheDefault Allocating transient cache for 2147483647 transient cores
   [junit4]   2> 596017 INFO  (SUITE-TestNRTOpen-seed#[186C55E95182C85C]-worker) [    ] o.a.s.h.a.MetricsHistoryHandler No .system collection, keeping metrics history in memory.
   [junit4]   2> 596053 INFO  (SUITE-TestNRTOpen-seed#[186C55E95182C85C]-worker) [    ] o.a.s.m.r.SolrJmxReporter JMX monitoring for 'solr.node' (registry 'solr.node') enabled at server: com.sun.jmx.mbeanserver.JmxMBeanServer@1fda74
   [junit4]   2> 596059 INFO  (SUITE-TestNRTOpen-seed#[186C55E95182C85C]-worker) [    ] o.a.s.m.r.SolrJmxReporter JMX monitoring for 'solr.jvm' (registry 'solr.jvm') enabled at server: com.sun.jmx.mbeanserver.JmxMBeanServer@1fda74
   [junit4]   2> 596061 INFO  (SUITE-TestNRTOpen-seed#[186C55E95182C85C]-worker) [    ] o.a.s.m.r.SolrJmxReporter JMX monitoring for 'solr.jetty' (registry 'solr.jetty') enabled at server: com.sun.jmx.mbeanserver.JmxMBeanServer@1fda74
   [junit4]   2> 596066 INFO  (coreLoadExecutor-2070-thread-1) [    x:collection1] o.a.s.c.SolrResourceLoader [null] Added 2 libs to classloader, from paths: [/C:/Users/jenkins/workspace/Lucene-Solr-7.x-Windows/solr/core/src/test-files/solr/collection1/lib, /C:/Users/jenkins/workspace/Lucene-Solr-7.x-Windows/solr/core/src/test-files/solr/collection1/lib/classes]
   [junit4]   2> 596170 INFO  (coreLoadExecutor-2070-thread-1) [    x:collection1] o.a.s.c.SolrConfig Using Lucene MatchVersion: 7.7.0
   [junit4]   2> 596176 INFO  (coreLoadExecutor-2070-thread-1) [    x:collection1] o.a.s.s.IndexSchema [collection1] Schema name=minimal
   [junit4]   2> 596182 WARN  (coreLoadExecutor-2070-thread-1) [    x:collection1] o.a.s.s.IndexSchema no uniqueKey specified in schema.
   [junit4]   2> 596182 INFO  (coreLoadExecutor-2070-thread-1) [    x:collection1] o.a.s.s.IndexSchema Loaded schema minimal/1.1 with uniqueid field null
   [junit4]   2> 596182 INFO  (coreLoadExecutor-2070-thread-1) [    x:collection1] o.a.s.c.CoreContainer Creating SolrCore 'collection1' using configuration from instancedir C:\Users\jenkins\workspace\Lucene-Solr-7.x-Windows\solr\core\src\test-files\solr\collection1, trusted=true
   [junit4]   2> 596182 INFO  (coreLoadExecutor-2070-thread-1) [    x:collection1] o.a.s.m.r.SolrJmxReporter JMX monitoring for 'solr.core.collection1' (registry 'solr.core.collection1') enabled at server: com.sun.jmx.mbeanserver.JmxMBeanServer@1fda74
   [junit4]   2> 596183 INFO  (coreLoadExecutor-2070-thread-1) [    x:collection1] o.a.s.c.SolrCore [[collection1] ] Opening new SolrCore at [C:\Users\jenkins\workspace\Lucene-Solr-7.x-Windows\solr\core\src\test-files\solr\collection1], dataDir=[C:\Users\jenkins\workspace\Lucene-Solr-7.x-Windows\solr\build\solr-core\test\J0\temp\solr.core.TestNRTOpen_186C55E95182C85C-001\init-core-data-001\]
   [junit4]   2> 596382 INFO  (coreLoadExecutor-2070-thread-1) [    x:collection1] o.a.s.u.CommitTracker Hard AutoCommit: disabled
   [junit4]   2> 596382 INFO  (coreLoadExecutor-2070-thread-1) [    x:collection1] o.a.s.u.CommitTracker Soft AutoCommit: disabled
   [junit4]   2> 596424 INFO  (coreLoadExecutor-2070-thread-1) [    x:collection1] o.a.s.s.SolrIndexSearcher Opening [Searcher@480322[collection1] main]
   [junit4]   2> 596425 WARN  (coreLoadExecutor-2070-thread-1) [    x:collection1] o.a.s.r.ManagedResourceStorage Cannot write to config directory C:\Users\jenkins\workspace\Lucene-Solr-7.x-Windows\solr\core\src\test-files\solr\collection1\conf; switching to use InMemory storage instead.
   [junit4]   2> 596426 INFO  (coreLoadExecutor-2070-thread-1) [    x:collection1] o.a.s.h.ReplicationHandler Commits will be reserved for 10000ms.
   [junit4]   2> 596428 INFO  (SUITE-TestNRTOpen-seed#[186C55E95182C85C]-worker) [    ] o.a.s.SolrTestCaseJ4 ####initCore end
   [junit4]   2> 596431 INFO  (searcherExecutor-2071-thread-1-processing-x:collection1) [    x:collection1] o.a.s.c.SolrCore [collection1] Registered new searcher Searcher@480322[collection1] main{ExitableDirectoryReader(UninvertingDirectoryReader())}
   [junit4]   2> 596433 INFO  (SUITE-TestNRTOpen-seed#[186C55E95182C85C]-worker) [    ] o.a.s.u.p.LogUpdateProcessorFactory [collection1]  webapp=null path=null params={}{add=[(null)]} 0 5
   [junit4]   2> 596441 INFO  (SUITE-TestNRTOpen-seed#[186C55E95182C85C]-worker) [    ] o.a.s.u.DirectUpdateHandler2 start commit{,optimize=false,openSearcher=true,waitSearcher=true,expungeDeletes=false,softCommit=false,prepareCommit=false}
   [junit4]   2> 596441 INFO  (SUITE-TestNRTOpen-seed#[186C55E95182C85C]-worker) [    ] o.a.s.u.SolrIndexWriter Calling setCommitData with IW:org.apache.solr.update.SolrIndexWriter@cd826e commitCommandVersion:0
   [junit4]   2> 596560 INFO  (SUITE-TestNRTOpen-seed#[186C55E95182C85C]-worker) [    ] o.a.s.s.SolrIndexSearcher Opening [Searcher@495e9[collection1] main]
   [junit4]   2> 596561 INFO  (SUITE-TestNRTOpen-seed#[186C55E95182C85C]-worker) [    ] o.a.s.u.DirectUpdateHandler2 end_commit_flush
   [junit4]   2> 596564 INFO  (searcherExecutor-2071-thread-1) [    ] o.a.s.c.SolrCore [collection1] Registered new searcher Searcher@495e9[collection1] main{ExitableDirectoryReader(UninvertingDirectoryReader(Uninverting(_0(7.7.0):c1:[diagnostics={os=Windows 10, java.vendor=Oracle Corporation, java.version=1.8.0_172, java.vm.version=25.172-b11, lucene.version=7.7.0, os.arch=x86, java.runtime.version=1.8.0_172-b11, source=flush, os.version=10.0, timestamp=1546405474305}]:[attributes={Lucene50StoredFieldsFormat.mode=BEST_SPEED}])))}
   [junit4]   2> 596564 INFO  (SUITE-TestNRTOpen-seed#[186C55E95182C85C]-worker) [    ] o.a.s.u.p.LogUpdateProcessorFactory [collection1]  webapp=null path=null params={}{commit=} 0 111
   [junit4]   2> 596565 INFO  (SUITE-TestNRTOpen-seed#[186C55E95182C85C]-worker) [    ] o.a.s.SolrTestCaseJ4 ###deleteCore
   [junit4]   2> 596565 INFO  (SUITE-TestNRTOpen-seed#[186C55E95182C85C]-worker) [    ] o.a.s.c.CoreContainer Shutting down CoreContainer instance=5793272
   [junit4]   2> 596566 INFO  (coreCloseExecutor-2075-thread-1) [    x:collection1] o.a.s.c.SolrCore [collection1]  CLOSING SolrCore org.apache.solr.core.SolrCore@4ee505
   [junit4]   2> 596566 INFO  (coreCloseExecutor-2075-thread-1) [    x:collection1] o.a.s.m.SolrMetricManager Closing metric reporters for registry=solr.core.collection1, tag=4ee505
   [junit4]   2> 596566 INFO  (coreCloseExecutor-2075-thread-1) [    x:collection1] o.a.s.m.r.SolrJmxReporter Closing reporter [org.apache.solr.metrics.reporters.SolrJmxReporter@1937120: rootName = null, domain = solr.core.collection1, service url = null, agent id = null] for registry solr.core.collection1 / com.codahale.metrics.MetricRegistry@db8ca1
   [junit4]   2> 596593 INFO  (SUITE-TestNRTOpen-seed#[186C55E95182C85C]-worker) [    ] o.a.s.m.SolrMetricManager Closing metric reporters for registry=solr.node, tag=null
   [junit4]   2> 596593 INFO  (SUITE-TestNRTOpen-seed#[186C55E95182C85C]-worker) [    ] o.a.s.m.r.SolrJmxReporter Closing reporter [org.apache.solr.metrics.reporters.SolrJmxReporter@17a1cfa: rootName = null, domain = solr.node, service url = null, agent id = null] for registry solr.node / com.codahale.metrics.MetricRegistry@aec16a
   [junit4]   2> 596597 INFO  (SUITE-TestNRTOpen-seed#[186C55E95182C85C]-worker) [    ] o.a.s.m.SolrMetricManager Closing metric reporters for registry=solr.jvm, tag=null
   [junit4]   2> 596597 INFO  (SUITE-TestNRTOpen-seed#[186C55E95182C85C]-worker) [    ] o.a.s.m.r.SolrJmxReporter Closing reporter [org.apache.solr.metrics.reporters.SolrJmxReporter@f5e2c1: rootName = null, domain = solr.jvm, service url = null, agent id = null] for registry solr.jvm / com.codahale.metrics.MetricRegistry@1eb6429
   [junit4]   2> 596611 INFO  (SUITE-TestNRTOpen-seed#[186C55E95182C85C]-worker) [    ] o.a.s.m.SolrMetricManager Closing metric reporters for registry=solr.jetty, tag=null
   [junit4]   2> 596611 INFO  (SUITE-TestNRTOpen-seed#[186C55E95182C85C]-worker) [    ] o.a.s.m.r.SolrJmxReporter Closing reporter [org.apache.solr.metrics.reporters.SolrJmxReporter@1e210c4: rootName = null, domain = solr.jetty, service url = null, agent id = null] for registry solr.jetty / com.codahale.metrics.MetricRegistry@1e3d405
   [junit4]   2> 596627 INFO  (SUITE-TestNRTOpen-seed#[186C55E95182C85C]-worker) [    ] o.a.s.SolrTestCaseJ4 ####initCore
   [junit4]   2> 596635 INFO  (SUITE-TestNRTOpen-seed#[186C55E95182C85C]-worker) [    ] o.a.s.c.SolrResourceLoader [null] Added 2 libs to classloader, from paths: [/C:/Users/jenkins/workspace/Lucene-Solr-7.x-Windows/solr/core/src/test-files/solr/collection1/lib, /C:/Users/jenkins/workspace/Lucene-Solr-7.x-Windows/solr/core/src/test-files/solr/collection1/lib/classes]
   [junit4]   2> 596726 INFO  (SUITE-TestNRTOpen-seed#[186C55E95182C85C]-worker) [    ] o.a.s.c.SolrConfig Using Lucene MatchVersion: 7.7.0
   [junit4]   2> 596734 INFO  (SUITE-TestNRTOpen-seed#[186C55E95182C85C]-worker) [    ] o.a.s.s.IndexSchema [null] Schema name=minimal
   [junit4]   2> 596739 WARN  (SUITE-TestNRTOpen-seed#[186C55E95182C85C]-worker) [    ] o.a.s.s.IndexSchema no uniqueKey specified in schema.
   [junit4]   2> 596739 INFO  (SUITE-TestNRTOpen-seed#[186C55E95182C85C]-worker) [    ] o.a.s.s.IndexSchema Loaded schema minimal/1.1 with uniqueid field null
   [junit4]   2> 598003 INFO  (SUITE-TestNRTOpen-seed#[186C55E95182C85C]-worker) [    ] o.a.s.c.TransientSolrCoreCacheDefault Allocating transient cache for 2147483647 transient cores
   [junit4]   2> 598003 INFO  (SUITE-TestNRTOpen-seed#[186C55E95182C85C]-worker) [    ] o.a.s.h.a.MetricsHistoryHandler No .system collection, keeping metrics history in memory.
   [junit4]   2> 598043 INFO  (SUITE-TestNRTOpen-seed#[186C55E95182C85C]-worker) [    ] o.a.s.m.r.SolrJmxReporter JMX monitoring for 'solr.node' (registry 'solr.node') enabled at server: com.sun.jmx.mbeanserver.JmxMBeanServer@1fda74
   [junit4]   2> 598052 INFO  (SUITE-TestNRTOpen-seed#[186C55E95182C85C]-worker) [    ] o.a.s.m.r.SolrJmxReporter JMX monitoring for 'solr.jvm' (registry 'solr.jvm') enabled at server: com.sun.jmx.mbeanserver.JmxMBeanServer@1fda74
   [junit4]   2> 598052 INFO  (SUITE-TestNRTOpen-seed#[186C55E95182C85C]-worker) [    ] o.a.s.m.r.SolrJmxReporter JMX monitoring for 'solr.jetty' (registry 'solr.jetty') enabled at server: com.sun.jmx.mbeanserver.JmxMBeanServer@1fda74
   [junit4]   2> 598055 INFO  (coreLoadExecutor-2085-thread-1) [    x:collection1] o.a.s.c.SolrResourceLoader [null] Added 2 libs to classloader, from paths: [/C:/Users/jenkins/workspace/Lucene-Solr-7.x-Windows/solr/core/src/test-files/solr/collection1/lib, /C:/Users/jenkins/workspace/Lucene-Solr-7.x-Windows/solr/core/src/test-files/solr/collection1/lib/classes]
   [junit4]   2> 598140 INFO  (coreLoadExecutor-2085-thread-1) [    x:collection1] o.a.s.c.SolrConfig Using Lucene MatchVersion: 7.7.0
   [junit4]   2> 598145 INFO  (coreLoadExecutor-2085-thread-1) [    x:collection1] o.a.s.s.IndexSchema [collection1] Schema name=minimal
   [junit4]   2> 598149 WARN  (coreLoadExecutor-2085-thread-1) [    x:collection1] o.a.s.s.IndexSchema no uniqueKey specified in schema.
   [junit4]   2> 598149 INFO  (coreLoadExecutor-2085-thread-1) [    x:collection1] o.a.s.s.IndexSchema Loaded schema minimal/1.1 with uniqueid field null
   [junit4]   2> 598149 INFO  (coreLoadExecutor-2085-thread-1) [    x:collection1] o.a.s.c.CoreContainer Creating SolrCore 'collection1' using configuration from instancedir C:\Users\jenkins\workspace\Lucene-Solr-7.x-Windows\solr\core\src\test-files\solr\collection1, trusted=true
   [junit4]   2> 598150 INFO  (coreLoadExecutor-2085-thread-1) [    x:collection1] o.a.s.m.r.SolrJmxReporter JMX monitoring for 'solr.core.collection1' (registry 'solr.core.collection1') enabled at server: com.sun.jmx.mbeanserver.JmxMBeanServer@1fda74
   [junit4]   2> 598150 INFO  (coreLoadExecutor-2085-thread-1) [    x:collection1] o.a.s.c.SolrCore [[collection1] ] Opening new SolrCore at [C:\Users\jenkins\workspace\Lucene-Solr-7.x-Windows\solr\core\src\test-files\solr\collection1], dataDir=[C:\Users\jenkins\workspace\Lucene-Solr-7.x-Windows\solr\build\solr-core\test\J0\temp\solr.core.TestNRTOpen_186C55E95182C85C-001\init-core-data-001\]
   [junit4]   2> 598293 INFO  (coreLoadExecutor-2085-thread-1) [    x:collection1] o.a.s.u.CommitTracker Hard AutoCommit: disabled
   [junit4]   2> 598293 INFO  (coreLoadExecutor-2085-thread-1) [    x:collection1] o.a.s.u.CommitTracker Soft AutoCommit: disabled
   [junit4]   2> 598300 INFO  (coreLoadExecutor-2085-thread-1) [    x:collection1] o.a.s.s.SolrIndexSearcher Opening [Searcher@186fde[collection1] main]
   [junit4]   2> 598301 WARN  (coreLoadExecutor-2085-thread-1) [    x:collection1] o.a.s.r.ManagedResourceStorage Cannot write to config directory C:\Users\jenkins\workspace\Lucene-Solr-7.x-Windows\solr\core\src\test-files\solr\collection1\conf; switching to use InMemory storage instead.
   [junit4]   2> 598302 INFO  (coreLoadExecutor-2085-thread-1) [    x:collection1] o.a.s.h.ReplicationHandler Commits will be reserved for 10000ms.
   [junit4]   2> 598303 INFO  (searcherExecutor-2086-thread-1-processing-x:collection1) [    x:collection1] o.a.s.c.SolrCore [collection1] Registered new searcher Searcher@186fde[collection1] main{ExitableDirectoryReader(UninvertingDirectoryReader(Uninverting(_0(7.7.0):c1:[diagnostics={java.runtime.version=1.8.0_172-b11, java.vendor=Oracle Corporation, java.version=1.8.0_172, java.vm.version=25.172-b11, lucene.version=7.7.0, os=Windows 10, os.arch=x86, os.version=10.0, source=flush, timestamp=1546405474305}]:[attributes={Lucene50StoredFieldsFormat.mode=BEST_SPEED}])))}
   [junit4]   2> 598304 INFO  (SUITE-TestNRTOpen-seed#[186C55E95182C85C]-worker) [    ] o.a.s.SolrTestCaseJ4 ####initCore end
   [junit4]   2> 598308 INFO  (TEST-TestNRTOpen.testReaderIsNRT-seed#[186C55E95182C85C]) [    ] o.a.s.SolrTestCaseJ4 ###Starting testReaderIsNRT
   [junit4]   2> 598309 INFO  (TEST-TestNRTOpen.testReaderIsNRT-seed#[186C55E95182C85C]) [    ] o.a.s.u.DirectUpdateHandler2 [collection1] REMOVING ALL DOCUMENTS FROM INDEX
   [junit4]   2> 598320 INFO  (TEST-TestNRTOpen.testReaderIsNRT-seed#[186C55E95182C85C]) [    ] o.a.s.u.p.LogUpdateProcessorFactory [collection1]  webapp=null path=null params={}{deleteByQuery=*:*} 0 10
   [junit4]   2> 598322 INFO  (TEST-TestNRTOpen.testReaderIsNRT-seed#[186C55E95182C85C]) [    ] o.a.s.u.p.LogUpdateProcessorFactory [collection1]  webapp=null path=null params={}{add=[(null)]} 0 1
   [junit4]   2> 598322 INFO  (TEST-TestNRTOpen.testReaderIsNRT-seed#[186C55E95182C85C]) [    ] o.a.s.u.DirectUpdateHandler2 start commit{,optimize=false,openSearcher=true,waitSearcher=true,expungeDeletes=false,softCommit=false,prepareCommit=false}
   [junit4]   2> 598322 INFO  (TEST-TestNRTOpen.testReaderIsNRT-seed#[186C55E95182C85C]) [    ] o.a.s.u.SolrIndexWriter Calling setCommitData with IW:org.apache.solr.update.SolrIndexWriter@1792aff commitCommandVersion:0
   [junit4]   2> 598336 INFO  (TEST-TestNRTOpen.testReaderIsNRT-seed#[186C55E95182C85C]) [    ] o.a.s.s.SolrIndexSearcher Opening [Searcher@ae3d49[collection1] main]
   [junit4]   2> 598337 INFO  (TEST-TestNRTOpen.testReaderIsNRT-seed#[186C55E95182C85C]) [    ] o.a.s.u.DirectUpdateHandler2 end_commit_flush
   [junit4]   2> 598338 INFO  (searcherExecutor-2086-thread-1) [    ] o.a.s.c.SolrCore [collection1] Registered new searcher Searcher@ae3d49[collection1] main{ExitableDirectoryReader(UninvertingDirectoryReader(Uninverting(_1(7.7.0):c1:[diagnostics={os=Windows 10, java.vendor=Oracle Corporation, java.version=1.8.0_172, java.vm.version=25.172-b11, lucene.version=7.7.0, os.arch=x86, java.runtime.version=1.8.0_172-b11, source=flush, os.version=10.0, timestamp=1546405476179}]:[attributes={Lucene50StoredFieldsFormat.mode=BEST_SPEED}])))}
   [junit4]   2> 598345 INFO  (TEST-TestNRTOpen.testReaderIsNRT-seed#[186C55E95182C85C]) [    ] o.a.s.u.p.LogUpdateProcessorFactory [collection1]  webapp=null path=null params={}{commit=} 0 20
   [junit4]   2> 598346 ERROR (TEST-TestNRTOpen.testReaderIsNRT-seed#[186C55E95182C85C]) [    ] o.a.s.c.CorePropertiesLocator Couldn't load core descriptor from C:\Users\jenkins\workspace\Lucene-Solr-7.x-Windows\solr\core\src\test-files\solr\collection1\core.properties:java.nio.file.NoSuchFileException: C:\Users\jenkins\workspace\Lucene-Solr-7.x-Windows\solr\core\src\test-files\solr\collection1\core.properties
   [junit4]   2> 598349 INFO  (TEST-TestNRTOpen.testReaderIsNRT-seed#[186C55E95182C85C]) [    ] o.a.s.c.SolrResourceLoader [null] Added 2 libs to classloader, from paths: [/C:/Users/jenkins/workspace/Lucene-Solr-7.x-Windows/solr/core/src/test-files/solr/collection1/lib, /C:/Users/jenkins/workspace/Lucene-Solr-7.x-Windows/solr/core/src/test-files/solr/collection1/lib/classes]
   [junit4]   2> 598504 INFO  (TEST-TestNRTOpen.testReaderIsNRT-seed#[186C55E95182C85C]) [    ] o.a.s.c.SolrConfig Using Lucene MatchVersion: 7.7.0
   [junit4]   2> 598511 INFO  (TEST-TestNRTOpen.testReaderIsNRT-seed#[186C55E95182C85C]) [    ] o.a.s.s.IndexSchema [collection1] Schema name=minimal
   [junit4]   2> 598515 WARN  (TEST-TestNRTOpen.testReaderIsNRT-seed#[186C55E95182C85C]) [    ] o.a.s.s.IndexSchema no uniqueKey specified in schema.
   [junit4]   2> 598515 INFO  (TEST-TestNRTOpen.testReaderIsNRT-seed#[186C55E95182C85C]) [    ] o.a.s.s.IndexSchema Loaded schema minimal/1.1 with uniqueid field null
   [junit4]   2> 598515 INFO  (TEST-TestNRTOpen.testReaderIsNRT-seed#[186C55E95182C85C]) [    ] o.a.s.c.CoreContainer Reloading SolrCore 'collection1' using configuration from instancedir C:\Users\jenkins\workspace\Lucene-Solr-7.x-Windows\solr\core\src\test-files\solr\collection1
   [junit4]   2> 598543 INFO  (TEST-TestNRTOpen.testReaderIsNRT-seed#[186C55E95182C85C]) [    x:collection1] o.a.s.m.r.SolrJmxReporter JMX monitoring for 'solr.core.collection1' (registry 'solr.core.collection1') enabled at server: com.sun.jmx.mbeanserver.JmxMBeanServer@1fda74
   [junit4]   2> 598544 INFO  (TEST-TestNRTOpen.testReaderIsNRT-seed#[186C55E95182C85C]) [    x:collection1] o.a.s.c.SolrCore [[collection1] ] Opening new SolrCore at [C:\Users\jenkins\workspace\Lucene-Solr-7.x-Windows\solr\core\src\test-files\solr\collection1], dataDir=[C:\Users\jenkins\workspace\Lucene-Solr-7.x-Windows\solr\build\solr-core\test\J0\temp\solr.core.TestNRTOpen_186C55E95182C85C-001\init-core-data-001\]
   [junit4]   2> 598671 INFO  (TEST-TestNRTOpen.testReaderIsNRT-seed#[186C55E95182C85C]) [    x:collection1] o.a.s.u.CommitTracker Hard AutoCommit: disabled
   [junit4]   2> 598671 INFO  (TEST-TestNRTOpen.testReaderIsNRT-seed#[186C55E95182C85C]) [    x:collection1] o.a.s.u.CommitTracker Soft AutoCommit: disabled
   [junit4]   2> 598674 INFO  (TEST-TestNRTOpen.testReaderIsNRT-seed#[186C55E95182C85C]) [    x:collection1] o.a.s.s.SolrIndexSearcher Opening [Searcher@148ff40[collection1] main]
   [junit4]   2> 598674 WARN  (TEST-TestNRTOpen.testReaderIsNRT-seed#[186C55E95182C85C]) [    x:collection1] o.a.s.r.ManagedResourceStorage Cannot write to config directory C:\Users\jenkins\workspace\Lucene-Solr-7.x-Windows\solr\core\src\test-files\solr\collection1\conf; switching to use InMemory storage instead.
   [junit4]   2> 598675 INFO  (TEST-TestNRTOpen.testReaderIsNRT-seed#[186C55E95182C85C]) [    x:collection1] o.a.s.h.ReplicationHandler Commits will be reserved for 10000ms.
   [junit4]   2> 598677 INFO  (searcherExecutor-2090-thread-1-processing-x:collection1) [    x:collection1] o.a.s.c.SolrCore [collection1] Registered new searcher Searcher@148ff40[collection1] main{ExitableDirectoryReader(UninvertingDirectoryReader(Uninverting(_1(7.7.0):c1:[diagnostics={os=Windows 10, java.vendor=Oracle Corporation, java.version=1.8.0_172, java.vm.version=25.172-b11, lucene.version=7.7.0, os.arch=x86, java.runtime.version=1.8.0_172-b11, source=flush, os.version=10.0, timestamp=1546405476179}]:[attributes={Lucene50StoredFieldsFormat.mode=BEST_SPEED}])))}
   [junit4]   2> 598677 INFO  (TEST-TestNRTOpen.testReaderIsNRT-seed#[186C55E95182C85C]) [    x:collection1] o.a.s.u.DefaultSolrCoreState New IndexWriter is ready to be used.
   [junit4]   2> 598678 INFO  (TEST-TestNRTOpen.testReaderIsNRT-seed#[186C55E95182C85C]) [    x:collection1] o.a.s.s.SolrIndexSearcher Opening [Searcher@1d836ce[collection1] main]
   [junit4]   2> 598680 INFO  (searcherExecutor-2090-thread-1-processing-x:collection1) [    x:collection1] o.a.s.c.SolrCore [collection1] Registered new searcher Searcher@1d836ce[collection1] main{ExitableDirectoryReader(UninvertingDirectoryReader(Uninverting(_1(7.7.0):c1:[diagnostics={java.runtime.version=1.8.0_172-b11, java.vendor=Oracle Corporation, java.version=1.8.0_172, java.vm.version=25.172-b11, lucene.version=7.7.0, os=Windows 10, os.arch=x86, os.version=10.0, source=flush, timestamp=1546405476179}]:[attributes={Lucene50StoredFieldsFormat.mode=BEST_SPEED}])))}
   [junit4]   2> 598680 INFO  (TEST-TestNRTOpen.testReaderIsNRT-seed#[186C55E95182C85C]) [    x:collection1] o.a.s.c.SolrCore [collection1]  CLOSING SolrCore org.apache.solr.core.SolrCore@155b5c5
   [junit4]   2> 598681 INFO  (TEST-TestNRTOpen.testReaderIsNRT-seed#[186C55E95182C85C]) [    x:collection1] o.a.s.m.SolrMetricManager Closing metric reporters for registry=solr.core.collection1, tag=155b5c5
   [junit4]   2> 598681 INFO  (TEST-TestNRTOpen.testReaderIsNRT-seed#[186C55E95182C85C]) [    x:collection1] o.a.s.m.r.SolrJmxReporter Closing reporter [org.apache.solr.metrics.reporters.SolrJmxReporter@12cf8c6: rootName = null, domain = solr.core.collection1, service url = null, agent id = null] for registry solr.core.collection1 / com.codahale.metrics.MetricRegistry@1a0c1d7
   [junit4]   2> 598689 INFO  (TEST-TestNRTOpen.testReaderIsNRT-seed#[186C55E95182C85C]) [    x:collection1] o.a.s.u.p.LogUpdateProcessorFactory [collection1]  webapp=null path=null params={}{add=[(null)]} 0 0
   [junit4]   2> 598690 INFO  (TEST-TestNRTOpen.testReaderIsNRT-seed#[186C55E95182C85C]) [    x:collection1] o.a.s.u.DirectUpdateHandler2 start commit{,optimize=false,openSearcher=true,waitSearcher=true,expungeDeletes=false,softCommit=true,prepareCommit=false}
   [junit4]   2> 598697 INFO  (TEST-TestNRTOpen.testReaderIsNRT-seed#[186C55E95182C85C]) [    x:collection1] o.a.s.s.SolrIndexSearcher Opening [Searcher@fe6887[collection1] main]
   [junit4]   2> 598698 INFO  (TEST-TestNRTOpen.testReaderIsNRT-seed#[186C55E95182C85C]) [    x:collection1] o.a.s.u.DirectUpdateHandler2 end_commit_flush
   [junit4]   2> 598699 INFO  (searcherExecutor-2090-thread-1-processing-x:collection1) [    x:collection1] o.a.s.c.SolrCore [collection1] Registered new searcher Searcher@fe6887[collection1] main{ExitableDirectoryReader(UninvertingDirectoryReader(Uninverting(_1(7.7.0):c1:[diagnostics={java.runtime.version=1.8.0_172-b11, java.vendor=Oracle Corporation, java.version=1.8.0_172, java.vm.version=25.172-b11, lucene.version=7.7.0, os=Windows 10, os.arch=x86, os.version=10.0, source=flush, timestamp=1546405476179}]:[attributes={Lucene50StoredFieldsFormat.mode=BEST_SPEED}]) Uninverting(_2(7.7.0):c1:[diagnostics={os=Windows 10, java.vendor=Oracle Corporation, java.version=1.8.0_172, java.vm.version=25.172-b11, lucene.version=7.7.0, os.arch=x86, java.runtime.version=1.8.0_172-b11, source=flush, os.version=10.0, timestamp=1546405476547}]:[attributes={Lucene50StoredFieldsFormat.mode=BEST_SPEED}])))}
   [junit4]   2> 598699 INFO  (TEST-TestNRTOpen.testReaderIsNRT-seed#[186C55E95182C85C]) [    x:collection1] o.a.s.u.p.LogUpdateProcessorFactory [collection1]  webapp=null path=null params={}{commit=} 0 8
   [junit4]   2> 598701 INFO  (TEST-TestNRTOpen.testReaderIsNRT-seed#[186C55E95182C85C]) [    x:collection1] o.a.s.u.p.LogUpdateProcessorFactory [collection1]  webapp=null path=null params={}{add=[(null)]} 0 1
   [junit4]   2> 598701 INFO  (TEST-TestNRTOpen.testReaderIsNRT-seed#[186C55E95182C85C]) [    x:collection1] o.a.s.u.DirectUpdateHandler2 start commit{,optimize=false,openSearcher=true,waitSearcher=true,expungeDeletes=false,softCommit=false,prepareCommit=false}
   [junit4]   2> 598701 INFO  (TEST-TestNRTOpen.testReaderIsNRT-seed#[186C55E95182C85C]) [    x:collection1] o.a.s.u.SolrIndexWriter Calling setCommitData with IW:org.apache.solr.update.SolrIndexWriter@1a2e226 commitCommandVersion:0
   [junit4]   2> 598715 INFO  (TEST-TestNRTOpen.testReaderIsNRT-seed#[186C55E95182C85C]) [    x:collection1] o.a.s.s.SolrIndexSearcher Opening [Searcher@122ed43[collection1] main]
   [junit4]   2> 598716 INFO  (TEST-TestNRTOpen.testReaderIsNRT-seed#[186C55E95182C85C]) [    x:collection1] o.a.s.u.DirectUpdateHandler2 end_commit_flush
   [junit4]   2> 598716 INFO  (searcherExecutor-2090-thread-1-processing-x:collection1) [    x:collection1] o.a.s.c.SolrCore [collection1] Registered new searcher Searcher@122ed43[collection1] main{ExitableDirectoryReader(UninvertingDirectoryReader(Uninverting(_1(7.7.0):c1:[diagnostics={java.runtime.version=1.8.0_172-b11, java.vendor=Oracle Corporation, java.version=1.8.0_172, java.vm.version=25.172-b11, lucene.version=7.7.0, os=Windows 10, os.arch=x86, os.version=10.0, source=flush, timestamp=1546405476179}]:[attributes={Lucene50StoredFieldsFormat.mode=BEST_SPEED}]) Uninverting(_2(7.7.0):c1:[diagnostics={os=Windows 10, java.vendor=Oracle Corporation, java.version=1.8.0_172, java.vm.version=25.172-b11, lucene.version=7.7.0, os.arch=x86, java.runtime.version=1.8.0_172-b11, source=flush, os.version=10.0, timestamp=1546405476547}]:[attributes={Lucene50StoredFieldsFormat.mode=BEST_SPEED}]) Uninverting(_3(7.7.0):c1:[diagnostics={os=Windows 10, java.vendor=Oracle Corporation, java.version=1.8.0_172, java.vm.version=25.172-b11, lucene.version=7.7.0, os.arch=x86, java.runtime.version=1.8.0_172-b11, source=flush, os.version=10.0, timestamp=1546405476558}]:[attributes={Lucene50StoredFieldsFormat.mode=BEST_SPEED}])))}
   [junit4]   2> 598717 INFO  (TEST-TestNRTOpen.testReaderIsNRT-seed#[186C55E95182C85C]) [    x:collection1] o.a.s.u.p.LogUpdateProcessorFactory [collection1]  webapp=null path=null params={}{commit=} 0 14
   [junit4]   2> 598717 INFO  (TEST-TestNRTOpen.testReaderIsNRT-seed#[186C55E95182C85C]) [    x:collection1] o.a.s.u.p.LogUpdateProcessorFactory [collection1]  webapp=null path=null params={}{add=[(null)]} 0 1
   [junit4]   2> 598719 ERROR (TEST-TestNRTOpen.testReaderIsNRT-seed#[186C55E95182C85C]) [    x:collection1] o.a.s.c.CorePropertiesLocator Couldn't load core descriptor from C:\Users\jenkins\workspace\Lucene-Solr-7.x-Windows\solr\core\src\test-files\solr\collection1\core.properties:java.nio.file.NoSuchFileException: C:\Users\jenkins\workspace\Lucene-Solr-7.x-Windows\solr\core\src\test-files\solr\collection1\core.properties
   [junit4]   2> 598721 INFO  (TEST-TestNRTOpen.testReaderIsNRT-seed#[186C55E95182C85C]) [    x:collection1] o.a.s.c.SolrResourceLoader [null] Added 2 libs to classloader, from paths: [/C:/Users/jenkins/workspace/Lucene-Solr-7.x-Windows/solr/core/src/test-files/solr/collection1/lib, /C:/Users/jenkins/workspace/Lucene-Solr-7.x-Windows/solr/core/src/test-files/solr/collection1/lib/classes]
   [junit4]   2> 598790 INFO  (TEST-TestNRTOpen.testReaderIsNRT-seed#[186C55E95182C85C]) [    x:collection1] o.a.s.c.SolrConfig Using Lucene MatchVersion: 7.7.0
   [junit4]   2> 598796 INFO  (TEST-TestNRTOpen.testReaderIsNRT-seed#[186C55E95182C85C]) [    x:collection1] o.a.s.s.IndexSchema [collection1] Schema name=minimal
   [junit4]   2> 598801 WARN  (TEST-TestNRTOpen.testReaderIsNRT-seed#[186C55E95182C85C]) [    x:collection1] o.a.s.s.IndexSchema no uniqueKey specified in schema.
   [junit4]   2> 598801 INFO  (TEST-TestNRTOpen.testReaderIsNRT-seed#[186C55E95182C85C]) [    x:collection1] o.a.s.s.IndexSchema Loaded schema minimal/1.1 with uniqueid field null
   [junit4]   2> 598801 INFO  (TEST-TestNRTOpen.testReaderIsNRT-seed#[186C55E95182C85C]) [    x:collection1] o.a.s.c.CoreContainer Reloading SolrCore 'collection1' using configuration from instancedir C:\Users\jenkins\workspace\Lucene-Solr-7.x-Windows\solr\core\src\test-files\solr\collection1
   [junit4]   2> 598821 INFO  (TEST-TestNRTOpen.testReaderIsNRT-seed#[186C55E95182C85C]) [    x:collection1] o.a.s.m.r.SolrJmxReporter JMX monitoring for 'solr.core.collection1' (registry 'solr.core.collection1') enabled at server: com.sun.jmx.mbeanserver.JmxMBeanServer@1fda74
   [junit4]   2> 598821 INFO  (TEST-TestNRTOpen.testReaderIsNRT-seed#[186C55E95182C85C]) [    x:collection1] o.a.s.c.SolrCore [[collection1] ] Opening new SolrCore at [C:\Users\jenkins\workspace\Lucene-Solr-7.x-Windows\solr\core\src\test-files\solr\collection1], dataDir=[C:\Users\jenkins\workspace\Lucene-Solr-7.x-Windows\solr\build\solr-core\test\J0\temp\solr.core.TestNRTOpen_186C55E95182C85C-001\init-core-data-001\]
   [junit4]   2> 598953 INFO  (TEST-TestNRTOpen.testReaderIsNRT-seed#[186C55E95182C85C]) [    x:collection1] o.a.s.u.CommitTracker Hard AutoCommit: disabled
   [junit4]   2> 598953 INFO  (TEST-TestNRTOpen.testReaderIsNRT-seed#[186C55E95182C85C]) [    x:collection1] o.a.s.u.CommitTracker Soft AutoCommit: disabled
   [junit4]   2> 598962 INFO  (TEST-TestNRTOpen.testReaderIsNRT-seed#[186C55E95182C85C]) [    x:collection1] o.a.s.s.SolrIndexSearcher Opening [Searcher@245c49[collection1] main]
   [junit4]   2> 598966 WARN  (TEST-TestNRTOpen.testReaderIsNRT-seed#[186C55E95182C85C]) [    x:collection1] o.a.s.r.ManagedResourceStorage Cannot write to config directory C:\Users\jenkins\workspace\Lucene-Solr-7.x-Windows\solr\core\src\test-files\solr\collection1\conf; switching to use InMemory storage instead.
   [junit4]   2> 598966 INFO  (TEST-TestNRTOpen.testReaderIsNRT-seed#[186C55E95182C85C]) [    x:collection1] o.a.s.h.ReplicationHandler Commits will be reserved for 10000ms.
   [junit4]   2> 598969 INFO  (searcherExecutor-2094-thread-1-processing-x:collection1) [    x:collection1] o.a.s.c.SolrCore [collection1] Registered new searcher Searcher@245c49[collection1] main{ExitableDirectoryReader(UninvertingDirectoryReader(Uninverting(_1(7.7.0):c1:[diagnostics={java.runtime.version=1.8.0_172-b11, java.vendor=Oracle Corporation, java.version=1.8.0_172, java.vm.version=25.172-b11, lucene.version=7.7.0, os=Windows 10, os.arch=x86, os.version=10.0, source=flush, timestamp=1546405476179}]:[attributes={Lucene50StoredFieldsFormat.mode=BEST_SPEED}]) Uninverting(_2(7.7.0):c1:[diagnostics={os=Windows 10, java.vendor=Oracle Corporation, java.version=1.8.0_172, java.vm.version=25.172-b11, lucene.version=7.7.0, os.arch=x86, java.runtime.version=1.8.0_172-b11, source=flush, os.version=10.0, timestamp=1546405476547}]:[attributes={Lucene50StoredFieldsFormat.mode=BEST_SPEED}]) Uninverting(_3(7.7.0):c1:[diagnostics={os=Windows 10, java.vendor=Oracle Corporation, java.version=1.8.0_172, java.vm.version=25.172-b11, lucene.version=7.7.0, os.arch=x86, java.runtime.version=1.8.0_172-b11, source=flush, os.version=10.0, timestamp=1546405476558}]:[attributes={Lucene50StoredFieldsFormat.mode=BEST_SPEED}]) Uninverting(_4(7.7.0):c1:[diagnostics={os=Windows 10, java.vendor=Oracle Corporation, java.version=1.8.0_172, java.vm.version=25.172-b11, lucene.version=7.7.0, os.arch=x86, java.runtime.version=1.8.0_172-b11, source=flush, os.version=10.0, timestamp=1546405476813}]:[attributes={Lucene50StoredFieldsFormat.mode=BEST_SPEED}])))}
   [junit4]   2> 598986 INFO  (TEST-TestNRTOpen.testReaderIsNRT-seed#[186C55E95182C85C]) [    x:collection1] o.a.s.u.DefaultSolrCoreState New IndexWriter is ready to be used.
   [junit4]   2> 598988 INFO  (TEST-TestNRTOpen.testReaderIsNRT-seed#[186C55E95182C85C]) [    x:collection1] o.a.s.s.SolrIndexSearcher Opening [Searcher@20b0b4[collection1] main]
   [junit4]   2> 598988 INFO  (TEST-TestNRTOpen.testReaderIsNRT-seed#[186C55E95182C85C]) [    x:collection1] o.a.s.c.SolrCore [collection1]  CLOSING SolrCore org.apache.solr.core.SolrCore@1926a4d
   [junit4]   2> 598990 INFO  (TEST-TestNRTOpen.testReaderIsNRT-seed#[186C55E95182C85C]) [    x:collection1] o.a.s.m.SolrMetricManager Closing metric reporters for registry=solr.core.collection1, tag=1926a4d
   [junit4]   2> 598990 INFO  (TEST-TestNRTOpen.testReaderIsNRT-seed#[186C55E95182C85C]) [    x:collection1] o.a.s.m.r.SolrJmxReporter Closing reporter [org.apache.solr.metrics.reporters.SolrJmxReporter@dd822e: rootName = null, domain = solr.core.collection1, service url = null, agent id = null] for registry solr.core.collection1 / com.codahale.metrics.MetricRegistry@1a0c1d7
   [junit4]   2> 598991 INFO  (searcherExecutor-2094-thread-1-processing-x:collection1) [    x:collection1] o.a.s.c.SolrCore [collection1] Registered new searcher Searcher@20b0b4[collection1] main{ExitableDirectoryReader(UninvertingDirectoryReader(Uninverting(_1(7.7.0):c1:[diagnostics={java.runtime.version=1.8.0_172-b11, java.vendor=Oracle Corporation, java.version=1.8.0_172, java.vm.version=25.172-b11, lucene.version=7.7.0, os=Windows 10, os.arch=x86, os.version=10.0, source=flush, timestamp=1546405476179}]:[attributes={Lucene50StoredFieldsFormat.mode=BEST_SPEED}]) Uninverting(_2(7.7.0):c1:[diagnostics={java.runtime.version=1.8.0_172-b11, java.vendor=Oracle Corporation, java.version=1.8.0_172, java.vm.version=25.172-b11, lucene.version=7.7.0, os=Windows 10, os.arch=x86, os.version=10.0, source=flush, timestamp=1546405476547}]:[attributes={Lucene50StoredFieldsFormat.mode=BEST_SPEED}]) Uninverting(_3(7.7.0):c1:[diagnostics={java.runtime.version=1.8.0_172-b11, java.vendor=Oracle Corporation, java.version=1.8.0_172, java.vm.version=25.172-b11, lucene.version=7.7.0, os=Windows 10, os.arch=x86, os.version=10.0, source=flush, timestamp=1546405476558}]:[attributes={Lucene50StoredFieldsFormat.mode=BEST_SPEED}]) Uninverting(_4(7.7.0):c1:[diagnostics={java.runtime.version=1.8.0_172-b11, java.vendor=Oracle Corporation, java.version=1.8.0_172, java.vm.version=25.172-b11, lucene.version=7.7.0, os=Windows 10, os.arch=x86, os.version=10.0, source=flush, timestamp=1546405476813}]:[attributes={Lucene50StoredFieldsFormat.mode=BEST_SPEED}])))}
   [junit4]   2> 598999 INFO  (TEST-TestNRTOpen.testReaderIsNRT-seed#[186C55E95182C85C]) [    x:collection1] o.a.s.SolrTestCaseJ4 ###Ending testReaderIsNRT
   [junit4]   2> 599003 INFO  (TEST-TestNRTOpen.testSharedCores-seed#[186C55E95182C85C]) [    x:collection1] o.a.s.SolrTestCaseJ4 ###Starting testSharedCores
   [junit4]   2> 599003 INFO  (TEST-TestNRTOpen.testSharedCores-seed#[186C55E95182C85C]) [    x:collection1] o.a.s.u.DirectUpdateHandler2 [collection1] REMOVING ALL DOCUMENTS FROM INDEX
   [junit4]   2> 599003 INFO  (TEST-TestNRTOpen.testSharedCores-seed#[186C55E95182C85C]) [    x:collection1] o.a.s.u.p.LogUpdateProcessorFactory [collection1]  webapp=null path=null params={}{deleteByQuery=*:*} 0 0
   [junit4]   2> 599005 INFO  (TEST-TestNRTOpen.testSharedCores-seed#[186C55E95182C85C]) [    x:collection1] o.a.s.u.p.LogUpdateProcessorFactory [collection1]  webapp=null path=null params={}{add=[(null)]} 0 1
   [junit4]   2> 599005 INFO  (TEST-TestNRTOpen.testSharedCores-seed#[186C55E95182C85C]) [    x:collection1] o.a.s.u.DirectUpdateHandler2 start commit{,optimize=false,openSearcher=true,waitSearcher=true,expungeDeletes=false,softCommit=false,prepareCommit=false}
   [junit4]   2> 599005 INFO  (TEST-TestNRTOpen.testSharedCores-seed#[186C55E95182C85C]) [    x:collection1] o.a.s.u.SolrIndexWriter Calling setCommitData with IW:org.apache.solr.update.SolrIndexWriter@13b7113 commitCommandVersion:0
   [junit4]   2> 599028 INFO  (TEST-TestNRTOpen.testSharedCores-seed#[186C55E95182C85C]) [    x:collection1] o.a.s.s.SolrIndexSearcher Opening [Searcher@1e271ce[collection1] main]
   [junit4]   2> 599029 INFO  (TEST-TestNRTOpen.testSharedCores-seed#[186C55E95182C85C]) [    x:collection1] o.a.s.u.DirectUpdateHandler2 end_commit_flush
   [junit4]   2> 599030 INFO  (searcherExecutor-2094-thread-1-processing-x:collection1) [    x:collection1] o.a.s.c.SolrCore [collection1] Registered new searcher Searcher@1e271ce[collection1] main{ExitableDirectoryReader(UninvertingDirectoryReader(Uninverting(_5(7.7.0):c1:[diagnostics={os=Windows 10, java.vendor=Oracle Corporation, java.version=1.8.0_172, java.vm.version=25.172-b11, lucene.version=7.7.0, os.arch=x86, java.runtime.version=1.8.0_172-b11, source=flush, os.version=10.0, timestamp=1546405476863}]:[attributes={Lucene50StoredFieldsFormat.mode=BEST_SPEED}])))}
   [junit4]   2> 599037 INFO  (TEST-TestNRTOpen.testSharedCores-seed#[186C55E95182C85C]) [    x:collection1] o.a.s.u.p.LogUpdateProcessorFactory [collection1]  webapp=null path=null params={}{commit=} 0 29
   [junit4]   2> 599038 INFO  (TEST-TestNRTOpen.testSharedCores-seed#[186C55E95182C85C]) [    x:collection1] o.a.s.u.DirectUpdateHandler2 start commit{,optimize=true,openSearcher=true,waitSearcher=true,expungeDeletes=false,softCommit=false,prepareCommit=false}
   [junit4]   2> 599038 WARN  (TEST-TestNRTOpen.testSharedCores-seed#[186C55E95182C85C]) [    x:collection1] o.a.s.u.DirectUpdateHandler2 Starting optimize... Reading and rewriting a potentially large percent of the entire index, reducing to 2147483647 segments
   [junit4]   2> 599038 INFO  (TEST-TestNRTOpen.testSharedCores-seed#[186C55E95182C85C]) [    x:collection1] o.a.s.u.DirectUpdateHandler2 No uncommitted changes. Skipping IW.commit.
   [junit4]   2> 599039 INFO  (TEST-TestNRTOpen.testSharedCores-seed#[186C55E95182C85C]) [    x:collection1] o.a.s.u.DirectUpdateHandler2 end_commit_flush
   [junit4]   2> 599039 INFO  (TEST-TestNRTOpen.testSharedCores-seed#[186C55E95182C85C]) [    x:collection1] o.a.s.u.p.LogUpdateProcessorFactory [collection1]  webapp=null path=null params={}{optimize=} 0 1
   [junit4]   2> 599042 INFO  (TEST-TestNRTOpen.testSharedCores-seed#[186C55E95182C85C]) [    x:collection1] o.a.s.u.p.LogUpdateProcessorFactory [collection1]  webapp=null path=null params={}{add=[(null)]} 0 1
   [junit4]   2> 599043 INFO  (TEST-TestNRTOpen.testSharedCores-seed#[186C55E95182C85C]) [    x:collection1] o.a.s.u.DirectUpdateHandler2 start commit{,optimize=false,openSearcher=true,waitSearcher=true,expungeDeletes=false,softCommit=true,prepareCommit=false}
   [junit4]   2> 599056 INFO  (TEST-TestNRTOpen.testSharedCores-seed#[186C55E95182C85C]) [    x:collection1] o.a.s.s.SolrIndexSearcher Opening [Searcher@dd9f39[collection1] main]
   [junit4]   2> 599058 INFO  (TEST-TestNRTOpen.testSharedCores-seed#[186C55E95182C85C]) [    x:collection1] o.a.s.u.DirectUpdateHandler2 end_commit_flush
   [junit4]   2> 599060 INFO  (searcherExecutor-2094-thread-1-processing-x:collection1) [    x:collection1] o.a.s.c.SolrCore [collection1] Registered new searcher Searcher@dd9f39[collection1] main{ExitableDirectoryReader(UninvertingDirectoryReader(Uninverting(_5(7.7.0):c1:[diagnostics={os=Windows 10, java.vendor=Oracle Corporation, java.version=1.8.0_172, java.vm.version=25.172-b11, lucene.version=7.7.0, os.arch=x86, java.runtime.version=1.8.0_172-b11, source=flush, os.version=10.0, timestamp=1546405476863}]:[attributes={Lucene50StoredFieldsFormat.mode=BEST_SPEED}]) Uninverting(_6(7.7.0):c1:[diagnostics={os=Windows 10, java.vendor=Oracle Corporation, java.version=1.8.0_172, java.vm.version=25.172-b11, lucene.version=7.7.0, os.arch=x86, java.runtime.version=1.8.0_172-b11, source=flush, os.version=10.0, timestamp=1546405476903}]:[attributes={Lucene50StoredFieldsFormat.mode=BEST_SPEED}])))}
   [junit4]   2> 599060 INFO  (TEST-TestNRTOpen.testSharedCores-seed#[186C55E95182C85C]) [    x:collection1] o.a.s.u.p.LogUpdateProcessorFactory [collection1]  webapp=null path=null params={}{commit=} 0 15
   [junit4]   2> 599062 INFO  (TEST-TestNRTOpen.testSharedCores-seed#[186C55E95182C85C]) [    x:collection1] o.a.s.u.p.LogUpdateProcessorFactory [collection1]  webapp=null path=null params={}{add=[(null)]} 0 1
   [junit4]   2> 599063 INFO  (TEST-TestNRTOpen.testSharedCores-seed#[186C55E95182C85C]) [    x:collection1] o.a.s.u.p.LogUpdateProcessorFactory [collection1]  webapp=null path=null params={}{add=[(null)]} 0 0
   [junit4]   2> 599064 INFO  (TEST-TestNRTOpen.testSharedCores-seed#[186C55E95182C85C]) [    x:collection1] o.a.s.u.DirectUpdateHandler2 start commit{,optimize=false,openSearcher=true,waitSearcher=true,expungeDeletes=false,softCommit=false,prepareCommit=false}
   [junit4]   2> 599064 INFO  (TEST-TestNRTOpen.testSharedCores-seed#[186C55E95182C85C]) [    x:collection1] o.a.s.u.SolrIndexWriter Calling setCommitData with IW:org.apache.solr.update.SolrIndexWriter@13b7113 commitCommandVersion:0
   [junit4]   2> 599083 INFO  (TEST-TestNRTOpen.testSharedCores-seed#[186C55E95182C85C]) [    x:collection1] o.a.s.s.SolrIndexSearcher Opening [Searcher@67320e[collection1] main]
   [junit4]   2> 599085 INFO  (TEST-TestNRTOpen.testSharedCores-seed#[186C55E95182C85C]) [    x:collection1] o.a.s.u.DirectUpdateHandler2 end_commit_flush
   [junit4]   2> 599087 INFO  (searcherExecutor-2094-thread-1-processing-x:collection1) [    x:collection1] o.a.s.c.SolrCore [collection1] Registered new searcher Searcher@67320e[collection1] main{ExitableDirectoryReader(UninvertingDirectoryReader(Uninverting(_5(7.7.0):c1:[diagnostics={os=Windows 10, java.vendor=Oracle Corporation, java.version=1.8.0_172, java.vm.version=25.172-b11, lucene.version=7.7.0, os.arch=x86, java.runtime.version=1.8.0_172-b11, source=flush, os.version=10.0, timestamp=1546405476863}]:[attributes={Lucene50StoredFieldsFormat.mode=BEST_SPEED}]) Uninverting(_6(7.7.0):c1:[diagnostics={os=Windows 10, java.vendor=Oracle Corporation, java.version=1.8.0_172, java.vm.version=25.172-b11, lucene.version=7.7.0, os.arch=x86, java.runtime.version=1.8.0_172-b11, source=flush, os.version=10.0, timestamp=1546405476903}]:[attributes={Lucene50StoredFieldsFormat.mode=BEST_SPEED}]) Uninverting(_7(7.7.0):c2:[diagnostics={os=Windows 10, java.vendor=Oracle Corporation, java.version=1.8.0_172, java.vm.version=25.172-b11, lucene.version=7.7.0, os.arch=x86, java.runtime.version=1.8.0_172-b11, source=flush, os.version=10.0, timestamp=1546405476923}]:[attributes={Lucene50StoredFieldsFormat.mode=BEST_SPEED}])))}
   [junit4]   2> 599087 INFO  (TEST-TestNRTOpen.testSharedCores-seed#[186C55E95182C85C]) [    x:collection1] o.a.s.u.p.LogUpdateProcessorFactory [collection1]  webapp=null path=null params={}{commit=} 0 21
   [junit4]   2> 599088 INFO  (TEST-TestNRTOpen.testSharedCores-seed#[186C55E95182C85C]) [    x:collection1] o.a.s.u.p.LogUpdateProcessorFactory [collection1]  webapp=null path=null params={}{deleteByQuery=foo2:doc} 0 0
   [junit4]   2> 599089 INFO  (TEST-TestNRTOpen.testSharedCores-seed#[186C55E95182C85C]) [    x:collection1] o.a.s.u.DirectUpdateHandler2 start commit{,optimize=false,openSearcher=true,waitSearcher=true,expungeDeletes=false,softCommit=false,prepareCommit=false}
   [junit4]   2> 599089 INFO  (TEST-TestNRTOpen.testSharedCores-seed#[186C55E95182C85C]) [    x:collection1] o.a.s.u.SolrIndexWriter Calling setCommitData with IW:org.apache.solr.update.SolrIndexWriter@13b7113 commitCommandVersion:0
   [junit4]   2> 599098 INFO  (TEST-TestNRTOpen.testSharedCores-seed#[186C55E95182C85C]) [    x:collection1] o.a.s.s.SolrIndexSearcher Opening [Searcher@129a8c8[collection1] main]
   [junit4]   2> 599099 INFO  (TEST-TestNRTOpen.testSharedCores-seed#[186C55E95182C85C]) [    x:collection1] o.a.s.u.DirectUpdateHandler2 end_commit_flush
   [junit4]   2> 599101 INFO  (searcherExecutor-2094-thread-1-processing-x:collection1) [    x:collection1] o.a.s.c.SolrCore [collection1] Registered new searcher Searcher@129a8c8[collection1] main{ExitableDirectoryReader(UninvertingDirectoryReader(Uninverting(_5(7.7.0):c1:[diagnostics={os=Windows 10, java.vendor=Oracle Corporation, java.version=1.8.0_172, java.vm.version=25.172-b11, lucene.version=7.7.0, os.arch=x86, java.runtime.version=1.8.0_172-b11, source=flush, os.version=10.0, timestamp=1546405476863}]:[attributes={Lucene50StoredFieldsFormat.mode=BEST_SPEED}]) Uninverting(_6(7.7.0):c1:[diagnostics={os=Windows 10, java.vendor=Oracle Corporation, java.version=1.8.0_172, java.vm.version=25.172-b11, lucene.version=7.7.0, os.arch=x86, java.runtime.version=1.8.0_172-b11, source=flush, os.version=10.0, timestamp=1546405476903}]:[attributes={Lucene50StoredFieldsFormat.mode=BEST_SPEED}]) Uninverting(_7(7.7.0):c2/1:[diagnostics={os=Windows 10, java.vendor=Oracle Corporation, java.version=1.8.0_172, java.vm.version=25.172-b11, lucene.version=7.7.0, os.arch=x86, java.runtime.version=1.8.0_172-b11, source=flush, os.version=10.0, timestamp=1546405476923}]:[attributes={Lucene50StoredFieldsFormat.mode=BEST_SPEED}]:delGen=1)))}
   [junit4]   2> 599101 INFO  (TEST-TestNRTOpen.testSharedCores-seed#[186C55E95182C85C]) [    x:collection1] o.a.s.u.p.LogUpdateProcessorFactory [collection1]  webapp=null path=null params={}{commit=} 0 10
   [junit4]   2> 599102 INFO  (TEST-TestNRTOpen.testSharedCores-seed#[186C55E95182C85C]) [    x:collection1] o.a.s.SolrTestCaseJ4 ###Ending testSharedCores
   [junit4]   2> 599102 INFO  (SUITE-TestNRTOpen-seed#[186C55E95182C85C]-worker) [    x:collection1] o.a.s.SolrTestCaseJ4 ###deleteCore
   [junit4]   2> 599102 INFO  (SUITE-TestNRTOpen-seed#[186C55E95182C85C]-worker) [    x:collection1] o.a.s.c.CoreContainer Shutting down CoreContainer instance=12933292
   [junit4]   2> 599109 INFO  (coreCloseExecutor-2098-thread-1-processing-x:collection1) [    x:collection1] o.a.s.c.SolrCore [collection1]  CLOSING SolrCore org.apache.solr.core.SolrCore@14c21f3
   [junit4]   2> 599110 INFO  (coreCloseExecutor-2098-thread-1-processing-x:collection1) [    x:collection1] o.a.s.m.SolrMetricManager Closing metric reporters for registry=solr.core.collection1, tag=14c21f3
   [junit4]   2> 599110 INFO  (coreCloseExecutor-2098-thread-1-processing-x:collection1) [    x:collection1] o.a.s.m.r.SolrJmxReporter Closing reporter [org.apache.solr.metrics.reporters.SolrJmxReporter@183fdec: rootName = null, domain = solr.core.collection1, service url = null, agent id = null] for registry solr.core.collection1 / com.codahale.metrics.MetricRegistry@1a0c1d7
   [junit4]   2> 599131 INFO  (SUITE-TestNRTOpen-seed#[186C55E95182C85C]-worker) [    x:collection1] o.a.s.m.SolrMetricManager Closing metric reporters for registry=solr.node, tag=null
   [junit4]   2> 599131 INFO  (SUITE-TestNRTOpen-seed#[186C55E95182C85C]-worker) [    x:collection1] o.a.s.m.r.SolrJmxReporter Closing reporter [org.apache.solr.metrics.reporters.SolrJmxReporter@a5b903: rootName = null, domain = solr.node, service url = null, agent id = null] for registry solr.node / com.codahale.metrics.MetricRegistry@16dd8ba
   [junit4]   2> 599136 INFO  (SUITE-TestNRTOpen-seed#[186C55E95182C85C]-worker) [    x:collection1] o.a.s.m.SolrMetricManager Closing metric reporters for registry=solr.jvm, tag=null
   [junit4]   2> 599136 INFO  (SUITE-TestNRTOpen-seed#[186C55E95182C85C]-worker) [    x:collection1] o.a.s.m.r.SolrJmxReporter Closing reporter [org.apache.solr.metrics.reporters.SolrJmxReporter@12387a5: rootName = null, domain = solr.jvm, service url = null, agent id = null] for registry solr.jvm / com.codahale.metrics.MetricRegistry@1eb6429
   [junit4]   2> 599140 INFO  (SUITE-TestNRTOpen-seed#[186C55E95182C85C]-worker) [    x:collection1] o.a.s.m.SolrMetricManager Closing metric reporters for registry=solr.jetty, tag=null
   [junit4]   2> 599141 INFO  (SUITE-TestNRTOpen-seed#[186C55E95182C85C]-worker) [    x:collection1] o.a.s.m.r.SolrJmxReporter Closing reporter [org.apache.solr.metrics.reporters.SolrJmxReporter@13d75e5: rootName = null, domain = solr.jetty, service url = null, agent id = null] for registry solr.jetty / com.codahale.metrics.MetricRegistry@1e3d405
   [junit4]   2> 599146 INFO  (SUITE-TestNRTOpen-seed#[186C55E95182C85C]-worker) [    x:collection1] o.a.s.SolrTestCaseJ4 ------------------------------------------------------- Done waiting for tracked resources to be released
   [junit4]   2> NOTE: test params are: codec=CheapBastard, sim=RandomSimilarity(queryNorm=true): {}, locale=de-AT, timezone=Asia/Choibalsan
   [junit4]   2> NOTE: Windows 10 10.0 x86/Oracle Corporation 1.8.0_172 (32-bit)/cpus=3,threads=1,free=94851632,total=373293056
   [junit4]   2> NOTE: All tests run in this JVM: [AnalysisErrorHandlingTest, TestCloudManagedSchema, TestStressRecovery, ResponseHeaderTest, DocValuesNotIndexedTest, TestCloudSearcherWarming, NodeLostTriggerIntegrationTest, TestBadConfig, SearchRateTriggerTest, TestReloadDeadlock, TestSweetSpotSimilarityFactory, RequiredFieldsTest, TestSchemaResource, TestSurroundQueryParser, SolrCloudExampleTest, OrderedExecutorTest, TestFieldCacheSortRandom, TestMinMaxOnMultiValuedField, SchemaVersionSpecificBehaviorTest, TestSolrConfigHandler, TestRandomRequestDistribution, ConjunctionSolrSpellCheckerTest, TestRestManager, TestCollapseQParserPlugin, TestSimLargeCluster, AliasIntegrationTest, DistributedQueryElevationComponentTest, TestMaxScoreQueryParser, HdfsChaosMonkeyNothingIsSafeTest, TestComplexPhraseQParserPlugin, TestLMJelinekMercerSimilarityFactory, TestTrie, CurrencyRangeFacetCloudTest, TestRandomFaceting, DisMaxRequestHandlerTest, ChaosMonkeySafeLeaderTest, IgnoreCommitOptimizeUpdateProcessorFactoryTest, NumericFieldsTest, CdcrRequestHandlerTest, TestSearcherReuse, TestManagedSynonymFilterFactory, TestCoreAdminApis, TestGeoJSONResponseWriter, ChaosMonkeyNothingIsSafeTest, SpellCheckCollatorTest, TriggerEventQueueTest, TestFieldTypeResource, SortByFunctionTest, URLClassifyProcessorTest, ActionThrottleTest, TestJavabinTupleStreamParser, BadComponentTest, TestSafeXMLParsing, TestFieldCacheReopen, SmileWriterTest, RollingRestartTest, LargeFieldTest, TestNRTOpen]
   [junit4]   2> NOTE: reproduce with: ant test  -Dtestcase=TestNRTOpen -Dtests.seed=186C55E95182C85C -Dtests.slow=true -Dtests.locale=de-AT -Dtests.timezone=Asia/Choibalsan -Dtests.asserts=true -Dtests.file.encoding=Cp1252
   [junit4] ERROR   0.00s J0 | TestNRTOpen (suite) <<<
   [junit4]    > Throwable #1: java.io.IOException: Could not remove the following files (in the order of attempts):
   [junit4]    >    C:\Users\jenkins\workspace\Lucene-Solr-7.x-Windows\solr\build\solr-core\test\J0\temp\solr.core.TestNRTOpen_186C55E95182C85C-001\init-core-data-001: java.nio.file.AccessDeniedException: C:\Users\jenkins\workspace\Lucene-Solr-7.x-Windows\solr\build\solr-core\test\J0\temp\solr.core.TestNRTOpen_186C55E95182C85C-001\init-core-data-001
   [junit4]    >    C:\Users\jenkins\workspace\Lucene-Solr-7.x-Windows\solr\build\solr-core\test\J0\temp\solr.core.TestNRTOpen_186C55E95182C85C-001: java.nio.file.DirectoryNotEmptyException: C:\Users\jenkins\workspace\Lucene-Solr-7.x-Windows\solr\build\solr-core\test\J0\temp\solr.core.TestNRTOpen_186C55E95182C85C-001
   [junit4]    > 	at __randomizedtesting.SeedInfo.seed([186C55E95182C85C]:0)
   [junit4]    > 	at org.apache.lucene.util.IOUtils.rm(IOUtils.java:318)
   [junit4]    > 	at java.lang.Thread.run(Thread.java:748)
   [junit4] Completed [119/835 (1!)] on J0 in 3.84s, 2 tests, 1 error <<< FAILURES!

[...truncated 1759 lines...]
   [junit4] Suite: org.apache.solr.handler.TestSQLHandler
   [junit4]   2> Creating dataDir: C:\Users\jenkins\workspace\Lucene-Solr-7.x-Windows\solr\build\solr-core\test\J0\temp\solr.handler.TestSQLHandler_186C55E95182C85C-001\init-core-data-001
   [junit4]   2> 2915413 WARN  (SUITE-TestSQLHandler-seed#[186C55E95182C85C]-worker) [    ] o.a.s.SolrTestCaseJ4 startTrackingSearchers: numOpens=15 numCloses=15
   [junit4]   2> 2915413 INFO  (SUITE-TestSQLHandler-seed#[186C55E95182C85C]-worker) [    ] o.a.s.SolrTestCaseJ4 Using PointFields (NUMERIC_POINTS_SYSPROP=true) w/NUMERIC_DOCVALUES_SYSPROP=true
   [junit4]   2> 2915418 INFO  (SUITE-TestSQLHandler-seed#[186C55E95182C85C]-worker) [    ] o.a.s.SolrTestCaseJ4 Randomized ssl (false) and clientAuth (false) via: @org.apache.solr.SolrTestCaseJ4$SuppressSSL(bugUrl=None)
   [junit4]   2> 2915418 INFO  (SUITE-TestSQLHandler-seed#[186C55E95182C85C]-worker) [    ] o.a.s.SolrTestCaseJ4 SecureRandom sanity checks: test.solr.allowed.securerandom=null & java.security.egd=file:/dev/./urandom
   [junit4]   2> 2915418 INFO  (SUITE-TestSQLHandler-seed#[186C55E95182C85C]-worker) [    ] o.a.s.BaseDistributedSearchTestCase Setting hostContext system property: /g_roe/
   [junit4]   2> 2915421 INFO  (TEST-TestSQLHandler.doTest-seed#[186C55E95182C85C]) [    ] o.a.s.c.ZkTestServer STARTING ZK TEST SERVER
   [junit4]   2> 2915421 INFO  (ZkTestServer Run Thread) [    ] o.a.s.c.ZkTestServer client port:0.0.0.0/0.0.0.0:0
   [junit4]   2> 2915421 INFO  (ZkTestServer Run Thread) [    ] o.a.s.c.ZkTestServer Starting server
   [junit4]   2> 2915521 INFO  (TEST-TestSQLHandler.doTest-seed#[186C55E95182C85C]) [    ] o.a.s.c.ZkTestServer start zk server on port:62419
   [junit4]   2> 2915521 INFO  (TEST-TestSQLHandler.doTest-seed#[186C55E95182C85C]) [    ] o.a.s.c.ZkTestServer parse host and port list: 127.0.0.1:62419
   [junit4]   2> 2915521 INFO  (TEST-TestSQLHandler.doTest-seed#[186C55E95182C85C]) [    ] o.a.s.c.ZkTestServer connecting to 127.0.0.1 62419
   [junit4]   2> 2915526 INFO  (zkConnectionManagerCallback-13119-thread-1) [    ] o.a.s.c.c.ConnectionManager zkClient has connected
   [junit4]   2> 2915529 INFO  (zkConnectionManagerCallback-13121-thread-1) [    ] o.a.s.c.c.ConnectionManager zkClient has connected
   [junit4]   2> 2915531 INFO  (TEST-TestSQLHandler.doTest-seed#[186C55E95182C85C]) [    ] o.a.s.c.ZkTestServer put C:\Users\jenkins\workspace\Lucene-Solr-7.x-Windows\solr\core\src\test-files\solr\collection1\conf\solrconfig-sql.xml to /configs/conf1/solrconfig.xml
   [junit4]   2> 2915532 INFO  (TEST-TestSQLHandler.doTest-seed#[186C55E95182C85C]) [    ] o.a.s.c.ZkTestServer put C:\Users\jenkins\workspace\Lucene-Solr-7.x-Windows\solr\core\src\test-files\solr\collection1\conf\schema-sql.xml to /configs/conf1/schema.xml
   [junit4]   2> 2915533 INFO  (TEST-TestSQLHandler.doTest-seed#[186C55E95182C85C]) [    ] o.a.s.c.ZkTestServer put C:\Users\jenkins\workspace\Lucene-Solr-7.x-Windows\solr\core\src\test-files\solr\collection1\conf\solrconfig.snippet.randomindexconfig.xml to /configs/conf1/solrconfig.snippet.randomindexconfig.xml
   [junit4]   2> 2915534 INFO  (TEST-TestSQLHandler.doTest-seed#[186C55E95182C85C]) [    ] o.a.s.c.ZkTestServer put C:\Users\jenkins\workspace\Lucene-Solr-7.x-Windows\solr\core\src\test-files\solr\collection1\conf\stopwords.txt to /configs/conf1/stopwords.txt
   [junit4]   2> 2915535 INFO  (TEST-TestSQLHandler.doTest-seed#[186C55E95182C85C]) [    ] o.a.s.c.ZkTestServer put C:\Users\jenkins\workspace\Lucene-Solr-7.x-Windows\solr\core\src\test-files\solr\collection1\conf\protwords.txt to /configs/conf1/protwords.txt
   [junit4]   2> 2915536 INFO  (TEST-TestSQLHandler.doTest-seed#[186C55E95182C85C]) [    ] o.a.s.c.ZkTestServer put C:\Users\jenkins\workspace\Lucene-Solr-7.x-Windows\solr\core\src\test-files\solr\collection1\conf\currency.xml to /configs/conf1/currency.xml
   [junit4]   2> 2915537 INFO  (TEST-TestSQLHandler.doTest-seed#[186C55E95182C85C]) [    ] o.a.s.c.ZkTestServer put C:\Users\jenkins\workspace\Lucene-Solr-7.x-Windows\solr\core\src\test-files\solr\collection1\conf\enumsConfig.xml to /configs/conf1/enumsConfig.xml
   [junit4]   2> 2915538 INFO  (TEST-TestSQLHandler.doTest-seed#[186C55E95182C85C]) [    ] o.a.s.c.ZkTestServer put C:\Users\jenkins\workspace\Lucene-Solr-7.x-Windows\solr\core\src\test-files\solr\collection1\conf\open-exchange-rates.json to /configs/conf1/open-exchange-rates.json
   [junit4]   2> 2915539 INFO  (TEST-TestSQLHandler.doTest-seed#[186C55E95182C85C]) [    ] o.a.s.c.ZkTestServer put C:\Users\jenkins\workspace\Lucene-Solr-7.x-Windows\solr\core\src\test-files\solr\collection1\conf\mapping-ISOLatin1Accent.txt to /configs/conf1/mapping-ISOLatin1Accent.txt
   [junit4]   2> 2915540 INFO  (TEST-TestSQLHandler.doTest-seed#[186C55E95182C85C]) [    ] o.a.s.c.ZkTestServer put C:\Users\jenkins\workspace\Lucene-Solr-7.x-Windows\solr\core\src\test-files\solr\collection1\conf\old_synonyms.txt to /configs/conf1/old_synonyms.txt
   [junit4]   2> 2915541 INFO  (TEST-TestSQLHandler.doTest-seed#[186C55E95182C85C]) [    ] o.a.s.c.ZkTestServer put C:\Users\jenkins\workspace\Lucene-Solr-7.x-Windows\solr\core\src\test-files\solr\collection1\conf\synonyms.txt to /configs/conf1/synonyms.txt
   [junit4]   2> 2915542 INFO  (TEST-TestSQLHandler.doTest-seed#[186C55E95182C85C]) [    ] o.a.s.c.AbstractFullDistribZkTestBase Will use NRT replicas unless explicitly asked otherwise
   [junit4]   2> 2916039 WARN  (TEST-TestSQLHandler.doTest-seed#[186C55E95182C85C]) [    ] o.e.j.s.AbstractConnector Ignoring deprecated socket close linger time
   [junit4]   2> 2916039 INFO  (TEST-TestSQLHandler.doTest-seed#[186C55E95182C85C]) [    ] o.a.s.c.s.e.JettySolrRunner Start Jetty (original configured port=0)
   [junit4]   2> 2916039 INFO  (TEST-TestSQLHandler.doTest-seed#[186C55E95182C85C]) [    ] o.a.s.c.s.e.JettySolrRunner Trying to start Jetty on port 0 try number 1 ...
   [junit4]   2> 2916039 INFO  (TEST-TestSQLHandler.doTest-seed#[186C55E95182C85C]) [    ] o.e.j.s.Server jetty-9.4.14.v20181114; built: 2018-11-14T21:20:31.478Z; git: c4550056e785fb5665914545889f21dc136ad9e6; jvm 1.8.0_172-b11
   [junit4]   2> 2916040 INFO  (TEST-TestSQLHandler.doTest-seed#[186C55E95182C85C]) [    ] o.e.j.s.session DefaultSessionIdManager workerName=node0
   [junit4]   2> 2916040 INFO  (TEST-TestSQLHandler.doTest-seed#[186C55E95182C85C]) [    ] o.e.j.s.session No SessionScavenger set, using defaults
   [junit4]   2> 2916040 INFO  (TEST-TestSQLHandler.doTest-seed#[186C55E95182C85C]) [    ] o.e.j.s.session node0 Scavenging every 660000ms
   [junit4]   2> 2916043 INFO  (TEST-TestSQLHandler.doTest-seed#[186C55E95182C85C]) [    ] o.e.j.s.h.ContextHandler Started o.e.j.s.ServletContextHandler@112b297{/g_roe,null,AVAILABLE}
   [junit4]   2> 2916044 INFO  (TEST-TestSQLHandler.doTest-seed#[186C55E95182C85C]) [    ] o.e.j.s.AbstractConnector Started ServerConnector@13348e{HTTP/1.1,[http/1.1]}{127.0.0.1:62427}
   [junit4]   2> 2916044 INFO  (TEST-TestSQLHandler.doTest-seed#[186C55E95182C85C]) [    ] o.e.j.s.Server Started @2886578ms
   [junit4]   2> 2916044 INFO  (TEST-TestSQLHandler.doTest-seed#[186C55E95182C85C]) [    ] o.a.s.c.s.e.JettySolrRunner Jetty properties: {solr.data.dir=C:\Users\jenkins\workspace\Lucene-Solr-7.x-Windows\solr\build\solr-core\test\J0\temp\solr.handler.TestSQLHandler_186C55E95182C85C-001\tempDir-001/control/data, replicaType=NRT, hostContext=/g_roe, hostPort=62427, coreRootDirectory=C:\Users\jenkins\workspace\Lucene-Solr-7.x-Windows\solr\build\solr-core\test\J0\..\..\..\..\..\..\..\..\..\Users\jenkins\workspace\Lucene-Solr-7.x-Windows\solr\build\solr-core\test\J0\temp\solr.handler.TestSQLHandler_186C55E95182C85C-001\control-001\cores}
   [junit4]   2> 2916045 ERROR (TEST-TestSQLHandler.doTest-seed#[186C55E95182C85C]) [    ] o.a.s.u.StartupLoggingUtils Missing Java Option solr.log.dir. Logging may be missing or incomplete.
   [junit4]   2> 2916045 INFO  (TEST-TestSQLHandler.doTest-seed#[186C55E95182C85C]) [    ] o.a.s.s.SolrDispatchFilter Using logger factory org.apache.logging.slf4j.Log4jLoggerFactory
   [junit4]   2> 2916045 INFO  (TEST-TestSQLHandler.doTest-seed#[186C55E95182C85C]) [    ] o.a.s.s.SolrDispatchFilter  ___      _       Welcome to Apache Solr™ version 7.7.0
   [junit4]   2> 2916045 INFO  (TEST-TestSQLHandler.doTest-seed#[186C55E95182C85C]) [    ] o.a.s.s.SolrDispatchFilter / __| ___| |_ _   Starting in cloud mode on port null
   [junit4]   2> 2916045 INFO  (TEST-TestSQLHandler.doTest-seed#[186C55E95182C85C]) [    ] o.a.s.s.SolrDispatchFilter \__ \/ _ \ | '_|  Install dir: null
   [junit4]   2> 2916045 INFO  (TEST-TestSQLHandler.doTest-seed#[186C55E95182C85C]) [    ] o.a.s.s.SolrDispatchFilter |___/\___/_|_|    Start time: 2019-01-02T05:43:13.899Z
   [junit4]   2> 2916048 INFO  (zkConnectionManagerCallback-13123-thread-1) [    ] o.a.s.c.c.ConnectionManager zkClient has connected
   [junit4]   2> 2916050 INFO  (TEST-TestSQLHandler.doTest-seed#[186C55E95182C85C]) [    ] o.a.s.s.SolrDispatchFilter Loading solr.xml from SolrHome (not found in ZooKeeper)
   [junit4]   2> 2916050 INFO  (TEST-TestSQLHandler.doTest-seed#[186C55E95182C85C]) [    ] o.a.s.c.SolrXmlConfig Loading container configuration from C:\Users\jenkins\workspace\Lucene-Solr-7.x-Windows\solr\build\solr-core\test\J0\temp\solr.handler.TestSQLHandler_186C55E95182C85C-001\control-001\solr.xml
   [junit4]   2> 2916057 INFO  (TEST-TestSQLHandler.doTest-seed#[186C55E95182C85C]) [    ] o.a.s.c.SolrXmlConfig Configuration parameter autoReplicaFailoverWorkLoopDelay is ignored
   [junit4]   2> 2916057 INFO  (TEST-TestSQLHandler.doTest-seed#[186C55E95182C85C]) [    ] o.a.s.c.SolrXmlConfig Configuration parameter autoReplicaFailoverBadNodeExpiration is ignored
   [junit4]   2> 2916057 INFO  (TEST-TestSQLHandler.doTest-seed#[186C55E95182C85C]) [    ] o.a.s.c.SolrXmlConfig MBean server found: com.sun.jmx.mbeanserver.JmxMBeanServer@1fda74, but no JMX reporters were configured - adding default JMX reporter.
   [junit4]   2> 2916390 INFO  (TEST-TestSQLHandler.doTest-seed#[186C55E95182C85C]) [    ] o.a.s.c.ZkContainer Zookeeper client=127.0.0.1:62419/solr
   [junit4]   2> 2916392 INFO  (zkConnectionManagerCallback-13127-thread-1) [    ] o.a.s.c.c.ConnectionManager zkClient has connected
   [junit4]   2> 2916394 WARN  (NIOServerCxn.Factory:0.0.0.0/0.0.0.0:0) [    ] o.a.z.s.NIOServerCnxn Unable to read additional data from client sessionid 0x1003d83041c0003, likely client has closed socket
   [junit4]   2> 2916397 INFO  (zkConnectionManagerCallback-13129-thread-1) [    ] o.a.s.c.c.ConnectionManager zkClient has connected
   [junit4]   2> 2916458 INFO  (TEST-TestSQLHandler.doTest-seed#[186C55E95182C85C]) [n:127.0.0.1:62427_g_roe    ] o.a.s.c.OverseerElectionContext I am going to be the leader 127.0.0.1:62427_g_roe
   [junit4]   2> 2916459 INFO  (TEST-TestSQLHandler.doTest-seed#[186C55E95182C85C]) [n:127.0.0.1:62427_g_roe    ] o.a.s.c.Overseer Overseer (id=72125226956881924-127.0.0.1:62427_g_roe-n_0000000000) starting
   [junit4]   2> 2916464 INFO  (zkConnectionManagerCallback-13136-thread-1) [    ] o.a.s.c.c.ConnectionManager zkClient has connected
   [junit4]   2> 2916466 INFO  (TEST-TestSQLHandler.doTest-seed#[186C55E95182C85C]) [n:127.0.0.1:62427_g_roe    ] o.a.s.c.s.i.ZkClientClusterStateProvider Cluster at 127.0.0.1:62419/

[...truncated too long message...]

metric reporters for registry=solr.jetty, tag=null
   [junit4]   2> 92429 INFO  (closeThreadPool-2896-thread-10) [    ] o.a.s.m.r.SolrJmxReporter Closing reporter [org.apache.solr.metrics.reporters.SolrJmxReporter@ba945b: rootName = null, domain = solr.jetty, service url = null, agent id = null] for registry solr.jetty / com.codahale.metrics.MetricRegistry@16525
   [junit4]   2> 92429 INFO  (closeThreadPool-2896-thread-10) [    ] o.a.s.m.SolrMetricManager Closing metric reporters for registry=solr.cluster, tag=null
   [junit4]   2> 92430 INFO  (zkCallback-2845-thread-2) [    ] o.a.s.c.c.ZkStateReader Updated live nodes from ZooKeeper... (2) -> (1)
   [junit4]   2> 92432 INFO  (zkCallback-2845-thread-1) [    ] o.a.s.c.OverseerElectionContext I am going to be the leader 127.0.0.1:65000_g_roe
   [junit4]   2> 92432 INFO  (zkCallback-2852-thread-1) [    ] o.a.s.c.c.ZkStateReader Updated live nodes from ZooKeeper... (2) -> (1)
   [junit4]   2> 92432 INFO  (zkCallback-2804-thread-1) [    ] o.a.s.c.c.ZkStateReader Updated live nodes from ZooKeeper... (2) -> (1)
   [junit4]   2> 92434 INFO  (zkCallback-2852-thread-1) [    ] o.a.s.c.c.ZkStateReader Updated live nodes from ZooKeeper... (1) -> (0)
   [junit4]   2> 92434 INFO  (zkCallback-2804-thread-1) [    ] o.a.s.c.c.ZkStateReader Updated live nodes from ZooKeeper... (1) -> (0)
   [junit4]   2> 92445 INFO  (closeThreadPool-2896-thread-10) [    ] o.e.j.s.AbstractConnector Stopped ServerConnector@11a4c4b{HTTP/1.1,[http/1.1]}{127.0.0.1:0}
   [junit4]   2> 92447 INFO  (closeThreadPool-2896-thread-10) [    ] o.e.j.s.h.ContextHandler Stopped o.e.j.s.ServletContextHandler@bc76f3{/g_roe,null,UNAVAILABLE}
   [junit4]   2> 92447 INFO  (closeThreadPool-2896-thread-10) [    ] o.e.j.s.session node0 Stopped scavenging
   [junit4]   2> 92454 INFO  (closeThreadPool-2896-thread-7) [    ] o.e.j.s.AbstractConnector Stopped ServerConnector@1ca95ee{HTTP/1.1,[http/1.1]}{127.0.0.1:0}
   [junit4]   2> 92455 INFO  (closeThreadPool-2896-thread-7) [    ] o.e.j.s.h.ContextHandler Stopped o.e.j.s.ServletContextHandler@17fd9e5{/g_roe,null,UNAVAILABLE}
   [junit4]   2> 92455 INFO  (closeThreadPool-2896-thread-7) [    ] o.e.j.s.session node0 Stopped scavenging
   [junit4]   2> 92458 INFO  (TEST-TestSQLHandler.doTest-seed#[186C55E95182C85C]) [    ] o.a.s.c.ZkTestServer Shutting down ZkTestServer.
   [junit4]   2> 92458 WARN  (NIOServerCxn.Factory:0.0.0.0/0.0.0.0:0) [    ] o.a.z.s.NIOServerCnxn Unable to read additional data from client sessionid 0x1003da1b4e00000, likely client has closed socket
   [junit4]   2> 92461 WARN  (ZkTestServer Run Thread) [    ] o.a.s.c.ZkTestServer Watch limit violations: 
   [junit4]   2> Maximum concurrent create/delete watches above limit:
   [junit4]   2> 
   [junit4]   2> 	19	/solr/aliases.json
   [junit4]   2> 	18	/solr/collections/collection1/state.json
   [junit4]   2> 	11	/solr/collections/collection1/terms/shard1
   [junit4]   2> 	11	/solr/collections/collection1/terms/shard2
   [junit4]   2> 	5	/solr/security.json
   [junit4]   2> 	5	/solr/configs/conf1
   [junit4]   2> 	3	/solr/collections/control_collection/terms/shard1
   [junit4]   2> 
   [junit4]   2> Maximum concurrent data watches above limit:
   [junit4]   2> 
   [junit4]   2> 	19	/solr/clusterstate.json
   [junit4]   2> 	19	/solr/clusterprops.json
   [junit4]   2> 	7	/solr/collections/control_collection/state.json
   [junit4]   2> 	2	/solr/overseer_elect/election/72125358771535882-127.0.0.1:64928_g_roe-n_0000000001
   [junit4]   2> 
   [junit4]   2> Maximum concurrent children watches above limit:
   [junit4]   2> 
   [junit4]   2> 	19	/solr/live_nodes
   [junit4]   2> 	19	/solr/collections
   [junit4]   2> 
   [junit4]   2> 92468 INFO  (TEST-TestSQLHandler.doTest-seed#[186C55E95182C85C]) [    ] o.a.s.c.ZkTestServer parse host and port list: 127.0.0.1:64876
   [junit4]   2> 92468 INFO  (TEST-TestSQLHandler.doTest-seed#[186C55E95182C85C]) [    ] o.a.s.c.ZkTestServer connecting to 127.0.0.1 64876
   [junit4]   2> NOTE: reproduce with: ant test  -Dtestcase=TestSQLHandler -Dtests.method=doTest -Dtests.seed=186C55E95182C85C -Dtests.slow=true -Dtests.badapples=true -Dtests.locale=de-LU -Dtests.timezone=America/Chicago -Dtests.asserts=true -Dtests.file.encoding=Cp1252
   [junit4] ERROR   13.6s J0 | TestSQLHandler.doTest <<<
   [junit4]    > Throwable #1: java.io.IOException: --> http://127.0.0.1:64928/g_roe/collection1_shard2_replica_n1:Failed to execute sqlQuery 'select id, field_i, str_s, field_i_p, field_f_p, field_d_p, field_l_p from collection1 where (text='(XXXX)' OR text='XXXX') AND text='XXXX' order by field_i desc' against JDBC connection 'jdbc:calcitesolr:'.
   [junit4]    > Error while executing SQL "select id, field_i, str_s, field_i_p, field_f_p, field_d_p, field_l_p from collection1 where (text='(XXXX)' OR text='XXXX') AND text='XXXX' order by field_i desc": java.io.IOException: java.util.concurrent.ExecutionException: java.io.IOException: --> http://127.0.0.1:64928/g_roe/collection1_shard2_replica_n1/:id{type=string,properties=indexed,stored,sortMissingLast,uninvertible} must have DocValues to use this feature.
   [junit4]    > 	at __randomizedtesting.SeedInfo.seed([186C55E95182C85C:BF28ED4D3C39DBE5]:0)
   [junit4]    > 	at org.apache.solr.client.solrj.io.stream.SolrStream.read(SolrStream.java:215)
   [junit4]    > 	at org.apache.solr.handler.TestSQLHandler.getTuples(TestSQLHandler.java:2617)
   [junit4]    > 	at org.apache.solr.handler.TestSQLHandler.testBasicSelect(TestSQLHandler.java:145)
   [junit4]    > 	at org.apache.solr.handler.TestSQLHandler.doTest(TestSQLHandler.java:93)
   [junit4]    > 	at org.apache.solr.BaseDistributedSearchTestCase$ShardsRepeatRule$ShardsFixedStatement.callStatement(BaseDistributedSearchTestCase.java:1063)
   [junit4]    > 	at org.apache.solr.BaseDistributedSearchTestCase$ShardsRepeatRule$ShardsStatement.evaluate(BaseDistributedSearchTestCase.java:1035)
   [junit4]    > 	at java.lang.Thread.run(Thread.java:748)
   [junit4]   2> NOTE: leaving temporary files on disk at: C:\Users\jenkins\workspace\Lucene-Solr-7.x-Windows\solr\build\solr-core\test\J0\temp\solr.handler.TestSQLHandler_186C55E95182C85C-002
   [junit4]   2> NOTE: test params are: codec=Asserting(Lucene70): {multiDefault=PostingsFormat(name=LuceneVarGapDocFreqInterval), id=PostingsFormat(name=LuceneVarGapFixedInterval), text=BlockTreeOrds(blocksize=128), str_s=BlockTreeOrds(blocksize=128)}, docValues:{range_facet_l_dv=DocValuesFormat(name=Direct), intDefault=DocValuesFormat(name=Lucene70), field_i=DocValuesFormat(name=Memory), range_facet_l=DocValuesFormat(name=Lucene70), _version_=DocValuesFormat(name=Lucene70), field_l_p=DocValuesFormat(name=Memory), id_i1=DocValuesFormat(name=Memory), field_i_p=DocValuesFormat(name=Asserting), range_facet_i_dv=DocValuesFormat(name=Lucene70), field_f_p=DocValuesFormat(name=Lucene70), intDvoDefault=DocValuesFormat(name=Asserting), field_d_p=DocValuesFormat(name=Memory), timestamp=DocValuesFormat(name=Lucene70)}, maxPointsInLeafNode=1566, maxMBSortInHeap=7.190015705656913, sim=RandomSimilarity(queryNorm=true): {}, locale=de-LU, timezone=America/Chicago
   [junit4]   2> NOTE: Windows 10 10.0 x86/Oracle Corporation 1.8.0_172 (32-bit)/cpus=3,threads=1,free=157097640,total=279707648
   [junit4]   2> NOTE: All tests run in this JVM: [TestSQLHandler, TestSQLHandler, TestSQLHandler]
   [junit4] Completed [8/10 (3!)] on J0 in 13.88s, 1 test, 1 error <<< FAILURES!

[...truncated 22 lines...]
BUILD FAILED
C:\Users\jenkins\workspace\Lucene-Solr-7.x-Windows\lucene\common-build.xml:1572: The following error occurred while executing this line:
C:\Users\jenkins\workspace\Lucene-Solr-7.x-Windows\lucene\common-build.xml:1099: There were test failures: 10 suites, 15 tests, 3 errors [seed: 186C55E95182C85C]

Total time: 1 minute 40 seconds

[repro] Setting last failure code to 1

[repro] Failures:
[repro]   0/5 failed: org.apache.solr.core.TestNRTOpen
[repro]   3/5 failed: org.apache.solr.handler.TestSQLHandler
[repro] Exiting with code 1

C:\Users\jenkins\workspace\Lucene-Solr-7.x-Windows>IF EXIST lucene\build move /y lucene\build lucene\build.repro 
        1 dir(s) moved.

C:\Users\jenkins\workspace\Lucene-Solr-7.x-Windows>IF EXIST solr\build move /y solr\build solr\build.repro 
        1 dir(s) moved.

C:\Users\jenkins\workspace\Lucene-Solr-7.x-Windows>IF EXIST lucene\build.orig move /y lucene\build.orig lucene\build 
        1 dir(s) moved.

C:\Users\jenkins\workspace\Lucene-Solr-7.x-Windows>IF EXIST solr\build.orig move /y solr\build.orig solr\build 
        1 dir(s) moved.

C:\Users\jenkins\workspace\Lucene-Solr-7.x-Windows>exit 0 
Archiving artifacts
Setting ANT_1_8_2_HOME=C:\Users\jenkins\tools\hudson.tasks.Ant_AntInstallation\ANT_1.8.2
[WARNINGS] Parsing warnings in console log with parser Java Compiler (javac)
Setting ANT_1_8_2_HOME=C:\Users\jenkins\tools\hudson.tasks.Ant_AntInstallation\ANT_1.8.2
Setting ANT_1_8_2_HOME=C:\Users\jenkins\tools\hudson.tasks.Ant_AntInstallation\ANT_1.8.2
<Git Blamer> Using GitBlamer to create author and commit information for all warnings.
<Git Blamer> GIT_COMMIT=2ccb505912f5ee1818112e27518154b606b7512e, workspace=C:\Users\jenkins\workspace\Lucene-Solr-7.x-Windows
[WARNINGS] Computing warning deltas based on reference build #936
Recording test results
Setting ANT_1_8_2_HOME=C:\Users\jenkins\tools\hudson.tasks.Ant_AntInstallation\ANT_1.8.2
Build step 'Publish JUnit test result report' changed build result to UNSTABLE
Email was triggered for: Unstable (Test Failures)
Sending email for trigger: Unstable (Test Failures)
Setting ANT_1_8_2_HOME=C:\Users\jenkins\tools\hudson.tasks.Ant_AntInstallation\ANT_1.8.2
Setting ANT_1_8_2_HOME=C:\Users\jenkins\tools\hudson.tasks.Ant_AntInstallation\ANT_1.8.2
Setting ANT_1_8_2_HOME=C:\Users\jenkins\tools\hudson.tasks.Ant_AntInstallation\ANT_1.8.2
Setting ANT_1_8_2_HOME=C:\Users\jenkins\tools\hudson.tasks.Ant_AntInstallation\ANT_1.8.2

Mime
View raw message