lucene-dev mailing list archives

Site index · List index
Message view « Date » · « Thread »
Top « Date » · « Thread »
From Apache Jenkins Server <jenk...@builds.apache.org>
Subject [JENKINS] Lucene-Solr-Tests-8.x - Build # 7 - Unstable
Date Thu, 17 Jan 2019 00:29:42 GMT
Build: https://builds.apache.org/job/Lucene-Solr-Tests-8.x/7/

2 tests failed.
FAILED:  org.apache.solr.cloud.DeleteReplicaTest.deleteReplicaFromClusterStateLegacy

Error Message:
Timeout waiting for replica get deleted Timeout waiting to see state for collection=deleteFromClusterState_true :DocCollection(deleteFromClusterState_true//collections/deleteFromClusterState_true/state.json/7)={   "pullReplicas":"0",   "replicationFactor":"3",   "shards":{"shard1":{       "range":"80000000-7fffffff",       "state":"active",       "replicas":{         "core_node4":{           "core":"deleteFromClusterState_true_shard1_replica_n1",           "base_url":"http://127.0.0.1:39333/solr",           "node_name":"127.0.0.1:39333_solr",           "state":"active",           "type":"NRT"},         "core_node6":{           "core":"deleteFromClusterState_true_shard1_replica_n3",           "base_url":"http://127.0.0.1:44940/solr",           "node_name":"127.0.0.1:44940_solr",           "state":"active",           "type":"NRT",           "leader":"true"},         "core_node5":{           "core":"deleteFromClusterState_true_shard1_replica_n2",           "base_url":"http://127.0.0.1:45668/solr",           "node_name":"127.0.0.1:45668_solr",           "state":"active",           "type":"NRT"}}}},   "router":{"name":"compositeId"},   "maxShardsPerNode":"1",   "autoAddReplicas":"false",   "nrtReplicas":"3",   "tlogReplicas":"0"} Live Nodes: [127.0.0.1:39333_solr, 127.0.0.1:41208_solr, 127.0.0.1:44940_solr, 127.0.0.1:45668_solr] Last available state: DocCollection(deleteFromClusterState_true//collections/deleteFromClusterState_true/state.json/7)={   "pullReplicas":"0",   "replicationFactor":"3",   "shards":{"shard1":{       "range":"80000000-7fffffff",       "state":"active",       "replicas":{         "core_node4":{           "core":"deleteFromClusterState_true_shard1_replica_n1",           "base_url":"http://127.0.0.1:39333/solr",           "node_name":"127.0.0.1:39333_solr",           "state":"active",           "type":"NRT"},         "core_node6":{           "core":"deleteFromClusterState_true_shard1_replica_n3",           "base_url":"http://127.0.0.1:44940/solr",           "node_name":"127.0.0.1:44940_solr",           "state":"active",           "type":"NRT",           "leader":"true"},         "core_node5":{           "core":"deleteFromClusterState_true_shard1_replica_n2",           "base_url":"http://127.0.0.1:45668/solr",           "node_name":"127.0.0.1:45668_solr",           "state":"active",           "type":"NRT"}}}},   "router":{"name":"compositeId"},   "maxShardsPerNode":"1",   "autoAddReplicas":"false",   "nrtReplicas":"3",   "tlogReplicas":"0"}

Stack Trace:
java.lang.AssertionError: Timeout waiting for replica get deleted
Timeout waiting to see state for collection=deleteFromClusterState_true :DocCollection(deleteFromClusterState_true//collections/deleteFromClusterState_true/state.json/7)={
  "pullReplicas":"0",
  "replicationFactor":"3",
  "shards":{"shard1":{
      "range":"80000000-7fffffff",
      "state":"active",
      "replicas":{
        "core_node4":{
          "core":"deleteFromClusterState_true_shard1_replica_n1",
          "base_url":"http://127.0.0.1:39333/solr",
          "node_name":"127.0.0.1:39333_solr",
          "state":"active",
          "type":"NRT"},
        "core_node6":{
          "core":"deleteFromClusterState_true_shard1_replica_n3",
          "base_url":"http://127.0.0.1:44940/solr",
          "node_name":"127.0.0.1:44940_solr",
          "state":"active",
          "type":"NRT",
          "leader":"true"},
        "core_node5":{
          "core":"deleteFromClusterState_true_shard1_replica_n2",
          "base_url":"http://127.0.0.1:45668/solr",
          "node_name":"127.0.0.1:45668_solr",
          "state":"active",
          "type":"NRT"}}}},
  "router":{"name":"compositeId"},
  "maxShardsPerNode":"1",
  "autoAddReplicas":"false",
  "nrtReplicas":"3",
  "tlogReplicas":"0"}
Live Nodes: [127.0.0.1:39333_solr, 127.0.0.1:41208_solr, 127.0.0.1:44940_solr, 127.0.0.1:45668_solr]
Last available state: DocCollection(deleteFromClusterState_true//collections/deleteFromClusterState_true/state.json/7)={
  "pullReplicas":"0",
  "replicationFactor":"3",
  "shards":{"shard1":{
      "range":"80000000-7fffffff",
      "state":"active",
      "replicas":{
        "core_node4":{
          "core":"deleteFromClusterState_true_shard1_replica_n1",
          "base_url":"http://127.0.0.1:39333/solr",
          "node_name":"127.0.0.1:39333_solr",
          "state":"active",
          "type":"NRT"},
        "core_node6":{
          "core":"deleteFromClusterState_true_shard1_replica_n3",
          "base_url":"http://127.0.0.1:44940/solr",
          "node_name":"127.0.0.1:44940_solr",
          "state":"active",
          "type":"NRT",
          "leader":"true"},
        "core_node5":{
          "core":"deleteFromClusterState_true_shard1_replica_n2",
          "base_url":"http://127.0.0.1:45668/solr",
          "node_name":"127.0.0.1:45668_solr",
          "state":"active",
          "type":"NRT"}}}},
  "router":{"name":"compositeId"},
  "maxShardsPerNode":"1",
  "autoAddReplicas":"false",
  "nrtReplicas":"3",
  "tlogReplicas":"0"}
	at __randomizedtesting.SeedInfo.seed([701375370C0E791F:6F2BD05FDDA8CE8C]:0)
	at org.junit.Assert.fail(Assert.java:88)
	at org.apache.solr.cloud.SolrCloudTestCase.waitForState(SolrCloudTestCase.java:289)
	at org.apache.solr.cloud.SolrCloudTestCase.waitForState(SolrCloudTestCase.java:267)
	at org.apache.solr.cloud.DeleteReplicaTest.deleteReplicaFromClusterState(DeleteReplicaTest.java:236)
	at org.apache.solr.cloud.DeleteReplicaTest.deleteReplicaFromClusterStateLegacy(DeleteReplicaTest.java:204)
	at sun.reflect.NativeMethodAccessorImpl.invoke0(Native Method)
	at sun.reflect.NativeMethodAccessorImpl.invoke(NativeMethodAccessorImpl.java:62)
	at sun.reflect.DelegatingMethodAccessorImpl.invoke(DelegatingMethodAccessorImpl.java:43)
	at java.lang.reflect.Method.invoke(Method.java:498)
	at com.carrotsearch.randomizedtesting.RandomizedRunner.invoke(RandomizedRunner.java:1750)
	at com.carrotsearch.randomizedtesting.RandomizedRunner$8.evaluate(RandomizedRunner.java:938)
	at com.carrotsearch.randomizedtesting.RandomizedRunner$9.evaluate(RandomizedRunner.java:974)
	at com.carrotsearch.randomizedtesting.RandomizedRunner$10.evaluate(RandomizedRunner.java:988)
	at com.carrotsearch.randomizedtesting.rules.SystemPropertiesRestoreRule$1.evaluate(SystemPropertiesRestoreRule.java:57)
	at org.apache.lucene.util.TestRuleSetupTeardownChained$1.evaluate(TestRuleSetupTeardownChained.java:49)
	at org.apache.lucene.util.AbstractBeforeAfterRule$1.evaluate(AbstractBeforeAfterRule.java:45)
	at org.apache.lucene.util.TestRuleThreadAndTestName$1.evaluate(TestRuleThreadAndTestName.java:48)
	at org.apache.lucene.util.TestRuleIgnoreAfterMaxFailures$1.evaluate(TestRuleIgnoreAfterMaxFailures.java:64)
	at org.apache.lucene.util.TestRuleMarkFailure$1.evaluate(TestRuleMarkFailure.java:47)
	at com.carrotsearch.randomizedtesting.rules.StatementAdapter.evaluate(StatementAdapter.java:36)
	at com.carrotsearch.randomizedtesting.ThreadLeakControl$StatementRunner.run(ThreadLeakControl.java:368)
	at com.carrotsearch.randomizedtesting.ThreadLeakControl.forkTimeoutingTask(ThreadLeakControl.java:817)
	at com.carrotsearch.randomizedtesting.ThreadLeakControl$3.evaluate(ThreadLeakControl.java:468)
	at com.carrotsearch.randomizedtesting.RandomizedRunner.runSingleTest(RandomizedRunner.java:947)
	at com.carrotsearch.randomizedtesting.RandomizedRunner$5.evaluate(RandomizedRunner.java:832)
	at com.carrotsearch.randomizedtesting.RandomizedRunner$6.evaluate(RandomizedRunner.java:883)
	at com.carrotsearch.randomizedtesting.RandomizedRunner$7.evaluate(RandomizedRunner.java:894)
	at com.carrotsearch.randomizedtesting.rules.StatementAdapter.evaluate(StatementAdapter.java:36)
	at com.carrotsearch.randomizedtesting.rules.SystemPropertiesRestoreRule$1.evaluate(SystemPropertiesRestoreRule.java:57)
	at org.apache.lucene.util.AbstractBeforeAfterRule$1.evaluate(AbstractBeforeAfterRule.java:45)
	at com.carrotsearch.randomizedtesting.rules.StatementAdapter.evaluate(StatementAdapter.java:36)
	at org.apache.lucene.util.TestRuleStoreClassName$1.evaluate(TestRuleStoreClassName.java:41)
	at com.carrotsearch.randomizedtesting.rules.NoShadowingOrOverridesOnMethodsRule$1.evaluate(NoShadowingOrOverridesOnMethodsRule.java:40)
	at com.carrotsearch.randomizedtesting.rules.NoShadowingOrOverridesOnMethodsRule$1.evaluate(NoShadowingOrOverridesOnMethodsRule.java:40)
	at com.carrotsearch.randomizedtesting.rules.StatementAdapter.evaluate(StatementAdapter.java:36)
	at com.carrotsearch.randomizedtesting.rules.StatementAdapter.evaluate(StatementAdapter.java:36)
	at com.carrotsearch.randomizedtesting.rules.StatementAdapter.evaluate(StatementAdapter.java:36)
	at org.apache.lucene.util.TestRuleAssertionsRequired$1.evaluate(TestRuleAssertionsRequired.java:53)
	at org.apache.lucene.util.TestRuleMarkFailure$1.evaluate(TestRuleMarkFailure.java:47)
	at org.apache.lucene.util.TestRuleIgnoreAfterMaxFailures$1.evaluate(TestRuleIgnoreAfterMaxFailures.java:64)
	at org.apache.lucene.util.TestRuleIgnoreTestSuites$1.evaluate(TestRuleIgnoreTestSuites.java:54)
	at com.carrotsearch.randomizedtesting.rules.StatementAdapter.evaluate(StatementAdapter.java:36)
	at com.carrotsearch.randomizedtesting.ThreadLeakControl$StatementRunner.run(ThreadLeakControl.java:368)
	at java.lang.Thread.run(Thread.java:748)


FAILED:  org.apache.solr.cloud.autoscaling.sim.TestSimTriggerIntegration.testSearchRate

Error Message:
The trigger did not start in time

Stack Trace:
java.lang.AssertionError: The trigger did not start in time
	at __randomizedtesting.SeedInfo.seed([701375370C0E791F:2D5B6BBEC3C8DF50]:0)
	at org.junit.Assert.fail(Assert.java:88)
	at org.junit.Assert.assertTrue(Assert.java:41)
	at org.apache.solr.cloud.autoscaling.sim.TestSimTriggerIntegration.testSearchRate(TestSimTriggerIntegration.java:1330)
	at sun.reflect.NativeMethodAccessorImpl.invoke0(Native Method)
	at sun.reflect.NativeMethodAccessorImpl.invoke(NativeMethodAccessorImpl.java:62)
	at sun.reflect.DelegatingMethodAccessorImpl.invoke(DelegatingMethodAccessorImpl.java:43)
	at java.lang.reflect.Method.invoke(Method.java:498)
	at com.carrotsearch.randomizedtesting.RandomizedRunner.invoke(RandomizedRunner.java:1750)
	at com.carrotsearch.randomizedtesting.RandomizedRunner$8.evaluate(RandomizedRunner.java:938)
	at com.carrotsearch.randomizedtesting.RandomizedRunner$9.evaluate(RandomizedRunner.java:974)
	at com.carrotsearch.randomizedtesting.RandomizedRunner$10.evaluate(RandomizedRunner.java:988)
	at com.carrotsearch.randomizedtesting.rules.SystemPropertiesRestoreRule$1.evaluate(SystemPropertiesRestoreRule.java:57)
	at org.apache.lucene.util.TestRuleSetupTeardownChained$1.evaluate(TestRuleSetupTeardownChained.java:49)
	at org.apache.lucene.util.AbstractBeforeAfterRule$1.evaluate(AbstractBeforeAfterRule.java:45)
	at org.apache.lucene.util.TestRuleThreadAndTestName$1.evaluate(TestRuleThreadAndTestName.java:48)
	at org.apache.lucene.util.TestRuleIgnoreAfterMaxFailures$1.evaluate(TestRuleIgnoreAfterMaxFailures.java:64)
	at org.apache.lucene.util.TestRuleMarkFailure$1.evaluate(TestRuleMarkFailure.java:47)
	at com.carrotsearch.randomizedtesting.rules.StatementAdapter.evaluate(StatementAdapter.java:36)
	at com.carrotsearch.randomizedtesting.ThreadLeakControl$StatementRunner.run(ThreadLeakControl.java:368)
	at com.carrotsearch.randomizedtesting.ThreadLeakControl.forkTimeoutingTask(ThreadLeakControl.java:817)
	at com.carrotsearch.randomizedtesting.ThreadLeakControl$3.evaluate(ThreadLeakControl.java:468)
	at com.carrotsearch.randomizedtesting.RandomizedRunner.runSingleTest(RandomizedRunner.java:947)
	at com.carrotsearch.randomizedtesting.RandomizedRunner$5.evaluate(RandomizedRunner.java:832)
	at com.carrotsearch.randomizedtesting.RandomizedRunner$6.evaluate(RandomizedRunner.java:883)
	at com.carrotsearch.randomizedtesting.RandomizedRunner$7.evaluate(RandomizedRunner.java:894)
	at com.carrotsearch.randomizedtesting.rules.StatementAdapter.evaluate(StatementAdapter.java:36)
	at com.carrotsearch.randomizedtesting.rules.SystemPropertiesRestoreRule$1.evaluate(SystemPropertiesRestoreRule.java:57)
	at org.apache.lucene.util.AbstractBeforeAfterRule$1.evaluate(AbstractBeforeAfterRule.java:45)
	at com.carrotsearch.randomizedtesting.rules.StatementAdapter.evaluate(StatementAdapter.java:36)
	at org.apache.lucene.util.TestRuleStoreClassName$1.evaluate(TestRuleStoreClassName.java:41)
	at com.carrotsearch.randomizedtesting.rules.NoShadowingOrOverridesOnMethodsRule$1.evaluate(NoShadowingOrOverridesOnMethodsRule.java:40)
	at com.carrotsearch.randomizedtesting.rules.NoShadowingOrOverridesOnMethodsRule$1.evaluate(NoShadowingOrOverridesOnMethodsRule.java:40)
	at com.carrotsearch.randomizedtesting.rules.StatementAdapter.evaluate(StatementAdapter.java:36)
	at com.carrotsearch.randomizedtesting.rules.StatementAdapter.evaluate(StatementAdapter.java:36)
	at com.carrotsearch.randomizedtesting.rules.StatementAdapter.evaluate(StatementAdapter.java:36)
	at org.apache.lucene.util.TestRuleAssertionsRequired$1.evaluate(TestRuleAssertionsRequired.java:53)
	at org.apache.lucene.util.TestRuleMarkFailure$1.evaluate(TestRuleMarkFailure.java:47)
	at org.apache.lucene.util.TestRuleIgnoreAfterMaxFailures$1.evaluate(TestRuleIgnoreAfterMaxFailures.java:64)
	at org.apache.lucene.util.TestRuleIgnoreTestSuites$1.evaluate(TestRuleIgnoreTestSuites.java:54)
	at com.carrotsearch.randomizedtesting.rules.StatementAdapter.evaluate(StatementAdapter.java:36)
	at com.carrotsearch.randomizedtesting.ThreadLeakControl$StatementRunner.run(ThreadLeakControl.java:368)
	at java.lang.Thread.run(Thread.java:748)




Build Log:
[...truncated 14035 lines...]
   [junit4] Suite: org.apache.solr.cloud.autoscaling.sim.TestSimTriggerIntegration
   [junit4]   2> Creating dataDir: /home/jenkins/jenkins-slave/workspace/Lucene-Solr-Tests-8.x/solr/build/solr-core/test/J2/temp/solr.cloud.autoscaling.sim.TestSimTriggerIntegration_701375370C0E791F-001/init-core-data-001
   [junit4]   2> 2333833 DEBUG (TEST-TestSimTriggerIntegration.testNodeAddedTrigger-seed#[701375370C0E791F]) [    ] o.a.s.c.a.s.SimClusterStateProvider --- new Overseer leader: 127.0.0.1:10000_solr
   [junit4]   2> 2333833 DEBUG (Simulated OverseerAutoScalingTriggerThread) [    ] o.a.s.c.a.OverseerTriggerThread Adding .auto_add_replicas and .scheduled_maintenance triggers
   [junit4]   2> 2333834 DEBUG (Simulated OverseerAutoScalingTriggerThread) [    ] o.a.s.c.a.OverseerTriggerThread Refreshing /autoscaling.json with znode version 1
   [junit4]   2> 2333849 DEBUG (Simulated OverseerAutoScalingTriggerThread) [    ] o.a.s.c.a.OverseerTriggerThread Current znodeVersion 1, lastZnodeVersion 0
   [junit4]   2> 2333849 DEBUG (Simulated OverseerAutoScalingTriggerThread) [    ] o.a.s.c.a.OverseerTriggerThread Processed trigger updates upto znodeVersion 1
   [junit4]   2> 2333868 DEBUG (TEST-TestSimTriggerIntegration.testNodeAddedTrigger-seed#[701375370C0E791F]) [    ] o.a.s.c.a.s.SimClusterStateProvider ** creating new collection states, currentVersion=0
   [junit4]   2> 2333883 DEBUG (TEST-TestSimTriggerIntegration.testNodeAddedTrigger-seed#[701375370C0E791F]) [    ] o.a.s.c.a.s.SimClusterStateProvider ** saved cluster state version 0
   [junit4]   2> 2333883 INFO  (TEST-TestSimTriggerIntegration.testNodeAddedTrigger-seed#[701375370C0E791F]) [    ] o.a.s.h.a.MetricsHistoryHandler No .system collection, keeping metrics history in memory.
   [junit4]   2> 2333886 DEBUG (Simulated OverseerAutoScalingTriggerThread) [    ] o.a.s.c.a.NodeLostTrigger NodeLostTrigger .auto_add_replicas - Initial livenodes: [127.0.0.1:10001_solr, 127.0.0.1:10000_solr]
   [junit4]   2> 2333886 DEBUG (Simulated OverseerAutoScalingTriggerThread) [    ] o.a.s.c.a.OverseerTriggerThread -- cleaning old nodeLost / nodeAdded markers
   [junit4]   2> 2333887 DEBUG (Simulated OverseerAutoScalingTriggerThread) [    ] o.a.s.c.a.OverseerTriggerThread Current znodeVersion 1, lastZnodeVersion 1
   [junit4]   2> 2333888 DEBUG (ScheduledTrigger-5764-thread-1) [    ] o.a.s.c.a.NodeLostTrigger Running NodeLostTrigger: .auto_add_replicas with currently live nodes: 2 and last live nodes: 2
   [junit4]   2> 2334058 DEBUG (ScheduledTrigger-5764-thread-2) [    ] o.a.s.c.a.NodeLostTrigger Running NodeLostTrigger: .auto_add_replicas with currently live nodes: 2 and last live nodes: 2
   [junit4]   2> 2334071 DEBUG (simCloudManagerPool-5763-thread-2) [    ] o.a.s.c.a.AutoScalingHandler Verified autoscaling configuration
   [junit4]   2> 2334071 DEBUG (simCloudManagerPool-5763-thread-2) [    ] o.a.s.c.a.OverseerTriggerThread Refreshing /autoscaling.json with znode version 2
   [junit4]   2> 2334072 DEBUG (Simulated OverseerAutoScalingTriggerThread) [    ] o.a.s.c.a.OverseerTriggerThread Processed trigger updates upto znodeVersion 2
   [junit4]   2> 2334072 DEBUG (Simulated OverseerAutoScalingTriggerThread) [    ] o.a.s.c.a.OverseerTriggerThread -- cleaning old nodeLost / nodeAdded markers
   [junit4]   2> 2334072 DEBUG (Simulated OverseerAutoScalingTriggerThread) [    ] o.a.s.c.a.OverseerTriggerThread Current znodeVersion 2, lastZnodeVersion 2
   [junit4]   2> 2334093 DEBUG (ScheduledTrigger-5764-thread-2) [    ] o.a.s.c.a.NodeLostTrigger Running NodeLostTrigger: .auto_add_replicas with currently live nodes: 2 and last live nodes: 2
   [junit4]   2> 2334130 DEBUG (ScheduledTrigger-5764-thread-2) [    ] o.a.s.c.a.NodeLostTrigger Running NodeLostTrigger: .auto_add_replicas with currently live nodes: 2 and last live nodes: 2
   [junit4]   2> 2334143 DEBUG (simCloudManagerPool-5763-thread-3) [    ] o.a.s.c.a.AutoScalingHandler Verified autoscaling configuration
   [junit4]   2> 2334143 DEBUG (simCloudManagerPool-5763-thread-3) [    ] o.a.s.c.a.OverseerTriggerThread Refreshing /autoscaling.json with znode version 3
   [junit4]   2> 2334166 DEBUG (ScheduledTrigger-5764-thread-2) [    ] o.a.s.c.a.NodeLostTrigger Running NodeLostTrigger: .auto_add_replicas with currently live nodes: 2 and last live nodes: 2
   [junit4]   2> 2334180 DEBUG (Simulated OverseerAutoScalingTriggerThread) [    ] o.a.s.c.a.OverseerTriggerThread Processed trigger updates upto znodeVersion 3
   [junit4]   2> 2334180 INFO  (Simulated OverseerAutoScalingTriggerThread) [    ] o.a.s.c.a.s.TestSimTriggerIntegration TestTriggerAction init
   [junit4]   2> 2334180 DEBUG (Simulated OverseerAutoScalingTriggerThread) [    ] o.a.s.c.a.NodeAddedTrigger NodeAddedTrigger node_added_trigger - Initial livenodes: [127.0.0.1:10001_solr, 127.0.0.1:10000_solr]
   [junit4]   2> 2334180 DEBUG (Simulated OverseerAutoScalingTriggerThread) [    ] o.a.s.c.a.NodeAddedTrigger NodeAddedTrigger node_added_trigger instantiated with properties: {event=nodeAdded, waitFor=3, actions=[{name=test, class=org.apache.solr.cloud.autoscaling.sim.TestSimTriggerIntegration$TestTriggerAction}], enabled=true}
   [junit4]   2> 2334181 DEBUG (Simulated OverseerAutoScalingTriggerThread) [    ] o.a.s.c.a.OverseerTriggerThread -- cleaning old nodeLost / nodeAdded markers
   [junit4]   2> 2334181 DEBUG (Simulated OverseerAutoScalingTriggerThread) [    ] o.a.s.c.a.OverseerTriggerThread Current znodeVersion 3, lastZnodeVersion 3
   [junit4]   2> 2334182 DEBUG (TEST-TestSimTriggerIntegration.testNodeAddedTrigger-seed#[701375370C0E791F]) [    ] o.a.s.c.a.s.SimClusterStateProvider -- creating marker: /autoscaling/nodeAdded/127.0.0.1:10002_solr
   [junit4]   2> 2334182 DEBUG (ScheduledTrigger-5764-thread-1) [    ] o.a.s.c.a.NodeAddedTrigger Running NodeAddedTrigger node_added_trigger
   [junit4]   2> 2334198 DEBUG (ScheduledTrigger-5764-thread-3) [    ] o.a.s.c.a.NodeLostTrigger Running NodeLostTrigger: .auto_add_replicas with currently live nodes: 3 and last live nodes: 2
   [junit4]   2> 2334201 DEBUG (ScheduledTrigger-5764-thread-1) [    ] o.a.s.c.a.NodeAddedTrigger Found livenodes: 3
   [junit4]   2> 2334201 DEBUG (ScheduledTrigger-5764-thread-1) [    ] o.a.s.c.a.NodeAddedTrigger Tracking new node: 127.0.0.1:10002_solr at time 30017018912477533
   [junit4]   2> 2334235 DEBUG (ScheduledTrigger-5764-thread-3) [    ] o.a.s.c.a.NodeLostTrigger Running NodeLostTrigger: .auto_add_replicas with currently live nodes: 3 and last live nodes: 3
   [junit4]   2> 2334235 DEBUG (ScheduledTrigger-5764-thread-3) [    ] o.a.s.c.a.NodeAddedTrigger Running NodeAddedTrigger node_added_trigger
   [junit4]   2> 2334235 DEBUG (ScheduledTrigger-5764-thread-3) [    ] o.a.s.c.a.NodeAddedTrigger Found livenodes: 3
   [junit4]   2> 2334267 DEBUG (ScheduledTrigger-5764-thread-2) [    ] o.a.s.c.a.NodeAddedTrigger Running NodeAddedTrigger node_added_trigger
   [junit4]   2> 2334267 DEBUG (ScheduledTrigger-5764-thread-4) [    ] o.a.s.c.a.NodeLostTrigger Running NodeLostTrigger: .auto_add_replicas with currently live nodes: 3 and last live nodes: 3
   [junit4]   2> 2334267 DEBUG (ScheduledTrigger-5764-thread-2) [    ] o.a.s.c.a.NodeAddedTrigger Found livenodes: 3
   [junit4]   2> 2334267 DEBUG (ScheduledTrigger-5764-thread-2) [    ] o.a.s.c.a.NodeAddedTrigger NodeAddedTrigger node_added_trigger firing registered processor for nodes: [127.0.0.1:10002_solr] added at times [30017018912477533], now=30017022208217383
   [junit4]   2> 2334268 DEBUG (ScheduledTrigger-5764-thread-2) [    ] o.a.s.c.a.ScheduledTriggers ++++++++ Cooldown inactive - processing event: {
   [junit4]   2>   "id":"6aa451d57e915dTc2lzut84j65v63f5hcbb10hrl",
   [junit4]   2>   "source":"node_added_trigger",
   [junit4]   2>   "eventTime":30017018912477533,
   [junit4]   2>   "eventType":"NODEADDED",
   [junit4]   2>   "properties":{
   [junit4]   2>     "eventTimes":[30017018912477533],
   [junit4]   2>     "preferredOperation":"movereplica",
   [junit4]   2>     "nodeNames":["127.0.0.1:10002_solr"]}}
   [junit4]   2> 2334269 DEBUG (ScheduledTrigger-5764-thread-2) [    ] o.a.s.c.a.ScheduledTriggers Pausing all triggers: [.auto_add_replicas, node_added_trigger]
   [junit4]   2> 2334270 DEBUG (ScheduledTrigger-5764-thread-2) [    ] o.a.s.c.a.SystemLogListener Collection .system missing, skip sending event {
   [junit4]   2>   "id":"6aa451d57e915dTc2lzut84j65v63f5hcbb10hrl",
   [junit4]   2>   "source":"node_added_trigger",
   [junit4]   2>   "eventTime":30017018912477533,
   [junit4]   2>   "eventType":"NODEADDED",
   [junit4]   2>   "properties":{
   [junit4]   2>     "eventTimes":[30017018912477533],
   [junit4]   2>     "preferredOperation":"movereplica",
   [junit4]   2>     "_enqueue_time_":30017022304712733,
   [junit4]   2>     "nodeNames":["127.0.0.1:10002_solr"]}}
   [junit4]   2> 2334270 DEBUG (AutoscalingActionExecutor-5765-thread-1) [    ] o.a.s.c.a.ScheduledTriggers -- processing actions for {
   [junit4]   2>   "id":"6aa451d57e915dTc2lzut84j65v63f5hcbb10hrl",
   [junit4]   2>   "source":"node_added_trigger",
   [junit4]   2>   "eventTime":30017018912477533,
   [junit4]   2>   "eventType":"NODEADDED",
   [junit4]   2>   "properties":{
   [junit4]   2>     "eventTimes":[30017018912477533],
   [junit4]   2>     "preferredOperation":"movereplica",
   [junit4]   2>     "_enqueue_time_":30017022304712733,
   [junit4]   2>     "nodeNames":["127.0.0.1:10002_solr"]}}
   [junit4]   2> 2334270 DEBUG (ScheduledTrigger-5764-thread-2) [    ] o.a.s.c.a.NodeAddedTrigger Removing new node from tracking: 127.0.0.1:10002_solr
   [junit4]   2> 2334270 DEBUG (AutoscalingActionExecutor-5765-thread-1) [    ] o.a.s.c.a.SystemLogListener Collection .system missing, skip sending event {
   [junit4]   2>   "id":"6aa451d57e915dTc2lzut84j65v63f5hcbb10hrl",
   [junit4]   2>   "source":"node_added_trigger",
   [junit4]   2>   "eventTime":30017018912477533,
   [junit4]   2>   "eventType":"NODEADDED",
   [junit4]   2>   "properties":{
   [junit4]   2>     "eventTimes":[30017018912477533],
   [junit4]   2>     "preferredOperation":"movereplica",
   [junit4]   2>     "_enqueue_time_":30017022304712733,
   [junit4]   2>     "nodeNames":["127.0.0.1:10002_solr"]}}
   [junit4]   2> 2334270 DEBUG (AutoscalingActionExecutor-5765-thread-1) [    ] o.a.s.c.a.ScheduledTriggers Resuming trigger: node_added_trigger after 100ms
   [junit4]   2> 2334270 DEBUG (AutoscalingActionExecutor-5765-thread-1) [    ] o.a.s.c.a.ScheduledTriggers Resuming trigger: .auto_add_replicas after 100ms
   [junit4]   2> 2334270 DEBUG (AutoscalingActionExecutor-5765-thread-1) [    ] o.a.s.c.a.ScheduledTriggers -- processing took 31 ms for event id=6aa451d57e915dTc2lzut84j65v63f5hcbb10hrl
   [junit4]   2> 2334288 DEBUG (simCloudManagerPool-5763-thread-4) [    ] o.a.s.c.a.AutoScalingHandler Verified autoscaling configuration
   [junit4]   2> 2334288 DEBUG (simCloudManagerPool-5763-thread-4) [    ] o.a.s.c.a.OverseerTriggerThread Refreshing /autoscaling.json with znode version 4
   [junit4]   2> 2334289 DEBUG (Simulated OverseerAutoScalingTriggerThread) [    ] o.a.s.c.a.OverseerTriggerThread Processed trigger updates upto znodeVersion 4
   [junit4]   2> 2334289 DEBUG (Simulated OverseerAutoScalingTriggerThread) [    ] o.a.s.c.a.OverseerTriggerThread -- cleaning old nodeLost / nodeAdded markers
   [junit4]   2> 2334289 DEBUG (Simulated OverseerAutoScalingTriggerThread) [    ] o.a.s.c.a.OverseerTriggerThread Current znodeVersion 4, lastZnodeVersion 4
   [junit4]   2> 2334361 DEBUG (TEST-TestSimTriggerIntegration.testNodeAddedTrigger-seed#[701375370C0E791F]) [    ] o.a.s.c.a.ScheduledTriggers Shutting down scheduled thread pool executor now
   [junit4]   2> 2334361 DEBUG (TEST-TestSimTriggerIntegration.testNodeAddedTrigger-seed#[701375370C0E791F]) [    ] o.a.s.c.a.ScheduledTriggers Shutting down action executor now
   [junit4]   2> 2334361 DEBUG (TEST-TestSimTriggerIntegration.testNodeAddedTrigger-seed#[701375370C0E791F]) [    ] o.a.s.c.a.ScheduledTriggers Awaiting termination for action executor
   [junit4]   2> 2334361 INFO  (Simulated OverseerAutoScalingTriggerThread) [    ] o.a.s.c.a.OverseerTriggerThread OverseerTriggerThread woken up but we are closed, exiting.
   [junit4]   2> 2334373 DEBUG (TEST-TestSimTriggerIntegration.testNodeAddedTrigger-seed#[701375370C0E791F]) [    ] o.a.s.c.a.ScheduledTriggers Awaiting termination for scheduled thread pool executor
   [junit4]   2> 2334373 DEBUG (TEST-TestSimTriggerIntegration.testNodeAddedTrigger-seed#[701375370C0E791F]) [    ] o.a.s.c.a.ScheduledTriggers ScheduledTriggers closed completely
   [junit4]   2> 2334373 DEBUG (TEST-TestSimTriggerIntegration.testNodeAddedTrigger-seed#[701375370C0E791F]) [    ] o.a.s.c.a.OverseerTriggerThread OverseerTriggerThread has been closed explicitly
   [junit4]   2> 2334380 DEBUG (TEST-TestSimTriggerIntegration.testListeners-seed#[701375370C0E791F]) [    ] o.a.s.c.a.s.SimClusterStateProvider --- new Overseer leader: 127.0.0.1:10003_solr
   [junit4]   2> 2334393 DEBUG (TEST-TestSimTriggerIntegration.testListeners-seed#[701375370C0E791F]) [    ] o.a.s.c.a.s.SimClusterStateProvider ** creating new collection states, currentVersion=0
   [junit4]   2> 2334393 DEBUG (TEST-TestSimTriggerIntegration.testListeners-seed#[701375370C0E791F]) [    ] o.a.s.c.a.s.SimClusterStateProvider ** saved cluster state version 0
   [junit4]   2> 2334393 INFO  (TEST-TestSimTriggerIntegration.testListeners-seed#[701375370C0E791F]) [    ] o.a.s.h.a.MetricsHistoryHandler No .system collection, keeping metrics history in memory.
   [junit4]   2> 2334397 DEBUG (Simulated OverseerAutoScalingTriggerThread) [    ] o.a.s.c.a.OverseerTriggerThread Adding .auto_add_replicas and .scheduled_maintenance triggers
   [junit4]   2> 2334397 DEBUG (Simulated OverseerAutoScalingTriggerThread) [    ] o.a.s.c.a.OverseerTriggerThread Refreshing /autoscaling.json with znode version 1
   [junit4]   2> 2334398 DEBUG (Simulated OverseerAutoScalingTriggerThread) [    ] o.a.s.c.a.OverseerTriggerThread Current znodeVersion 1, lastZnodeVersion 0
   [junit4]   2> 2334398 DEBUG (Simulated OverseerAutoScalingTriggerThread) [    ] o.a.s.c.a.OverseerTriggerThread Processed trigger updates upto znodeVersion 1
   [junit4]   2> 2334400 DEBUG (Simulated OverseerAutoScalingTriggerThread) [    ] o.a.s.c.a.NodeLostTrigger NodeLostTrigger .auto_add_replicas - Initial livenodes: [127.0.0.1:10004_solr, 127.0.0.1:10003_solr]
   [junit4]   2> 2334421 DEBUG (Simulated OverseerAutoScalingTriggerThread) [    ] o.a.s.c.a.OverseerTriggerThread -- cleaning old nodeLost / nodeAdded markers
   [junit4]   2> 2334421 DEBUG (Simulated OverseerAutoScalingTriggerThread) [    ] o.a.s.c.a.OverseerTriggerThread Current znodeVersion 1, lastZnodeVersion 1
   [junit4]   2> 2334423 DEBUG (ScheduledTrigger-5770-thread-2) [    ] o.a.s.c.a.NodeLostTrigger Running NodeLostTrigger: .auto_add_replicas with currently live nodes: 2 and last live nodes: 2
   [junit4]   2> 2334428 DEBUG (simCloudManagerPool-5769-thread-2) [    ] o.a.s.c.a.AutoScalingHandler Verified autoscaling configuration
   [junit4]   2> 2334428 DEBUG (simCloudManagerPool-5769-thread-2) [    ] o.a.s.c.a.OverseerTriggerThread Refreshing /autoscaling.json with znode version 2
   [junit4]   2> 2334452 DEBUG (simCloudManagerPool-5769-thread-3) [    ] o.a.s.c.a.AutoScalingHandler Verified autoscaling configuration
   [junit4]   2> 2334453 DEBUG (simCloudManagerPool-5769-thread-3) [    ] o.a.s.c.a.OverseerTriggerThread Refreshing /autoscaling.json with znode version 3
   [junit4]   2> 2334458 DEBUG (Simulated OverseerAutoScalingTriggerThread) [    ] o.a.s.c.a.OverseerTriggerThread Processed trigger updates upto znodeVersion 3
   [junit4]   2> 2334468 DEBUG (ScheduledTrigger-5770-thread-4) [    ] o.a.s.c.a.NodeLostTrigger Running NodeLostTrigger: .auto_add_replicas with currently live nodes: 2 and last live nodes: 2
   [junit4]   2> 2334492 DEBUG (simCloudManagerPool-5769-thread-4) [    ] o.a.s.c.a.AutoScalingHandler Verified autoscaling configuration
   [junit4]   2> 2334492 DEBUG (simCloudManagerPool-5769-thread-4) [    ] o.a.s.c.a.OverseerTriggerThread Refreshing /autoscaling.json with znode version 4
   [junit4]   2> 2334493 DEBUG (simCloudManagerPool-5769-thread-5) [    ] o.a.s.c.a.AutoScalingHandler Verified autoscaling configuration
   [junit4]   2> 2334493 DEBUG (simCloudManagerPool-5769-thread-5) [    ] o.a.s.c.a.OverseerTriggerThread Refreshing /autoscaling.json with znode version 5
   [junit4]   2> 2334494 DEBUG (ScheduledTrigger-5770-thread-4) [    ] o.a.s.c.a.NodeLostTrigger Running NodeLostTrigger: .auto_add_replicas with currently live nodes: 2 and last live nodes: 2
   [junit4]   2> 2334494 INFO  (Simulated OverseerAutoScalingTriggerThread) [    ] o.a.s.c.a.s.TestSimTriggerIntegration TestTriggerAction init
   [junit4]   2> 2334494 DEBUG (Simulated OverseerAutoScalingTriggerThread) [    ] o.a.s.c.a.NodeAddedTrigger NodeAddedTrigger node_added_trigger - Initial livenodes: [127.0.0.1:10004_solr, 127.0.0.1:10003_solr]
   [junit4]   2> 2334494 DEBUG (Simulated OverseerAutoScalingTriggerThread) [    ] o.a.s.c.a.NodeAddedTrigger NodeAddedTrigger node_added_trigger instantiated with properties: {event=nodeAdded, waitFor=2, actions=[{name=test, class=org.apache.solr.cloud.autoscaling.sim.TestSimTriggerIntegration$TestTriggerAction}, {name=test1, class=org.apache.solr.cloud.autoscaling.sim.TestSimTriggerIntegration$TestDummyAction}], enabled=true}
   [junit4]   2> 2334494 DEBUG (Simulated OverseerAutoScalingTriggerThread) [    ] o.a.s.c.a.OverseerTriggerThread -- cleaning old nodeLost / nodeAdded markers
   [junit4]   2> 2334494 DEBUG (Simulated OverseerAutoScalingTriggerThread) [    ] o.a.s.c.a.OverseerTriggerThread Current znodeVersion 5, lastZnodeVersion 3
   [junit4]   2> 2334494 DEBUG (Simulated OverseerAutoScalingTriggerThread) [    ] o.a.s.c.a.OverseerTriggerThread Processed trigger updates upto znodeVersion 5
   [junit4]   2> 2334495 DEBUG (Simulated OverseerAutoScalingTriggerThread) [    ] o.a.s.c.a.OverseerTriggerThread -- cleaning old nodeLost / nodeAdded markers
   [junit4]   2> 2334495 DEBUG (Simulated OverseerAutoScalingTriggerThread) [    ] o.a.s.c.a.OverseerTriggerThread Current znodeVersion 5, lastZnodeVersion 5
   [junit4]   2> 2334495 DEBUG (ScheduledTrigger-5770-thread-3) [    ] o.a.s.c.a.NodeAddedTrigger Running NodeAddedTrigger node_added_trigger
   [junit4]   2> 2334495 DEBUG (ScheduledTrigger-5770-thread-3) [    ] o.a.s.c.a.NodeAddedTrigger Found livenodes: 2
   [junit4]   2> 2334503 DEBUG (TEST-TestSimTriggerIntegration.testListeners-seed#[701375370C0E791F]) [    ] o.a.s.c.a.s.SimClusterStateProvider -- creating marker: /autoscaling/nodeAdded/127.0.0.1:10005_solr
   [junit4]   2> 2334514 DEBUG (ScheduledTrigger-5770-thread-3) [    ] o.a.s.c.a.NodeLostTrigger Running NodeLostTrigger: .auto_add_replicas with currently live nodes: 3 and last live nodes: 2
   [junit4]   2> 2334543 DEBUG (ScheduledTrigger-5770-thread-2) [    ] o.a.s.c.a.NodeLostTrigger Running NodeLostTrigger: .auto_add_replicas with currently live nodes: 3 and last live nodes: 3
   [junit4]   2> 2334543 DEBUG (ScheduledTrigger-5770-thread-1) [    ] o.a.s.c.a.NodeAddedTrigger Running NodeAddedTrigger node_added_trigger
   [junit4]   2> 2334543 DEBUG (ScheduledTrigger-5770-thread-1) [    ] o.a.s.c.a.NodeAddedTrigger Found livenodes: 3
   [junit4]   2> 2334543 DEBUG (ScheduledTrigger-5770-thread-1) [    ] o.a.s.c.a.NodeAddedTrigger Tracking new node: 127.0.0.1:10005_solr at time 30017036002594783
   [junit4]   2> 2334563 DEBUG (ScheduledTrigger-5770-thread-2) [    ] o.a.s.c.a.NodeLostTrigger Running NodeLostTrigger: .auto_add_replicas with currently live nodes: 3 and last live nodes: 3
   [junit4]   2> 2334567 DEBUG (ScheduledTrigger-5770-thread-3) [    ] o.a.s.c.a.NodeAddedTrigger Running NodeAddedTrigger node_added_trigger
   [junit4]   2> 2334567 DEBUG (ScheduledTrigger-5770-thread-3) [    ] o.a.s.c.a.NodeAddedTrigger Found livenodes: 3
   [junit4]   2> 2334591 DEBUG (ScheduledTrigger-5770-thread-4) [    ] o.a.s.c.a.NodeAddedTrigger Running NodeAddedTrigger node_added_trigger
   [junit4]   2> 2334591 DEBUG (ScheduledTrigger-5770-thread-2) [    ] o.a.s.c.a.NodeLostTrigger Running NodeLostTrigger: .auto_add_replicas with currently live nodes: 3 and last live nodes: 3
   [junit4]   2> 2334591 DEBUG (ScheduledTrigger-5770-thread-4) [    ] o.a.s.c.a.NodeAddedTrigger Found livenodes: 3
   [junit4]   2> 2334591 DEBUG (ScheduledTrigger-5770-thread-4) [    ] o.a.s.c.a.NodeAddedTrigger NodeAddedTrigger node_added_trigger firing registered processor for nodes: [127.0.0.1:10005_solr] added at times [30017036002594783], now=30017038410367533
   [junit4]   2> 2334592 DEBUG (ScheduledTrigger-5770-thread-4) [    ] o.a.s.c.a.ScheduledTriggers ++++++++ Cooldown inactive - processing event: {
   [junit4]   2>   "id":"6aa455d0250fdfTc2lzut84j65v63f5hcbb10hrn",
   [junit4]   2>   "source":"node_added_trigger",
   [junit4]   2>   "eventTime":30017036002594783,
   [junit4]   2>   "eventType":"NODEADDED",
   [junit4]   2>   "properties":{
   [junit4]   2>     "eventTimes":[30017036002594783],
   [junit4]   2>     "preferredOperation":"movereplica",
   [junit4]   2>     "nodeNames":["127.0.0.1:10005_solr"]}}
   [junit4]   2> 2334592 DEBUG (ScheduledTrigger-5770-thread-4) [    ] o.a.s.c.a.ScheduledTriggers Pausing all triggers: [.auto_add_replicas, node_added_trigger]
   [junit4]   2> 2334592 DEBUG (ScheduledTrigger-5770-thread-4) [    ] o.a.s.c.a.SystemLogListener Collection .system missing, skip sending event {
   [junit4]   2>   "id":"6aa455d0250fdfTc2lzut84j65v63f5hcbb10hrn",
   [junit4]   2>   "source":"node_added_trigger",
   [junit4]   2>   "eventTime":30017036002594783,
   [junit4]   2>   "eventType":"NODEADDED",
   [junit4]   2>   "properties":{
   [junit4]   2>     "eventTimes":[30017036002594783],
   [junit4]   2>     "preferredOperation":"movereplica",
   [junit4]   2>     "_enqueue_time_":30017038433340733,
   [junit4]   2>     "nodeNames":["127.0.0.1:10005_solr"]}}
   [junit4]   2> 2334624 DEBUG (ScheduledTrigger-5770-thread-4) [    ] o.a.s.c.a.NodeAddedTrigger Removing new node from tracking: 127.0.0.1:10005_solr
   [junit4]   2> 2334624 DEBUG (AutoscalingActionExecutor-5771-thread-1) [    ] o.a.s.c.a.ScheduledTriggers -- processing actions for {
   [junit4]   2>   "id":"6aa455d0250fdfTc2lzut84j65v63f5hcbb10hrn",
   [junit4]   2>   "source":"node_added_trigger",
   [junit4]   2>   "eventTime":30017036002594783,
   [junit4]   2>   "eventType":"NODEADDED",
   [junit4]   2>   "properties":{
   [junit4]   2>     "eventTimes":[30017036002594783],
   [junit4]   2>     "preferredOperation":"movereplica",
   [junit4]   2>     "_enqueue_time_":30017038433340733,
   [junit4]   2>     "nodeNames":["127.0.0.1:10005_solr"]}}
   [junit4]   2> 2334625 DEBUG (AutoscalingActionExecutor-5771-thread-1) [    ] o.a.s.c.a.SystemLogListener Collection .system missing, skip sending event {
   [junit4]   2>   "id":"6aa455d0250fdfTc2lzut84j65v63f5hcbb10hrn",
   [junit4]   2>   "source":"node_added_trigger",
   [junit4]   2>   "eventTime":30017036002594783,
   [junit4]   2>   "eventType":"NODEADDED",
   [junit4]   2>   "properties":{
   [junit4]   2>     "eventTimes":[30017036002594783],
   [junit4]   2>     "preferredOperation":"movereplica",
   [junit4]   2>     "_enqueue_time_":30017038433340733,
   [junit4]   2>     "nodeNames":["127.0.0.1:10005_solr"]}}
   [junit4]   2> 2334625 DEBUG (TEST-TestSimTriggerIntegration.testListeners-seed#[701375370C0E791F]) [    ] o.a.s.c.a.s.SimClusterStateProvider -- creating marker: /autoscaling/nodeAdded/127.0.0.1:10006_solr
   [junit4]   2> 2334626 DEBUG (AutoscalingActionExecutor-5771-thread-1) [    ] o.a.s.c.a.ScheduledTriggers Resuming trigger: node_added_trigger after 100ms
   [junit4]   2> 2334626 DEBUG (AutoscalingActionExecutor-5771-thread-1) [    ] o.a.s.c.a.ScheduledTriggers Resuming trigger: .auto_add_replicas after 100ms
   [junit4]   2> 2334626 DEBUG (AutoscalingActionExecutor-5771-thread-1) [    ] o.a.s.c.a.ScheduledTriggers -- processing took 81 ms for event id=6aa455d0250fdfTc2lzut84j65v63f5hcbb10hrn
   [junit4]   2> 2334729 DEBUG (ScheduledTrigger-5770-thread-3) [    ] o.a.s.c.a.NodeAddedTrigger Running NodeAddedTrigger node_added_trigger
   [junit4]   2> 2334729 DEBUG (ScheduledTrigger-5770-thread-3) [    ] o.a.s.c.a.NodeAddedTrigger Found livenodes: 4
   [junit4]   2> 2334729 DEBUG (ScheduledTrigger-5770-thread-3) [    ] o.a.s.c.a.NodeAddedTrigger Tracking new node: 127.0.0.1:10006_solr at time 30017045300217233
   [junit4]   2> 2334729 DEBUG (ScheduledTrigger-5770-thread-3) [    ] o.a.s.c.a.NodeLostTrigger Running NodeLostTrigger: .auto_add_replicas with currently live nodes: 4 and last live nodes: 3
   [junit4]   2> 2334749 DEBUG (ScheduledTrigger-5770-thread-3) [    ] o.a.s.c.a.NodeAddedTrigger Running NodeAddedTrigger node_added_trigger
   [junit4]   2> 2334750 DEBUG (ScheduledTrigger-5770-thread-3) [    ] o.a.s.c.a.NodeAddedTrigger Found livenodes: 4
   [junit4]   2> 2334750 DEBUG (ScheduledTrigger-5770-thread-3) [    ] o.a.s.c.a.NodeLostTrigger Running NodeLostTrigger: .auto_add_replicas with currently live nodes: 4 and last live nodes: 4
   [junit4]   2> 2334770 DEBUG (ScheduledTrigger-5770-thread-3) [    ] o.a.s.c.a.NodeAddedTrigger Running NodeAddedTrigger node_added_trigger
   [junit4]   2> 2334770 DEBUG (ScheduledTrigger-5770-thread-3) [    ] o.a.s.c.a.NodeAddedTrigger Found livenodes: 4
   [junit4]   2> 2334770 DEBUG (ScheduledTrigger-5770-thread-3) [    ] o.a.s.c.a.NodeAddedTrigger NodeAddedTrigger node_added_trigger firing registered processor for nodes: [127.0.0.1:10006_solr] added at times [30017045300217233], now=30017047327948533
   [junit4]   2> 2334770 DEBUG (ScheduledTrigger-5770-thread-3) [    ] o.a.s.c.a.ScheduledTriggers ++++++++ Cooldown inactive - processing event: {
   [junit4]   2>   "id":"6aa457fa538591Tc2lzut84j65v63f5hcbb10hro",
   [junit4]   2>   "source":"node_added_trigger",
   [junit4]   2>   "eventTime":30017045300217233,
   [junit4]   2>   "eventType":"NODEADDED",
   [junit4]   2>   "properties":{
   [junit4]   2>     "eventTimes":[30017045300217233],
   [junit4]   2>     "preferredOperation":"movereplica",
   [junit4]   2>     "nodeNames":["127.0.0.1:10006_solr"]}}
   [junit4]   2> 2334770 DEBUG (ScheduledTrigger-5770-thread-3) [    ] o.a.s.c.a.ScheduledTriggers Pausing all triggers: [.auto_add_replicas, node_added_trigger]
   [junit4]   2> 2334770 DEBUG (ScheduledTrigger-5770-thread-3) [    ] o.a.s.c.a.SystemLogListener Collection .system missing, skip sending event {
   [junit4]   2>   "id":"6aa457fa538591Tc2lzut84j65v63f5hcbb10hro",
   [junit4]   2>   "source":"node_added_trigger",
   [junit4]   2>   "eventTime":30017045300217233,
   [junit4]   2>   "eventType":"NODEADDED",
   [junit4]   2>   "properties":{
   [junit4]   2>     "eventTimes":[30017045300217233],
   [junit4]   2>     "preferredOperation":"movereplica",
   [junit4]   2>     "_enqueue_time_":30017047338027183,
   [junit4]   2>     "nodeNames":["127.0.0.1:10006_solr"]}}
   [junit4]   2> 2334770 DEBUG (ScheduledTrigger-5770-thread-3) [    ] o.a.s.c.a.NodeAddedTrigger Removing new node from tracking: 127.0.0.1:10006_solr
   [junit4]   2> 2334770 DEBUG (AutoscalingActionExecutor-5771-thread-1) [    ] o.a.s.c.a.ScheduledTriggers -- processing actions for {
   [junit4]   2>   "id":"6aa457fa538591Tc2lzut84j65v63f5hcbb10hro",
   [junit4]   2>   "source":"node_added_trigger",
   [junit4]   2>   "eventTime":30017045300217233,
   [junit4]   2>   "eventType":"NODEADDED",
   [junit4]   2>   "properties":{
   [junit4]   2>     "eventTimes":[30017045300217233],
   [junit4]   2>     "preferredOperation":"movereplica",
   [junit4]   2>     "_enqueue_time_":30017047338027183,
   [junit4]   2>     "nodeNames":["127.0.0.1:10006_solr"]}}
   [junit4]   2> 2334771 DEBUG (AutoscalingActionExecutor-5771-thread-1) [    ] o.a.s.c.a.SystemLogListener Collection .system missing, skip sending event {
   [junit4]   2>   "id":"6aa457fa538591Tc2lzut84j65v63f5hcbb10hro",
   [junit4]   2>   "source":"node_added_trigger",
   [junit4]   2>   "eventTime":30017045300217233,
   [junit4]   2>   "eventType":"NODEADDED",
   [junit4]   2>   "properties":{
   [junit4]   2>     "eventTimes":[30017045300217233],
   [junit4]   2>     "preferredOperation":"movereplica",
   [junit4]   2>     "_enqueue_time_":30017047338027183,
   [junit4]   2>     "nodeNames":["127.0.0.1:10006_solr"]}}
   [junit4]   2> 2334771 WARN  (AutoscalingActionExecutor-5771-thread-1) [    ] o.a.s.c.a.ScheduledTriggers Exception executing actions
   [junit4]   2> org.apache.solr.cloud.autoscaling.TriggerActionException: Error processing action for trigger event: {
   [junit4]   2>   "id":"6aa457fa538591Tc2lzut84j65v63f5hcbb10hro",
   [junit4]   2>   "source":"node_added_trigger",
   [junit4]   2>   "eventTime":30017045300217233,
   [junit4]   2>   "eventType":"NODEADDED",
   [junit4]   2>   "properties":{
   [junit4]   2>     "eventTimes":[30017045300217233],
   [junit4]   2>     "preferredOperation":"movereplica",
   [junit4]   2>     "_enqueue_time_":30017047338027183,
   [junit4]   2>     "nodeNames":["127.0.0.1:10006_solr"]}}
   [junit4]   2> 	at org.apache.solr.cloud.autoscaling.ScheduledTriggers.lambda$null$3(ScheduledTriggers.java:327) ~[java/:?]
   [junit4]   2> 	at java.util.concurrent.Executors$RunnableAdapter.call(Executors.java:511) ~[?:1.8.0_191]
   [junit4]   2> 	at java.util.concurrent.FutureTask.run(FutureTask.java:266) ~[?:1.8.0_191]
   [junit4]   2> 	at org.apache.solr.common.util.ExecutorUtil$MDCAwareThreadPoolExecutor.lambda$execute$0(ExecutorUtil.java:209) ~[java/:?]
   [junit4]   2> 	at java.util.concurrent.ThreadPoolExecutor.runWorker(ThreadPoolExecutor.java:1149) [?:1.8.0_191]
   [junit4]   2> 	at java.util.concurrent.ThreadPoolExecutor$Worker.run(ThreadPoolExecutor.java:624) [?:1.8.0_191]
   [junit4]   2> 	at java.lang.Thread.run(Thread.java:748) [?:1.8.0_191]
   [junit4]   2> Caused by: java.lang.RuntimeException: failure
   [junit4]   2> 	at org.apache.solr.cloud.autoscaling.sim.TestSimTriggerIntegration$TestDummyAction.process(TestSimTriggerIntegration.java:1007) ~[test/:?]
   [junit4]   2> 	at org.apache.solr.cloud.autoscaling.ScheduledTriggers.lambda$null$3(ScheduledTriggers.java:324) ~[java/:?]
   [junit4]   2> 	... 6 more
   [junit4]   2> 2334772 DEBUG (AutoscalingActionExecutor-5771-thread-1) [    ] o.a.s.c.a.ScheduledTriggers Resuming trigger: node_added_trigger after 100ms
   [junit4]   2> 2334772 DEBUG (AutoscalingActionExecutor-5771-thread-1) [    ] o.a.s.c.a.ScheduledTriggers Resuming trigger: .auto_add_replicas after 100ms
   [junit4]   2> 2334772 DEBUG (AutoscalingActionExecutor-5771-thread-1) [    ] o.a.s.c.a.ScheduledTriggers -- processing took 88 ms for event id=6aa457fa538591Tc2lzut84j65v63f5hcbb10hro
   [junit4]   2> 2334774 DEBUG (TEST-TestSimTriggerIntegration.testListeners-seed#[701375370C0E791F]) [    ] o.a.s.c.a.ScheduledTriggers Shutting down scheduled thread pool executor now
   [junit4]   2> 2334774 DEBUG (TEST-TestSimTriggerIntegration.testListeners-seed#[701375370C0E791F]) [    ] o.a.s.c.a.ScheduledTriggers Shutting down action executor now
   [junit4]   2> 2334774 DEBUG (TEST-TestSimTriggerIntegration.testListeners-seed#[701375370C0E791F]) [    ] o.a.s.c.a.ScheduledTriggers Awaiting termination for action executor
   [junit4]   2> 2334786 INFO  (Simulated OverseerAutoScalingTriggerThread) [    ] o.a.s.c.a.OverseerTriggerThread OverseerTriggerThread woken up but we are closed, exiting.
   [junit4]   2> 2334790 DEBUG (TEST-TestSimTriggerIntegration.testListeners-seed#[701375370C0E791F]) [    ] o.a.s.c.a.ScheduledTriggers Awaiting termination for scheduled thread pool executor
   [junit4]   2> 2334790 DEBUG (TEST-TestSimTriggerIntegration.testListeners-seed#[701375370C0E791F]) [    ] o.a.s.c.a.ScheduledTriggers ScheduledTriggers closed completely
   [junit4]   2> 2334790 DEBUG (TEST-TestSimTriggerIntegration.testListeners-seed#[701375370C0E791F]) [    ] o.a.s.c.a.OverseerTriggerThread OverseerTriggerThread has been closed explicitly
   [junit4]   2> 2334859 DEBUG (TEST-TestSimTriggerIntegration.testEventQueue-seed#[701375370C0E791F]) [    ] o.a.s.c.a.s.SimClusterStateProvider --- new Overseer leader: 127.0.0.1:10007_solr
   [junit4]   2> 2334863 DEBUG (Simulated OverseerAutoScalingTriggerThread) [    ] o.a.s.c.a.OverseerTriggerThread Adding .auto_add_replicas and .scheduled_maintenance triggers
   [junit4]   2> 2334863 DEBUG (Simulated OverseerAutoScalingTriggerThread) [    ] o.a.s.c.a.OverseerTriggerThread Refreshing /autoscaling.json with znode version 1
   [junit4]   2> 2334864 DEBUG (Simulated OverseerAutoScalingTriggerThread) [    ] o.a.s.c.a.OverseerTriggerThread Current znodeVersion 1, lastZnodeVersion 0
   [junit4]   2> 2334864 DEBUG (Simulated OverseerAutoScalingTriggerThread) [    ] o.a.s.c.a.OverseerTriggerThread Processed trigger updates upto znodeVersion 1
   [junit4]   2> 2334895 DEBUG (TEST-TestSimTriggerIntegration.testEventQueue-seed#[701375370C0E791F]) [    ] o.a.s.c.a.s.SimClusterStateProvider ** creating new collection states, currentVersion=0
   [junit4]   2> 2334912 DEBUG (TEST-TestSimTriggerIntegration.testEventQueue-seed#[701375370C0E791F]) [    ] o.a.s.c.a.s.SimClusterStateProvider ** saved cluster state version 0
   [junit4]   2> 2334912 INFO  (TEST-TestSimTriggerIntegration.testEventQueue-seed#[701375370C0E791F]) [    ] o.a.s.h.a.MetricsHistoryHandler No .system collection, keeping metrics history in memory.
   [junit4]   2> 2334920 DEBUG (Simulated OverseerAutoScalingTriggerThread) [    ] o.a.s.c.a.NodeLostTrigger NodeLostTrigger .auto_add_replicas - Initial livenodes: [127.0.0.1:10008_solr, 127.0.0.1:10007_solr]
   [junit4]   2> 2334936 DEBUG (ScheduledTrigger-5776-thread-1) [    ] o.a.s.c.a.NodeLostTrigger Running NodeLostTrigger: .auto_add_replicas with currently live nodes: 2 and last live nodes: 2
   [junit4]   2> 2334936 DEBUG (Simulated OverseerAutoScalingTriggerThread) [    ] o.a.s.c.a.OverseerTriggerThread -- cleaning old nodeLost / nodeAdded markers
   [junit4]   2> 2334936 DEBUG (Simulated OverseerAutoScalingTriggerThread) [    ] o.a.s.c.a.OverseerTriggerThread Current znodeVersion 1, lastZnodeVersion 1
   [junit4]   2> 2334948 DEBUG (simCloudManagerPool-5775-thread-2) [    ] o.a.s.c.a.AutoScalingHandler Verified autoscaling configuration
   [junit4]   2> 2334948 DEBUG (simCloudManagerPool-5775-thread-2) [    ] o.a.s.c.a.OverseerTriggerThread Refreshing /autoscaling.json with znode version 2
   [junit4]   2> 2334968 DEBUG (Simulated OverseerAutoScalingTriggerThread) [    ] o.a.s.c.a.OverseerTriggerThread Processed trigger updates upto znodeVersion 2
   [junit4]   2> 2334970 DEBUG (ScheduledTrigger-5776-thread-2) [    ] o.a.s.c.a.NodeLostTrigger Running NodeLostTrigger: .auto_add_replicas with currently live nodes: 2 and last live nodes: 2
   [junit4]   2> 2334970 DEBUG (Simulated OverseerAutoScalingTriggerThread) [    ] o.a.s.c.a.OverseerTriggerThread -- cleaning old nodeLost / nodeAdded markers
   [junit4]   2> 2334970 DEBUG (Simulated OverseerAutoScalingTriggerThread) [    ] o.a.s.c.a.OverseerTriggerThread Current znodeVersion 2, lastZnodeVersion 2
   [junit4]   2> 2334972 INFO  (simCloudManagerPool-5775-thread-3) [    ] o.a.s.c.a.s.TestSimTriggerIntegration TestEventQueueAction instantiated
   [junit4]   2> 2334972 DEBUG (simCloudManagerPool-5775-thread-3) [    ] o.a.s.c.a.s.TestSimTriggerIntegration TestTriggerAction init
   [junit4]   2> 2334989 DEBUG (simCloudManagerPool-5775-thread-3) [    ] o.a.s.c.a.AutoScalingHandler Verified autoscaling configuration
   [junit4]   2> 2334989 DEBUG (simCloudManagerPool-5775-thread-3) [    ] o.a.s.c.a.OverseerTriggerThread Refreshing /autoscaling.json with znode version 3
   [junit4]   2> 2334989 INFO  (simCloudManagerPool-5775-thread-3) [    ] o.a.s.c.a.s.TestSimTriggerIntegration TestEventQueueAction instantiated
   [junit4]   2> 2334989 DEBUG (simCloudManagerPool-5775-thread-3) [    ] o.a.s.c.a.s.TestSimTriggerIntegration TestTriggerAction init
   [junit4]   2> 2334990 DEBUG (Simulated OverseerAutoScalingTriggerThread) [    ] o.a.s.c.a.OverseerTriggerThread Processed trigger updates upto znodeVersion 3
   [junit4]   2> 2334990 DEBUG (Simulated OverseerAutoScalingTriggerThread) [    ] o.a.s.c.a.NodeAddedTrigger NodeAddedTrigger node_added_trigger1 - Initial livenodes: [127.0.0.1:10008_solr, 127.0.0.1:10007_solr]
   [junit4]   2> 2334990 DEBUG (Simulated OverseerAutoScalingTriggerThread) [    ] o.a.s.c.a.NodeAddedTrigger NodeAddedTrigger node_added_trigger1 instantiated with properties: {event=nodeAdded, waitFor=1, actions=[{name=test, class=org.apache.solr.cloud.autoscaling.sim.TestSimTriggerIntegration$TestEventQueueAction}], enabled=true}
   [junit4]   2> 2334990 DEBUG (Simulated OverseerAutoScalingTriggerThread) [    ] o.a.s.c.a.OverseerTriggerThread -- cleaning old nodeLost / nodeAdded markers
   [junit4]   2> 2334990 DEBUG (Simulated OverseerAutoScalingTriggerThread) [    ] o.a.s.c.a.OverseerTriggerThread Current znodeVersion 3, lastZnodeVersion 3
   [junit4]   2> 2334990 DEBUG (ScheduledTrigger-5776-thread-4) [    ] o.a.s.c.a.NodeAddedTrigger Running NodeAddedTrigger node_added_trigger1
   [junit4]   2> 2334990 DEBUG (ScheduledTrigger-5776-thread-4) [    ] o.a.s.c.a.NodeAddedTrigger Found livenodes: 2
   [junit4]   2> 2334990 DEBUG (ScheduledTrigger-5776-thread-4) [    ] o.a.s.c.a.NodeLostTrigger Running NodeLostTrigger: .auto_add_replicas with currently live nodes: 2 and last live nodes: 2
   [junit4]   2> 2335010 DEBUG (ScheduledTrigger-5776-thread-4) [    ] o.a.s.c.a.NodeAddedTrigger Running NodeAddedTrigger node_added_trigger1
   [junit4]   2> 2335010 DEBUG (ScheduledTrigger-5776-thread-4) [    ] o.a.s.c.a.NodeAddedTrigger Found livenodes: 2
   [junit4]   2> 2335010 DEBUG (ScheduledTrigger-5776-thread-4) [    ] o.a.s.c.a.NodeLostTrigger Running NodeLostTrigger: .auto_add_replicas with currently live nodes: 2 and last live nodes: 2
   [junit4]   2> 2335041 DEBUG (TEST-TestSimTriggerIntegration.testEventQueue-seed#[701375370C0E791F]) [    ] o.a.s.c.a.s.SimClusterStateProvider -- creating marker: /autoscaling/nodeAdded/127.0.0.1:10009_solr
   [junit4]   2> 2335045 DEBUG (ScheduledTrigger-5776-thread-4) [    ] o.a.s.c.a.NodeAddedTrigger Running NodeAddedTrigger node_added_trigger1
   [junit4]   2> 2335045 DEBUG (ScheduledTrigger-5776-thread-4) [    ] o.a.s.c.a.NodeAddedTrigger Found livenodes: 3
   [junit4]   2> 2335045 DEBUG (ScheduledTrigger-5776-thread-1) [    ] o.a.s.c.a.NodeLostTrigger Running NodeLostTrigger: .auto_add_replicas with currently live nodes: 3 and last live nodes: 2
   [junit4]   2> 2335045 DEBUG (ScheduledTrigger-5776-thread-4) [    ] o.a.s.c.a.NodeAddedTrigger Tracking new node: 127.0.0.1:10009_solr at time 30017061100969883
   [junit4]   2> 2335082 DEBUG (ScheduledTrigger-5776-thread-1) [    ] o.a.s.c.a.NodeLostTrigger Running NodeLostTrigger: .auto_add_replicas with currently live nodes: 3 and last live nodes: 3
   [junit4]   2> 2335082 DEBUG (ScheduledTrigger-5776-thread-1) [    ] o.a.s.c.a.NodeAddedTrigger Running NodeAddedTrigger node_added_trigger1
   [junit4]   2> 2335082 DEBUG (ScheduledTrigger-5776-thread-1) [    ] o.a.s.c.a.NodeAddedTrigger Found livenodes: 3
   [junit4]   2> 2335082 DEBUG (ScheduledTrigger-5776-thread-1) [    ] o.a.s.c.a.NodeAddedTrigger NodeAddedTrigger node_added_trigger1 firing registered processor for nodes: [127.0.0.1:10009_solr] added at times [30017061100969883], now=30017062950454633
   [junit4]   2> 2335082 DEBUG (ScheduledTrigger-5776-thread-1) [    ] o.a.s.c.a.ScheduledTriggers ++++++++ Cooldown inactive - processing event: {
   [junit4]   2>   "id":"6aa45ba81fdf9bTc2lzut84j65v63f5hcbb10hrq",
   [junit4]   2>   "source":"node_added_trigger1",
   [junit4]   2>   "eventTime":30017061100969883,
   [junit4]   2>   "eventType":"NODEADDED",
   [junit4]   2>   "properties":{
   [junit4]   2>     "eventTimes":[30017061100969883],
   [junit4]   2>     "preferredOperation":"movereplica",
   [junit4]   2>     "nodeNames":["127.0.0.1:10009_solr"]}}
   [junit4]   2> 2335083 DEBUG (ScheduledTrigger-5776-thread-1) [    ] o.a.s.c.a.ScheduledTriggers Pausing all triggers: [.auto_add_replicas, node_added_trigger1]
   [junit4]   2> 2335083 DEBUG (ScheduledTrigger-5776-thread-1) [    ] o.a.s.c.a.SystemLogListener Collection .system missing, skip sending event {
   [junit4]   2>   "id":"6aa45ba81fdf9bTc2lzut84j65v63f5hcbb10hrq",
   [junit4]   2>   "source":"node_added_trigger1",
   [junit4]   2>   "eventTime":30017061100969883,
   [junit4]   2>   "eventType":"NODEADDED",
   [junit4]   2>   "properties":{
   [junit4]   2>     "eventTimes":[30017061100969883],
   [junit4]   2>     "preferredOperation":"movereplica",
   [junit4]   2>     "_enqueue_time_":30017062967242033,
   [junit4]   2>     "nodeNames":["127.0.0.1:10009_solr"]}}
   [junit4]   2> 2335083 DEBUG (ScheduledTrigger-5776-thread-1) [    ] o.a.s.c.a.NodeAddedTrigger Removing new node from tracking: 127.0.0.1:10009_solr
   [junit4]   2> 2335083 DEBUG (AutoscalingActionExecutor-5777-thread-1) [    ] o.a.s.c.a.ScheduledTriggers -- processing actions for {
   [junit4]   2>   "id":"6aa45ba81fdf9bTc2lzut84j65v63f5hcbb10hrq",
   [junit4]   2>   "source":"node_added_trigger1",
   [junit4]   2>   "eventTime":30017061100969883,
   [junit4]   2>   "eventType":"NODEADDED",
   [junit4]   2>   "properties":{
   [junit4]   2>     "eventTimes":[30017061100969883],
   [junit4]   2>     "preferredOperation":"movereplica",
   [junit4]   2>     "_enqueue_time_":30017062967242033,
   [junit4]   2>     "nodeNames":["127.0.0.1:10009_solr"]}}
   [junit4]   2> 2335083 INFO  (AutoscalingActionExecutor-5777-thread-1) [    ] o.a.s.c.a.s.TestSimTriggerIntegration -- event: {
   [junit4]   2>   "id":"6aa45ba81fdf9bTc2lzut84j65v63f5hcbb10hrq",
   [junit4]   2>   "source":"node_added_trigger1",
   [junit4]   2>   "eventTime":30017061100969883,
   [junit4]   2>   "eventType":"NODEADDED",
   [junit4]   2>   "properties":{
   [junit4]   2>     "eventTimes":[30017061100969883],
   [junit4]   2>     "preferredOperation":"movereplica",
   [junit4]   2>     "_enqueue_time_":30017062967242033,
   [junit4]   2>     "nodeNames":["127.0.0.1:10009_solr"]}}
   [junit4]   2> 2335083 INFO  (TEST-TestSimTriggerIntegration.testEventQueue-seed#[701375370C0E791F]) [    ] o.a.s.c.a.s.SimCloudManager === Restarting OverseerTriggerThread and clearing object cache...
   [junit4]   2> 2335083 DEBUG (TEST-TestSimTriggerIntegration.testEventQueue-seed#[701375370C0E791F]) [    ] o.a.s.c.a.ScheduledTriggers Shutting down scheduled thread pool executor now
   [junit4]   2> 2335083 DEBUG (TEST-TestSimTriggerIntegration.testEventQueue-seed#[701375370C0E791F]) [    ] o.a.s.c.a.ScheduledTriggers Shutting down action executor now
   [junit4]   2> 2335083 DEBUG (TEST-TestSimTriggerIntegration.testEventQueue-seed#[701375370C0E791F]) [    ] o.a.s.c.a.ScheduledTriggers Awaiting termination for action executor
   [junit4]   2> 2335083 INFO  (Simulated OverseerAutoScalingTriggerThread) [    ] o.a.s.c.a.OverseerTriggerThread OverseerTriggerThread woken up but we are closed, exiting.
   [junit4]   2> 2335084 DEBUG (AutoscalingActionExecutor-5777-thread-1) [    ] o.a.s.c.a.SystemLogListener Collection .system missing, skip sending event {
   [junit4]   2>   "id":"6aa45ba81fdf9bTc2lzut84j65v63f5hcbb10hrq",
   [junit4]   2>   "source":"node_added_trigger1",
   [junit4]   2>   "eventTime":30017061100969883,
   [junit4]   2>   "eventType":"NODEADDED",
   [junit4]   2>   "properties":{
   [junit4]   2>     "eventTimes":[30017061100969883],
   [junit4]   2>     "preferredOperation":"movereplica",
   [junit4]   2>     "_enqueue_time_":30017062967242033,
   [junit4]   2>     "nodeNames":["127.0.0.1:10009_solr"]}}
   [junit4]   2> 2335084 WARN  (AutoscalingActionExecutor-5777-thread-1) [    ] o.a.s.c.a.ScheduledTriggers Unhandled exception executing actions
   [junit4]   2> org.apache.solr.common.AlreadyClosedException: ScheduledTrigger node_added_trigger1 has been closed.
   [junit4]   2> 	at org.apache.solr.cloud.autoscaling.ScheduledTriggers$TriggerWrapper.dequeue(ScheduledTriggers.java:583) ~[java/:?]
   [junit4]   2> 	at org.apache.solr.cloud.autoscaling.ScheduledTriggers.lambda$null$3(ScheduledTriggers.java:334) ~[java/:?]
   [junit4]   2> 	at java.util.concurrent.Executors$RunnableAdapter.call(Executors.java:511) ~[?:1.8.0_191]
   [junit4]   2> 	at java.util.concurrent.FutureTask.run(FutureTask.java:266) ~[?:1.8.0_191]
   [junit4]   2> 	at org.apache.solr.common.util.ExecutorUtil$MDCAwareThreadPoolExecutor.lambda$execute$0(ExecutorUtil.java:209) ~[java/:?]
   [junit4]   2> 	at java.util.concurrent.ThreadPoolExecutor.runWorker(ThreadPoolExecutor.java:1149) [?:1.8.0_191]
   [junit4]   2> 	at java.util.concurrent.ThreadPoolExecutor$Worker.run(ThreadPoolExecutor.java:624) [?:1.8.0_191]
   [junit4]   2> 	at java.lang.Thread.run(Thread.java:748) [?:1.8.0_191]
   [junit4]   2> 2335085 DEBUG (AutoscalingActionExecutor-5777-thread-1) [    ] o.a.s.c.a.ScheduledTriggers -- processing took 84 ms for event id=6aa45ba81fdf9bTc2lzut84j65v63f5hcbb10hrq
   [junit4]   2> 2335085 DEBUG (TEST-TestSimTriggerIntegration.testEventQueue-seed#[701375370C0E791F]) [    ] o.a.s.c.a.ScheduledTriggers Awaiting termination for scheduled thread pool executor
   [junit4]   2> 2335085 DEBUG (TEST-TestSimTriggerIntegration.testEventQueue-seed#[701375370C0E791F]) [    ] o.a.s.c.a.ScheduledTriggers ScheduledTriggers closed completely
   [junit4]   2> 2335085 DEBUG (TEST-TestSimTriggerIntegration.testEventQueue-seed#[701375370C0E791F]) [    ] o.a.s.c.a.OverseerTriggerThread OverseerTriggerThread has been closed explicitly
   [junit4]   2> 2335085 INFO  (TEST-TestSimTriggerIntegration.testEventQueue-seed#[701375370C0E791F]) [    ] o.a.s.c.a.s.SimCloudManager   = killing node 127.0.0.1:10008_solr
   [junit4]   2> 2335086 DEBUG (TEST-TestSimTriggerIntegration.testEventQueue-seed#[701375370C0E791F]) [    ] o.a.s.c.a.s.SimClusterStateProvider  -- created marker: /autoscaling/nodeLost/127.0.0.1:10008_solr
   [junit4]   2> 2335151 DEBUG (Simulated OverseerAutoScalingTriggerThread) [    ] o.a.s.c.a.OverseerTriggerThread Refreshing /autoscaling.json with znode version 3
   [junit4]   2> 2335151 INFO  (Simulated OverseerAutoScalingTriggerThread) [    ] o.a.s.c.a.s.TestSimTriggerIntegration TestEventQueueAction instantiated
   [junit4]   2> 2335151 DEBUG (Simulated OverseerAutoScalingTriggerThread) [    ] o.a.s.c.a.s.TestSimTriggerIntegration TestTriggerAction init
   [junit4]   2> 2335151 DEBUG (Simulated OverseerAutoScalingTriggerThread) [    ] o.a.s.c.a.OverseerTriggerThread Current znodeVersion 3, lastZnodeVersion 0
   [junit4]   2> 2335151 DEBUG (Simulated OverseerAutoScalingTriggerThread) [    ] o.a.s.c.a.OverseerTriggerThread Processed trigger updates upto znodeVersion 3
   [junit4]   2> 2335152 DEBUG (Simulated OverseerAutoScalingTriggerThread) [    ] o.a.s.c.a.NodeLostTrigger NodeLostTrigger .auto_add_replicas - Initial livenodes: [127.0.0.1:10009_solr, 127.0.0.1:10007_solr]
   [junit4]   2> 2335152 DEBUG (Simulated OverseerAutoScalingTriggerThread) [    ] o.a.s.c.a.NodeLostTrigger Adding lost node from marker path: 127.0.0.1:10008_solr
   [junit4]   2> 2335152 DEBUG (Simulated OverseerAutoScalingTriggerThread) [    ] o.a.s.c.a.NodeAddedTrigger NodeAddedTrigger node_added_trigger1 - Initial livenodes: [127.0.0.1:10009_solr, 127.0.0.1:10007_solr]
   [junit4]   2> 2335152 DEBUG (Simulated OverseerAutoScalingTriggerThread) [    ] o.a.s.c.a.NodeAddedTrigger NodeAddedTrigger node_added_trigger1 instantiated with properties: {event=nodeAdded, waitFor=1, actions=[{name=test, class=org.apache.solr.cloud.autoscaling.sim.TestSimTriggerIntegration$TestEventQueueAction}], enabled=true}
   [junit4]   2> 2335152 DEBUG (Simulated OverseerAutoScalingTriggerThread) [    ] o.a.s.c.a.NodeAddedTrigger Adding node from marker path: 127.0.0.1:10009_solr
   [junit4]   2> 2335152 DEBUG (ScheduledTrigger-5781-thread-1) [    ] o.a.s.c.a.NodeLostTrigger Running NodeLostTrigger: .auto_add_replicas with currently live nodes: 2 and last live nodes: 3
   [junit4]   2> 2335152 DEBUG (ScheduledTrigger-5781-thread-1) [    ] o.a.s.c.a.NodeLostTrigger Tracking lost node: 127.0.0.1:10008_solr
   [junit4]   2> 2335152 DEBUG (Simulated OverseerAutoScalingTriggerThread) [    ] o.a.s.c.a.OverseerTriggerThread -- cleaning old nodeLost / nodeAdded markers
   [junit4]   2> 2335152 DEBUG (Simulated OverseerAutoScalingTriggerThread) [    ] o.a.s.c.a.OverseerTriggerThread Current znodeVersion 3, lastZnodeVersion 3
   [junit4]   2> 2335168 DEBUG (ScheduledTrigger-5781-thread-2) [    ] o.a.s.c.a.ScheduledTriggers ++++++++ Cooldown inactive - processing event: {
   [junit4]   2>   "id":"6aa45ba81fdf9bTc2lzut84j65v63f5hcbb10hrq",
   [junit4]   2>   "source":"node_added_trigger1",
   [junit4]   2>   "eventTime":30017061100969883,
   [junit4]   2>   "eventType":"NODEADDED",
   [junit4]   2>   "properties":{
   [junit4]   2>     "eventTimes":[30017061100969883],
   [junit4]   2>     "_dequeue_time_":30017066469131283,
   [junit4]   2>     "preferredOperation":"movereplica",
   [junit4]   2>     "_enqueue_time_":30017062967242033,
   [junit4]   2>     "nodeNames":["127.0.0.1:10009_solr"],
   [junit4]   2>     "replaying":true}}
   [junit4]   2> 2335171 DEBUG (ScheduledTrigger-5781-thread-2) [    ] o.a.s.c.a.ScheduledTriggers Pausing all triggers: [.auto_add_replicas, node_added_trigger1]
   [junit4]   2> 2335171 DEBUG (ScheduledTrigger-5781-thread-2) [    ] o.a.s.c.a.SystemLogListener Collection .system missing, skip sending event {
   [junit4]   2>   "id":"6aa45ba81fdf9bTc2lzut84j65v63f5hcbb10hrq",
   [junit4]   2>   "source":"node_added_trigger1",
   [junit4]   2>   "eventTime":30017061100969883,
   [junit4]   2>   "eventType":"NODEADDED",
   [junit4]   2>   "properties":{
   [junit4]   2>     "eventTimes":[30017061100969883],
   [junit4]   2>     "_dequeue_time_":30017066469131283,
   [junit4]   2>     "preferredOperation":"movereplica",
   [junit4]   2>     "_enqueue_time_":30017062967242033,
   [junit4]   2>     "nodeNames":["127.0.0.1:10009_solr"],
   [junit4]   2>     "replaying":true}}
   [junit4]   2> 2335191 DEBUG (ScheduledTrigger-5781-thread-2) [    ] o.a.s.c.a.NodeAddedTrigger Running NodeAddedTrigger node_added_trigger1
   [junit4]   2> 2335191 DEBUG (AutoscalingActionExecutor-5782-thread-1) [    ] o.a.s.c.a.ScheduledTriggers -- processing actions for {
   [junit4]   2>   "id":"6aa45ba81fdf9bTc2lzut84j65v63f5hcbb10hrq",
   [junit4]   2>   "source":"node_added_trigger1",
   [junit4]   2>   "eventTime":30017061100969883,
   [junit4]   2>   "eventType":"NODEADDED",
   [junit4]   2>   "properties":{
   [junit4]   2>     "eventTimes":[30017061100969883],
   [junit4]   2>     "_dequeue_time_":30017066469131283,
   [junit4]   2>     "preferredOperation":"movereplica",
   [junit4]   2>     "_enqueue_time_":30017062967242033,
   [junit4]   2>     "nodeNames":["127.0.0.1:10009_solr"],
   [junit4]   2>     "replaying":true}}
   [junit4]   2> 2335191 DEBUG (ScheduledTrigger-5781-thread-2) [    ] o.a.s.c.a.NodeAddedTrigger Found livenodes: 2
   [junit4]   2> 2335191 INFO  (AutoscalingActionExecutor-5782-thread-1) [    ] o.a.s.c.a.s.TestSimTriggerIntegration -- event: {
   [junit4]   2>   "id":"6aa45ba81fdf9bTc2lzut84j65v63f5hcbb10hrq",
   [junit4]   2>   "source":"node_added_trigger1",
   [junit4]   2>   "eventTime":30017061100969883,
   [junit4]   2>   "eventType":"NODEADDED",
   [junit4]   2>   "properties":{
   [junit4]   2>     "eventTimes":[30017061100969883],
   [junit4]   2>     "_dequeue_time_":30017066469131283,
   [junit4]   2>     "preferredOperation":"movereplica",
   [junit4]   2>     "_enqueue_time_":30017062967242033,
   [junit4]   2>     "nodeNames":["127.0.0.1:10009_solr"],
   [junit4]   2>     "replaying":true}}
   [junit4]   2> 2335193 DEBUG (AutoscalingActionExecutor-5782-thread-1) [    ] o.a.s.c.a.SystemLogListener Collection .system missing, skip sending event {
   [junit4]   2>   "id":"6aa45ba81fdf9bTc2lzut84j65v63f5hcbb10hrq",
   [junit4]   2>   "source":"node_added_trigger1",
   [junit4]   2>   "eventTime":30017061100969883,
   [junit4]   2>   "eventType":"NODEADDED",
   [junit4]   2>   "properties":{
   [junit4]   2>     "eventTimes":[30017061100969883],
   [junit4]   2>     "_dequeue_time_":30017066469131283,
   [junit4]   2>     "preferredOperation":"movereplica",
   [junit4]   2>     "_enqueue_time_":30017062967242033,
   [junit4]   2>     "nodeNames":["127.0.0.1:10009_solr"],
   [junit4]   2>     "replaying":true}}
   [junit4]   2> 2335193 DEBUG (AutoscalingActionExecutor-5782-thread-1) [    ] o.a.s.c.a.ScheduledTriggers Resuming trigger: .auto_add_replicas after 100ms
   [junit4]   2> 2335211 DEBUG (AutoscalingActionExecutor-5782-thread-1) [    ] o.a.s.c.a.ScheduledTriggers Resuming trigger: node_added_trigger1 after 100ms
   [junit4]   2> 2335211 DEBUG (AutoscalingActionExecutor-5782-thread-1) [    ] o.a.s.c.a.ScheduledTriggers -- processing took 1008 ms for event id=6aa45ba81fdf9bTc2lzut84j65v63f5hcbb10hrq
   [junit4]   2> 2335237 DEBUG (TEST-TestSimTriggerIntegration.testEventQueue-seed#[701375370C0E791F]) [    ] o.a.s.c.a.ScheduledTriggers Shutting down scheduled thread pool executor now
   [junit4]   2> 2335237 DEBUG (TEST-TestSimTriggerIntegration.testEventQueue-seed#[701375370C0E791F]) [    ] o.a.s.c.a.ScheduledTriggers Shutting down action executor now
   [junit4]   2> 2335237 DEBUG (TEST-TestSimTriggerIntegration.testEventQueue-seed#[701375370C0E791F]) [    ] o.a.s.c.a.ScheduledTriggers Awaiting termination for action executor
   [junit4]   2> 2335237 INFO  (Simulated OverseerAutoScalingTriggerThread) [    ] o.a.s.c.a.OverseerTriggerThread OverseerTriggerThread woken up but we are closed, exiting.
   [junit4]   2> 2335244 DEBUG (TEST-TestSimTriggerIntegration.testEventQueue-seed#[701375370C0E791F]) [    ] o.a.s.c.a.ScheduledTriggers Awaiting termination for scheduled thread pool executor
   [junit4]   2> 2335244 DEBUG (TEST-TestSimTriggerIntegration.testEventQueue-seed#[701375370C0E791F]) [    ] o.a.s.c.a.ScheduledTriggers ScheduledTriggers closed completely
   [junit4]   2> 2335244 DEBUG (TEST-TestSimTriggerIntegration.testEventQueue-seed#[701375370C0E791F]) [    ] o.a.s.c.a.OverseerTriggerThread OverseerTriggerThread has been closed explicitly
   [junit4]   2> 2335280 DEBUG (TEST-TestSimTriggerIntegration.testEventFromRestoredState-seed#[701375370C0E791F]) [    ] o.a.s.c.a.s.SimClusterStateProvider --- new Overseer leader: 127.0.0.1:10010_solr
   [junit4]   2> 2335297 DEBUG (Simulated OverseerAutoScalingTriggerThread) [    ] o.a.s.c.a.OverseerTriggerThread Adding .auto_add_replicas and .scheduled_maintenance triggers
   [junit4]   2> 2335297 DEBUG (Simulated OverseerAutoScalingTriggerThread) [    ] o.a.s.c.a.OverseerTriggerThread Refreshing /autoscaling.json with znode version 1
   [junit4]   2> 2335297 DEBUG (Simulated OverseerAutoScalingTriggerThread) [    ] o.a.s.c.a.OverseerTriggerThread Current znodeVersion 1, lastZnodeVersion 0
   [junit4]   2> 2335297 DEBUG (Simulated OverseerAutoScalingTriggerThread) [    ] o.a.s.c.a.OverseerTriggerThread Processed trigger updates upto znodeVersion 1
   [junit4]   2> 2335317 DEBUG (TEST-TestSimTriggerIntegration.testEventFromRestoredState-seed#[701375370C0E791F]) [    ] o.a.s.c.a.s.SimClusterStateProvider ** creating new collection states, currentVersion=0
   [junit4]   2> 2335317 DEBUG (TEST-TestSimTriggerIntegration.testEventFromRestoredState-seed#[701375370C0E791F]) [    ] o.a.s.c.a.s.SimClusterStateProvider ** saved cluster state version 0
   [junit4]   2> 2335317 INFO  (TEST-TestSimTriggerIntegration.testEventFromRestoredState-seed#[701375370C0E791F]) [    ] o.a.s.h.a.MetricsHistoryHandler No .system collection, keeping metrics history in memory.
   [junit4]   2> 2335333 DEBUG (simCloudManagerPool-5784-thread-2) [    ] o.a.s.c.a.AutoScalingHandler Verified autoscaling configuration
   [junit4]   2> 2335336 DEBUG (simCloudManagerPool-5784-thread-2) [    ] o.a.s.c.a.OverseerTriggerThread Refreshing /autoscaling.json with znode version 2
   [junit4]   2> 2335336 DEBUG (Simulated OverseerAutoScalingTriggerThread) [    ] o.a.s.c.a.NodeLostTrigger NodeLostTrigger .auto_add_replicas - Initial livenodes: [127.0.0.1:10010_solr, 127.0.0.1:10011_solr]
   [junit4]   2> 2335361 DEBUG (Simulated OverseerAutoScalingTriggerThread) [    ] o.a.s.c.a.OverseerTriggerThread -- cleaning old nodeLost / nodeAdded markers
   [junit4]   2> 2335406 DEBUG (ScheduledTrigger-5785-thread-2) [    ] o.a.s.c.a.NodeLostTrigger Running NodeLostTrigger: .auto_add_replicas with currently live nodes: 2 and last live nodes: 2
   [junit4]   2> 2335426 DEBUG (Simulated OverseerAutoScalingTriggerThread) [    ] o.a.s.c.a.OverseerTriggerThread Current znodeVersion 2, lastZnodeVersion 1
   [junit4]   2> 2335426 DEBUG (Simulated OverseerAutoScalingTriggerThread) [    ] o.a.s.c.a.OverseerTriggerThread Processed trigger updates upto znodeVersion 2
   [junit4]   2> 2335572 DEBUG (Simulated OverseerAutoScalingTriggerThread) [    ] o.a.s.c.a.OverseerTriggerThread -- cleaning old nodeLost / nodeAdded markers
   [junit4]   2> 2335572 DEBUG (Simulated OverseerAutoScalingTriggerThread) [    ] o.a.s.c.a.OverseerTriggerThread Current znodeVersion 2, lastZnodeVersion 2
   [junit4]   2> 2335573 DEBUG (ScheduledTrigger-5785-thread-1) [    ] o.a.s.c.a.NodeLostTrigger Running NodeLostTrigger: .auto_add_replicas with currently live nodes: 2 and last live nodes: 2
   [junit4]   2> 2335589 DEBUG (simCloudManagerPool-5784-thread-3) [    ] o.a.s.c.a.AutoScalingHandler Verified autoscaling configuration
   [junit4]   2> 2335589 DEBUG (simCloudManagerPool-5784-thread-3) [    ] o.a.s.c.a.OverseerTriggerThread Refreshing /autoscaling.json with znode version 3
   [junit4]   2> 2335589 DEBUG (Simulated OverseerAutoScalingTriggerThread) [    ] o.a.s.c.a.OverseerTriggerThread Processed trigger updates upto znodeVersion 3
   [junit4]   2> 2335590 INFO  (Simulated OverseerAutoScalingTriggerThread) [    ] o.a.s.c.a.s.TestSimTriggerIntegration TestTriggerAction init
   [junit4]   2> 2335590 DEBUG (Simulated OverseerAutoScalingTriggerThread) [    ] o.a.s.c.a.NodeAddedTrigger NodeAddedTrigger node_added_trigger - Initial livenodes: [127.0.0.1:10010_solr, 127.0.0.1:10011_solr]
   [junit4]   2> 2335590 DEBUG (Simulated OverseerAutoScalingTriggerThread) [    ] o.a.s.c.a.NodeAddedTrigger NodeAddedTrigger node_added_trigger instantiated with properties: {event=nodeAdded, waitFor=10, actions=[{name=test, class=org.apache.solr.cloud.autoscaling.sim.TestSimTriggerIntegration$TestTriggerAction}], enabled=true}
   [junit4]   2> 2335590 DEBUG (Simulated OverseerAutoScalingTriggerThread) [    ] o.a.s.c.a.OverseerTriggerThread -- cleaning old nodeLost / nodeAdded markers
   [junit4]   2> 2335590 DEBUG (Simulated OverseerAutoScalingTriggerThread) [    ] o.a.s.c.a.OverseerTriggerThread Current znodeVersion 3, lastZnodeVersion 3
   [junit4]   2> 2335590 DEBUG (ScheduledTrigger-5785-thread-2) [    ] o.a.s.c.a.NodeAddedTrigger Running NodeAddedTrigger node_added_trigger
   [junit4]   2> 2335590 DEBUG (ScheduledTrigger-5785-thread-2) [    ] o.a.s.c.a.NodeAddedTrigger Found livenodes: 2
   [junit4]   2> 2335605 DEBUG (TEST-TestSimTriggerIntegration.testEventFromRestoredState-seed#[701375370C0E791F]) [    ] o.a.s.c.a.s.SimClusterStateProvider -- creating marker: /autoscaling/nodeAdded/127.0.0.1:10012_solr
   [junit4]   2> 2335608 DEBUG (ScheduledTrigger-5785-thread-2) [    ] o.a.s.c.a.NodeLostTrigger Running NodeLostTrigger: .auto_add_replicas with currently live nodes: 3 and last live nodes: 2
   [junit4]   2> 2335610 DEBUG (ScheduledTrigger-5785-thread-2) [    ] o.a.s.c.a.NodeAddedTrigger Running NodeAddedTrigger node_added_trigger
   [junit4]   2> 2335610 DEBUG (ScheduledTrigger-5785-thread-2) [    ] o.a.s.c.a.NodeAddedTrigger Found livenodes: 3
   [junit4]   2> 2335610 DEBUG (ScheduledTrigger-5785-thread-2) [    ] o.a.s.c.a.NodeAddedTrigger Tracking new node: 127.0.0.1:10012_solr at time 30017089348011683
   [junit4]   2> 2335645 DEBUG (ScheduledTrigger-5785-thread-3) [    ] o.a.s.c.a.NodeLostTrigger Running NodeLostTrigger: .auto_add_replicas with currently live nodes: 3 and last live nodes: 3
   [junit4]   2> 2335646 DEBUG (ScheduledTrigger-5785-thread-4) [    ] o.a.s.c.a.NodeAddedTrigger Running NodeAddedTrigger node_added_trigger
   [junit4]   2> 2335646 DEBUG (ScheduledTrigger-5785-thread-4) [    ] o.a.s.c.a.NodeAddedTrigger Found livenodes: 3
   [junit4]   2> 2335681 DEBUG (ScheduledTrigger-5785-thread-3) [    ] o.a.s.c.a.NodeLostTrigger Running NodeLostTrigger: .auto_add_replicas with currently live nodes: 3 and last live nodes: 3
   [junit4]   2> 2335681 DEBUG (ScheduledTrigger-5785-thread-3) [    ] o.a.s.c.a.NodeAddedTrigger Running NodeAddedTrigger node_added_trigger
   [junit4]   2> 2335682 DEBUG (ScheduledTrigger-5785-thread-3) [    ] o.a.s.c.a.NodeAddedTrigger Found livenodes: 3
   [junit4]   2> 2335718 DEBUG (ScheduledTrigger-5785-thread-3) [    ] o.a.s.c.a.NodeLostTrigger Running NodeLostTrigger: .auto_add_replicas with currently live nodes: 3 and last live nodes: 3
   [junit4]   2> 2335718 DEBUG (ScheduledTrigger-5785-thread-3) [    ] o.a.s.c.a.NodeAddedTrigger Running NodeAddedTrigger node_added_trigger
   [junit4]   2> 2335718 DEBUG (ScheduledTrigger-5785-thread-3) [    ] o.a.s.c.a.NodeAddedTrigger Found livenodes: 3
   [junit4]   2> 2335754 DEBUG (ScheduledTrigger-5785-thread-3) [    ] o.a.s.c.a.NodeLostTrigger Running NodeLostTrigger: .auto_add_replicas with currently live nodes: 3 and last live nodes: 3
   [junit4]   2> 2335754 DEBUG (ScheduledTrigger-5785-thread-3) [    ] o.a.s.c.a.NodeAddedTrigger Running NodeAddedTrigger node_added_trigger
   [junit4]   2> 2335754 DEBUG (ScheduledTrigger-5785-thread-3) [    ] o.a.s.c.a.NodeAddedTrigger Found livenodes: 3
   [junit4]   2> 2335791 DEBUG (ScheduledTrigger-5785-thread-3) [    ] o.a.s.c.a.NodeLostTrigger Running NodeLostTrigger: .auto_add_replicas with currently live nodes: 3 and last live nodes: 3
   [junit4]   2> 2335791 DEBUG (ScheduledTrigger-5785-thread-3) [    ] o.a.s.c.a.NodeAddedTrigger Running NodeAddedTrigger node_added_trigger
   [junit4]   2> 2335791 DEBUG (ScheduledTrigger-5785-thread-3) [    ] o.a.s.c.a.NodeAddedTrigger Found livenodes: 3
   [junit4]   2> 2335827 DEBUG (ScheduledTrigger-5785-thread-3) [    ] o.a.s.c.a.NodeLostTrigger Running NodeLostTrigger: .auto_add_replicas with currently live nodes: 3 and last live nodes: 3
   [junit4]   2> 2335827 DEBUG (ScheduledTrigger-5785-thread-3) [    ] o.a.s.c.a.NodeAddedTrigger Running NodeAddedTrigger node_added_trigger
   [junit4]   2> 2335827 DEBUG (ScheduledTrigger-5785-thread-3) [    ] o.a.s.c.a.NodeAddedTrigger Found livenodes: 3
   [junit4]   2> 2335828 DEBUG (ScheduledTrigger-5785-thread-3) [    ] o.a.s.c.a.NodeAddedTrigger NodeAddedTrigger node_added_trigger firing registered processor for nodes: [127.0.0.1:10012_solr] added at times [30017089348011683], now=30017100226314583
   [junit4]   2> 2335828 DEBUG (ScheduledTrigger-5785-thread-3) [    ] o.a.s.c.a.ScheduledTriggers ++++++++ Cooldown inactive - processing event: {
   [junit4]   2>   "id":"6aa4623bc786a3Tc2lzut84j65v63f5hcbb10hrs",
   [junit4]   2>   "source":"node_added_trigger",
   [junit4]   2>   "eventTime":30017089348011683,
   [junit4]   2>   "eventType":"NODEADDED",
   [junit4]   2>   "properties":{
   [junit4]   2>     "eventTimes":[30017089348011683],
   [junit4]   2>     "preferredOperation":"movereplica",
   [junit4]   2>     "nodeNames":["127.0.0.1:10012_solr"]}}
   [junit4]   2> 2335828 DEBUG (ScheduledTrigger-5785-thread-3) [    ] o.a.s.c.a.ScheduledTriggers Pausing all triggers: [.auto_add_replicas, node_added_trigger]
   [junit4]   2> 2335828 DEBUG (ScheduledTrigger-5785-thread-3) [    ] o.a.s.c.a.SystemLogListener Collection .system missing, skip sending event {
   [junit4]   2>   "id":"6aa4623bc786a3Tc2lzut84j65v63f5hcbb10hrs",
   [junit4]   2>   "source":"node_added_trigger",
   [junit4]   2>   "eventTime":30017089348011683,
   [junit4]   2>   "eventType":"NODEADDED",
   [junit4]   2>   "properties":{
   [junit4]   2>     "eventTimes":[30017089348011683],
   [junit4]   2>     "preferredOperation":"movereplica",
   [junit4]   2>     "_enqueue_time_":30017100248901833,
   [junit4]   2>     "nodeNames":["127.0.0.1:10012_solr"]}}
   [junit4]   2> 2335843 DEBUG (ScheduledTrigger-5785-thread-3) [    ] o.a.s.c.a.NodeAddedTrigger Removing new node from tracking: 127.0.0.1:10012_solr
   [junit4]   2> 2335844 DEBUG (AutoscalingActionExecutor-5786-thread-1) [    ] o.a.s.c.a.ScheduledTriggers -- processing actions for {
   [junit4]   2>   "id":"6aa4623bc786a3Tc2lzut84j65v63f5hcbb10hrs",
   [junit4]   2>   "source":"node_added_trigger",
   [junit4]   2>   "eventTime":30017089348011683,
   [junit4]   2>   "eventType":"NODEADDED",
   [junit4]   2>   "properties":{
   [junit4]   2>     "eventTimes":[30017089348011683],
   [junit4]   2>     "preferredOperation":"movereplica",
   [junit4]   2>     "_enqueue_time_":30017100248901833,
   [junit4]   2>     "nodeNames":["127.0.0.1:10012_solr"]}}
   [junit4]   2> 2335844 DEBUG (TEST-TestSimTriggerIntegration.testEventFromRestoredState-seed#[701375370C0E791F]) [    ] o.a.s.c.a.s.SimClusterStateProvider -- creating marker: /autoscaling/nodeAdded/127.0.0.1:10013_solr
   [junit4]   2> 2335844 DEBUG (AutoscalingActionExecutor-5786-thread-1) [    ] o.a.s.c.a.SystemLogListener Collection .system missing, skip sending event {
   [junit4]   2>   "id":"6aa4623bc786a3Tc2lzut84j65v63f5hcbb10hrs",
   [junit4]   2>   "source":"node_added_trigger",
   [junit4]   2>   "eventTime":30017089348011683,
   [junit4]   2>   "eventType":"NODEADDED",
   [junit4]   2>   "properties":{
   [junit4]   2>     "eventTimes":[30017089348011683],
   [junit4]   2>     "preferredOperation":"movereplica",
   [junit4]   2>     "_enqueue_time_":30017100248901833,
   [junit4]   2>     "nodeNames":["127.0.0.1:10012_solr"]}}
   [junit4]   2> 2335844 DEBUG (AutoscalingActionExecutor-5786-thread-1) [    ] o.a.s.c.a.ScheduledTriggers Resuming trigger: node_added_trigger after 100ms
   [junit4]   2> 2335844 DEBUG (AutoscalingActionExecutor-5786-thread-1) [    ] o.a.s.c.a.ScheduledTriggers Resuming trigger: .auto_add_replicas after 100ms
   [junit4]   2> 2335844 DEBUG (AutoscalingActionExecutor-5786-thread-1) [    ] o.a.s.c.a.ScheduledTriggers -- processing took 32 ms for event id=6aa4623bc786a3Tc2lzut84j65v63f5hcbb10hrs
   [junit4]   2> 2335953 DEBUG (ScheduledTrigger-5785-thread-1) [    ] o.a.s.c.a.NodeAddedTrigger Running NodeAddedTrigger node_added_trigger
   [junit4]   2> 2335953 DEBUG (ScheduledTrigger-5785-thread-1) [    ] o.a.s.c.a.NodeAddedTrigger Found livenodes: 4
   [junit4]   2> 2335953 DEBUG (ScheduledTrigger-5785-thread-1) [    ] o.a.s.c.a.NodeAddedTrigger Tracking new node: 127.0.0.1:10013_solr at time 30017106488483983
   [junit4]   2> 2335953 DEBUG (ScheduledTrigger-5785-thread-1) [    ] o.a.s.c.a.NodeLostTrigger Running NodeLostTrigger: .auto_add_replicas with currently live nodes: 4 and last live nodes: 3
   [junit4]   2> 2335973 DEBUG (ScheduledTrigger-5785-thread-1) [    ] o.a.s.c.a.NodeAddedTrigger Running NodeAddedTrigger node_added_trigger
   [junit4]   2> 2335973 DEBUG (ScheduledTrigger-5785-thread-1) [    ] o.a.s.c.a.NodeAddedTrigger Found livenodes: 4
   [junit4]   2> 2335973 DEBUG (ScheduledTrigger-5785-thread-1) [    ] o.a.s.c.a.NodeLostTrigger Running NodeLostTrigger: .auto_add_replicas with currently live nodes: 4 and last live nodes: 4
   [junit4]   2> 2336006 DEBUG (ScheduledTrigger-5785-thread-1) [    ] o.a.s.c.a.NodeAddedTrigger Running NodeAddedTrigger node_added_trigger
   [junit4]   2> 2336006 DEBUG (ScheduledTrigger-5785-thread-1) [    ] o.a.s.c.a.NodeAddedTrigger Found livenodes: 4
   [junit4]   2> 2336006 DEBUG (ScheduledTrigger-5785-thread-1) [    ] o.a.s.c.a.NodeLostTrigger Running NodeLostTrigger: .auto_add_replicas with currently live nodes: 4 and last live nodes: 4
   [junit4]   2> 2336026 DEBUG (ScheduledTrigger-5785-thread-1) [    ] o.a.s.c.a.NodeAddedTrigger Running NodeAddedTrigger node_added_trigger
   [junit4]   2> 2336026 DEBUG (ScheduledTrigger-5785-thread-1) [    ] o.a.s.c.a.NodeAddedTrigger Found livenodes: 4
   [junit4]   2> 2336026 DEBUG (ScheduledTrigger-5785-thread-1) [    ] o.a.s.c.a.NodeLostTrigger Running NodeLostTrigger: .auto_add_replicas with currently live nodes: 4 and last live nodes: 4
   [junit4]   2> 2336046 INFO  (TEST-TestSimTriggerIntegration.testEventFromRestoredState-seed#[701375370C0E791F]) [    ] o.a.s.c.a.s.SimCloudManager === Restarting OverseerTriggerThread and clearing object cache...
   [junit4]   2> 2336046 DEBUG (TEST-TestSimTriggerIntegration.testEventFromRestoredState-seed#[701375370C0E791F]) [    ] o.a.s.c.a.ScheduledTriggers Shutting down scheduled thread pool executor now
   [junit4]   2> 2336046 DEBUG (TEST-TestSimTriggerIntegration.testEventFromRestoredState-seed#[701375370C0E791F]) [    ] o.a.s.c.a.ScheduledTriggers Shutting down action executor now
   [junit4]   2> 2336046 DEBUG (TEST-TestSimTriggerIntegration.testEventFromRestoredState-seed#[701375370C0E791F]) [    ] o.a.s.c.a.ScheduledTriggers Awaiting termination for action executor
   [junit4]   2> 2336046 INFO  (Simulated OverseerAutoScalingTriggerThread) [    ] o.a.s.c.a.OverseerTriggerThread OverseerTriggerThread woken up but we are closed, exiting.
   [junit4]   2> 2336047 DEBUG (TEST-TestSimTriggerIntegration.testEventFromRestoredState-seed#[701375370C0E791F]) [    ] o.a.s.c.a.ScheduledTriggers Awaiting termination for scheduled thread pool executor
   [junit4]   2> 2336047 DEBUG (TEST-TestSimTriggerIntegration.testEventFromRestoredState-seed#[701375370C0E791F]) [    ] o.a.s.c.a.ScheduledTriggers ScheduledTriggers closed completely
   [junit4]   2> 2336047 DEBUG (TEST-TestSimTriggerIntegration.testEventFromRestoredState-seed#[701375370C0E791F]) [    ] o.a.s.c.a.OverseerTriggerThread OverseerTriggerThread has been closed explicitly
   [junit4]   2> 2336063 DEBUG (Simulated OverseerAutoScalingTriggerThread) [    ] o.a.s.c.a.OverseerTriggerThread Refreshing /autoscaling.json with znode version 3
   [junit4]   2> 2336063 DEBUG (Simulated OverseerAutoScalingTriggerThread) [    ] o.a.s.c.a.OverseerTriggerThread Current znodeVersion 3, lastZnodeVersion 0
   [junit4]   2> 2336063 DEBUG (Simulated OverseerAutoScalingTriggerThread) [    ] o.a.s.c.a.OverseerTriggerThread Processed trigger updates upto znodeVersion 3
   [junit4]   2> 2336063 DEBUG (Simulated OverseerAutoScalingTriggerThread) [    ] o.a.s.c.a.NodeLostTrigger NodeLostTrigger .auto_add_replicas - Initial livenodes: [127.0.0.1:10010_solr, 127.0.0.1:10013_solr, 127.0.0.1:10012_solr, 127.0.0.1:10011_solr]
   [junit4]   2> 2336063 INFO  (Simulated OverseerAutoScalingTriggerThread) [    ] o.a.s.c.a.s.TestSimTriggerIntegration TestTriggerAction init
   [junit4]   2> 2336063 DEBUG (Simulated OverseerAutoScalingTriggerThread) [    ] o.a.s.c.a.NodeAddedTrigger NodeAddedTrigger node_added_trigger - Initial livenodes: [127.0.0.1:10010_solr, 127.0.0.1:10013_solr, 127.0.0.1:10012_solr, 127.0.0.1:10011_solr]
   [junit4]   2> 2336063 DEBUG (Simulated OverseerAutoScalingTriggerThread) [    ] o.a.s.c.a.NodeAddedTrigger NodeAddedTrigger node_added_trigger instantiated with properties: {event=nodeAdded, waitFor=10, actions=[{name=test, class=org.apache.solr.cloud.autoscaling.sim.TestSimTriggerIntegration$TestTriggerAction}], enabled=true}
   [junit4]   2> 2336063 DEBUG (Simulated OverseerAutoScalingTriggerThread) [    ] o.a.s.c.a.NodeAddedTrigger Adding node from marker path: 127.0.0.1:10012_solr
   [junit4]   2> 2336063 DEBUG (Simulated OverseerAutoScalingTriggerThread) [    ] o.a.s.c.a.NodeAddedTrigger Adding node from marker path: 127.0.0.1:10013_solr
   [junit4]   2> 2336063 DEBUG (ScheduledTrigger-5790-thread-1) [    ] o.a.s.c.a.NodeLostTrigger Running NodeLostTrigger: .auto_add_replicas with currently live nodes: 4 and last live nodes: 4
   [junit4]   2> 2336064 DEBUG (Simulated OverseerAutoScalingTriggerThread) [    ] o.a.s.c.a.OverseerTriggerThread -- cleaning old nodeLost / nodeAdded markers
   [junit4]   2> 2336064 DEBUG (Simulated OverseerAutoScalingTriggerThread) [    ] o.a.s.c.a.OverseerTriggerThread Current znodeVersion 3, lastZnodeVersion 3
   [junit4]   2> 2336064 DEBUG (ScheduledTrigger-5790-thread-2) [    ] o.a.s.c.a.NodeAddedTrigger Running NodeAddedTrigger node_added_trigger
   [junit4]   2> 2336064 DEBUG (ScheduledTrigger-5790-thread-2) [    ] o.a.s.c.a.NodeAddedTrigger Found livenodes: 4
   [junit4]   2> 2336084 DEBUG (ScheduledTrigger-5790-thread-1) [    ] o.a.s.c.a.NodeLostTrigger Running NodeLostTrigger: .auto_add_replicas with currently live nodes: 4 and last live nodes: 4
   [junit4]   2> 2336084 DEBUG (ScheduledTrigger-5790-thread-1) [    ] o.a.s.c.a.NodeAddedTrigger Running NodeAddedTrigger node_added_trigger
   [junit4]   2> 2336084 DEBUG (ScheduledTrigger-5790-thread-1) [    ] o.a.s.c.a.NodeAddedTrigger Found livenodes: 4
   [junit4]   2> 2336119 DEBUG (ScheduledTrigger-5790-thread-4) [    ] o.a.s.c.a.NodeAddedTrigger Running NodeAddedTrigger node_added_trigger
   [junit4]   2> 2336119 DEBUG (ScheduledTrigger-5790-thread-4) [    ] o.a.s.c.a.NodeAddedTrigger Found livenodes: 4
   [junit4]   2> 2336120 DEBUG (ScheduledTrigger-5790-thread-2) [    ] o.a.s.c.a.NodeLostTrigger Running NodeLostTrigger: .auto_add_replicas with currently live nodes: 4 and last live nodes: 4
   [junit4]   2> 2336155 DEBUG (ScheduledTrigger-5790-thread-4) [    ] o.a.s.c.a.NodeAddedTrigger Running NodeAddedTrigger node_added_trigger
   [junit4]   2> 2336155 DEBUG (ScheduledTrigger-5790-thread-4) [    ] o.a.s.c.a.NodeAddedTrigger Found livenodes: 4
   [junit4]   2> 2336156 DEBUG (ScheduledTrigger-5790-thread-1) [    ] o.a.s.c.a.NodeLostTrigger Running NodeLostTrigger: .auto_add_replicas with currently live nodes: 4 and last live nodes: 4
   [junit4]   2> 2336156 DEBUG (ScheduledTrigger-5790-thread-4) [    ] o.a.s.c.a.NodeAddedTrigger NodeAddedTrigger node_added_trigger firing registered processor for nodes: [127.0.0.1:10013_solr] added at times [30017106488483983], now=30017116620083133
   [junit4]   2> 2336156 DEBUG (ScheduledTrigger-5790-thread-4) [    ] o.a.s.c.a.ScheduledTriggers ++++++++ Cooldown inactive - processing event: {
   [junit4]   2>   "id":"6aa466396e608fTc2lzut84j65v63f5hcbb10hrt",
   [junit4]   2>   "source":"node_added_trigger",
   [junit4]   2>   "eventTime":30017106488483983,
   [junit4]   2>   "eventType":"NODEADDED",
   [junit4]   2>   "properties":{
   [junit4]   2>     "eventTimes":[30017106488483983],
   [junit4]   2>     "preferredOperation":"movereplica",
   [junit4]   2>     "nodeNames":["127.0.0.1:10013_solr"]}}
   [junit4]   2> 2336156 DEBUG (ScheduledTrigger-5790-thread-4) [    ] o.a.s.c.a.ScheduledTriggers Pausing all triggers: [.auto_add_replicas, node_added_trigger]
   [junit4]   2> 2336156 DEBUG (ScheduledTrigger-5790-thread-4) [    ] o.a.s.c.a.SystemLogListener Collection .system missing, skip sending event {
   [junit4]   2>   "id":"6aa466396e608fTc2lzut84j65v63f5hcbb10hrt",
   [junit4]   2>   "source":"node_added_trigger",
   [junit4]   2>   "eventTime":30017106488483983,
   [junit4]   2>   "eventType":"NODEADDED",
   [junit4]   2>   "properties":{
   [junit4]   2>     "eventTimes":[30017106488483983],
   [junit4]   2>     "preferredOperation":"movereplica",
   [junit4]   2>     "_enqueue_time_":30017116641888133,
   [junit4]   2>     "nodeNames":["127.0.0.1:10013_solr"]}}
   [junit4]   2> 2336156 DEBUG (ScheduledTrigger-5790-thread-4) [    ] o.a.s.c.a.NodeAddedTrigger Removing new node from tracking: 127.0.0.1:10013_solr
   [junit4]   2> 2336157 DEBUG (AutoscalingActionExecutor-5791-thread-1) [    ] o.a.s.c.a.ScheduledTriggers -- processing actions for {
   [junit4]   2>   "id":"6aa466396e608fTc2lzut84j65v63f5hcbb10hrt",
   [junit4]   2>   "source":"node_added_trigger",
   [junit4]   2>   "eventTime":30017106488483983,
   [junit4]   2>   "eventType":"NODEADDED",
   [junit4]   2>   "properties":{
   [junit4]   2>     "eventTimes

[...truncated too long message...]

vy-fail-disallowed-ivy-version:

ivy-fail:

ivy-fail:

ivy-configure:
[ivy:configure] :: loading settings :: file = /home/jenkins/jenkins-slave/workspace/Lucene-Solr-Tests-8.x/lucene/top-level-ivy-settings.xml

resolve:

ivy-availability-check:
[loadresource] Do not set property disallowed.ivy.jars.list as its length is 0.

-ivy-fail-disallowed-ivy-version:

ivy-fail:

ivy-configure:
[ivy:configure] :: loading settings :: file = /home/jenkins/jenkins-slave/workspace/Lucene-Solr-Tests-8.x/lucene/top-level-ivy-settings.xml

resolve:

ivy-availability-check:
[loadresource] Do not set property disallowed.ivy.jars.list as its length is 0.

-ivy-fail-disallowed-ivy-version:

ivy-fail:

ivy-fail:

ivy-configure:
[ivy:configure] :: loading settings :: file = /home/jenkins/jenkins-slave/workspace/Lucene-Solr-Tests-8.x/lucene/top-level-ivy-settings.xml

resolve:

ivy-availability-check:
[loadresource] Do not set property disallowed.ivy.jars.list as its length is 0.

-ivy-fail-disallowed-ivy-version:

ivy-fail:

ivy-configure:
[ivy:configure] :: loading settings :: file = /home/jenkins/jenkins-slave/workspace/Lucene-Solr-Tests-8.x/lucene/top-level-ivy-settings.xml

resolve:

ivy-availability-check:
[loadresource] Do not set property disallowed.ivy.jars.list as its length is 0.

-ivy-fail-disallowed-ivy-version:

ivy-fail:

ivy-fail:

ivy-configure:
[ivy:configure] :: loading settings :: file = /home/jenkins/jenkins-slave/workspace/Lucene-Solr-Tests-8.x/lucene/top-level-ivy-settings.xml

resolve:

ivy-availability-check:
[loadresource] Do not set property disallowed.ivy.jars.list as its length is 0.

-ivy-fail-disallowed-ivy-version:

ivy-fail:

ivy-fail:

ivy-configure:
[ivy:configure] :: loading settings :: file = /home/jenkins/jenkins-slave/workspace/Lucene-Solr-Tests-8.x/lucene/top-level-ivy-settings.xml

resolve:

ivy-availability-check:
[loadresource] Do not set property disallowed.ivy.jars.list as its length is 0.

-ivy-fail-disallowed-ivy-version:

ivy-fail:

ivy-fail:

ivy-configure:
[ivy:configure] :: loading settings :: file = /home/jenkins/jenkins-slave/workspace/Lucene-Solr-Tests-8.x/lucene/top-level-ivy-settings.xml

resolve:

ivy-availability-check:
[loadresource] Do not set property disallowed.ivy.jars.list as its length is 0.

-ivy-fail-disallowed-ivy-version:

ivy-fail:

ivy-fail:

ivy-configure:
[ivy:configure] :: loading settings :: file = /home/jenkins/jenkins-slave/workspace/Lucene-Solr-Tests-8.x/lucene/top-level-ivy-settings.xml

resolve:

ivy-availability-check:
[loadresource] Do not set property disallowed.ivy.jars.list as its length is 0.

-ivy-fail-disallowed-ivy-version:

ivy-fail:

ivy-fail:

ivy-configure:
[ivy:configure] :: loading settings :: file = /home/jenkins/jenkins-slave/workspace/Lucene-Solr-Tests-8.x/lucene/top-level-ivy-settings.xml

resolve:

ivy-availability-check:
[loadresource] Do not set property disallowed.ivy.jars.list as its length is 0.

-ivy-fail-disallowed-ivy-version:

ivy-fail:

ivy-fail:

ivy-configure:
[ivy:configure] :: loading settings :: file = /home/jenkins/jenkins-slave/workspace/Lucene-Solr-Tests-8.x/lucene/top-level-ivy-settings.xml

resolve:

ivy-availability-check:
[loadresource] Do not set property disallowed.ivy.jars.list as its length is 0.

-ivy-fail-disallowed-ivy-version:

ivy-fail:

ivy-fail:

ivy-configure:
[ivy:configure] :: loading settings :: file = /home/jenkins/jenkins-slave/workspace/Lucene-Solr-Tests-8.x/lucene/top-level-ivy-settings.xml

resolve:

ivy-availability-check:
[loadresource] Do not set property disallowed.ivy.jars.list as its length is 0.

-ivy-fail-disallowed-ivy-version:

ivy-fail:

ivy-fail:

ivy-configure:
[ivy:configure] :: loading settings :: file = /home/jenkins/jenkins-slave/workspace/Lucene-Solr-Tests-8.x/lucene/top-level-ivy-settings.xml

resolve:

ivy-availability-check:
[loadresource] Do not set property disallowed.ivy.jars.list as its length is 0.

-ivy-fail-disallowed-ivy-version:

ivy-fail:

ivy-fail:

ivy-configure:
[ivy:configure] :: loading settings :: file = /home/jenkins/jenkins-slave/workspace/Lucene-Solr-Tests-8.x/lucene/top-level-ivy-settings.xml

resolve:

ivy-availability-check:
[loadresource] Do not set property disallowed.ivy.jars.list as its length is 0.

-ivy-fail-disallowed-ivy-version:

ivy-fail:

ivy-fail:

ivy-configure:
[ivy:configure] :: loading settings :: file = /home/jenkins/jenkins-slave/workspace/Lucene-Solr-Tests-8.x/lucene/top-level-ivy-settings.xml

resolve:

jar-checksums:
    [mkdir] Created dir: /home/jenkins/jenkins-slave/workspace/Lucene-Solr-Tests-8.x/solr/null1916570164
     [copy] Copying 256 files to /home/jenkins/jenkins-slave/workspace/Lucene-Solr-Tests-8.x/solr/null1916570164
   [delete] Deleting directory /home/jenkins/jenkins-slave/workspace/Lucene-Solr-Tests-8.x/solr/null1916570164

check-working-copy:
[ivy:cachepath] :: resolving dependencies :: org.eclipse.jgit#org.eclipse.jgit-caller;working
[ivy:cachepath] 	confs: [default]
[ivy:cachepath] 	found org.eclipse.jgit#org.eclipse.jgit;4.6.0.201612231935-r in public
[ivy:cachepath] 	found com.jcraft#jsch;0.1.53 in public
[ivy:cachepath] 	found com.googlecode.javaewah#JavaEWAH;1.1.6 in public
[ivy:cachepath] 	found org.apache.httpcomponents#httpclient;4.3.6 in public
[ivy:cachepath] 	found org.apache.httpcomponents#httpcore;4.3.3 in public
[ivy:cachepath] 	found commons-logging#commons-logging;1.1.3 in public
[ivy:cachepath] 	found commons-codec#commons-codec;1.6 in public
[ivy:cachepath] 	found org.slf4j#slf4j-api;1.7.2 in public
[ivy:cachepath] :: resolution report :: resolve 87ms :: artifacts dl 28ms
	---------------------------------------------------------------------
	|                  |            modules            ||   artifacts   |
	|       conf       | number| search|dwnlded|evicted|| number|dwnlded|
	---------------------------------------------------------------------
	|      default     |   8   |   0   |   0   |   0   ||   8   |   0   |
	---------------------------------------------------------------------
[wc-checker] Initializing working copy...
[wc-checker] SLF4J: Failed to load class "org.slf4j.impl.StaticLoggerBinder".
[wc-checker] SLF4J: Defaulting to no-operation (NOP) logger implementation
[wc-checker] SLF4J: See http://www.slf4j.org/codes.html#StaticLoggerBinder for further details.
[wc-checker] Checking working copy status...

-jenkins-base:

BUILD SUCCESSFUL
Total time: 217 minutes 47 seconds
Archiving artifacts
java.lang.InterruptedException: no matches found within 10000
	at hudson.FilePath$ValidateAntFileMask.hasMatch(FilePath.java:2847)
	at hudson.FilePath$ValidateAntFileMask.invoke(FilePath.java:2726)
	at hudson.FilePath$ValidateAntFileMask.invoke(FilePath.java:2707)
	at hudson.FilePath$FileCallableWrapper.call(FilePath.java:3086)
Also:   hudson.remoting.Channel$CallSiteStackTrace: Remote call to lucene2
		at hudson.remoting.Channel.attachCallSiteStackTrace(Channel.java:1741)
		at hudson.remoting.UserRequest$ExceptionResponse.retrieve(UserRequest.java:357)
		at hudson.remoting.Channel.call(Channel.java:955)
		at hudson.FilePath.act(FilePath.java:1072)
		at hudson.FilePath.act(FilePath.java:1061)
		at hudson.FilePath.validateAntFileMask(FilePath.java:2705)
		at hudson.tasks.ArtifactArchiver.perform(ArtifactArchiver.java:243)
		at hudson.tasks.BuildStepCompatibilityLayer.perform(BuildStepCompatibilityLayer.java:81)
		at hudson.tasks.BuildStepMonitor$1.perform(BuildStepMonitor.java:20)
		at hudson.model.AbstractBuild$AbstractBuildExecution.perform(AbstractBuild.java:744)
		at hudson.model.AbstractBuild$AbstractBuildExecution.performAllBuildSteps(AbstractBuild.java:690)
		at hudson.model.Build$BuildExecution.post2(Build.java:186)
		at hudson.model.AbstractBuild$AbstractBuildExecution.post(AbstractBuild.java:635)
		at hudson.model.Run.execute(Run.java:1835)
		at hudson.model.FreeStyleBuild.run(FreeStyleBuild.java:43)
		at hudson.model.ResourceController.execute(ResourceController.java:97)
		at hudson.model.Executor.run(Executor.java:429)
Caused: hudson.FilePath$TunneledInterruptedException
	at hudson.FilePath$FileCallableWrapper.call(FilePath.java:3088)
	at hudson.remoting.UserRequest.perform(UserRequest.java:212)
	at hudson.remoting.UserRequest.perform(UserRequest.java:54)
	at hudson.remoting.Request$2.run(Request.java:369)
	at hudson.remoting.InterceptingExecutorService$1.call(InterceptingExecutorService.java:72)
	at java.util.concurrent.FutureTask.run(FutureTask.java:266)
	at java.util.concurrent.ThreadPoolExecutor.runWorker(ThreadPoolExecutor.java:1142)
	at java.util.concurrent.ThreadPoolExecutor$Worker.run(ThreadPoolExecutor.java:617)
	at java.lang.Thread.run(Thread.java:748)
Caused: java.lang.InterruptedException: java.lang.InterruptedException: no matches found within 10000
	at hudson.FilePath.act(FilePath.java:1074)
	at hudson.FilePath.act(FilePath.java:1061)
	at hudson.FilePath.validateAntFileMask(FilePath.java:2705)
	at hudson.tasks.ArtifactArchiver.perform(ArtifactArchiver.java:243)
	at hudson.tasks.BuildStepCompatibilityLayer.perform(BuildStepCompatibilityLayer.java:81)
	at hudson.tasks.BuildStepMonitor$1.perform(BuildStepMonitor.java:20)
	at hudson.model.AbstractBuild$AbstractBuildExecution.perform(AbstractBuild.java:744)
	at hudson.model.AbstractBuild$AbstractBuildExecution.performAllBuildSteps(AbstractBuild.java:690)
	at hudson.model.Build$BuildExecution.post2(Build.java:186)
	at hudson.model.AbstractBuild$AbstractBuildExecution.post(AbstractBuild.java:635)
	at hudson.model.Run.execute(Run.java:1835)
	at hudson.model.FreeStyleBuild.run(FreeStyleBuild.java:43)
	at hudson.model.ResourceController.execute(ResourceController.java:97)
	at hudson.model.Executor.run(Executor.java:429)
No artifacts found that match the file pattern "**/*.events,heapdumps/**,**/hs_err_pid*". Configuration error?
Recording test results
Build step 'Publish JUnit test result report' changed build result to UNSTABLE
Email was triggered for: Unstable (Test Failures)
Sending email for trigger: Unstable (Test Failures)

Mime
View raw message