lucene-dev mailing list archives

Site index · List index
Message view « Date » · « Thread »
Top « Date » · « Thread »
From Policeman Jenkins Server <jenk...@thetaphi.de>
Subject [JENKINS] Lucene-Solr-master-Solaris (64bit/jdk1.8.0) - Build # 2260 - Unstable!
Date Tue, 15 Jan 2019 14:38:08 GMT
Build: https://jenkins.thetaphi.de/job/Lucene-Solr-master-Solaris/2260/
Java: 64bit/jdk1.8.0 -XX:-UseCompressedOops -XX:+UseSerialGC

3 tests failed.
FAILED:  junit.framework.TestSuite.org.apache.solr.client.solrj.request.json.DirectJsonQueryRequestFacetingIntegrationTest

Error Message:
Error starting up MiniSolrCloudCluster

Stack Trace:
java.lang.Exception: Error starting up MiniSolrCloudCluster
	at __randomizedtesting.SeedInfo.seed([B62EE87E71D19AAC]:0)
	at org.apache.solr.cloud.MiniSolrCloudCluster.checkForExceptions(MiniSolrCloudCluster.java:619)
	at org.apache.solr.cloud.MiniSolrCloudCluster.<init>(MiniSolrCloudCluster.java:275)
	at org.apache.solr.cloud.SolrCloudTestCase$Builder.build(SolrCloudTestCase.java:206)
	at org.apache.solr.cloud.SolrCloudTestCase$Builder.configure(SolrCloudTestCase.java:198)
	at org.apache.solr.client.solrj.request.json.DirectJsonQueryRequestFacetingIntegrationTest.setupCluster(DirectJsonQueryRequestFacetingIntegrationTest.java:54)
	at sun.reflect.NativeMethodAccessorImpl.invoke0(Native Method)
	at sun.reflect.NativeMethodAccessorImpl.invoke(NativeMethodAccessorImpl.java:62)
	at sun.reflect.DelegatingMethodAccessorImpl.invoke(DelegatingMethodAccessorImpl.java:43)
	at java.lang.reflect.Method.invoke(Method.java:498)
	at com.carrotsearch.randomizedtesting.RandomizedRunner.invoke(RandomizedRunner.java:1750)
	at com.carrotsearch.randomizedtesting.RandomizedRunner$6.evaluate(RandomizedRunner.java:878)
	at com.carrotsearch.randomizedtesting.RandomizedRunner$7.evaluate(RandomizedRunner.java:894)
	at com.carrotsearch.randomizedtesting.rules.StatementAdapter.evaluate(StatementAdapter.java:36)
	at com.carrotsearch.randomizedtesting.rules.SystemPropertiesRestoreRule$1.evaluate(SystemPropertiesRestoreRule.java:57)
	at org.apache.lucene.util.AbstractBeforeAfterRule$1.evaluate(AbstractBeforeAfterRule.java:45)
	at com.carrotsearch.randomizedtesting.rules.StatementAdapter.evaluate(StatementAdapter.java:36)
	at org.apache.lucene.util.TestRuleStoreClassName$1.evaluate(TestRuleStoreClassName.java:41)
	at com.carrotsearch.randomizedtesting.rules.NoShadowingOrOverridesOnMethodsRule$1.evaluate(NoShadowingOrOverridesOnMethodsRule.java:40)
	at com.carrotsearch.randomizedtesting.rules.NoShadowingOrOverridesOnMethodsRule$1.evaluate(NoShadowingOrOverridesOnMethodsRule.java:40)
	at com.carrotsearch.randomizedtesting.rules.StatementAdapter.evaluate(StatementAdapter.java:36)
	at com.carrotsearch.randomizedtesting.rules.StatementAdapter.evaluate(StatementAdapter.java:36)
	at com.carrotsearch.randomizedtesting.rules.StatementAdapter.evaluate(StatementAdapter.java:36)
	at org.apache.lucene.util.TestRuleAssertionsRequired$1.evaluate(TestRuleAssertionsRequired.java:53)
	at org.apache.lucene.util.TestRuleMarkFailure$1.evaluate(TestRuleMarkFailure.java:47)
	at org.apache.lucene.util.TestRuleIgnoreAfterMaxFailures$1.evaluate(TestRuleIgnoreAfterMaxFailures.java:64)
	at org.apache.lucene.util.TestRuleIgnoreTestSuites$1.evaluate(TestRuleIgnoreTestSuites.java:54)
	at com.carrotsearch.randomizedtesting.rules.StatementAdapter.evaluate(StatementAdapter.java:36)
	at com.carrotsearch.randomizedtesting.ThreadLeakControl$StatementRunner.run(ThreadLeakControl.java:368)
	at java.lang.Thread.run(Thread.java:748)
	Suppressed: java.lang.RuntimeException: Jetty/Solr unresponsive
		at org.apache.solr.client.solrj.embedded.JettySolrRunner.start(JettySolrRunner.java:493)
		at org.apache.solr.client.solrj.embedded.JettySolrRunner.start(JettySolrRunner.java:451)
		at org.apache.solr.cloud.MiniSolrCloudCluster.startJettySolrRunner(MiniSolrCloudCluster.java:434)
		at org.apache.solr.cloud.MiniSolrCloudCluster.lambda$new$0(MiniSolrCloudCluster.java:269)
		at java.util.concurrent.FutureTask.run(FutureTask.java:266)
		at org.apache.solr.common.util.ExecutorUtil$MDCAwareThreadPoolExecutor.lambda$execute$0(ExecutorUtil.java:209)
		at java.util.concurrent.ThreadPoolExecutor.runWorker(ThreadPoolExecutor.java:1149)
		at java.util.concurrent.ThreadPoolExecutor$Worker.run(ThreadPoolExecutor.java:624)
		... 1 more


FAILED:  junit.framework.TestSuite.org.apache.solr.client.solrj.request.json.DirectJsonQueryRequestFacetingIntegrationTest

Error Message:
10 threads leaked from SUITE scope at org.apache.solr.client.solrj.request.json.DirectJsonQueryRequestFacetingIntegrationTest:     1) Thread[id=2235, name=qtp1080377500-2235, state=TIMED_WAITING, group=TGRP-DirectJsonQueryRequestFacetingIntegrationTest]         at sun.misc.Unsafe.park(Native Method)         at java.util.concurrent.locks.LockSupport.parkNanos(LockSupport.java:215)         at java.util.concurrent.locks.AbstractQueuedSynchronizer$ConditionObject.awaitNanos(AbstractQueuedSynchronizer.java:2078)         at org.eclipse.jetty.util.BlockingArrayQueue.poll(BlockingArrayQueue.java:392)         at org.eclipse.jetty.util.thread.QueuedThreadPool.idleJobPoll(QueuedThreadPool.java:656)         at org.eclipse.jetty.util.thread.QueuedThreadPool.access$800(QueuedThreadPool.java:46)         at org.eclipse.jetty.util.thread.QueuedThreadPool$2.run(QueuedThreadPool.java:720)         at java.lang.Thread.run(Thread.java:748)    2) Thread[id=2240, name=Scheduler-1695837204, state=TIMED_WAITING, group=TGRP-DirectJsonQueryRequestFacetingIntegrationTest]         at sun.misc.Unsafe.park(Native Method)         at java.util.concurrent.locks.LockSupport.parkNanos(LockSupport.java:215)         at java.util.concurrent.locks.AbstractQueuedSynchronizer$ConditionObject.awaitNanos(AbstractQueuedSynchronizer.java:2078)         at java.util.concurrent.ScheduledThreadPoolExecutor$DelayedWorkQueue.take(ScheduledThreadPoolExecutor.java:1093)         at java.util.concurrent.ScheduledThreadPoolExecutor$DelayedWorkQueue.take(ScheduledThreadPoolExecutor.java:809)         at java.util.concurrent.ThreadPoolExecutor.getTask(ThreadPoolExecutor.java:1074)         at java.util.concurrent.ThreadPoolExecutor.runWorker(ThreadPoolExecutor.java:1134)         at java.util.concurrent.ThreadPoolExecutor$Worker.run(ThreadPoolExecutor.java:624)         at java.lang.Thread.run(Thread.java:748)    3) Thread[id=2229, name=qtp1080377500-2229, state=TIMED_WAITING, group=TGRP-DirectJsonQueryRequestFacetingIntegrationTest]         at sun.misc.Unsafe.park(Native Method)         at java.util.concurrent.locks.LockSupport.parkNanos(LockSupport.java:215)         at java.util.concurrent.locks.AbstractQueuedSynchronizer$ConditionObject.awaitNanos(AbstractQueuedSynchronizer.java:2078)         at org.eclipse.jetty.util.BlockingArrayQueue.poll(BlockingArrayQueue.java:392)         at org.eclipse.jetty.util.thread.QueuedThreadPool.idleJobPoll(QueuedThreadPool.java:656)         at org.eclipse.jetty.util.thread.QueuedThreadPool.access$800(QueuedThreadPool.java:46)         at org.eclipse.jetty.util.thread.QueuedThreadPool$2.run(QueuedThreadPool.java:720)         at java.lang.Thread.run(Thread.java:748)    4) Thread[id=2230, name=qtp1080377500-2230, state=TIMED_WAITING, group=TGRP-DirectJsonQueryRequestFacetingIntegrationTest]         at sun.misc.Unsafe.park(Native Method)         at java.util.concurrent.locks.LockSupport.parkNanos(LockSupport.java:215)         at java.util.concurrent.locks.AbstractQueuedSynchronizer$ConditionObject.awaitNanos(AbstractQueuedSynchronizer.java:2078)         at org.eclipse.jetty.util.BlockingArrayQueue.poll(BlockingArrayQueue.java:392)         at org.eclipse.jetty.util.thread.QueuedThreadPool.idleJobPoll(QueuedThreadPool.java:656)         at org.eclipse.jetty.util.thread.QueuedThreadPool.access$800(QueuedThreadPool.java:46)         at org.eclipse.jetty.util.thread.QueuedThreadPool$2.run(QueuedThreadPool.java:720)         at java.lang.Thread.run(Thread.java:748)    5) Thread[id=2231, name=qtp1080377500-2231-acceptor-0@669866ca-ServerConnector@46aff548{SSL,[ssl, http/1.1]}{127.0.0.1:60005}, state=RUNNABLE, group=TGRP-DirectJsonQueryRequestFacetingIntegrationTest]         at sun.nio.ch.ServerSocketChannelImpl.accept0(Native Method)         at sun.nio.ch.ServerSocketChannelImpl.accept(ServerSocketChannelImpl.java:422)         at sun.nio.ch.ServerSocketChannelImpl.accept(ServerSocketChannelImpl.java:250)         at org.eclipse.jetty.server.ServerConnector.accept(ServerConnector.java:385)         at org.eclipse.jetty.server.AbstractConnector$Acceptor.run(AbstractConnector.java:648)         at org.eclipse.jetty.util.thread.QueuedThreadPool.runJob(QueuedThreadPool.java:765)         at org.eclipse.jetty.util.thread.QueuedThreadPool$2.run(QueuedThreadPool.java:683)         at java.lang.Thread.run(Thread.java:748)    6) Thread[id=2236, name=qtp1080377500-2236, state=TIMED_WAITING, group=TGRP-DirectJsonQueryRequestFacetingIntegrationTest]         at sun.misc.Unsafe.park(Native Method)         at java.util.concurrent.locks.LockSupport.parkNanos(LockSupport.java:215)         at java.util.concurrent.locks.AbstractQueuedSynchronizer$ConditionObject.awaitNanos(AbstractQueuedSynchronizer.java:2078)         at org.eclipse.jetty.util.BlockingArrayQueue.poll(BlockingArrayQueue.java:392)         at org.eclipse.jetty.util.thread.QueuedThreadPool.idleJobPoll(QueuedThreadPool.java:656)         at org.eclipse.jetty.util.thread.QueuedThreadPool.access$800(QueuedThreadPool.java:46)         at org.eclipse.jetty.util.thread.QueuedThreadPool$2.run(QueuedThreadPool.java:720)         at java.lang.Thread.run(Thread.java:748)    7) Thread[id=2234, name=qtp1080377500-2234, state=TIMED_WAITING, group=TGRP-DirectJsonQueryRequestFacetingIntegrationTest]         at sun.misc.Unsafe.park(Native Method)         at java.util.concurrent.locks.LockSupport.parkNanos(LockSupport.java:215)         at java.util.concurrent.locks.AbstractQueuedSynchronizer$ConditionObject.awaitNanos(AbstractQueuedSynchronizer.java:2078)         at org.eclipse.jetty.util.BlockingArrayQueue.poll(BlockingArrayQueue.java:392)         at org.eclipse.jetty.util.thread.QueuedThreadPool.idleJobPoll(QueuedThreadPool.java:656)         at org.eclipse.jetty.util.thread.QueuedThreadPool.access$800(QueuedThreadPool.java:46)         at org.eclipse.jetty.util.thread.QueuedThreadPool$2.run(QueuedThreadPool.java:720)         at java.lang.Thread.run(Thread.java:748)    8) Thread[id=2232, name=qtp1080377500-2232, state=RUNNABLE, group=TGRP-DirectJsonQueryRequestFacetingIntegrationTest]         at sun.nio.ch.DevPollArrayWrapper.poll0(Native Method)         at sun.nio.ch.DevPollArrayWrapper.poll(DevPollArrayWrapper.java:223)         at sun.nio.ch.DevPollSelectorImpl.doSelect(DevPollSelectorImpl.java:98)         at sun.nio.ch.SelectorImpl.lockAndDoSelect(SelectorImpl.java:86)         at sun.nio.ch.SelectorImpl.select(SelectorImpl.java:97)         at sun.nio.ch.SelectorImpl.select(SelectorImpl.java:101)         at org.eclipse.jetty.io.ManagedSelector$SelectorProducer.select(ManagedSelector.java:423)         at org.eclipse.jetty.io.ManagedSelector$SelectorProducer.produce(ManagedSelector.java:360)         at org.eclipse.jetty.util.thread.strategy.EatWhatYouKill.produceTask(EatWhatYouKill.java:357)         at org.eclipse.jetty.util.thread.strategy.EatWhatYouKill.doProduce(EatWhatYouKill.java:181)         at org.eclipse.jetty.util.thread.strategy.EatWhatYouKill.tryProduce(EatWhatYouKill.java:168)         at org.eclipse.jetty.util.thread.strategy.EatWhatYouKill.produce(EatWhatYouKill.java:132)         at org.eclipse.jetty.io.ManagedSelector$$Lambda$47/1040688067.run(Unknown Source)         at org.eclipse.jetty.util.thread.QueuedThreadPool.runJob(QueuedThreadPool.java:765)         at org.eclipse.jetty.util.thread.QueuedThreadPool$2.run(QueuedThreadPool.java:683)         at java.lang.Thread.run(Thread.java:748)    9) Thread[id=2237, name=Scheduler-2060163861, state=TIMED_WAITING, group=TGRP-DirectJsonQueryRequestFacetingIntegrationTest]         at sun.misc.Unsafe.park(Native Method)         at java.util.concurrent.locks.LockSupport.parkNanos(LockSupport.java:215)         at java.util.concurrent.locks.AbstractQueuedSynchronizer$ConditionObject.awaitNanos(AbstractQueuedSynchronizer.java:2078)         at java.util.concurrent.ScheduledThreadPoolExecutor$DelayedWorkQueue.take(ScheduledThreadPoolExecutor.java:1093)         at java.util.concurrent.ScheduledThreadPoolExecutor$DelayedWorkQueue.take(ScheduledThreadPoolExecutor.java:809)         at java.util.concurrent.ThreadPoolExecutor.getTask(ThreadPoolExecutor.java:1074)         at java.util.concurrent.ThreadPoolExecutor.runWorker(ThreadPoolExecutor.java:1134)         at java.util.concurrent.ThreadPoolExecutor$Worker.run(ThreadPoolExecutor.java:624)         at java.lang.Thread.run(Thread.java:748)   10) Thread[id=2233, name=qtp1080377500-2233, state=TIMED_WAITING, group=TGRP-DirectJsonQueryRequestFacetingIntegrationTest]         at sun.misc.Unsafe.park(Native Method)         at java.util.concurrent.locks.LockSupport.parkNanos(LockSupport.java:215)         at java.util.concurrent.locks.AbstractQueuedSynchronizer$ConditionObject.awaitNanos(AbstractQueuedSynchronizer.java:2078)         at org.eclipse.jetty.util.BlockingArrayQueue.poll(BlockingArrayQueue.java:392)         at org.eclipse.jetty.util.thread.QueuedThreadPool.idleJobPoll(QueuedThreadPool.java:656)         at org.eclipse.jetty.util.thread.QueuedThreadPool.access$800(QueuedThreadPool.java:46)         at org.eclipse.jetty.util.thread.QueuedThreadPool$2.run(QueuedThreadPool.java:720)         at java.lang.Thread.run(Thread.java:748)

Stack Trace:
com.carrotsearch.randomizedtesting.ThreadLeakError: 10 threads leaked from SUITE scope at org.apache.solr.client.solrj.request.json.DirectJsonQueryRequestFacetingIntegrationTest: 
   1) Thread[id=2235, name=qtp1080377500-2235, state=TIMED_WAITING, group=TGRP-DirectJsonQueryRequestFacetingIntegrationTest]
        at sun.misc.Unsafe.park(Native Method)
        at java.util.concurrent.locks.LockSupport.parkNanos(LockSupport.java:215)
        at java.util.concurrent.locks.AbstractQueuedSynchronizer$ConditionObject.awaitNanos(AbstractQueuedSynchronizer.java:2078)
        at org.eclipse.jetty.util.BlockingArrayQueue.poll(BlockingArrayQueue.java:392)
        at org.eclipse.jetty.util.thread.QueuedThreadPool.idleJobPoll(QueuedThreadPool.java:656)
        at org.eclipse.jetty.util.thread.QueuedThreadPool.access$800(QueuedThreadPool.java:46)
        at org.eclipse.jetty.util.thread.QueuedThreadPool$2.run(QueuedThreadPool.java:720)
        at java.lang.Thread.run(Thread.java:748)
   2) Thread[id=2240, name=Scheduler-1695837204, state=TIMED_WAITING, group=TGRP-DirectJsonQueryRequestFacetingIntegrationTest]
        at sun.misc.Unsafe.park(Native Method)
        at java.util.concurrent.locks.LockSupport.parkNanos(LockSupport.java:215)
        at java.util.concurrent.locks.AbstractQueuedSynchronizer$ConditionObject.awaitNanos(AbstractQueuedSynchronizer.java:2078)
        at java.util.concurrent.ScheduledThreadPoolExecutor$DelayedWorkQueue.take(ScheduledThreadPoolExecutor.java:1093)
        at java.util.concurrent.ScheduledThreadPoolExecutor$DelayedWorkQueue.take(ScheduledThreadPoolExecutor.java:809)
        at java.util.concurrent.ThreadPoolExecutor.getTask(ThreadPoolExecutor.java:1074)
        at java.util.concurrent.ThreadPoolExecutor.runWorker(ThreadPoolExecutor.java:1134)
        at java.util.concurrent.ThreadPoolExecutor$Worker.run(ThreadPoolExecutor.java:624)
        at java.lang.Thread.run(Thread.java:748)
   3) Thread[id=2229, name=qtp1080377500-2229, state=TIMED_WAITING, group=TGRP-DirectJsonQueryRequestFacetingIntegrationTest]
        at sun.misc.Unsafe.park(Native Method)
        at java.util.concurrent.locks.LockSupport.parkNanos(LockSupport.java:215)
        at java.util.concurrent.locks.AbstractQueuedSynchronizer$ConditionObject.awaitNanos(AbstractQueuedSynchronizer.java:2078)
        at org.eclipse.jetty.util.BlockingArrayQueue.poll(BlockingArrayQueue.java:392)
        at org.eclipse.jetty.util.thread.QueuedThreadPool.idleJobPoll(QueuedThreadPool.java:656)
        at org.eclipse.jetty.util.thread.QueuedThreadPool.access$800(QueuedThreadPool.java:46)
        at org.eclipse.jetty.util.thread.QueuedThreadPool$2.run(QueuedThreadPool.java:720)
        at java.lang.Thread.run(Thread.java:748)
   4) Thread[id=2230, name=qtp1080377500-2230, state=TIMED_WAITING, group=TGRP-DirectJsonQueryRequestFacetingIntegrationTest]
        at sun.misc.Unsafe.park(Native Method)
        at java.util.concurrent.locks.LockSupport.parkNanos(LockSupport.java:215)
        at java.util.concurrent.locks.AbstractQueuedSynchronizer$ConditionObject.awaitNanos(AbstractQueuedSynchronizer.java:2078)
        at org.eclipse.jetty.util.BlockingArrayQueue.poll(BlockingArrayQueue.java:392)
        at org.eclipse.jetty.util.thread.QueuedThreadPool.idleJobPoll(QueuedThreadPool.java:656)
        at org.eclipse.jetty.util.thread.QueuedThreadPool.access$800(QueuedThreadPool.java:46)
        at org.eclipse.jetty.util.thread.QueuedThreadPool$2.run(QueuedThreadPool.java:720)
        at java.lang.Thread.run(Thread.java:748)
   5) Thread[id=2231, name=qtp1080377500-2231-acceptor-0@669866ca-ServerConnector@46aff548{SSL,[ssl, http/1.1]}{127.0.0.1:60005}, state=RUNNABLE, group=TGRP-DirectJsonQueryRequestFacetingIntegrationTest]
        at sun.nio.ch.ServerSocketChannelImpl.accept0(Native Method)
        at sun.nio.ch.ServerSocketChannelImpl.accept(ServerSocketChannelImpl.java:422)
        at sun.nio.ch.ServerSocketChannelImpl.accept(ServerSocketChannelImpl.java:250)
        at org.eclipse.jetty.server.ServerConnector.accept(ServerConnector.java:385)
        at org.eclipse.jetty.server.AbstractConnector$Acceptor.run(AbstractConnector.java:648)
        at org.eclipse.jetty.util.thread.QueuedThreadPool.runJob(QueuedThreadPool.java:765)
        at org.eclipse.jetty.util.thread.QueuedThreadPool$2.run(QueuedThreadPool.java:683)
        at java.lang.Thread.run(Thread.java:748)
   6) Thread[id=2236, name=qtp1080377500-2236, state=TIMED_WAITING, group=TGRP-DirectJsonQueryRequestFacetingIntegrationTest]
        at sun.misc.Unsafe.park(Native Method)
        at java.util.concurrent.locks.LockSupport.parkNanos(LockSupport.java:215)
        at java.util.concurrent.locks.AbstractQueuedSynchronizer$ConditionObject.awaitNanos(AbstractQueuedSynchronizer.java:2078)
        at org.eclipse.jetty.util.BlockingArrayQueue.poll(BlockingArrayQueue.java:392)
        at org.eclipse.jetty.util.thread.QueuedThreadPool.idleJobPoll(QueuedThreadPool.java:656)
        at org.eclipse.jetty.util.thread.QueuedThreadPool.access$800(QueuedThreadPool.java:46)
        at org.eclipse.jetty.util.thread.QueuedThreadPool$2.run(QueuedThreadPool.java:720)
        at java.lang.Thread.run(Thread.java:748)
   7) Thread[id=2234, name=qtp1080377500-2234, state=TIMED_WAITING, group=TGRP-DirectJsonQueryRequestFacetingIntegrationTest]
        at sun.misc.Unsafe.park(Native Method)
        at java.util.concurrent.locks.LockSupport.parkNanos(LockSupport.java:215)
        at java.util.concurrent.locks.AbstractQueuedSynchronizer$ConditionObject.awaitNanos(AbstractQueuedSynchronizer.java:2078)
        at org.eclipse.jetty.util.BlockingArrayQueue.poll(BlockingArrayQueue.java:392)
        at org.eclipse.jetty.util.thread.QueuedThreadPool.idleJobPoll(QueuedThreadPool.java:656)
        at org.eclipse.jetty.util.thread.QueuedThreadPool.access$800(QueuedThreadPool.java:46)
        at org.eclipse.jetty.util.thread.QueuedThreadPool$2.run(QueuedThreadPool.java:720)
        at java.lang.Thread.run(Thread.java:748)
   8) Thread[id=2232, name=qtp1080377500-2232, state=RUNNABLE, group=TGRP-DirectJsonQueryRequestFacetingIntegrationTest]
        at sun.nio.ch.DevPollArrayWrapper.poll0(Native Method)
        at sun.nio.ch.DevPollArrayWrapper.poll(DevPollArrayWrapper.java:223)
        at sun.nio.ch.DevPollSelectorImpl.doSelect(DevPollSelectorImpl.java:98)
        at sun.nio.ch.SelectorImpl.lockAndDoSelect(SelectorImpl.java:86)
        at sun.nio.ch.SelectorImpl.select(SelectorImpl.java:97)
        at sun.nio.ch.SelectorImpl.select(SelectorImpl.java:101)
        at org.eclipse.jetty.io.ManagedSelector$SelectorProducer.select(ManagedSelector.java:423)
        at org.eclipse.jetty.io.ManagedSelector$SelectorProducer.produce(ManagedSelector.java:360)
        at org.eclipse.jetty.util.thread.strategy.EatWhatYouKill.produceTask(EatWhatYouKill.java:357)
        at org.eclipse.jetty.util.thread.strategy.EatWhatYouKill.doProduce(EatWhatYouKill.java:181)
        at org.eclipse.jetty.util.thread.strategy.EatWhatYouKill.tryProduce(EatWhatYouKill.java:168)
        at org.eclipse.jetty.util.thread.strategy.EatWhatYouKill.produce(EatWhatYouKill.java:132)
        at org.eclipse.jetty.io.ManagedSelector$$Lambda$47/1040688067.run(Unknown Source)
        at org.eclipse.jetty.util.thread.QueuedThreadPool.runJob(QueuedThreadPool.java:765)
        at org.eclipse.jetty.util.thread.QueuedThreadPool$2.run(QueuedThreadPool.java:683)
        at java.lang.Thread.run(Thread.java:748)
   9) Thread[id=2237, name=Scheduler-2060163861, state=TIMED_WAITING, group=TGRP-DirectJsonQueryRequestFacetingIntegrationTest]
        at sun.misc.Unsafe.park(Native Method)
        at java.util.concurrent.locks.LockSupport.parkNanos(LockSupport.java:215)
        at java.util.concurrent.locks.AbstractQueuedSynchronizer$ConditionObject.awaitNanos(AbstractQueuedSynchronizer.java:2078)
        at java.util.concurrent.ScheduledThreadPoolExecutor$DelayedWorkQueue.take(ScheduledThreadPoolExecutor.java:1093)
        at java.util.concurrent.ScheduledThreadPoolExecutor$DelayedWorkQueue.take(ScheduledThreadPoolExecutor.java:809)
        at java.util.concurrent.ThreadPoolExecutor.getTask(ThreadPoolExecutor.java:1074)
        at java.util.concurrent.ThreadPoolExecutor.runWorker(ThreadPoolExecutor.java:1134)
        at java.util.concurrent.ThreadPoolExecutor$Worker.run(ThreadPoolExecutor.java:624)
        at java.lang.Thread.run(Thread.java:748)
  10) Thread[id=2233, name=qtp1080377500-2233, state=TIMED_WAITING, group=TGRP-DirectJsonQueryRequestFacetingIntegrationTest]
        at sun.misc.Unsafe.park(Native Method)
        at java.util.concurrent.locks.LockSupport.parkNanos(LockSupport.java:215)
        at java.util.concurrent.locks.AbstractQueuedSynchronizer$ConditionObject.awaitNanos(AbstractQueuedSynchronizer.java:2078)
        at org.eclipse.jetty.util.BlockingArrayQueue.poll(BlockingArrayQueue.java:392)
        at org.eclipse.jetty.util.thread.QueuedThreadPool.idleJobPoll(QueuedThreadPool.java:656)
        at org.eclipse.jetty.util.thread.QueuedThreadPool.access$800(QueuedThreadPool.java:46)
        at org.eclipse.jetty.util.thread.QueuedThreadPool$2.run(QueuedThreadPool.java:720)
        at java.lang.Thread.run(Thread.java:748)
	at __randomizedtesting.SeedInfo.seed([B62EE87E71D19AAC]:0)


FAILED:  junit.framework.TestSuite.org.apache.solr.client.solrj.request.json.DirectJsonQueryRequestFacetingIntegrationTest

Error Message:
There are still zombie threads that couldn't be terminated:    1) Thread[id=2240, name=Scheduler-1695837204, state=WAITING, group=TGRP-DirectJsonQueryRequestFacetingIntegrationTest]         at sun.misc.Unsafe.park(Native Method)         at java.util.concurrent.locks.LockSupport.park(LockSupport.java:175)         at java.util.concurrent.locks.AbstractQueuedSynchronizer$ConditionObject.await(AbstractQueuedSynchronizer.java:2039)         at java.util.concurrent.ScheduledThreadPoolExecutor$DelayedWorkQueue.take(ScheduledThreadPoolExecutor.java:1081)         at java.util.concurrent.ScheduledThreadPoolExecutor$DelayedWorkQueue.take(ScheduledThreadPoolExecutor.java:809)         at java.util.concurrent.ThreadPoolExecutor.getTask(ThreadPoolExecutor.java:1074)         at java.util.concurrent.ThreadPoolExecutor.runWorker(ThreadPoolExecutor.java:1134)         at java.util.concurrent.ThreadPoolExecutor$Worker.run(ThreadPoolExecutor.java:624)         at java.lang.Thread.run(Thread.java:748)    2) Thread[id=2232, name=qtp1080377500-2232, state=RUNNABLE, group=TGRP-DirectJsonQueryRequestFacetingIntegrationTest]         at sun.nio.ch.DevPollArrayWrapper.poll0(Native Method)         at sun.nio.ch.DevPollArrayWrapper.poll(DevPollArrayWrapper.java:223)         at sun.nio.ch.DevPollSelectorImpl.doSelect(DevPollSelectorImpl.java:98)         at sun.nio.ch.SelectorImpl.lockAndDoSelect(SelectorImpl.java:86)         at sun.nio.ch.SelectorImpl.select(SelectorImpl.java:97)         at sun.nio.ch.SelectorImpl.select(SelectorImpl.java:101)         at org.eclipse.jetty.io.ManagedSelector$SelectorProducer.select(ManagedSelector.java:423)         at org.eclipse.jetty.io.ManagedSelector$SelectorProducer.produce(ManagedSelector.java:360)         at org.eclipse.jetty.util.thread.strategy.EatWhatYouKill.produceTask(EatWhatYouKill.java:357)         at org.eclipse.jetty.util.thread.strategy.EatWhatYouKill.doProduce(EatWhatYouKill.java:181)         at org.eclipse.jetty.util.thread.strategy.EatWhatYouKill.tryProduce(EatWhatYouKill.java:168)         at org.eclipse.jetty.util.thread.strategy.EatWhatYouKill.produce(EatWhatYouKill.java:132)         at org.eclipse.jetty.io.ManagedSelector$$Lambda$47/1040688067.run(Unknown Source)         at org.eclipse.jetty.util.thread.QueuedThreadPool.runJob(QueuedThreadPool.java:765)         at org.eclipse.jetty.util.thread.QueuedThreadPool$2.run(QueuedThreadPool.java:683)         at java.lang.Thread.run(Thread.java:748)    3) Thread[id=2237, name=Scheduler-2060163861, state=TIMED_WAITING, group=TGRP-DirectJsonQueryRequestFacetingIntegrationTest]         at sun.misc.Unsafe.park(Native Method)         at java.util.concurrent.locks.LockSupport.parkNanos(LockSupport.java:215)         at java.util.concurrent.locks.AbstractQueuedSynchronizer$ConditionObject.awaitNanos(AbstractQueuedSynchronizer.java:2078)         at java.util.concurrent.ScheduledThreadPoolExecutor$DelayedWorkQueue.take(ScheduledThreadPoolExecutor.java:1093)         at java.util.concurrent.ScheduledThreadPoolExecutor$DelayedWorkQueue.take(ScheduledThreadPoolExecutor.java:809)         at java.util.concurrent.ThreadPoolExecutor.getTask(ThreadPoolExecutor.java:1074)         at java.util.concurrent.ThreadPoolExecutor.runWorker(ThreadPoolExecutor.java:1134)         at java.util.concurrent.ThreadPoolExecutor$Worker.run(ThreadPoolExecutor.java:624)         at java.lang.Thread.run(Thread.java:748)

Stack Trace:
com.carrotsearch.randomizedtesting.ThreadLeakError: There are still zombie threads that couldn't be terminated:
   1) Thread[id=2240, name=Scheduler-1695837204, state=WAITING, group=TGRP-DirectJsonQueryRequestFacetingIntegrationTest]
        at sun.misc.Unsafe.park(Native Method)
        at java.util.concurrent.locks.LockSupport.park(LockSupport.java:175)
        at java.util.concurrent.locks.AbstractQueuedSynchronizer$ConditionObject.await(AbstractQueuedSynchronizer.java:2039)
        at java.util.concurrent.ScheduledThreadPoolExecutor$DelayedWorkQueue.take(ScheduledThreadPoolExecutor.java:1081)
        at java.util.concurrent.ScheduledThreadPoolExecutor$DelayedWorkQueue.take(ScheduledThreadPoolExecutor.java:809)
        at java.util.concurrent.ThreadPoolExecutor.getTask(ThreadPoolExecutor.java:1074)
        at java.util.concurrent.ThreadPoolExecutor.runWorker(ThreadPoolExecutor.java:1134)
        at java.util.concurrent.ThreadPoolExecutor$Worker.run(ThreadPoolExecutor.java:624)
        at java.lang.Thread.run(Thread.java:748)
   2) Thread[id=2232, name=qtp1080377500-2232, state=RUNNABLE, group=TGRP-DirectJsonQueryRequestFacetingIntegrationTest]
        at sun.nio.ch.DevPollArrayWrapper.poll0(Native Method)
        at sun.nio.ch.DevPollArrayWrapper.poll(DevPollArrayWrapper.java:223)
        at sun.nio.ch.DevPollSelectorImpl.doSelect(DevPollSelectorImpl.java:98)
        at sun.nio.ch.SelectorImpl.lockAndDoSelect(SelectorImpl.java:86)
        at sun.nio.ch.SelectorImpl.select(SelectorImpl.java:97)
        at sun.nio.ch.SelectorImpl.select(SelectorImpl.java:101)
        at org.eclipse.jetty.io.ManagedSelector$SelectorProducer.select(ManagedSelector.java:423)
        at org.eclipse.jetty.io.ManagedSelector$SelectorProducer.produce(ManagedSelector.java:360)
        at org.eclipse.jetty.util.thread.strategy.EatWhatYouKill.produceTask(EatWhatYouKill.java:357)
        at org.eclipse.jetty.util.thread.strategy.EatWhatYouKill.doProduce(EatWhatYouKill.java:181)
        at org.eclipse.jetty.util.thread.strategy.EatWhatYouKill.tryProduce(EatWhatYouKill.java:168)
        at org.eclipse.jetty.util.thread.strategy.EatWhatYouKill.produce(EatWhatYouKill.java:132)
        at org.eclipse.jetty.io.ManagedSelector$$Lambda$47/1040688067.run(Unknown Source)
        at org.eclipse.jetty.util.thread.QueuedThreadPool.runJob(QueuedThreadPool.java:765)
        at org.eclipse.jetty.util.thread.QueuedThreadPool$2.run(QueuedThreadPool.java:683)
        at java.lang.Thread.run(Thread.java:748)
   3) Thread[id=2237, name=Scheduler-2060163861, state=TIMED_WAITING, group=TGRP-DirectJsonQueryRequestFacetingIntegrationTest]
        at sun.misc.Unsafe.park(Native Method)
        at java.util.concurrent.locks.LockSupport.parkNanos(LockSupport.java:215)
        at java.util.concurrent.locks.AbstractQueuedSynchronizer$ConditionObject.awaitNanos(AbstractQueuedSynchronizer.java:2078)
        at java.util.concurrent.ScheduledThreadPoolExecutor$DelayedWorkQueue.take(ScheduledThreadPoolExecutor.java:1093)
        at java.util.concurrent.ScheduledThreadPoolExecutor$DelayedWorkQueue.take(ScheduledThreadPoolExecutor.java:809)
        at java.util.concurrent.ThreadPoolExecutor.getTask(ThreadPoolExecutor.java:1074)
        at java.util.concurrent.ThreadPoolExecutor.runWorker(ThreadPoolExecutor.java:1134)
        at java.util.concurrent.ThreadPoolExecutor$Worker.run(ThreadPoolExecutor.java:624)
        at java.lang.Thread.run(Thread.java:748)
	at __randomizedtesting.SeedInfo.seed([B62EE87E71D19AAC]:0)




Build Log:
[...truncated 16196 lines...]
   [junit4] Suite: org.apache.solr.client.solrj.request.json.DirectJsonQueryRequestFacetingIntegrationTest
   [junit4]   2> 85909 INFO  (SUITE-DirectJsonQueryRequestFacetingIntegrationTest-seed#[B62EE87E71D19AAC]-worker) [    ] o.a.s.SolrTestCaseJ4 SecureRandom sanity checks: test.solr.allowed.securerandom=null & java.security.egd=file:/dev/./urandom
   [junit4]   2> Creating dataDir: /export/home/jenkins/workspace/Lucene-Solr-master-Solaris/solr/build/solr-solrj/test/J0/temp/solr.client.solrj.request.json.DirectJsonQueryRequestFacetingIntegrationTest_B62EE87E71D19AAC-001/init-core-data-001
   [junit4]   2> 85909 WARN  (SUITE-DirectJsonQueryRequestFacetingIntegrationTest-seed#[B62EE87E71D19AAC]-worker) [    ] o.a.s.SolrTestCaseJ4 startTrackingSearchers: numOpens=4 numCloses=4
   [junit4]   2> 85909 INFO  (SUITE-DirectJsonQueryRequestFacetingIntegrationTest-seed#[B62EE87E71D19AAC]-worker) [    ] o.a.s.SolrTestCaseJ4 Using PointFields (NUMERIC_POINTS_SYSPROP=true) w/NUMERIC_DOCVALUES_SYSPROP=true
   [junit4]   2> 85910 INFO  (SUITE-DirectJsonQueryRequestFacetingIntegrationTest-seed#[B62EE87E71D19AAC]-worker) [    ] o.a.s.SolrTestCaseJ4 Randomized ssl (true) and clientAuth (true) via: @org.apache.solr.util.RandomizeSSL(reason=, value=NaN, ssl=NaN, clientAuth=NaN)
   [junit4]   2> 85912 INFO  (SUITE-DirectJsonQueryRequestFacetingIntegrationTest-seed#[B62EE87E71D19AAC]-worker) [    ] o.a.s.c.MiniSolrCloudCluster Starting cluster of 1 servers in /export/home/jenkins/workspace/Lucene-Solr-master-Solaris/solr/build/solr-solrj/test/J0/temp/solr.client.solrj.request.json.DirectJsonQueryRequestFacetingIntegrationTest_B62EE87E71D19AAC-001/tempDir-001
   [junit4]   2> 85912 INFO  (SUITE-DirectJsonQueryRequestFacetingIntegrationTest-seed#[B62EE87E71D19AAC]-worker) [    ] o.a.s.c.ZkTestServer STARTING ZK TEST SERVER
   [junit4]   2> 85913 INFO  (ZkTestServer Run Thread) [    ] o.a.s.c.ZkTestServer client port:0.0.0.0/0.0.0.0:0
   [junit4]   2> 85913 INFO  (ZkTestServer Run Thread) [    ] o.a.s.c.ZkTestServer Starting server
   [junit4]   2> 86013 INFO  (SUITE-DirectJsonQueryRequestFacetingIntegrationTest-seed#[B62EE87E71D19AAC]-worker) [    ] o.a.s.c.ZkTestServer start zk server on port:60005
   [junit4]   2> 86013 INFO  (SUITE-DirectJsonQueryRequestFacetingIntegrationTest-seed#[B62EE87E71D19AAC]-worker) [    ] o.a.s.c.ZkTestServer parse host and port list: 127.0.0.1:60005
   [junit4]   2> 86013 INFO  (SUITE-DirectJsonQueryRequestFacetingIntegrationTest-seed#[B62EE87E71D19AAC]-worker) [    ] o.a.s.c.ZkTestServer connecting to 127.0.0.1 60005
   [junit4]   2> 86018 INFO  (zkConnectionManagerCallback-931-thread-1) [    ] o.a.s.c.c.ConnectionManager zkClient has connected
   [junit4]   2> 86035 INFO  (zkConnectionManagerCallback-933-thread-1) [    ] o.a.s.c.c.ConnectionManager zkClient has connected
   [junit4]   2> 86038 INFO  (zkConnectionManagerCallback-935-thread-1) [    ] o.a.s.c.c.ConnectionManager zkClient has connected
   [junit4]   2> 86043 WARN  (jetty-launcher-936-thread-1) [    ] o.e.j.s.AbstractConnector Ignoring deprecated socket close linger time
   [junit4]   2> 86043 INFO  (jetty-launcher-936-thread-1) [    ] o.a.s.c.s.e.JettySolrRunner Start Jetty (original configured port=0)
   [junit4]   2> 86043 INFO  (jetty-launcher-936-thread-1) [    ] o.a.s.c.s.e.JettySolrRunner Trying to start Jetty on port 0 try number 1 ...
   [junit4]   2> 86043 INFO  (jetty-launcher-936-thread-1) [    ] o.e.j.s.Server jetty-9.4.14.v20181114; built: 2018-11-14T21:20:31.478Z; git: c4550056e785fb5665914545889f21dc136ad9e6; jvm 1.8.0_191-b12
   [junit4]   2> 86044 INFO  (jetty-launcher-936-thread-1) [    ] o.e.j.s.session DefaultSessionIdManager workerName=node0
   [junit4]   2> 86044 INFO  (jetty-launcher-936-thread-1) [    ] o.e.j.s.session No SessionScavenger set, using defaults
   [junit4]   2> 86044 INFO  (jetty-launcher-936-thread-1) [    ] o.e.j.s.session node0 Scavenging every 600000ms
   [junit4]   2> 86044 INFO  (jetty-launcher-936-thread-1) [    ] o.e.j.s.h.ContextHandler Started o.e.j.s.ServletContextHandler@48a7c297{/solr,null,AVAILABLE}
   [junit4]   2> 86047 WARN  (jetty-launcher-936-thread-1) [    ] o.e.j.u.s.S.config No Client EndPointIdentificationAlgorithm configured for SslContextFactory@78bb3dd8[provider=null,keyStore=null,trustStore=null]
   [junit4]   2> 86048 INFO  (jetty-launcher-936-thread-1) [    ] o.e.j.s.AbstractConnector Started ServerConnector@46aff548{SSL,[ssl, http/1.1]}{127.0.0.1:60005}
   [junit4]   2> 86048 INFO  (jetty-launcher-936-thread-1) [    ] o.e.j.s.Server Started @86173ms
   [junit4]   2> 86048 INFO  (jetty-launcher-936-thread-1) [    ] o.a.s.c.s.e.JettySolrRunner Jetty properties: {hostContext=/solr, hostPort=60005}
   [junit4]   2> 86048 ERROR (jetty-launcher-936-thread-1) [    ] o.a.s.u.StartupLoggingUtils Missing Java Option solr.log.dir. Logging may be missing or incomplete.
   [junit4]   2> 86048 INFO  (jetty-launcher-936-thread-1) [    ] o.a.s.s.SolrDispatchFilter Using logger factory org.apache.logging.slf4j.Log4jLoggerFactory
   [junit4]   2> 86048 INFO  (jetty-launcher-936-thread-1) [    ] o.a.s.s.SolrDispatchFilter  ___      _       Welcome to Apache Solr™ version 9.0.0
   [junit4]   2> 86048 INFO  (jetty-launcher-936-thread-1) [    ] o.a.s.s.SolrDispatchFilter / __| ___| |_ _   Starting in cloud mode on port null
   [junit4]   2> 86048 INFO  (jetty-launcher-936-thread-1) [    ] o.a.s.s.SolrDispatchFilter \__ \/ _ \ | '_|  Install dir: null
   [junit4]   2> 86048 INFO  (jetty-launcher-936-thread-1) [    ] o.a.s.s.SolrDispatchFilter |___/\___/_|_|    Start time: 2019-01-15T14:09:23.363Z
   [junit4]   2> 86063 WARN  (jetty-launcher-936-thread-1-SendThread(serv1-vm3:60005)) [    ] o.a.z.ClientCnxn Session 0x0 for server serv1-vm3/127.0.0.1:60005, unexpected error, closing socket connection and attempting reconnect
   [junit4]   2> java.io.IOException: Packet len352518912 is out of range!
   [junit4]   2> 	at org.apache.zookeeper.ClientCnxnSocket.readLength(ClientCnxnSocket.java:113) ~[zookeeper-3.4.13.jar:3.4.13-2d71af4dbe22557fda74f9a9b4309b15a7487f03]
   [junit4]   2> 	at org.apache.zookeeper.ClientCnxnSocketNIO.doIO(ClientCnxnSocketNIO.java:79) ~[zookeeper-3.4.13.jar:3.4.13-2d71af4dbe22557fda74f9a9b4309b15a7487f03]
   [junit4]   2> 	at org.apache.zookeeper.ClientCnxnSocketNIO.doTransport(ClientCnxnSocketNIO.java:366) ~[zookeeper-3.4.13.jar:3.4.13-2d71af4dbe22557fda74f9a9b4309b15a7487f03]
   [junit4]   2> 	at org.apache.zookeeper.ClientCnxn$SendThread.run(ClientCnxn.java:1145) [zookeeper-3.4.13.jar:3.4.13-2d71af4dbe22557fda74f9a9b4309b15a7487f03]
   [junit4]   2> 87723 WARN  (jetty-launcher-936-thread-1-SendThread(serv1-vm3:60005)) [    ] o.a.z.ClientCnxn Session 0x0 for server serv1-vm3/127.0.0.1:60005, unexpected error, closing socket connection and attempting reconnect
   [junit4]   2> java.io.IOException: Packet len352518912 is out of range!
   [junit4]   2> 	at org.apache.zookeeper.ClientCnxnSocket.readLength(ClientCnxnSocket.java:113) ~[zookeeper-3.4.13.jar:3.4.13-2d71af4dbe22557fda74f9a9b4309b15a7487f03]
   [junit4]   2> 	at org.apache.zookeeper.ClientCnxnSocketNIO.doIO(ClientCnxnSocketNIO.java:79) ~[zookeeper-3.4.13.jar:3.4.13-2d71af4dbe22557fda74f9a9b4309b15a7487f03]
   [junit4]   2> 	at org.apache.zookeeper.ClientCnxnSocketNIO.doTransport(ClientCnxnSocketNIO.java:366) ~[zookeeper-3.4.13.jar:3.4.13-2d71af4dbe22557fda74f9a9b4309b15a7487f03]
   [junit4]   2> 	at org.apache.zookeeper.ClientCnxn$SendThread.run(ClientCnxn.java:1145) [zookeeper-3.4.13.jar:3.4.13-2d71af4dbe22557fda74f9a9b4309b15a7487f03]
   [junit4]   2> 89578 WARN  (jetty-launcher-936-thread-1-SendThread(serv1-vm3:60005)) [    ] o.a.z.ClientCnxn Session 0x0 for server serv1-vm3/127.0.0.1:60005, unexpected error, closing socket connection and attempting reconnect
   [junit4]   2> java.io.IOException: Packet len352518912 is out of range!
   [junit4]   2> 	at org.apache.zookeeper.ClientCnxnSocket.readLength(ClientCnxnSocket.java:113) ~[zookeeper-3.4.13.jar:3.4.13-2d71af4dbe22557fda74f9a9b4309b15a7487f03]
   [junit4]   2> 	at org.apache.zookeeper.ClientCnxnSocketNIO.doIO(ClientCnxnSocketNIO.java:79) ~[zookeeper-3.4.13.jar:3.4.13-2d71af4dbe22557fda74f9a9b4309b15a7487f03]
   [junit4]   2> 	at org.apache.zookeeper.ClientCnxnSocketNIO.doTransport(ClientCnxnSocketNIO.java:366) ~[zookeeper-3.4.13.jar:3.4.13-2d71af4dbe22557fda74f9a9b4309b15a7487f03]
   [junit4]   2> 	at org.apache.zookeeper.ClientCnxn$SendThread.run(ClientCnxn.java:1145) [zookeeper-3.4.13.jar:3.4.13-2d71af4dbe22557fda74f9a9b4309b15a7487f03]
   [junit4]   2> 91485 WARN  (jetty-launcher-936-thread-1-SendThread(serv1-vm3:60005)) [    ] o.a.z.ClientCnxn Session 0x0 for server serv1-vm3/127.0.0.1:60005, unexpected error, closing socket connection and attempting reconnect
   [junit4]   2> java.io.IOException: Packet len352518912 is out of range!
   [junit4]   2> 	at org.apache.zookeeper.ClientCnxnSocket.readLength(ClientCnxnSocket.java:113) ~[zookeeper-3.4.13.jar:3.4.13-2d71af4dbe22557fda74f9a9b4309b15a7487f03]
   [junit4]   2> 	at org.apache.zookeeper.ClientCnxnSocketNIO.doIO(ClientCnxnSocketNIO.java:79) ~[zookeeper-3.4.13.jar:3.4.13-2d71af4dbe22557fda74f9a9b4309b15a7487f03]
   [junit4]   2> 	at org.apache.zookeeper.ClientCnxnSocketNIO.doTransport(ClientCnxnSocketNIO.java:366) ~[zookeeper-3.4.13.jar:3.4.13-2d71af4dbe22557fda74f9a9b4309b15a7487f03]
   [junit4]   2> 	at org.apache.zookeeper.ClientCnxn$SendThread.run(ClientCnxn.java:1145) [zookeeper-3.4.13.jar:3.4.13-2d71af4dbe22557fda74f9a9b4309b15a7487f03]
   [junit4]   2> 93344 WARN  (jetty-launcher-936-thread-1-SendThread(serv1-vm3:60005)) [    ] o.a.z.ClientCnxn Session 0x0 for server serv1-vm3/127.0.0.1:60005, unexpected error, closing socket connection and attempting reconnect
   [junit4]   2> java.io.IOException: Packet len352518912 is out of range!
   [junit4]   2> 	at org.apache.zookeeper.ClientCnxnSocket.readLength(ClientCnxnSocket.java:113) ~[zookeeper-3.4.13.jar:3.4.13-2d71af4dbe22557fda74f9a9b4309b15a7487f03]
   [junit4]   2> 	at org.apache.zookeeper.ClientCnxnSocketNIO.doIO(ClientCnxnSocketNIO.java:79) ~[zookeeper-3.4.13.jar:3.4.13-2d71af4dbe22557fda74f9a9b4309b15a7487f03]
   [junit4]   2> 	at org.apache.zookeeper.ClientCnxnSocketNIO.doTransport(ClientCnxnSocketNIO.java:366) ~[zookeeper-3.4.13.jar:3.4.13-2d71af4dbe22557fda74f9a9b4309b15a7487f03]
   [junit4]   2> 	at org.apache.zookeeper.ClientCnxn$SendThread.run(ClientCnxn.java:1145) [zookeeper-3.4.13.jar:3.4.13-2d71af4dbe22557fda74f9a9b4309b15a7487f03]
   [junit4]   2> 94571 WARN  (jetty-launcher-936-thread-1-SendThread(serv1-vm3:60005)) [    ] o.a.z.ClientCnxn Session 0x0 for server serv1-vm3/127.0.0.1:60005, unexpected error, closing socket connection and attempting reconnect
   [junit4]   2> java.io.IOException: Packet len352518912 is out of range!
   [junit4]   2> 	at org.apache.zookeeper.ClientCnxnSocket.readLength(ClientCnxnSocket.java:113) ~[zookeeper-3.4.13.jar:3.4.13-2d71af4dbe22557fda74f9a9b4309b15a7487f03]
   [junit4]   2> 	at org.apache.zookeeper.ClientCnxnSocketNIO.doIO(ClientCnxnSocketNIO.java:79) ~[zookeeper-3.4.13.jar:3.4.13-2d71af4dbe22557fda74f9a9b4309b15a7487f03]
   [junit4]   2> 	at org.apache.zookeeper.ClientCnxnSocketNIO.doTransport(ClientCnxnSocketNIO.java:366) ~[zookeeper-3.4.13.jar:3.4.13-2d71af4dbe22557fda74f9a9b4309b15a7487f03]
   [junit4]   2> 	at org.apache.zookeeper.ClientCnxn$SendThread.run(ClientCnxn.java:1145) [zookeeper-3.4.13.jar:3.4.13-2d71af4dbe22557fda74f9a9b4309b15a7487f03]
   [junit4]   2> 95888 WARN  (jetty-launcher-936-thread-1-SendThread(serv1-vm3:60005)) [    ] o.a.z.ClientCnxn Session 0x0 for server serv1-vm3/127.0.0.1:60005, unexpected error, closing socket connection and attempting reconnect
   [junit4]   2> java.io.IOException: Packet len352518912 is out of range!
   [junit4]   2> 	at org.apache.zookeeper.ClientCnxnSocket.readLength(ClientCnxnSocket.java:113) ~[zookeeper-3.4.13.jar:3.4.13-2d71af4dbe22557fda74f9a9b4309b15a7487f03]
   [junit4]   2> 	at org.apache.zookeeper.ClientCnxnSocketNIO.doIO(ClientCnxnSocketNIO.java:79) ~[zookeeper-3.4.13.jar:3.4.13-2d71af4dbe22557fda74f9a9b4309b15a7487f03]
   [junit4]   2> 	at org.apache.zookeeper.ClientCnxnSocketNIO.doTransport(ClientCnxnSocketNIO.java:366) ~[zookeeper-3.4.13.jar:3.4.13-2d71af4dbe22557fda74f9a9b4309b15a7487f03]
   [junit4]   2> 	at org.apache.zookeeper.ClientCnxn$SendThread.run(ClientCnxn.java:1145) [zookeeper-3.4.13.jar:3.4.13-2d71af4dbe22557fda74f9a9b4309b15a7487f03]
   [junit4]   2> 97911 WARN  (jetty-launcher-936-thread-1-SendThread(serv1-vm3:60005)) [    ] o.a.z.ClientCnxn Session 0x0 for server serv1-vm3/127.0.0.1:60005, unexpected error, closing socket connection and attempting reconnect
   [junit4]   2> java.io.IOException: Packet len352518912 is out of range!
   [junit4]   2> 	at org.apache.zookeeper.ClientCnxnSocket.readLength(ClientCnxnSocket.java:113) ~[zookeeper-3.4.13.jar:3.4.13-2d71af4dbe22557fda74f9a9b4309b15a7487f03]
   [junit4]   2> 	at org.apache.zookeeper.ClientCnxnSocketNIO.doIO(ClientCnxnSocketNIO.java:79) ~[zookeeper-3.4.13.jar:3.4.13-2d71af4dbe22557fda74f9a9b4309b15a7487f03]
   [junit4]   2> 	at org.apache.zookeeper.ClientCnxnSocketNIO.doTransport(ClientCnxnSocketNIO.java:366) ~[zookeeper-3.4.13.jar:3.4.13-2d71af4dbe22557fda74f9a9b4309b15a7487f03]
   [junit4]   2> 	at org.apache.zookeeper.ClientCnxn$SendThread.run(ClientCnxn.java:1145) [zookeeper-3.4.13.jar:3.4.13-2d71af4dbe22557fda74f9a9b4309b15a7487f03]
   [junit4]   2> 99875 WARN  (jetty-launcher-936-thread-1-SendThread(serv1-vm3:60005)) [    ] o.a.z.ClientCnxn Session 0x0 for server serv1-vm3/127.0.0.1:60005, unexpected error, closing socket connection and attempting reconnect
   [junit4]   2> java.io.IOException: Packet len352518912 is out of range!
   [junit4]   2> 	at org.apache.zookeeper.ClientCnxnSocket.readLength(ClientCnxnSocket.java:113) ~[zookeeper-3.4.13.jar:3.4.13-2d71af4dbe22557fda74f9a9b4309b15a7487f03]
   [junit4]   2> 	at org.apache.zookeeper.ClientCnxnSocketNIO.doIO(ClientCnxnSocketNIO.java:79) ~[zookeeper-3.4.13.jar:3.4.13-2d71af4dbe22557fda74f9a9b4309b15a7487f03]
   [junit4]   2> 	at org.apache.zookeeper.ClientCnxnSocketNIO.doTransport(ClientCnxnSocketNIO.java:366) ~[zookeeper-3.4.13.jar:3.4.13-2d71af4dbe22557fda74f9a9b4309b15a7487f03]
   [junit4]   2> 	at org.apache.zookeeper.ClientCnxn$SendThread.run(ClientCnxn.java:1145) [zookeeper-3.4.13.jar:3.4.13-2d71af4dbe22557fda74f9a9b4309b15a7487f03]
   [junit4]   2> 101581 WARN  (jetty-launcher-936-thread-1-SendThread(serv1-vm3:60005)) [    ] o.a.z.ClientCnxn Session 0x0 for server serv1-vm3/127.0.0.1:60005, unexpected error, closing socket connection and attempting reconnect
   [junit4]   2> java.io.IOException: Packet len352518912 is out of range!
   [junit4]   2> 	at org.apache.zookeeper.ClientCnxnSocket.readLength(ClientCnxnSocket.java:113) ~[zookeeper-3.4.13.jar:3.4.13-2d71af4dbe22557fda74f9a9b4309b15a7487f03]
   [junit4]   2> 	at org.apache.zookeeper.ClientCnxnSocketNIO.doIO(ClientCnxnSocketNIO.java:79) ~[zookeeper-3.4.13.jar:3.4.13-2d71af4dbe22557fda74f9a9b4309b15a7487f03]
   [junit4]   2> 	at org.apache.zookeeper.ClientCnxnSocketNIO.doTransport(ClientCnxnSocketNIO.java:366) ~[zookeeper-3.4.13.jar:3.4.13-2d71af4dbe22557fda74f9a9b4309b15a7487f03]
   [junit4]   2> 	at org.apache.zookeeper.ClientCnxn$SendThread.run(ClientCnxn.java:1145) [zookeeper-3.4.13.jar:3.4.13-2d71af4dbe22557fda74f9a9b4309b15a7487f03]
   [junit4]   2> 103593 WARN  (jetty-launcher-936-thread-1-SendThread(serv1-vm3:60005)) [    ] o.a.z.ClientCnxn Session 0x0 for server serv1-vm3/127.0.0.1:60005, unexpected error, closing socket connection and attempting reconnect
   [junit4]   2> java.io.IOException: Packet len352518912 is out of range!
   [junit4]   2> 	at org.apache.zookeeper.ClientCnxnSocket.readLength(ClientCnxnSocket.java:113) ~[zookeeper-3.4.13.jar:3.4.13-2d71af4dbe22557fda74f9a9b4309b15a7487f03]
   [junit4]   2> 	at org.apache.zookeeper.ClientCnxnSocketNIO.doIO(ClientCnxnSocketNIO.java:79) ~[zookeeper-3.4.13.jar:3.4.13-2d71af4dbe22557fda74f9a9b4309b15a7487f03]
   [junit4]   2> 	at org.apache.zookeeper.ClientCnxnSocketNIO.doTransport(ClientCnxnSocketNIO.java:366) ~[zookeeper-3.4.13.jar:3.4.13-2d71af4dbe22557fda74f9a9b4309b15a7487f03]
   [junit4]   2> 	at org.apache.zookeeper.ClientCnxn$SendThread.run(ClientCnxn.java:1145) [zookeeper-3.4.13.jar:3.4.13-2d71af4dbe22557fda74f9a9b4309b15a7487f03]
   [junit4]   2> 105262 WARN  (jetty-launcher-936-thread-1-SendThread(serv1-vm3:60005)) [    ] o.a.z.ClientCnxn Session 0x0 for server serv1-vm3/127.0.0.1:60005, unexpected error, closing socket connection and attempting reconnect
   [junit4]   2> java.io.IOException: Packet len352518912 is out of range!
   [junit4]   2> 	at org.apache.zookeeper.ClientCnxnSocket.readLength(ClientCnxnSocket.java:113) ~[zookeeper-3.4.13.jar:3.4.13-2d71af4dbe22557fda74f9a9b4309b15a7487f03]
   [junit4]   2> 	at org.apache.zookeeper.ClientCnxnSocketNIO.doIO(ClientCnxnSocketNIO.java:79) ~[zookeeper-3.4.13.jar:3.4.13-2d71af4dbe22557fda74f9a9b4309b15a7487f03]
   [junit4]   2> 	at org.apache.zookeeper.ClientCnxnSocketNIO.doTransport(ClientCnxnSocketNIO.java:366) ~[zookeeper-3.4.13.jar:3.4.13-2d71af4dbe22557fda74f9a9b4309b15a7487f03]
   [junit4]   2> 	at org.apache.zookeeper.ClientCnxn$SendThread.run(ClientCnxn.java:1145) [zookeeper-3.4.13.jar:3.4.13-2d71af4dbe22557fda74f9a9b4309b15a7487f03]
   [junit4]   2> 106965 WARN  (jetty-launcher-936-thread-1-SendThread(serv1-vm3:60005)) [    ] o.a.z.ClientCnxn Session 0x0 for server serv1-vm3/127.0.0.1:60005, unexpected error, closing socket connection and attempting reconnect
   [junit4]   2> java.io.IOException: Packet len352518912 is out of range!
   [junit4]   2> 	at org.apache.zookeeper.ClientCnxnSocket.readLength(ClientCnxnSocket.java:113) ~[zookeeper-3.4.13.jar:3.4.13-2d71af4dbe22557fda74f9a9b4309b15a7487f03]
   [junit4]   2> 	at org.apache.zookeeper.ClientCnxnSocketNIO.doIO(ClientCnxnSocketNIO.java:79) ~[zookeeper-3.4.13.jar:3.4.13-2d71af4dbe22557fda74f9a9b4309b15a7487f03]
   [junit4]   2> 	at org.apache.zookeeper.ClientCnxnSocketNIO.doTransport(ClientCnxnSocketNIO.java:366) ~[zookeeper-3.4.13.jar:3.4.13-2d71af4dbe22557fda74f9a9b4309b15a7487f03]
   [junit4]   2> 	at org.apache.zookeeper.ClientCnxn$SendThread.run(ClientCnxn.java:1145) [zookeeper-3.4.13.jar:3.4.13-2d71af4dbe22557fda74f9a9b4309b15a7487f03]
   [junit4]   2> 108662 WARN  (jetty-launcher-936-thread-1-SendThread(serv1-vm3:60005)) [    ] o.a.z.ClientCnxn Session 0x0 for server serv1-vm3/127.0.0.1:60005, unexpected error, closing socket connection and attempting reconnect
   [junit4]   2> java.io.IOException: Packet len352518912 is out of range!
   [junit4]   2> 	at org.apache.zookeeper.ClientCnxnSocket.readLength(ClientCnxnSocket.java:113) ~[zookeeper-3.4.13.jar:3.4.13-2d71af4dbe22557fda74f9a9b4309b15a7487f03]
   [junit4]   2> 	at org.apache.zookeeper.ClientCnxnSocketNIO.doIO(ClientCnxnSocketNIO.java:79) ~[zookeeper-3.4.13.jar:3.4.13-2d71af4dbe22557fda74f9a9b4309b15a7487f03]
   [junit4]   2> 	at org.apache.zookeeper.ClientCnxnSocketNIO.doTransport(ClientCnxnSocketNIO.java:366) ~[zookeeper-3.4.13.jar:3.4.13-2d71af4dbe22557fda74f9a9b4309b15a7487f03]
   [junit4]   2> 	at org.apache.zookeeper.ClientCnxn$SendThread.run(ClientCnxn.java:1145) [zookeeper-3.4.13.jar:3.4.13-2d71af4dbe22557fda74f9a9b4309b15a7487f03]
   [junit4]   2> 110572 WARN  (jetty-launcher-936-thread-1-SendThread(serv1-vm3:60005)) [    ] o.a.z.ClientCnxn Session 0x0 for server serv1-vm3/127.0.0.1:60005, unexpected error, closing socket connection and attempting reconnect
   [junit4]   2> java.io.IOException: Packet len352518912 is out of range!
   [junit4]   2> 	at org.apache.zookeeper.ClientCnxnSocket.readLength(ClientCnxnSocket.java:113) ~[zookeeper-3.4.13.jar:3.4.13-2d71af4dbe22557fda74f9a9b4309b15a7487f03]
   [junit4]   2> 	at org.apache.zookeeper.ClientCnxnSocketNIO.doIO(ClientCnxnSocketNIO.java:79) ~[zookeeper-3.4.13.jar:3.4.13-2d71af4dbe22557fda74f9a9b4309b15a7487f03]
   [junit4]   2> 	at org.apache.zookeeper.ClientCnxnSocketNIO.doTransport(ClientCnxnSocketNIO.java:366) ~[zookeeper-3.4.13.jar:3.4.13-2d71af4dbe22557fda74f9a9b4309b15a7487f03]
   [junit4]   2> 	at org.apache.zookeeper.ClientCnxn$SendThread.run(ClientCnxn.java:1145) [zookeeper-3.4.13.jar:3.4.13-2d71af4dbe22557fda74f9a9b4309b15a7487f03]
   [junit4]   2> 112365 WARN  (jetty-launcher-936-thread-1-SendThread(serv1-vm3:60005)) [    ] o.a.z.ClientCnxn Session 0x0 for server serv1-vm3/127.0.0.1:60005, unexpected error, closing socket connection and attempting reconnect
   [junit4]   2> java.io.IOException: Packet len352518912 is out of range!
   [junit4]   2> 	at org.apache.zookeeper.ClientCnxnSocket.readLength(ClientCnxnSocket.java:113) ~[zookeeper-3.4.13.jar:3.4.13-2d71af4dbe22557fda74f9a9b4309b15a7487f03]
   [junit4]   2> 	at org.apache.zookeeper.ClientCnxnSocketNIO.doIO(ClientCnxnSocketNIO.java:79) ~[zookeeper-3.4.13.jar:3.4.13-2d71af4dbe22557fda74f9a9b4309b15a7487f03]
   [junit4]   2> 	at org.apache.zookeeper.ClientCnxnSocketNIO.doTransport(ClientCnxnSocketNIO.java:366) ~[zookeeper-3.4.13.jar:3.4.13-2d71af4dbe22557fda74f9a9b4309b15a7487f03]
   [junit4]   2> 	at org.apache.zookeeper.ClientCnxn$SendThread.run(ClientCnxn.java:1145) [zookeeper-3.4.13.jar:3.4.13-2d71af4dbe22557fda74f9a9b4309b15a7487f03]
   [junit4]   2> 114081 WARN  (jetty-launcher-936-thread-1-SendThread(serv1-vm3:60005)) [    ] o.a.z.ClientCnxn Session 0x0 for server serv1-vm3/127.0.0.1:60005, unexpected error, closing socket connection and attempting reconnect
   [junit4]   2> java.io.IOException: Packet len352518912 is out of range!
   [junit4]   2> 	at org.apache.zookeeper.ClientCnxnSocket.readLength(ClientCnxnSocket.java:113) ~[zookeeper-3.4.13.jar:3.4.13-2d71af4dbe22557fda74f9a9b4309b15a7487f03]
   [junit4]   2> 	at org.apache.zookeeper.ClientCnxnSocketNIO.doIO(ClientCnxnSocketNIO.java:79) ~[zookeeper-3.4.13.jar:3.4.13-2d71af4dbe22557fda74f9a9b4309b15a7487f03]
   [junit4]   2> 	at org.apache.zookeeper.ClientCnxnSocketNIO.doTransport(ClientCnxnSocketNIO.java:366) ~[zookeeper-3.4.13.jar:3.4.13-2d71af4dbe22557fda74f9a9b4309b15a7487f03]
   [junit4]   2> 	at org.apache.zookeeper.ClientCnxn$SendThread.run(ClientCnxn.java:1145) [zookeeper-3.4.13.jar:3.4.13-2d71af4dbe22557fda74f9a9b4309b15a7487f03]
   [junit4]   2> 115757 WARN  (jetty-launcher-936-thread-1-SendThread(serv1-vm3:60005)) [    ] o.a.z.ClientCnxn Session 0x0 for server serv1-vm3/127.0.0.1:60005, unexpected error, closing socket connection and attempting reconnect
   [junit4]   2> java.io.IOException: Packet len352518912 is out of range!
   [junit4]   2> 	at org.apache.zookeeper.ClientCnxnSocket.readLength(ClientCnxnSocket.java:113) ~[zookeeper-3.4.13.jar:3.4.13-2d71af4dbe22557fda74f9a9b4309b15a7487f03]
   [junit4]   2> 	at org.apache.zookeeper.ClientCnxnSocketNIO.doIO(ClientCnxnSocketNIO.java:79) ~[zookeeper-3.4.13.jar:3.4.13-2d71af4dbe22557fda74f9a9b4309b15a7487f03]
   [junit4]   2> 	at org.apache.zookeeper.ClientCnxnSocketNIO.doTransport(ClientCnxnSocketNIO.java:366) ~[zookeeper-3.4.13.jar:3.4.13-2d71af4dbe22557fda74f9a9b4309b15a7487f03]
   [junit4]   2> 	at org.apache.zookeeper.ClientCnxn$SendThread.run(ClientCnxn.java:1145) [zookeeper-3.4.13.jar:3.4.13-2d71af4dbe22557fda74f9a9b4309b15a7487f03]
   [junit4]   2> 116421 ERROR (jetty-launcher-936-thread-1) [    ] o.a.s.s.SolrDispatchFilter Could not start Solr. Check solr/home property and the logs
   [junit4]   2> 116421 ERROR (jetty-launcher-936-thread-1) [    ] o.a.s.c.SolrCore null:org.apache.solr.common.SolrException: Error occurred while loading solr.xml from zookeeper
   [junit4]   2> 	at org.apache.solr.servlet.SolrDispatchFilter.loadNodeConfig(SolrDispatchFilter.java:280)
   [junit4]   2> 	at org.apache.solr.servlet.SolrDispatchFilter.createCoreContainer(SolrDispatchFilter.java:250)
   [junit4]   2> 	at org.apache.solr.servlet.SolrDispatchFilter.init(SolrDispatchFilter.java:172)
   [junit4]   2> 	at org.eclipse.jetty.servlet.FilterHolder.initialize(FilterHolder.java:136)
   [junit4]   2> 	at org.eclipse.jetty.servlet.ServletHandler.lambda$initialize$0(ServletHandler.java:750)
   [junit4]   2> 	at java.util.Spliterators$ArraySpliterator.forEachRemaining(Spliterators.java:948)
   [junit4]   2> 	at java.util.stream.Streams$ConcatSpliterator.forEachRemaining(Streams.java:742)
   [junit4]   2> 	at java.util.stream.Streams$ConcatSpliterator.forEachRemaining(Streams.java:742)
   [junit4]   2> 	at java.util.stream.ReferencePipeline$Head.forEach(ReferencePipeline.java:580)
   [junit4]   2> 	at org.eclipse.jetty.servlet.ServletHandler.initialize(ServletHandler.java:744)
   [junit4]   2> 	at org.eclipse.jetty.servlet.ServletHandler.updateMappings(ServletHandler.java:1449)
   [junit4]   2> 	at org.eclipse.jetty.servlet.ServletHandler.setFilterMappings(ServletHandler.java:1513)
   [junit4]   2> 	at org.eclipse.jetty.servlet.ServletHandler.addFilterMapping(ServletHandler.java:1158)
   [junit4]   2> 	at org.eclipse.jetty.servlet.ServletHandler.addFilterWithMapping(ServletHandler.java:995)
   [junit4]   2> 	at org.eclipse.jetty.servlet.ServletContextHandler.addFilter(ServletContextHandler.java:467)
   [junit4]   2> 	at org.apache.solr.client.solrj.embedded.JettySolrRunner$1.lifeCycleStarted(JettySolrRunner.java:381)
   [junit4]   2> 	at org.eclipse.jetty.util.component.AbstractLifeCycle.setStarted(AbstractLifeCycle.java:179)
   [junit4]   2> 	at org.eclipse.jetty.util.component.AbstractLifeCycle.start(AbstractLifeCycle.java:69)
   [junit4]   2> 	at org.apache.solr.client.solrj.embedded.JettySolrRunner.retryOnPortBindFailure(JettySolrRunner.java:544)
   [junit4]   2> 	at org.apache.solr.client.solrj.embedded.JettySolrRunner.start(JettySolrRunner.java:483)
   [junit4]   2> 	at org.apache.solr.client.solrj.embedded.JettySolrRunner.start(JettySolrRunner.java:451)
   [junit4]   2> 	at org.apache.solr.cloud.MiniSolrCloudCluster.startJettySolrRunner(MiniSolrCloudCluster.java:434)
   [junit4]   2> 	at org.apache.solr.cloud.MiniSolrCloudCluster.lambda$new$0(MiniSolrCloudCluster.java:269)
   [junit4]   2> 	at java.util.concurrent.FutureTask.run(FutureTask.java:266)
   [junit4]   2> 	at org.apache.solr.common.util.ExecutorUtil$MDCAwareThreadPoolExecutor.lambda$execute$0(ExecutorUtil.java:209)
   [junit4]   2> 	at java.util.concurrent.ThreadPoolExecutor.runWorker(ThreadPoolExecutor.java:1149)
   [junit4]   2> 	at java.util.concurrent.ThreadPoolExecutor$Worker.run(ThreadPoolExecutor.java:624)
   [junit4]   2> 	at java.lang.Thread.run(Thread.java:748)
   [junit4]   2> Caused by: org.apache.solr.common.SolrException: java.util.concurrent.TimeoutException: Could not connect to ZooKeeper 127.0.0.1:60005/solr within 30000 ms
   [junit4]   2> 	at org.apache.solr.common.cloud.SolrZkClient.<init>(SolrZkClient.java:201)
   [junit4]   2> 	at org.apache.solr.common.cloud.SolrZkClient.<init>(SolrZkClient.java:126)
   [junit4]   2> 	at org.apache.solr.common.cloud.SolrZkClient.<init>(SolrZkClient.java:121)
   [junit4]   2> 	at org.apache.solr.common.cloud.SolrZkClient.<init>(SolrZkClient.java:108)
   [junit4]   2> 	at org.apache.solr.servlet.SolrDispatchFilter.loadNodeConfig(SolrDispatchFilter.java:273)
   [junit4]   2> 	... 27 more
   [junit4]   2> Caused by: java.util.concurrent.TimeoutException: Could not connect to ZooKeeper 127.0.0.1:60005/solr within 30000 ms
   [junit4]   2> 	at org.apache.solr.common.cloud.ConnectionManager.waitForConnected(ConnectionManager.java:250)
   [junit4]   2> 	at org.apache.solr.common.cloud.SolrZkClient.<init>(SolrZkClient.java:193)
   [junit4]   2> 	... 31 more
   [junit4]   2> 
   [junit4]   2> 118030 INFO  (SUITE-DirectJsonQueryRequestFacetingIntegrationTest-seed#[B62EE87E71D19AAC]-worker) [    ] o.a.s.c.ZkTestServer Shutting down ZkTestServer.
   [junit4]   2> 118056 INFO  (SUITE-DirectJsonQueryRequestFacetingIntegrationTest-seed#[B62EE87E71D19AAC]-worker) [    ] o.a.s.c.ZkTestServer parse host and port list: 127.0.0.1:60005
   [junit4]   2> 118057 INFO  (SUITE-DirectJsonQueryRequestFacetingIntegrationTest-seed#[B62EE87E71D19AAC]-worker) [    ] o.a.s.c.ZkTestServer connecting to 127.0.0.1 60005
   [junit4]   2> 118322 INFO  (SUITE-DirectJsonQueryRequestFacetingIntegrationTest-seed#[B62EE87E71D19AAC]-worker) [    ] o.a.s.c.ZkTestServer parse host and port list: 127.0.0.1:60005
   [junit4]   2> 118322 INFO  (SUITE-DirectJsonQueryRequestFacetingIntegrationTest-seed#[B62EE87E71D19AAC]-worker) [    ] o.a.s.c.ZkTestServer connecting to 127.0.0.1 60005
   [junit4]   2> 118575 INFO  (SUITE-DirectJsonQueryRequestFacetingIntegrationTest-seed#[B62EE87E71D19AAC]-worker) [    ] o.a.s.c.ZkTestServer parse host and port list: 127.0.0.1:60005
   [junit4]   2> 118575 INFO  (SUITE-DirectJsonQueryRequestFacetingIntegrationTest-seed#[B62EE87E71D19AAC]-worker) [    ] o.a.s.c.ZkTestServer connecting to 127.0.0.1 60005
   [junit4]   2> 118829 INFO  (SUITE-DirectJsonQueryRequestFacetingIntegrationTest-seed#[B62EE87E71D19AAC]-worker) [    ] o.a.s.c.ZkTestServer parse host and port list: 127.0.0.1:60005
   [junit4]   2> 118829 INFO  (SUITE-DirectJsonQueryRequestFacetingIntegrationTest-seed#[B62EE87E71D19AAC]-worker) [    ] o.a.s.c.ZkTestServer connecting to 127.0.0.1 60005
   [junit4]   2> 119082 INFO  (SUITE-DirectJsonQueryRequestFacetingIntegrationTest-seed#[B62EE87E71D19AAC]-worker) [    ] o.a.s.c.ZkTestServer parse host and port list: 127.0.0.1:60005
   [junit4]   2> 119082 INFO  (SUITE-DirectJsonQueryRequestFacetingIntegrationTest-seed#[B62EE87E71D19AAC]-worker) [    ] o.a.s.c.ZkTestServer connecting to 127.0.0.1 60005
   [junit4]   2> 119335 INFO  (SUITE-DirectJsonQueryRequestFacetingIntegrationTest-seed#[B62EE87E71D19AAC]-worker) [    ] o.a.s.c.ZkTestServer parse host and port list: 127.0.0.1:60005
   [junit4]   2> 119335 INFO  (SUITE-DirectJsonQueryRequestFacetingIntegrationTest-seed#[B62EE87E71D19AAC]-worker) [    ] o.a.s.c.ZkTestServer connecting to 127.0.0.1 60005
   [junit4]   2> 119588 INFO  (SUITE-DirectJsonQueryRequestFacetingIntegrationTest-seed#[B62EE87E71D19AAC]-worker) [    ] o.a.s.c.ZkTestServer parse host and port list: 127.0.0.1:60005
   [junit4]   2> 119588 INFO  (SUITE-DirectJsonQueryRequestFacetingIntegrationTest-seed#[B62EE87E71D19AAC]-worker) [    ] o.a.s.c.ZkTestServer connecting to 127.0.0.1 60005
   [junit4]   2> 119840 INFO  (SUITE-DirectJsonQueryRequestFacetingIntegrationTest-seed#[B62EE87E71D19AAC]-worker) [    ] o.a.s.c.ZkTestServer parse host and port list: 127.0.0.1:60005
   [junit4]   2> 119840 INFO  (SUITE-DirectJsonQueryRequestFacetingIntegrationTest-seed#[B62EE87E71D19AAC]-worker) [    ] o.a.s.c.ZkTestServer connecting to 127.0.0.1 60005
   [junit4]   2> 120093 INFO  (SUITE-DirectJsonQueryRequestFacetingIntegrationTest-seed#[B62EE87E71D19AAC]-worker) [    ] o.a.s.c.ZkTestServer parse host and port list: 127.0.0.1:60005
   [junit4]   2> 120093 INFO  (SUITE-DirectJsonQueryRequestFacetingIntegrationTest-seed#[B62EE87E71D19AAC]-worker) [    ] o.a.s.c.ZkTestServer connecting to 127.0.0.1 60005
   [junit4]   2> 120345 INFO  (SUITE-DirectJsonQueryRequestFacetingIntegrationTest-seed#[B62EE87E71D19AAC]-worker) [    ] o.a.s.c.ZkTestServer parse host and port list: 127.0.0.1:60005
   [junit4]   2> 120345 INFO  (SUITE-DirectJsonQueryRequestFacetingIntegrationTest-seed#[B62EE87E71D19AAC]-worker) [    ] o.a.s.c.ZkTestServer connecting to 127.0.0.1 60005
   [junit4]   2> 120597 INFO  (SUITE-DirectJsonQueryRequestFacetingIntegrationTest-seed#[B62EE87E71D19AAC]-worker) [    ] o.a.s.c.ZkTestServer parse host and port list: 127.0.0.1:60005
   [junit4]   2> 120597 INFO  (SUITE-DirectJsonQueryRequestFacetingIntegrationTest-seed#[B62EE87E71D19AAC]-worker) [    ] o.a.s.c.ZkTestServer connecting to 127.0.0.1 60005
   [junit4]   2> 120850 INFO  (SUITE-DirectJsonQueryRequestFacetingIntegrationTest-seed#[B62EE87E71D19AAC]-worker) [    ] o.a.s.c.ZkTestServer parse host and port list: 127.0.0.1:60005
   [junit4]   2> 120850 INFO  (SUITE-DirectJsonQueryRequestFacetingIntegrationTest-seed#[B62EE87E71D19AAC]-worker) [    ] o.a.s.c.ZkTestServer connecting to 127.0.0.1 60005
   [junit4]   2> 121103 INFO  (SUITE-DirectJsonQueryRequestFacetingIntegrationTest-seed#[B62EE87E71D19AAC]-worker) [    ] o.a.s.c.ZkTestServer parse host and port list: 127.0.0.1:60005
   [junit4]   2> 121103 INFO  (SUITE-DirectJsonQueryRequestFacetingIntegrationTest-seed#[B62EE87E71D19AAC]-worker) [    ] o.a.s.c.ZkTestServer connecting to 127.0.0.1 60005
   [junit4]   2> 121356 INFO  (SUITE-DirectJsonQueryRequestFacetingIntegrationTest-seed#[B62EE87E71D19AAC]-worker) [    ] o.a.s.c.ZkTestServer parse host and port list: 127.0.0.1:60005
   [junit4]   2> 121356 INFO  (SUITE-DirectJsonQueryRequestFacetingIntegrationTest-seed#[B62EE87E71D19AAC]-worker) [    ] o.a.s.c.ZkTestServer connecting to 127.0.0.1 60005
   [junit4]   2> 121610 INFO  (SUITE-DirectJsonQueryRequestFacetingIntegrationTest-seed#[B62EE87E71D19AAC]-worker) [    ] o.a.s.c.ZkTestServer parse host and port list: 127.0.0.1:60005
   [junit4]   2> 121610 INFO  (SUITE-DirectJsonQueryRequestFacetingIntegrationTest-seed#[B62EE87E71D19AAC]-worker) [    ] o.a.s.c.ZkTestServer connecting to 127.0.0.1 60005
   [junit4]   2> 121868 INFO  (SUITE-DirectJsonQueryRequestFacetingIntegrationTest-seed#[B62EE87E71D19AAC]-worker) [    ] o.a.s.c.ZkTestServer parse host and port list: 127.0.0.1:60005
   [junit4]   2> 121868 INFO  (SUITE-DirectJsonQueryRequestFacetingIntegrationTest-seed#[B62EE87E71D19AAC]-worker) [    ] o.a.s.c.ZkTestServer connecting to 127.0.0.1 60005
   [junit4]   2> 122126 INFO  (SUITE-DirectJsonQueryRequestFacetingIntegrationTest-seed#[B62EE87E71D19AAC]-worker) [    ] o.a.s.c.ZkTestServer parse host and port list: 127.0.0.1:60005
   [junit4]   2> 122126 INFO  (SUITE-DirectJsonQueryRequestFacetingIntegrationTest-seed#[B62EE87E71D19AAC]-worker) [    ] o.a.s.c.ZkTestServer connecting to 127.0.0.1 60005
   [junit4]   2> 122379 INFO  (SUITE-DirectJsonQueryRequestFacetingIntegrationTest-seed#[B62EE87E71D19AAC]-worker) [    ] o.a.s.c.ZkTestServer parse host and port list: 127.0.0.1:60005
   [junit4]   2> 122379 INFO  (SUITE-DirectJsonQueryRequestFacetingIntegrationTest-seed#[B62EE87E71D19AAC]-worker) [    ] o.a.s.c.ZkTestServer connecting to 127.0.0.1 60005
   [junit4]   2> 122632 INFO  (SUITE-DirectJsonQueryRequestFacetingIntegrationTest-seed#[B62EE87E71D19AAC]-worker) [    ] o.a.s.c.ZkTestServer parse host and port list: 127.0.0.1:60005
   [junit4]   2> 122632 INFO  (SUITE-DirectJsonQueryRequestFacetingIntegrationTest-seed#[B62EE87E71D19AAC]-worker) [    ] o.a.s.c.ZkTestServer connecting to 127.0.0.1 60005
   [junit4]   2> 122884 INFO  (SUITE-DirectJsonQueryRequestFacetingIntegrationTest-seed#[B62EE87E71D19AAC]-worker) [    ] o.a.s.c.ZkTestServer parse host and port list: 127.0.0.1:60005
   [junit4]   2> 122884 INFO  (SUITE-DirectJsonQueryRequestFacetingIntegrationTest-seed#[B62EE87E71D19AAC]-worker) [    ] o.a.s.c.ZkTestServer connecting to 127.0.0.1 60005
   [junit4]   2> 123137 INFO  (SUITE-DirectJsonQueryRequestFacetingIntegrationTest-seed#[B62EE87E71D19AAC]-worker) [    ] o.a.s.c.ZkTestServer parse host and port list: 127.0.0.1:60005
   [junit4]   2> 123137 INFO  (SUITE-DirectJsonQueryRequestFacetingIntegrationTest-seed#[B62EE87E71D19AAC]-worker) [    ] o.a.s.c.ZkTestServer connecting to 127.0.0.1 60005
   [junit4]   2> 123389 INFO  (SUITE-DirectJsonQueryRequestFacetingIntegrationTest-seed#[B62EE87E71D19AAC]-worker) [    ] o.a.s.c.ZkTestServer parse host and port list: 127.0.0.1:60005
   [junit4]   2> 123389 INFO  (SUITE-DirectJsonQueryRequestFacetingIntegrationTest-seed#[B62EE87E71D19AAC]-worker) [    ] o.a.s.c.ZkTestServer connecting to 127.0.0.1 60005
   [junit4]   2> 123643 INFO  (SUITE-DirectJsonQueryRequestFacetingIntegrationTest-seed#[B62EE87E71D19AAC]-worker) [    ] o.a.s.c.ZkTestServer parse host and port list: 127.0.0.1:60005
   [junit4]   2> 123643 INFO  (SUITE-DirectJsonQueryRequestFacetingIntegrationTest-seed#[B62EE87E71D19AAC]-worker) [    ] o.a.s.c.ZkTestServer connecting to 127.0.0.1 60005
   [junit4]   2> 123896 INFO  (SUITE-DirectJsonQueryRequestFacetingIntegrationTest-seed#[B62EE87E71D19AAC]-worker) [    ] o.a.s.c.ZkTestServer parse host and port list: 127.0.0.1:60005
   [junit4]   2> 123896 INFO  (SUITE-DirectJsonQueryRequestFacetingIntegrationTest-seed#[B62EE87E71D19AAC]-worker) [    ] o.a.s.c.ZkTestServer connecting to 127.0.0.1 60005
   [junit4]   2> 124148 INFO  (SUITE-DirectJsonQueryRequestFacetingIntegrationTest-seed#[B62EE87E71D19AAC]-worker) [    ] o.a.s.c.ZkTestServer parse host and port list: 127.0.0.1:60005
   [junit4]   2> 124148 INFO  (SUITE-DirectJsonQueryRequestFacetingIntegrationTest-seed#[B62EE87E71D19AAC]-worker) [    ] o.a.s.c.ZkTestServer connecting to 127.0.0.1 60005
   [junit4]   2> 124399 INFO  (SUITE-DirectJsonQueryRequestFacetingIntegrationTest-seed#[B62EE87E71D19AAC]-worker) [    ] o.a.s.c.ZkTestServer parse host and port list: 127.0.0.1:60005
   [junit4]   2> 124399 INFO  (SUITE-DirectJsonQueryRequestFacetingIntegrationTest-seed#[B62EE87E71D19AAC]-worker) [    ] o.a.s.c.ZkTestServer connecting to 127.0.0.1 60005
   [junit4]   2> 124652 INFO  (SUITE-DirectJsonQueryRequestFacetingIntegrationTest-seed#[B62EE87E71D19AAC]-worker) [    ] o.a.s.c.ZkTestServer parse host and port list: 127.0.0.1:60005
   [junit4]   2> 124652 INFO  (SUITE-DirectJsonQueryRequestFacetingIntegrationTest-seed#[B62EE87E71D19AAC]-worker) [    ] o.a.s.c.ZkTestServer connecting to 127.0.0.1 60005
   [junit4]   2> 124905 INFO  (SUITE-DirectJsonQueryRequestFacetingIntegrationTest-seed#[B62EE87E71D19AAC]-worker) [    ] o.a.s.c.ZkTestServer parse host and port list: 127.0.0.1:60005
   [junit4]   2> 124905 INFO  (SUITE-DirectJsonQueryRequestFacetingIntegrationTest-seed#[B62EE87E71D19AAC]-worker) [    ] o.a.s.c.ZkTestServer connecting to 127.0.0.1 60005
   [junit4]   2> 125157 INFO  (SUITE-DirectJsonQueryRequestFacetingIntegrationTest-seed#[B62EE87E71D19AAC]-worker) [    ] o.a.s.c.ZkTestServer parse host and port list: 127.0.0.1:60005
   [junit4]   2> 125157 INFO  (SUITE-DirectJsonQueryRequestFacetingIntegrationTest-seed#[B62EE87E71D19AAC]-worker) [    ] o.a.s.c.ZkTestServer connecting to 127.0.0.1 60005
   [junit4]   2> 125409 INFO  (SUITE-DirectJsonQueryRequestFacetingIntegrationTest-seed#[B62EE87E71D19AAC]-worker) [    ] o.a.s.c.ZkTestServer parse host and port list: 127.0.0.1:60005
   [junit4]   2> 125409 INFO  (SUITE-DirectJsonQueryRequestFacetingIntegrationTest-seed#[B62EE87E71D19AAC]-worker) [    ] o.a.s.c.ZkTestServer connecting to 127.0.0.1 60005
   [junit4]   2> 125662 INFO  (SUITE-DirectJsonQueryRequestFacetingIntegrationTest-seed#[B62EE87E71D19AAC]-worker) [    ] o.a.s.c.ZkTestServer parse host and port list: 127.0.0.1:60005
   [junit4]   2> 125662 INFO  (SUITE-DirectJsonQueryRequestFacetingIntegrationTest-seed#[B62EE87E71D19AAC]-worker) [    ] o.a.s.c.ZkTestServer connecting to 127.0.0.1 60005
   [junit4]   2> 125916 INFO  (SUITE-DirectJsonQueryRequestFacetingIntegrationTest-seed#[B62EE87E71D19AAC]-worker) [    ] o.a.s.c.ZkTestServer parse host and port list: 127.0.0.1:60005
   [junit4]   2> 125916 INFO  (SUITE-DirectJsonQueryRequestFacetingIntegrationTest-seed#[B62EE87E71D19AAC]-worker) [    ] o.a.s.c.ZkTestServer connecting to 127.0.0.1 60005
   [junit4]   2> 126167 INFO  (SUITE-DirectJsonQueryRequestFacetingIntegrationTest-seed#[B62EE87E71D19AAC]-worker) [    ] o.a.s.c.ZkTestServer parse host and port list: 127.0.0.1:60005
   [junit4]   2> 126167 INFO  (SUITE-DirectJsonQueryRequestFacetingIntegrationTest-seed#[B62EE87E71D19AAC]-worker) [    ] o.a.s.c.ZkTestServer connecting to 127.0.0.1 60005
   [junit4]   2> 126420 INFO  (SUITE-DirectJsonQueryRequestFacetingIntegrationTest-seed#[B62EE87E71D19AAC]-worker) [    ] o.a.s.c.ZkTestServer parse host and port list: 127.0.0.1:60005
   [junit4]   2> 126420 INFO  (SUITE-DirectJsonQueryRequestFacetingIntegrationTest-seed#[B62EE87E71D19AAC]-worker) [    ] o.a.s.c.ZkTestServer connecting to 127.0.0.1 60005
   [junit4]   2> 126671 INFO  (SUITE-DirectJsonQueryRequestFacetingIntegrationTest-seed#[B62EE87E71D19AAC]-worker) [    ] o.a.s.c.ZkTestServer parse host and port list: 127.0.0.1:60005
   [junit4]   2> 126671 INFO  (SUITE-DirectJsonQueryRequestFacetingIntegrationTest-seed#[B62EE87E71D19AAC]-worker) [    ] o.a.s.c.ZkTestServer connecting to 127.0.0.1 60005
   [junit4]   2> 126930 INFO  (SUITE-DirectJsonQueryRequestFacetingIntegrationTest-seed#[B62EE87E71D19AAC]-worker) [    ] o.a.s.c.ZkTestServer parse host and port list: 127.0.0.1:60005
   [junit4]   2> 126930 INFO  (SUITE-DirectJsonQueryRequestFacetingIntegrationTest-seed#[B62EE87E71D19AAC]-worker) [    ] o.a.s.c.ZkTestServer connecting to 127.0.0.1 60005
   [junit4]   2> 127182 INFO  (SUITE-DirectJsonQueryRequestFacetingIntegrationTest-seed#[B62EE87E71D19AAC]-worker) [    ] o.a.s.c.ZkTestServer parse host and port list: 127.0.0.1:60005
   [junit4]   2> 127182 INFO  (SUITE-DirectJsonQueryRequestFacetingIntegrationTest-seed#[B62EE87E71D19AAC]-worker) [    ] o.a.s.c.ZkTestServer connecting to 127.0.0.1 60005
   [junit4]   2> 127434 INFO  (SUITE-DirectJsonQueryRequestFacetingIntegrationTest-seed#[B62EE87E71D19AAC]-worker) [    ] o.a.s.c.ZkTestServer parse host and port list: 127.0.0.1:60005
   [junit4]   2> 127435 INFO  (SUITE-DirectJsonQueryRequestFacetingIntegrationTest-seed#[B62EE87E71D19AAC]-worker) [    ] o.a.s.c.ZkTestServer connecting to 127.0.0.1 60005
   [junit4]   2> 127687 INFO  (SUITE-DirectJsonQueryRequestFacetingIntegrationTest-seed#[B62EE87E71D19AAC]-worker) [    ] o.a.s.c.ZkTestServer parse host and port list: 127.0.0.1:60005
   [junit4]   2> 127687 INFO  (SUITE-DirectJsonQueryRequestFacetingIntegrationTest-seed#[B62EE87E71D19AAC]-worker) [    ] o.a.s.c.ZkTestServer connecting to 127.0.0.1 60005
   [junit4]   2> 127939 INFO  (SUITE-DirectJsonQueryRequestFacetingIntegrationTest-seed#[B62EE87E71D19AAC]-worker) [    ] o.a.s.c.ZkTestServer parse host and port list: 127.0.0.1:60005
   [junit4]   2> 127939 INFO  (SUITE-DirectJsonQueryRequestFacetingIntegrationTest-seed#[B62EE87E71D19AAC]-worker) [    ] o.a.s.c.ZkTestServer connecting to 127.0.0.1 60005
   [junit4]   2> 128195 INFO  (SUITE-DirectJsonQueryRequestFacetingIntegrationTest-seed#[B62EE87E71D19AAC]-worker) [    ] o.a.s.c.ZkTestServer parse host and port list: 127.0.0.1:60005
   [junit4]   2> 128195 INFO  (SUITE-DirectJsonQueryRequestFacetingIntegrationTest-seed#[B62EE87E71D19AAC]-worker) [    ] o.a.s.c.ZkTestServer connecting to 127.0.0.1 60005
   [junit4]   2> 128448 INFO  (SUITE-DirectJsonQueryRequestFacetingIntegrationTest-seed#[B62EE87E71D19AAC]-worker) [    ] o.a.s.c.ZkTestServer parse host and port list: 127.0.0.1:60005
   [junit4]   2> 128448 INFO  (SUITE-DirectJsonQueryRequestFacetingIntegrationTest-seed#[B62EE87E71D19AAC]-worker) [    ] o.a.s.c.ZkTestServer connecting to 127.0.0.1 60005
   [junit4]   2> 128699 INFO  (SUITE-DirectJsonQueryRequestFacetingIntegrationTest-seed#[B62EE87E71D19AAC]-worker) [    ] o.a.s.c.ZkTestServer parse host and port list: 127.0.0.1:60005
   [junit4]   2> 128699 INFO  (SUITE-DirectJsonQueryRequestFacetingIntegrationTest-seed#[B62EE87E71D19AAC]-worker) [    ] o.a.s.c.ZkTestServer connecting to 127.0.0.1 60005
   [junit4]   2> 128952 INFO  (SUITE-DirectJsonQueryRequestFacetingIntegrationTest-seed#[B62EE87E71D19AAC]-worker) [    ] o.a.s.c.ZkTestServer parse host and port list: 127.0.0.1:60005
   [junit4]   2> 128952 INFO  (SUITE-DirectJsonQueryRequestFacetingIntegrationTest-seed#[B62EE87E71D19AAC]-worker) [    ] o.a.s.c.ZkTestServer connecting to 127.0.0.1 60005
   [junit4]   2> 129203 INFO  (SUITE-DirectJsonQueryRequestFacetingIntegrationTest-seed#[B62EE87E71D19AAC]-worker) [    ] o.a.s.c.ZkTestServer parse host and port list: 127.0.0.1:60005
   [junit4]   2> 129203 INFO  (SUITE-DirectJsonQueryRequestFacetingIntegrationTest-seed#[B62EE87E71D19AAC]-worker) [    ] o.a.s.c.ZkTestServer connecting to 127.0.0.1 60005
   [junit4]   2> 129455 INFO  (SUITE-DirectJsonQueryRequestFacetingIntegrationTest-seed#[B62EE87E71D19AAC]-worker) [    ] o.a.s.c.ZkTestServer parse host and port list: 127.0.0.1:60005
   [junit4]   2> 129455 INFO  (SUITE-DirectJsonQueryRequestFacetingIntegrationTest-seed#[B62EE87E71D19AAC]-worker) [    ] o.a.s.c.ZkTestServer connecting to 127.0.0.1 60005
   [junit4]   2> 129706 INFO  (SUITE-DirectJsonQueryRequestFacetingIntegrationTest-seed#[B62EE87E71D19AAC]-worker) [    ] o.a.s.c.ZkTestServer parse host and port list: 127.0.0.1:60005
   [junit4]   2> 129706 INFO  (SUITE-DirectJsonQueryRequestFacetingIntegrationTest-seed#[B62EE87E71D19AAC]-worker) [    ] o.a.s.c.ZkTestServer connecting to 127.0.0.1 60005
   [junit4]   2> 129957 INFO  (SUITE-DirectJsonQueryRequestFacetingIntegrationTest-seed#[B62EE87E71D19AAC]-worker) [    ] o.a.s.c.ZkTestServer parse host and port list: 127.0.0.1:60005
   [junit4]   2> 129957 INFO  (SUITE-DirectJsonQueryRequestFacetingIntegrationTest-seed#[B62EE87E71D19AAC]-worker) [    ] o.a.s.c.ZkTestServer connecting to 127.0.0.1 60005
   [junit4]   2> 130210 INFO  (SUITE-DirectJsonQueryRequestFacetingIntegrationTest-seed#[B62EE87E71D19AAC]-worker) [    ] o.a.s.c.ZkTestServer parse host and port list: 127.0.0.1:60005
   [junit4]   2> 130210 INFO  (SUITE-DirectJsonQueryRequestFacetingIntegrationTest-seed#[B62EE87E71D19AAC]-worker) [    ] o.a.s.c.ZkTestServer connecting to 127.0.0.1 60005
   [junit4]   2> 130461 INFO  (SUITE-DirectJsonQueryRequestFacetingIntegrationTest-seed#[B62EE87E71D19AAC]-worker) [    ] o.a.s.c.ZkTestServer parse host and port list: 127.0.0.1:60005
   [junit4]   2> 130461 INFO  (SUITE-DirectJsonQueryRequestFacetingIntegrationTest-seed#[B62EE87E71D19AAC]-worker) [    ] o.a.s.c.ZkTestServer connecting to 127.0.0.1 60005
   [junit4]   2> 130713 INFO  (SUITE-DirectJsonQueryRequestFacetingIntegrationTest-seed#[B62EE87E71D19AAC]-worker) [    ] o.a.s.c.ZkTestServer parse host and port list: 127.0.0.1:60005
   [junit4]   2> 130713 INFO  (SUITE-DirectJsonQueryRequestFacetingIntegrationTest-seed#[B62EE87E71D19AAC]-worker) [    ] o.a.s.c.ZkTestServer connecting to 127.0.0.1 60005
   [junit4]   2> 130965 INFO  (SUITE-DirectJsonQueryRequestFacetingIntegrationTest-seed#[B62EE87E71D19AAC]-worker) [    ] o.a.s.c.ZkTestServer parse host and port list: 127.0.0.1:60005
   [junit4]   2> 130965 INFO  (SUITE-DirectJsonQueryRequestFacetingIntegrationTest-seed#[B62EE87E71D19AAC]-worker) [    ] o.a.s.c.ZkTestServer connecting to 127.0.0.1 60005
   [junit4]   2> 131216 INFO  (SUITE-DirectJsonQueryRequestFacetingIntegrationTest-seed#[B62EE87E71D19AAC]-worker) [    ] o.a.s.c.ZkTestServer parse host and port list: 127.0.0.1:60005
   [junit4]   2> 131216 INFO  (SUITE-DirectJsonQueryRequestFacetingIntegrationTest-seed#[B62EE87E71D19AAC]-worker) [    ] o.a.s.c.ZkTestServer connecting to 127.0.0.1 60005
   [junit4]   2> 131468 INFO  (SUITE-DirectJsonQueryRequestFacetingIntegrationTest-seed#[B62EE87E71D19AAC]-worker) [    ] o.a.s.c.ZkTestServer parse host and port list: 127.0.0.1:60005
   [junit4]   2> 131468 INFO  (SUITE-DirectJsonQueryRequestFacetingIntegrationTest-seed#[B62EE87E71D19AAC]-worker) [    ] o.a.s.c.ZkTestServer connecting to 127.0.0.1 60005
   [junit4]   2> 131719 INFO  (SUITE-DirectJsonQueryRequestFacetingIntegrationTest-seed#[B62EE87E71D19AAC]-worker) [    ] o.a.s.c.ZkTestServer parse host and port list: 127.0.0.1:60005
   [junit4]   2> 131719 INFO  (SUITE-DirectJsonQueryRequestFacetingIntegrationTest-seed#[B62EE87E71D19AAC]-worker) [    ] o.a.s.c.ZkTestServer connecting to 127.0.0.1 60005
   [junit4]   2> 131971 INFO  (SUITE-DirectJsonQueryRequestFacetingIntegrationTest-seed#[B62EE87E71D19AAC]-worker) [    ] o.a.s.c.ZkTestServer parse host and port list: 127.0.0.1:60005
   [junit4]   2> 131971 INFO  (SUITE-DirectJsonQueryRequestFacetingIntegrationTest-seed#[B62EE87E71D19AAC]-worker) [    ] o.a.s.c.ZkTestServer connecting to 127.0.0.1 60005
   [junit4]   2> 132222 INFO  (SUITE-DirectJsonQueryRequestFacetingIntegrationTest-seed#[B62EE87E71D19AAC]-worker) [    ] o.a.s.c.ZkTestServer parse host and port list: 127.0.0.1:60005
   [junit4]   2> 132222 INFO  (SUITE-DirectJsonQueryRequestFacetingIntegrationTest-seed#[B62EE87E71D19AAC]-worker) [    ] o.a.s.c.ZkTestServer connecting to 127.0.0.1 60005
   [junit4]   2> 132474 INFO  (SUITE-DirectJsonQueryRequestFacetingIntegrationTest-seed#[B62EE87E71D19AAC]-worker) [    ] o.a.s.c.ZkTestServer parse host and port list: 127.0.0.1:60005
   [junit4]   2> 132475 INFO  (SUITE-DirectJsonQueryRequestFacetingIntegrationTest-seed#[B62EE87E71D19AAC]-worker) [    ] o.a.s.c.ZkTestServer connecting to 127.0.0.1 60005
   [junit4]   2> 132727 INFO  (SUITE-DirectJsonQueryRequestFacetingIntegrationTest-seed#[B62EE87E71D19AAC]-worker) [    ] o.a.s.c.ZkTestServer parse host and port list: 127.0.0.1:60005
   [junit4]   2> 132727 INFO  (SUITE-DirectJsonQueryRequestFacetingIntegrationTest-seed#[B62EE87E71D19AAC]-worker) [    ] o.a.s.c.ZkTestServer connecting to 127.0.0.1 60005
   [junit4]   2> 132978 INFO  (SUITE-DirectJsonQueryRequestFacetingIntegrationTest-seed#[B62EE87E71D19AAC]-worker) [    ] o.a.s.c.ZkTestServer parse host and port list: 127.0.0.1:60005
   [junit4]   2> 132978 INFO  (SUITE-DirectJsonQueryRequestFacetingIntegrationTest-seed#[B62EE87E71D19AAC]-worker) [    ] o.a.s.c.ZkTestServer connecting to 127.0.0.1 60005
   [junit4]   2> 133230 INFO  (SUITE-DirectJsonQueryRequestFacetingIntegrationTest-seed#[B62EE87E71D19AAC]-worker) [    ] o.a.s.c.ZkTestServer parse host and port list: 127.0.0.1:60005
   [junit4]   2> 133230 INFO  (SUITE-DirectJsonQueryRequestFacetingIntegrationTest-seed#[B62EE87E71D19AAC]-worker) [    ] o.a.s.c.ZkTestServer connecting to 127.0.0.1 60005
   [junit4]   2> 133481 INFO  (SUITE-DirectJsonQueryRequestFacetingIntegrationTest-seed#[B62EE87E71D19AAC]-worker) [    ] o.a.s.c.ZkTestServer parse host and port list: 127.0.0.1:60005
   [junit4]   2> 133481 INFO  (SUITE-DirectJsonQueryRequestFacetingIntegrationTest-seed#[B62EE87E71D19AAC]-worker) [    ] o.a.s.c.ZkTestServer connecting to 127.0.0.1 60005
   [junit4]   2> 133733 INFO  (SUITE-DirectJsonQueryRequestFacetingIntegrationTest-seed#[B62EE87E71D19AAC]-worker) [    ] o.a.s.c.ZkTestServer parse host and port list: 127.0.0.1:60005
   [junit4]   2> 133733 INFO  (SUITE-DirectJsonQueryRequestFacetingIntegrationTest-seed#[B62EE87E71D19AAC]-worker) [    ] o.a.s.c.ZkTestServer connecting to 127.0.0.1 60005
   [junit4]   2> 133984 INFO  (SUITE-DirectJsonQueryRequestFacetingIntegrationTest-seed#[B62EE87E71D19AAC]-worker) [    ] o.a.s.c.ZkTestServer parse host and port list: 127.0.0.1:60005
   [junit4]   2> 133984 INFO  (SUITE-DirectJsonQueryRequestFacetingIntegrationTest-seed#[B62EE87E71D19AAC]-worker) [    ] o.a.s.c.ZkTestServer connecting to 127.0.0.1 60005
   [junit4]   2> 134236 INFO  (SUITE-DirectJsonQueryRequestFacetingIntegrationTest-seed#[B62EE87E71D19AAC]-worker) [    ] o.a.s.c.ZkTestServer parse host and port list: 127.0.0.1:60005
   [junit4]   2> 134236 INFO  (SUITE-DirectJsonQueryRequestFacetingIntegrationTest-seed#[B62EE87E71D19AAC]-worker) [    ] o.a.s.c.ZkTestServer connecting to 127.0.0.1 60005
   [junit4]   2> 134488 INFO  (SUITE-DirectJsonQueryRequestFacetingIntegrationTest-seed#[B62EE87E71D19AAC]-worker) [    ] o.a.s.c.ZkTestServer parse host and port list: 127.0.0.1:60005
   [junit4]   2> 134488 INFO  (SUITE-DirectJsonQueryRequestFacetingIntegrationTest-seed#[B62EE87E71D19AAC]-worker) [    ] o.a.s.c.ZkTestServer connecting to 127.0.0.1 60005
   [junit4]   2> 134741 INFO  (SUITE-DirectJsonQueryRequestFacetingIntegrationTest-seed#[B62EE87E71D19AAC]-worker) [    ] o.a.s.c.ZkTestServer parse host and port list: 127.0.0.1:60005
   [junit4]   2> 134741 INFO  (SUITE-DirectJsonQueryRequestFacetingIntegrationTest-seed#[B62EE87E71D19AAC]-worker) [    ] o.a.s.c.ZkTestServer connecting to 127.0.0.1 60005
   [junit4]   2> 134993 INFO  (SUITE-DirectJsonQueryRequestFacetingIntegrationTest-seed#[B62EE87E71D19AAC]-worker) [    ] o.a.s.c.ZkTestServer parse host and port list: 127.0.0.1:60005
   [junit4]   2> 134993 INFO  (SUITE-DirectJsonQueryRequestFacetingIntegrationTest-seed#[B62EE87E71D19AAC]-worker) [    ] o.a.s.c.ZkTestServer connecting to 127.0.0.1 60005
   [junit4]   2> 135246 INFO  (SUITE-DirectJsonQueryRequestFacetingIntegrationTest-seed#[B62EE87E71D19AAC]-worker) [    ] o.a.s.c.ZkTestServer parse host and port list: 127.0.0.1:60005
   [junit4]   2> 135246 INFO  (SUITE-DirectJsonQueryRequestFacetingIntegrationTest-seed#[B62EE87E71D19AAC]-worker) [    ] o.a.s.c.ZkTestServer connecting to 127.0.0.1 60005
   [junit4]   2> 135499 INFO  (SUITE-DirectJsonQueryRequestFacetingIntegrationTest-seed#[B62EE87E71D19AAC]-worker) [    ] o.a.s.c.ZkTestServer parse host and port list: 127.0.0.1:60005
   [junit4]   2> 135499 INFO  (SUITE-DirectJsonQueryRequestFacetingIntegrationTest-seed#[B62EE87E71D19AAC]-worker) [    ] o.a.s.c.ZkTestServer connecting to 127.0.0.1 60005
   [junit4]   2> 135751 INFO  (SUITE-DirectJsonQueryRequestFacetingIntegrationTest-seed#[B62EE87E71D19AAC]-worker) [    ] o.a.s.c.ZkTestServer parse host and port list: 127.0.0.1:60005
   [junit4]   2> 135751 INFO  (SUITE-DirectJsonQueryRequestFacetingIntegrationTest-seed#[B62EE87E71D19AAC]-worker) [    ] o.a.s.c.ZkTestServer connecting to 127.0.0.1 60005
   [junit4]   2> 136010 INFO  (SUITE-DirectJsonQueryRequestFacetingIntegrationTest-seed#[B62EE87E71D19AAC]-worker) [    ] o.a.s.c.ZkTestServer parse host and port list: 127.0.0.1:60005
   [junit4]   2> 136010 INFO  (SUITE-DirectJsonQueryRequestFacetingIntegrationTest-seed#[B62EE87E71D19AAC]-worker) [    ] o.a.s.c.ZkTestServer connecting to 127.0.0.1 60005
   [junit4]   2> 136270 INFO  (SUITE-DirectJsonQueryRequestFacetingIntegrationTest-seed#[B62EE87E71D19AAC]-worker) [    ] o.a.s.c.ZkTestServer parse host and port list: 127.0.0.1:60005
   [junit4]   2> 136270 INFO  (SUITE-DirectJsonQueryRequestFacetingIntegrationTest-seed#[B62EE87E71D19AAC]-worker) [    ] o.a.s.c.ZkTestServer connecting to 127.0.0.1 60005
   [junit4]   2> 136522 INFO  (SUITE-DirectJsonQueryRequestFacetingIntegrationTest-seed#[B62EE87E71D19AAC]-worker) [    ] o.a.s.c.ZkTestServer parse host and port list: 127.0.0.1:60005
   [junit4]   2> 136522 INFO  (SUITE-DirectJsonQueryRequestFacetingIntegrationTest-seed#[B62EE87E71D19AAC]-worker) [    ] o.a.s.c.ZkTestServer connecting to 127.0.0.1 60005
   [junit4]   2> 136774 INFO  (SUITE-DirectJsonQueryRequestFacetingIntegrationTest-seed#[B62EE87E71D19AAC]-worker) [    ] o.a.s.c.ZkTestServer parse host and port list: 127.0.0.1:60005
   [junit4]   2> 136774 INFO  (SUITE-DirectJsonQueryRequestFacetingIntegrationTest-seed#[B62EE87E71D19AAC]-worker) [    ] o.a.s.c.ZkTestServer connecting to 127.0.0.1 60005
   [junit4]   2> 137027 INFO  (SUITE-DirectJsonQueryRequestFacetingIntegrationTest-seed#[B62EE87E71D19AAC]-worker) [    ] o.a.s.c.ZkTestServer parse host and port list: 127.0.0.1:60005
   [junit4]   2> 137027 INFO  (SUITE-DirectJsonQueryRequestFacetingIntegrationTest-seed#[B62EE87E71D19AAC]-worker) [    ] o.a.s.c.ZkTestServer connecting to 127.0.0.1 60005
   [junit4]   2> 137278 INFO  (SUITE-DirectJsonQueryRequestFacetingIntegrationTest-seed#[B62EE87E71D19AAC]-worker) [    ] o.a.s.c.ZkTestServer parse host and port list: 127.0.0.1:60005
   [junit4]   2> 137278 INFO  (SUITE-DirectJsonQueryRequestFacetingIntegrationTest-seed#[B62EE87E71D19AAC]-worker) [    ] o.a.s.c.ZkTestServer connecting to 127.0.0.1 60005
   [junit4]   2> 137530 INFO  (SUITE-DirectJsonQueryRequestFacetingIntegrationTest-seed#[B62EE87E71D19AAC]-worker) [    ] o.a.s.c.ZkTestServer parse host and port list: 127.0.0.1:60005
   [junit4]   2> 137531 INFO  (SUITE-DirectJsonQueryRequestFacetingIntegrationTest-seed#[B62EE87E71D19AAC]-worker) [    ] o.a.s.c.ZkTestServer connecting to 127.0.0.1 60005
   [junit4]   2> 137783 INFO  (SUITE-DirectJsonQueryRequestFacetingIntegrationTest-seed#[B62EE87E71D19AAC]-worker) [    ] o.a.s.c.ZkTestServer parse host and port list: 127.0.0.1:60005
   [junit4]   2> 137783 INFO  (SUITE-DirectJsonQueryRequestFacetingIntegrationTest-seed#[B62EE87E71D19AAC]-worker) [    ] o.a.s.c.ZkTestServer connecting to 127.0.0.1 60005
   [junit4]   2> 138035 INFO  (SUITE-DirectJsonQueryRequestFacetingIntegrationTest-seed#[B62EE87E71D19AAC]-worker) [    ] o.a.s.c.ZkTestServer parse host and port list: 127.0.0.1:60005
   [junit4]   2> 138035 INFO  (SUITE-DirectJsonQueryRequestFacetingIntegrationTest-seed#[B62EE87E71D19AAC]-worker) [    ] o.a.s.c.ZkTestServer connecting to 127.0.0.1 60005
   [junit4]   2> 138288 INFO  (SUITE-DirectJsonQueryRequestFacetingIntegrationTest-seed#[B62EE87E71D19AAC]-worker) [    ] o.a.s.c.ZkTestServer parse host and port list: 127.0.0.1:60005
   [junit4]   2> 138288 INFO  (SUITE-DirectJsonQueryRequestFacetingIntegrationTest-seed#[B62EE87E71D19AAC]-worker) [    ] o.a.s.c.ZkTestServer connecting to 127.0.0.1 60005
   [junit4]   2> 138541 INFO  (SUITE-DirectJsonQueryRequestFacetingIntegrationTest-seed#[B62EE87E71D19AAC]-worker) [    ] o.a.s.c.ZkTestServer parse host and port list: 127.0.0.1:60005
   [junit4]   2> 138542 INFO  (SUITE-DirectJsonQueryRequestFacetingIntegrationTest-seed#[B62EE87E71D19AAC]-worker) [    ] o.a.s.c.ZkTestServer connecting to 127.0.0.1 60005
   [junit4]   2> 138793 INFO  (SUITE-DirectJsonQueryRequestFacetingIntegrationTest-seed#[B62EE87E71D19AAC]-worker) [    ] o.a.s.c.ZkTestServer parse host and port list: 127.0.0.1:60005
   [junit4]   2> 138793 INFO  (SUITE-DirectJsonQueryRequestFacetingIntegrationTest-seed#[B62EE87E71D19AAC]-worker) [    ] o.a.s.c.ZkTestServer connecting to 127.0.0.1 60005
   [junit4]   2> 139050 INFO  (SUITE-DirectJsonQueryRequestFacetingIntegrationTest-seed#[B62EE87E71D19AAC]-worker) [    ] o.a.s.c.ZkTestServer parse host and port list: 127.0.0.1:60005
   [junit4]   2> 139050 INFO  (SUITE-DirectJsonQueryRequestFacetingIntegrationTest-seed#[B62EE87E71D19AAC]-worker) [    ] o.a.s.c.ZkTestServer connecting to 127.0.0.1 60005
   [junit4]   2> 139301 INFO  (SUITE-DirectJsonQueryRequestFacetingIntegrationTest-seed#[B62EE87E71D19AAC]-worker) [    ] o.a.s.c.ZkTestServer parse host and port list: 127.0.0.1:60005
   [junit4]   2> 139301 INFO  (SUITE-DirectJsonQueryRequestFacetingIntegrationTest-seed#[B62EE87E71D19AAC]-worker) [    ] o.a.s.c.ZkTestServer connecting to 127.0.0.1 60005
   [junit4]   2> 139554 INFO  (SUITE-DirectJsonQueryRequestFacetingIntegrationTest-seed#[B62EE87E71D19AAC]-worker) [    ] o.a.s.c.ZkTestServer parse host and port list: 127.0.0.1:60005
   [junit4]   2> 139554 INFO  (SUITE-DirectJsonQueryRequestFacetingIntegrationTest-seed#[B62EE87E71D19AAC]-worker) [    ] o.a.s.c.ZkTestServer connecting to 127.0.0.1 60005
   [junit4]   2> 139806 INFO  (SUITE-DirectJsonQueryRequestFacetingIntegrationTest-seed#[B62EE87E71D19AAC]-worker) [    ] o.a.s.c.ZkTestServer parse host and port list: 127.0.0.1:60005
   [junit4]   2> 139807 INFO  (SUITE-DirectJsonQueryRequestFacetingIntegrationTest-seed#[B62EE87E71D19AAC]-worker) [    ] o.a.s.c.ZkTestServer connecting to 127.0.0.1 60005
   [junit4]   2> 140059 INFO  (SUITE-DirectJsonQueryRequestFacetingIntegrationTest-seed#[B62EE87E71D19AAC]-worker) [    ] o.a.s.c.ZkTestServer parse host and port list: 127.0.0.1:60005
   [junit4]   2> 140059 INFO  (SUITE-DirectJsonQueryRequestFacetingIntegrationTest-seed#[B62EE87E71D19AAC]-worker) [    ] o.a.s.c.ZkTestServer connecting to 127.0.0.1 60005
   [junit4]   2> 140310 INFO  (SUITE-DirectJsonQueryRequestFacetingIntegrationTest-seed#[B62EE87E71D19AAC]-worker) [    ] o.a.s.c.ZkTestServer parse host and port list: 127.0.0.1:60005
   [junit4]   2> 140310 INFO  (SUITE-DirectJsonQueryRequestFacetingIntegrationTest-seed#[B62EE87E71D19AAC]-worker) [    ] o.a.s.c.ZkTestServer connecting to 127.0.0.1 60005
   [junit4]   2> 140562 INFO  (SUITE-DirectJsonQueryRequestFacetingIntegrationTest-seed#[B62EE87E71D19AAC]-worker) [    ] o.a.s.c.ZkTestServer parse host and port list: 127.0.0.1:60005
   [junit4]   2> 140562 INFO  (SUITE-DirectJsonQueryRequestFacetingIntegrationTest-seed#[B62EE87E71D19AAC]-worker) [    ] o.a.s.c.ZkTestServer connecting to 127.0.0.1 60005
   [junit4]   2> 140814 INFO  (SUITE-DirectJsonQueryRequestFacetingIntegrationTest-seed#[B62EE87E71D19AAC]-worker) [    ] o.a.s.c.ZkTestServer parse host and port list: 127.0.0.1:60005
   [junit4]   2> 140814 INFO  (SUITE-DirectJsonQueryRequestFacetingInteg

[...truncated too long message...]

ntegrationTest.testSingleRangeFacet
   [junit4] OK      0.04s J1 | DirectJsonQueryRequestFacetingIntegrationTest.testFacetWithMultipleLocalParamsQueryClausesInArbitraryDomain
   [junit4] OK      0.04s J1 | DirectJsonQueryRequestFacetingIntegrationTest.testNestedTermsFacet
   [junit4] OK      0.06s J1 | DirectJsonQueryRequestFacetingIntegrationTest.testMultiTermsFacet
   [junit4] OK      0.02s J1 | DirectJsonQueryRequestFacetingIntegrationTest.testFacetWithDomainWidenedUsingExcludeTagsToIgnoreFilters
   [junit4] OK      0.02s J1 | DirectJsonQueryRequestFacetingIntegrationTest.testSingleStatFacet
   [junit4] OK      0.05s J1 | DirectJsonQueryRequestFacetingIntegrationTest.testFacetWithArbitraryDomainFromQueryString
   [junit4] OK      0.04s J1 | DirectJsonQueryRequestFacetingIntegrationTest.testFacetWithDomainFilteredBySimpleQueryString
   [junit4] OK      0.03s J1 | DirectJsonQueryRequestFacetingIntegrationTest.testMultiRangeFacet
   [junit4] OK      0.03s J1 | DirectJsonQueryRequestFacetingIntegrationTest.testMultiFacetsMixedTypes
   [junit4] OK      0.04s J1 | DirectJsonQueryRequestFacetingIntegrationTest.testFacetWithDomainFilteredByLocalParamsQueryString
   [junit4] OK      0.02s J1 | DirectJsonQueryRequestFacetingIntegrationTest.testFacetWithArbitraryDomainFromLocalParamsQuery
   [junit4] OK      0.03s J1 | DirectJsonQueryRequestFacetingIntegrationTest.testSingleTermsFacet
   [junit4] OK      0.04s J1 | DirectJsonQueryRequestFacetingIntegrationTest.testMultiStatFacet
   [junit4] OK      0.04s J1 | DirectJsonQueryRequestFacetingIntegrationTest.testFacetWithMultipleSimpleQueryClausesInArbitraryDomain
   [junit4] Completed [4/5] on J1 in 4.81s, 16 tests
   [junit4] 
   [junit4] Suite: org.apache.solr.client.solrj.request.json.DirectJsonQueryRequestFacetingIntegrationTest
   [junit4] OK      0.04s J0 | DirectJsonQueryRequestFacetingIntegrationTest.testNestedFacetsOfMixedTypes
   [junit4] OK      0.04s J0 | DirectJsonQueryRequestFacetingIntegrationTest.testSingleRangeFacet
   [junit4] OK      0.04s J0 | DirectJsonQueryRequestFacetingIntegrationTest.testFacetWithMultipleLocalParamsQueryClausesInArbitraryDomain
   [junit4] OK      0.03s J0 | DirectJsonQueryRequestFacetingIntegrationTest.testNestedTermsFacet
   [junit4] OK      0.07s J0 | DirectJsonQueryRequestFacetingIntegrationTest.testMultiTermsFacet
   [junit4] OK      0.04s J0 | DirectJsonQueryRequestFacetingIntegrationTest.testFacetWithDomainWidenedUsingExcludeTagsToIgnoreFilters
   [junit4] OK      0.04s J0 | DirectJsonQueryRequestFacetingIntegrationTest.testSingleStatFacet
   [junit4] OK      0.03s J0 | DirectJsonQueryRequestFacetingIntegrationTest.testFacetWithArbitraryDomainFromQueryString
   [junit4] OK      0.04s J0 | DirectJsonQueryRequestFacetingIntegrationTest.testFacetWithDomainFilteredBySimpleQueryString
   [junit4] OK      0.04s J0 | DirectJsonQueryRequestFacetingIntegrationTest.testMultiRangeFacet
   [junit4] OK      0.03s J0 | DirectJsonQueryRequestFacetingIntegrationTest.testMultiFacetsMixedTypes
   [junit4] OK      0.03s J0 | DirectJsonQueryRequestFacetingIntegrationTest.testFacetWithDomainFilteredByLocalParamsQueryString
   [junit4] OK      0.03s J0 | DirectJsonQueryRequestFacetingIntegrationTest.testFacetWithArbitraryDomainFromLocalParamsQuery
   [junit4] OK      0.03s J0 | DirectJsonQueryRequestFacetingIntegrationTest.testSingleTermsFacet
   [junit4] OK      0.03s J0 | DirectJsonQueryRequestFacetingIntegrationTest.testMultiStatFacet
   [junit4] OK      0.02s J0 | DirectJsonQueryRequestFacetingIntegrationTest.testFacetWithMultipleSimpleQueryClausesInArbitraryDomain
   [junit4] Completed [5/5] on J0 in 4.81s, 16 tests
   [junit4] 
   [junit4] JVM J0:     0.73 ..    26.09 =    25.36s
   [junit4] JVM J1:     0.74 ..    22.48 =    21.74s
   [junit4] Execution time total: 26 seconds
   [junit4] Tests summary: 5 suites, 80 tests
   [junit4] Could not remove temporary path: /export/home/jenkins/workspace/Lucene-Solr-master-Solaris/solr/build/solr-solrj/test/J1 (java.nio.file.DirectoryNotEmptyException: Remaining files: [/export/home/jenkins/workspace/Lucene-Solr-master-Solaris/solr/build/solr-solrj/test/J1/temp])
   [junit4] Could not remove temporary path: /export/home/jenkins/workspace/Lucene-Solr-master-Solaris/solr/build/solr-solrj/test/J0 (java.nio.file.DirectoryNotEmptyException: Remaining files: [/export/home/jenkins/workspace/Lucene-Solr-master-Solaris/solr/build/solr-solrj/test/J0/temp])
     [echo] 5 slowest tests:
[junit4:tophints]  57.44s | org.apache.solr.common.cloud.TestCollectionStateWatchers
[junit4:tophints]  20.00s | org.apache.solr.client.solrj.request.json.DirectJsonQueryRequestFacetingIntegrationTest
[junit4:tophints]  19.36s | org.apache.solr.client.solrj.request.json.JsonQueryRequestIntegrationTest
[junit4:tophints]  15.16s | org.apache.solr.client.solrj.io.stream.StreamExpressionTest
[junit4:tophints]  13.56s | org.apache.solr.client.solrj.TestLBHttp2SolrClient

-check-totals:

test-nocompile:

BUILD SUCCESSFUL
Total time: 28 seconds
[repro] Failures:
[repro]   0/5 failed: org.apache.solr.client.solrj.request.json.DirectJsonQueryRequestFacetingIntegrationTest
[repro] Exiting with code 0
+ mv lucene/build lucene/build.repro
+ mv solr/build solr/build.repro
+ mv lucene/build.orig lucene/build
+ mv solr/build.orig solr/build
Archiving artifacts
Setting ANT_1_8_2_HOME=/export/home/jenkins/tools/hudson.tasks.Ant_AntInstallation/ANT_1.8.2
java.lang.InterruptedException: no matches found within 10000
	at hudson.FilePath$ValidateAntFileMask.hasMatch(FilePath.java:2847)
	at hudson.FilePath$ValidateAntFileMask.invoke(FilePath.java:2726)
	at hudson.FilePath$ValidateAntFileMask.invoke(FilePath.java:2707)
	at hudson.FilePath$FileCallableWrapper.call(FilePath.java:3086)
Also:   hudson.remoting.Channel$CallSiteStackTrace: Remote call to Solaris VBOX
		at hudson.remoting.Channel.attachCallSiteStackTrace(Channel.java:1743)
		at hudson.remoting.UserRequest$ExceptionResponse.retrieve(UserRequest.java:357)
		at hudson.remoting.Channel.call(Channel.java:957)
		at hudson.FilePath.act(FilePath.java:1072)
		at hudson.FilePath.act(FilePath.java:1061)
		at hudson.FilePath.validateAntFileMask(FilePath.java:2705)
		at hudson.tasks.ArtifactArchiver.perform(ArtifactArchiver.java:243)
		at hudson.tasks.BuildStepCompatibilityLayer.perform(BuildStepCompatibilityLayer.java:81)
		at hudson.tasks.BuildStepMonitor$1.perform(BuildStepMonitor.java:20)
		at hudson.model.AbstractBuild$AbstractBuildExecution.perform(AbstractBuild.java:744)
		at hudson.model.AbstractBuild$AbstractBuildExecution.performAllBuildSteps(AbstractBuild.java:690)
		at hudson.model.Build$BuildExecution.post2(Build.java:186)
		at hudson.model.AbstractBuild$AbstractBuildExecution.post(AbstractBuild.java:635)
		at hudson.model.Run.execute(Run.java:1835)
		at hudson.model.FreeStyleBuild.run(FreeStyleBuild.java:43)
		at hudson.model.ResourceController.execute(ResourceController.java:97)
		at hudson.model.Executor.run(Executor.java:429)
Caused: hudson.FilePath$TunneledInterruptedException
	at hudson.FilePath$FileCallableWrapper.call(FilePath.java:3088)
	at hudson.remoting.UserRequest.perform(UserRequest.java:212)
	at hudson.remoting.UserRequest.perform(UserRequest.java:54)
	at hudson.remoting.Request$2.run(Request.java:369)
	at hudson.remoting.InterceptingExecutorService$1.call(InterceptingExecutorService.java:72)
	at java.util.concurrent.FutureTask.run(FutureTask.java:266)
	at java.util.concurrent.ThreadPoolExecutor.runWorker(ThreadPoolExecutor.java:1149)
	at java.util.concurrent.ThreadPoolExecutor$Worker.run(ThreadPoolExecutor.java:624)
	at java.lang.Thread.run(Thread.java:748)
Caused: java.lang.InterruptedException: java.lang.InterruptedException: no matches found within 10000
	at hudson.FilePath.act(FilePath.java:1074)
	at hudson.FilePath.act(FilePath.java:1061)
	at hudson.FilePath.validateAntFileMask(FilePath.java:2705)
	at hudson.tasks.ArtifactArchiver.perform(ArtifactArchiver.java:243)
	at hudson.tasks.BuildStepCompatibilityLayer.perform(BuildStepCompatibilityLayer.java:81)
	at hudson.tasks.BuildStepMonitor$1.perform(BuildStepMonitor.java:20)
	at hudson.model.AbstractBuild$AbstractBuildExecution.perform(AbstractBuild.java:744)
	at hudson.model.AbstractBuild$AbstractBuildExecution.performAllBuildSteps(AbstractBuild.java:690)
	at hudson.model.Build$BuildExecution.post2(Build.java:186)
	at hudson.model.AbstractBuild$AbstractBuildExecution.post(AbstractBuild.java:635)
	at hudson.model.Run.execute(Run.java:1835)
	at hudson.model.FreeStyleBuild.run(FreeStyleBuild.java:43)
	at hudson.model.ResourceController.execute(ResourceController.java:97)
	at hudson.model.Executor.run(Executor.java:429)
No artifacts found that match the file pattern "**/*.events,heapdumps/**,**/*_pid*.log". Configuration error?
[WARNINGS] Parsing warnings in console log with parser Java Compiler (javac)
Setting ANT_1_8_2_HOME=/export/home/jenkins/tools/hudson.tasks.Ant_AntInstallation/ANT_1.8.2
Setting ANT_1_8_2_HOME=/export/home/jenkins/tools/hudson.tasks.Ant_AntInstallation/ANT_1.8.2
<Git Blamer> Using GitBlamer to create author and commit information for all warnings.
<Git Blamer> GIT_COMMIT=d4e016afdf41baf0104f79e82d953a4650df42aa, workspace=/export/home/jenkins/workspace/Lucene-Solr-master-Solaris
[WARNINGS] Computing warning deltas based on reference build #2259
Recording test results
Setting ANT_1_8_2_HOME=/export/home/jenkins/tools/hudson.tasks.Ant_AntInstallation/ANT_1.8.2
Build step 'Publish JUnit test result report' changed build result to UNSTABLE
Email was triggered for: Unstable (Test Failures)
Sending email for trigger: Unstable (Test Failures)
Setting ANT_1_8_2_HOME=/export/home/jenkins/tools/hudson.tasks.Ant_AntInstallation/ANT_1.8.2
Setting ANT_1_8_2_HOME=/export/home/jenkins/tools/hudson.tasks.Ant_AntInstallation/ANT_1.8.2
Setting ANT_1_8_2_HOME=/export/home/jenkins/tools/hudson.tasks.Ant_AntInstallation/ANT_1.8.2
Setting ANT_1_8_2_HOME=/export/home/jenkins/tools/hudson.tasks.Ant_AntInstallation/ANT_1.8.2

Mime
View raw message