lucene-dev mailing list archives

Site index · List index
Message view « Date » · « Thread »
Top « Date » · « Thread »
From Apache Jenkins Server <jenk...@builds.apache.org>
Subject [JENKINS] Lucene-Solr-BadApples-Tests-master - Build # 263 - Unstable
Date Thu, 17 Jan 2019 08:50:51 GMT
Build: https://builds.apache.org/job/Lucene-Solr-BadApples-Tests-master/263/

4 tests failed.
FAILED:  org.apache.solr.analytics.legacy.facet.LegacyFieldFacetCloudTest.meanTest

Error Message:
Error starting up MiniSolrCloudCluster

Stack Trace:
java.lang.Exception: Error starting up MiniSolrCloudCluster
	at org.apache.solr.cloud.MiniSolrCloudCluster.checkForExceptions(MiniSolrCloudCluster.java:622)
	at org.apache.solr.cloud.MiniSolrCloudCluster.<init>(MiniSolrCloudCluster.java:278)
	at org.apache.solr.cloud.SolrCloudTestCase$Builder.build(SolrCloudTestCase.java:206)
	at org.apache.solr.cloud.SolrCloudTestCase$Builder.configure(SolrCloudTestCase.java:198)
	at org.apache.solr.analytics.legacy.LegacyAbstractAnalyticsCloudTest.setupCollection(LegacyAbstractAnalyticsCloudTest.java:49)
	at sun.reflect.NativeMethodAccessorImpl.invoke0(Native Method)
	at sun.reflect.NativeMethodAccessorImpl.invoke(NativeMethodAccessorImpl.java:62)
	at sun.reflect.DelegatingMethodAccessorImpl.invoke(DelegatingMethodAccessorImpl.java:43)
	at java.lang.reflect.Method.invoke(Method.java:498)
	at com.carrotsearch.randomizedtesting.RandomizedRunner.invoke(RandomizedRunner.java:1750)
	at com.carrotsearch.randomizedtesting.RandomizedRunner$9.evaluate(RandomizedRunner.java:972)
	at com.carrotsearch.randomizedtesting.RandomizedRunner$10.evaluate(RandomizedRunner.java:988)
	at com.carrotsearch.randomizedtesting.rules.SystemPropertiesRestoreRule$1.evaluate(SystemPropertiesRestoreRule.java:57)
	at org.apache.lucene.util.TestRuleSetupTeardownChained$1.evaluate(TestRuleSetupTeardownChained.java:49)
	at org.apache.lucene.util.AbstractBeforeAfterRule$1.evaluate(AbstractBeforeAfterRule.java:45)
	at org.apache.lucene.util.TestRuleThreadAndTestName$1.evaluate(TestRuleThreadAndTestName.java:48)
	at org.apache.lucene.util.TestRuleIgnoreAfterMaxFailures$1.evaluate(TestRuleIgnoreAfterMaxFailures.java:64)
	at org.apache.lucene.util.TestRuleMarkFailure$1.evaluate(TestRuleMarkFailure.java:47)
	at com.carrotsearch.randomizedtesting.rules.StatementAdapter.evaluate(StatementAdapter.java:36)
	at com.carrotsearch.randomizedtesting.ThreadLeakControl$StatementRunner.run(ThreadLeakControl.java:368)
	at com.carrotsearch.randomizedtesting.ThreadLeakControl.forkTimeoutingTask(ThreadLeakControl.java:817)
	at com.carrotsearch.randomizedtesting.ThreadLeakControl$3.evaluate(ThreadLeakControl.java:468)
	at com.carrotsearch.randomizedtesting.RandomizedRunner.runSingleTest(RandomizedRunner.java:947)
	at com.carrotsearch.randomizedtesting.RandomizedRunner$5.evaluate(RandomizedRunner.java:832)
	at com.carrotsearch.randomizedtesting.RandomizedRunner$6.evaluate(RandomizedRunner.java:883)
	at com.carrotsearch.randomizedtesting.RandomizedRunner$7.evaluate(RandomizedRunner.java:894)
	at com.carrotsearch.randomizedtesting.rules.StatementAdapter.evaluate(StatementAdapter.java:36)
	at com.carrotsearch.randomizedtesting.rules.SystemPropertiesRestoreRule$1.evaluate(SystemPropertiesRestoreRule.java:57)
	at org.apache.lucene.util.AbstractBeforeAfterRule$1.evaluate(AbstractBeforeAfterRule.java:45)
	at com.carrotsearch.randomizedtesting.rules.StatementAdapter.evaluate(StatementAdapter.java:36)
	at org.apache.lucene.util.TestRuleStoreClassName$1.evaluate(TestRuleStoreClassName.java:41)
	at com.carrotsearch.randomizedtesting.rules.NoShadowingOrOverridesOnMethodsRule$1.evaluate(NoShadowingOrOverridesOnMethodsRule.java:40)
	at com.carrotsearch.randomizedtesting.rules.NoShadowingOrOverridesOnMethodsRule$1.evaluate(NoShadowingOrOverridesOnMethodsRule.java:40)
	at com.carrotsearch.randomizedtesting.rules.StatementAdapter.evaluate(StatementAdapter.java:36)
	at com.carrotsearch.randomizedtesting.rules.StatementAdapter.evaluate(StatementAdapter.java:36)
	at com.carrotsearch.randomizedtesting.rules.StatementAdapter.evaluate(StatementAdapter.java:36)
	at org.apache.lucene.util.TestRuleAssertionsRequired$1.evaluate(TestRuleAssertionsRequired.java:53)
	at org.apache.lucene.util.TestRuleMarkFailure$1.evaluate(TestRuleMarkFailure.java:47)
	at org.apache.lucene.util.TestRuleIgnoreAfterMaxFailures$1.evaluate(TestRuleIgnoreAfterMaxFailures.java:64)
	at org.apache.lucene.util.TestRuleIgnoreTestSuites$1.evaluate(TestRuleIgnoreTestSuites.java:54)
	at com.carrotsearch.randomizedtesting.rules.StatementAdapter.evaluate(StatementAdapter.java:36)
	at com.carrotsearch.randomizedtesting.ThreadLeakControl$StatementRunner.run(ThreadLeakControl.java:368)
	at java.lang.Thread.run(Thread.java:748)
	Suppressed: java.lang.RuntimeException: Jetty/Solr unresponsive
		at org.apache.solr.client.solrj.embedded.JettySolrRunner.start(JettySolrRunner.java:493)
		at org.apache.solr.client.solrj.embedded.JettySolrRunner.start(JettySolrRunner.java:451)
		at org.apache.solr.cloud.MiniSolrCloudCluster.startJettySolrRunner(MiniSolrCloudCluster.java:437)
		at org.apache.solr.cloud.MiniSolrCloudCluster.lambda$new$0(MiniSolrCloudCluster.java:272)
		at java.util.concurrent.FutureTask.run(FutureTask.java:266)
		at org.apache.solr.common.util.ExecutorUtil$MDCAwareThreadPoolExecutor.lambda$execute$0(ExecutorUtil.java:209)
		at java.util.concurrent.ThreadPoolExecutor.runWorker(ThreadPoolExecutor.java:1149)
		at java.util.concurrent.ThreadPoolExecutor$Worker.run(ThreadPoolExecutor.java:624)
		... 1 more


FAILED:  junit.framework.TestSuite.org.apache.solr.analytics.legacy.facet.LegacyFieldFacetCloudTest

Error Message:
10 threads leaked from SUITE scope at org.apache.solr.analytics.legacy.facet.LegacyFieldFacetCloudTest:     1) Thread[id=2776, name=qtp1004676000-2776, state=TIMED_WAITING, group=TGRP-LegacyFieldFacetCloudTest]         at sun.misc.Unsafe.park(Native Method)         at java.util.concurrent.locks.LockSupport.parkNanos(LockSupport.java:215)         at java.util.concurrent.locks.AbstractQueuedSynchronizer$ConditionObject.awaitNanos(AbstractQueuedSynchronizer.java:2078)         at org.eclipse.jetty.util.BlockingArrayQueue.poll(BlockingArrayQueue.java:392)         at org.eclipse.jetty.util.thread.QueuedThreadPool.idleJobPoll(QueuedThreadPool.java:656)         at org.eclipse.jetty.util.thread.QueuedThreadPool.access$800(QueuedThreadPool.java:46)         at org.eclipse.jetty.util.thread.QueuedThreadPool$2.run(QueuedThreadPool.java:720)         at java.lang.Thread.run(Thread.java:748)    2) Thread[id=2769, name=qtp1004676000-2769, state=RUNNABLE, group=TGRP-LegacyFieldFacetCloudTest]         at sun.nio.ch.EPollArrayWrapper.epollWait(Native Method)         at sun.nio.ch.EPollArrayWrapper.poll(EPollArrayWrapper.java:269)         at sun.nio.ch.EPollSelectorImpl.doSelect(EPollSelectorImpl.java:93)         at sun.nio.ch.SelectorImpl.lockAndDoSelect(SelectorImpl.java:86)         at sun.nio.ch.SelectorImpl.select(SelectorImpl.java:97)         at sun.nio.ch.SelectorImpl.select(SelectorImpl.java:101)         at org.eclipse.jetty.io.ManagedSelector$SelectorProducer.select(ManagedSelector.java:423)         at org.eclipse.jetty.io.ManagedSelector$SelectorProducer.produce(ManagedSelector.java:360)         at org.eclipse.jetty.util.thread.strategy.EatWhatYouKill.produceTask(EatWhatYouKill.java:357)         at org.eclipse.jetty.util.thread.strategy.EatWhatYouKill.doProduce(EatWhatYouKill.java:181)         at org.eclipse.jetty.util.thread.strategy.EatWhatYouKill.tryProduce(EatWhatYouKill.java:168)         at org.eclipse.jetty.util.thread.strategy.EatWhatYouKill.produce(EatWhatYouKill.java:132)         at org.eclipse.jetty.io.ManagedSelector$$Lambda$142/1246289191.run(Unknown Source)         at org.eclipse.jetty.util.thread.QueuedThreadPool.runJob(QueuedThreadPool.java:765)         at org.eclipse.jetty.util.thread.QueuedThreadPool$2.run(QueuedThreadPool.java:683)         at java.lang.Thread.run(Thread.java:748)    3) Thread[id=2775, name=qtp1004676000-2775, state=TIMED_WAITING, group=TGRP-LegacyFieldFacetCloudTest]         at sun.misc.Unsafe.park(Native Method)         at java.util.concurrent.locks.LockSupport.parkNanos(LockSupport.java:215)         at java.util.concurrent.locks.AbstractQueuedSynchronizer$ConditionObject.awaitNanos(AbstractQueuedSynchronizer.java:2078)         at org.eclipse.jetty.util.BlockingArrayQueue.poll(BlockingArrayQueue.java:392)         at org.eclipse.jetty.util.thread.QueuedThreadPool.idleJobPoll(QueuedThreadPool.java:656)         at org.eclipse.jetty.util.thread.QueuedThreadPool.access$800(QueuedThreadPool.java:46)         at org.eclipse.jetty.util.thread.QueuedThreadPool$2.run(QueuedThreadPool.java:720)         at java.lang.Thread.run(Thread.java:748)    4) Thread[id=2773, name=qtp1004676000-2773, state=TIMED_WAITING, group=TGRP-LegacyFieldFacetCloudTest]         at sun.misc.Unsafe.park(Native Method)         at java.util.concurrent.locks.LockSupport.parkNanos(LockSupport.java:215)         at java.util.concurrent.locks.AbstractQueuedSynchronizer$ConditionObject.awaitNanos(AbstractQueuedSynchronizer.java:2078)         at org.eclipse.jetty.util.BlockingArrayQueue.poll(BlockingArrayQueue.java:392)         at org.eclipse.jetty.util.thread.QueuedThreadPool.idleJobPoll(QueuedThreadPool.java:656)         at org.eclipse.jetty.util.thread.QueuedThreadPool.access$800(QueuedThreadPool.java:46)         at org.eclipse.jetty.util.thread.QueuedThreadPool$2.run(QueuedThreadPool.java:720)         at java.lang.Thread.run(Thread.java:748)    5) Thread[id=2771, name=qtp1004676000-2771-acceptor-0@1cf2eb25-ServerConnector@123506cb{SSL,[ssl, http/1.1]}{127.0.0.1:38016}, state=RUNNABLE, group=TGRP-LegacyFieldFacetCloudTest]         at sun.nio.ch.ServerSocketChannelImpl.accept0(Native Method)         at sun.nio.ch.ServerSocketChannelImpl.accept(ServerSocketChannelImpl.java:422)         at sun.nio.ch.ServerSocketChannelImpl.accept(ServerSocketChannelImpl.java:250)         at org.eclipse.jetty.server.ServerConnector.accept(ServerConnector.java:385)         at org.eclipse.jetty.server.AbstractConnector$Acceptor.run(AbstractConnector.java:648)         at org.eclipse.jetty.util.thread.QueuedThreadPool.runJob(QueuedThreadPool.java:765)         at org.eclipse.jetty.util.thread.QueuedThreadPool$2.run(QueuedThreadPool.java:683)         at java.lang.Thread.run(Thread.java:748)    6) Thread[id=2772, name=qtp1004676000-2772, state=TIMED_WAITING, group=TGRP-LegacyFieldFacetCloudTest]         at sun.misc.Unsafe.park(Native Method)         at java.util.concurrent.locks.LockSupport.parkNanos(LockSupport.java:215)         at java.util.concurrent.locks.AbstractQueuedSynchronizer$ConditionObject.awaitNanos(AbstractQueuedSynchronizer.java:2078)         at org.eclipse.jetty.util.BlockingArrayQueue.poll(BlockingArrayQueue.java:392)         at org.eclipse.jetty.util.thread.QueuedThreadPool.idleJobPoll(QueuedThreadPool.java:656)         at org.eclipse.jetty.util.thread.QueuedThreadPool.access$800(QueuedThreadPool.java:46)         at org.eclipse.jetty.util.thread.QueuedThreadPool$2.run(QueuedThreadPool.java:720)         at java.lang.Thread.run(Thread.java:748)    7) Thread[id=2777, name=Scheduler-1859528979, state=TIMED_WAITING, group=TGRP-LegacyFieldFacetCloudTest]         at sun.misc.Unsafe.park(Native Method)         at java.util.concurrent.locks.LockSupport.parkNanos(LockSupport.java:215)         at java.util.concurrent.locks.AbstractQueuedSynchronizer$ConditionObject.awaitNanos(AbstractQueuedSynchronizer.java:2078)         at java.util.concurrent.ScheduledThreadPoolExecutor$DelayedWorkQueue.take(ScheduledThreadPoolExecutor.java:1093)         at java.util.concurrent.ScheduledThreadPoolExecutor$DelayedWorkQueue.take(ScheduledThreadPoolExecutor.java:809)         at java.util.concurrent.ThreadPoolExecutor.getTask(ThreadPoolExecutor.java:1074)         at java.util.concurrent.ThreadPoolExecutor.runWorker(ThreadPoolExecutor.java:1134)         at java.util.concurrent.ThreadPoolExecutor$Worker.run(ThreadPoolExecutor.java:624)         at java.lang.Thread.run(Thread.java:748)    8) Thread[id=2865, name=zkConnectionManagerCallback-1192-thread-1, state=WAITING, group=TGRP-LegacyFieldFacetCloudTest]         at sun.misc.Unsafe.park(Native Method)         at java.util.concurrent.locks.LockSupport.park(LockSupport.java:175)         at java.util.concurrent.locks.AbstractQueuedSynchronizer$ConditionObject.await(AbstractQueuedSynchronizer.java:2039)         at java.util.concurrent.LinkedBlockingQueue.take(LinkedBlockingQueue.java:442)         at java.util.concurrent.ThreadPoolExecutor.getTask(ThreadPoolExecutor.java:1074)         at java.util.concurrent.ThreadPoolExecutor.runWorker(ThreadPoolExecutor.java:1134)         at java.util.concurrent.ThreadPoolExecutor$Worker.run(ThreadPoolExecutor.java:624)         at java.lang.Thread.run(Thread.java:748)    9) Thread[id=2755, name=qtp1004676000-2755, state=RUNNABLE, group=TGRP-LegacyFieldFacetCloudTest]         at sun.nio.ch.EPollArrayWrapper.epollWait(Native Method)         at sun.nio.ch.EPollArrayWrapper.poll(EPollArrayWrapper.java:269)         at sun.nio.ch.EPollSelectorImpl.doSelect(EPollSelectorImpl.java:93)         at sun.nio.ch.SelectorImpl.lockAndDoSelect(SelectorImpl.java:86)         at sun.nio.ch.SelectorImpl.select(SelectorImpl.java:97)         at sun.nio.ch.SelectorImpl.select(SelectorImpl.java:101)         at org.eclipse.jetty.io.ManagedSelector$SelectorProducer.select(ManagedSelector.java:423)         at org.eclipse.jetty.io.ManagedSelector$SelectorProducer.produce(ManagedSelector.java:360)         at org.eclipse.jetty.util.thread.strategy.EatWhatYouKill.produceTask(EatWhatYouKill.java:357)         at org.eclipse.jetty.util.thread.strategy.EatWhatYouKill.doProduce(EatWhatYouKill.java:181)         at org.eclipse.jetty.util.thread.strategy.EatWhatYouKill.tryProduce(EatWhatYouKill.java:168)         at org.eclipse.jetty.util.thread.strategy.EatWhatYouKill.produce(EatWhatYouKill.java:132)         at org.eclipse.jetty.io.ManagedSelector$$Lambda$142/1246289191.run(Unknown Source)         at org.eclipse.jetty.util.thread.QueuedThreadPool.runJob(QueuedThreadPool.java:765)         at org.eclipse.jetty.util.thread.QueuedThreadPool$2.run(QueuedThreadPool.java:683)         at java.lang.Thread.run(Thread.java:748)   10) Thread[id=2774, name=qtp1004676000-2774, state=TIMED_WAITING, group=TGRP-LegacyFieldFacetCloudTest]         at sun.misc.Unsafe.park(Native Method)         at java.util.concurrent.locks.LockSupport.parkNanos(LockSupport.java:215)         at java.util.concurrent.locks.AbstractQueuedSynchronizer$ConditionObject.awaitNanos(AbstractQueuedSynchronizer.java:2078)         at org.eclipse.jetty.util.BlockingArrayQueue.poll(BlockingArrayQueue.java:392)         at org.eclipse.jetty.util.thread.QueuedThreadPool.idleJobPoll(QueuedThreadPool.java:656)         at org.eclipse.jetty.util.thread.QueuedThreadPool.access$800(QueuedThreadPool.java:46)         at org.eclipse.jetty.util.thread.QueuedThreadPool$2.run(QueuedThreadPool.java:720)         at java.lang.Thread.run(Thread.java:748)

Stack Trace:
com.carrotsearch.randomizedtesting.ThreadLeakError: 10 threads leaked from SUITE scope at org.apache.solr.analytics.legacy.facet.LegacyFieldFacetCloudTest: 
   1) Thread[id=2776, name=qtp1004676000-2776, state=TIMED_WAITING, group=TGRP-LegacyFieldFacetCloudTest]
        at sun.misc.Unsafe.park(Native Method)
        at java.util.concurrent.locks.LockSupport.parkNanos(LockSupport.java:215)
        at java.util.concurrent.locks.AbstractQueuedSynchronizer$ConditionObject.awaitNanos(AbstractQueuedSynchronizer.java:2078)
        at org.eclipse.jetty.util.BlockingArrayQueue.poll(BlockingArrayQueue.java:392)
        at org.eclipse.jetty.util.thread.QueuedThreadPool.idleJobPoll(QueuedThreadPool.java:656)
        at org.eclipse.jetty.util.thread.QueuedThreadPool.access$800(QueuedThreadPool.java:46)
        at org.eclipse.jetty.util.thread.QueuedThreadPool$2.run(QueuedThreadPool.java:720)
        at java.lang.Thread.run(Thread.java:748)
   2) Thread[id=2769, name=qtp1004676000-2769, state=RUNNABLE, group=TGRP-LegacyFieldFacetCloudTest]
        at sun.nio.ch.EPollArrayWrapper.epollWait(Native Method)
        at sun.nio.ch.EPollArrayWrapper.poll(EPollArrayWrapper.java:269)
        at sun.nio.ch.EPollSelectorImpl.doSelect(EPollSelectorImpl.java:93)
        at sun.nio.ch.SelectorImpl.lockAndDoSelect(SelectorImpl.java:86)
        at sun.nio.ch.SelectorImpl.select(SelectorImpl.java:97)
        at sun.nio.ch.SelectorImpl.select(SelectorImpl.java:101)
        at org.eclipse.jetty.io.ManagedSelector$SelectorProducer.select(ManagedSelector.java:423)
        at org.eclipse.jetty.io.ManagedSelector$SelectorProducer.produce(ManagedSelector.java:360)
        at org.eclipse.jetty.util.thread.strategy.EatWhatYouKill.produceTask(EatWhatYouKill.java:357)
        at org.eclipse.jetty.util.thread.strategy.EatWhatYouKill.doProduce(EatWhatYouKill.java:181)
        at org.eclipse.jetty.util.thread.strategy.EatWhatYouKill.tryProduce(EatWhatYouKill.java:168)
        at org.eclipse.jetty.util.thread.strategy.EatWhatYouKill.produce(EatWhatYouKill.java:132)
        at org.eclipse.jetty.io.ManagedSelector$$Lambda$142/1246289191.run(Unknown Source)
        at org.eclipse.jetty.util.thread.QueuedThreadPool.runJob(QueuedThreadPool.java:765)
        at org.eclipse.jetty.util.thread.QueuedThreadPool$2.run(QueuedThreadPool.java:683)
        at java.lang.Thread.run(Thread.java:748)
   3) Thread[id=2775, name=qtp1004676000-2775, state=TIMED_WAITING, group=TGRP-LegacyFieldFacetCloudTest]
        at sun.misc.Unsafe.park(Native Method)
        at java.util.concurrent.locks.LockSupport.parkNanos(LockSupport.java:215)
        at java.util.concurrent.locks.AbstractQueuedSynchronizer$ConditionObject.awaitNanos(AbstractQueuedSynchronizer.java:2078)
        at org.eclipse.jetty.util.BlockingArrayQueue.poll(BlockingArrayQueue.java:392)
        at org.eclipse.jetty.util.thread.QueuedThreadPool.idleJobPoll(QueuedThreadPool.java:656)
        at org.eclipse.jetty.util.thread.QueuedThreadPool.access$800(QueuedThreadPool.java:46)
        at org.eclipse.jetty.util.thread.QueuedThreadPool$2.run(QueuedThreadPool.java:720)
        at java.lang.Thread.run(Thread.java:748)
   4) Thread[id=2773, name=qtp1004676000-2773, state=TIMED_WAITING, group=TGRP-LegacyFieldFacetCloudTest]
        at sun.misc.Unsafe.park(Native Method)
        at java.util.concurrent.locks.LockSupport.parkNanos(LockSupport.java:215)
        at java.util.concurrent.locks.AbstractQueuedSynchronizer$ConditionObject.awaitNanos(AbstractQueuedSynchronizer.java:2078)
        at org.eclipse.jetty.util.BlockingArrayQueue.poll(BlockingArrayQueue.java:392)
        at org.eclipse.jetty.util.thread.QueuedThreadPool.idleJobPoll(QueuedThreadPool.java:656)
        at org.eclipse.jetty.util.thread.QueuedThreadPool.access$800(QueuedThreadPool.java:46)
        at org.eclipse.jetty.util.thread.QueuedThreadPool$2.run(QueuedThreadPool.java:720)
        at java.lang.Thread.run(Thread.java:748)
   5) Thread[id=2771, name=qtp1004676000-2771-acceptor-0@1cf2eb25-ServerConnector@123506cb{SSL,[ssl, http/1.1]}{127.0.0.1:38016}, state=RUNNABLE, group=TGRP-LegacyFieldFacetCloudTest]
        at sun.nio.ch.ServerSocketChannelImpl.accept0(Native Method)
        at sun.nio.ch.ServerSocketChannelImpl.accept(ServerSocketChannelImpl.java:422)
        at sun.nio.ch.ServerSocketChannelImpl.accept(ServerSocketChannelImpl.java:250)
        at org.eclipse.jetty.server.ServerConnector.accept(ServerConnector.java:385)
        at org.eclipse.jetty.server.AbstractConnector$Acceptor.run(AbstractConnector.java:648)
        at org.eclipse.jetty.util.thread.QueuedThreadPool.runJob(QueuedThreadPool.java:765)
        at org.eclipse.jetty.util.thread.QueuedThreadPool$2.run(QueuedThreadPool.java:683)
        at java.lang.Thread.run(Thread.java:748)
   6) Thread[id=2772, name=qtp1004676000-2772, state=TIMED_WAITING, group=TGRP-LegacyFieldFacetCloudTest]
        at sun.misc.Unsafe.park(Native Method)
        at java.util.concurrent.locks.LockSupport.parkNanos(LockSupport.java:215)
        at java.util.concurrent.locks.AbstractQueuedSynchronizer$ConditionObject.awaitNanos(AbstractQueuedSynchronizer.java:2078)
        at org.eclipse.jetty.util.BlockingArrayQueue.poll(BlockingArrayQueue.java:392)
        at org.eclipse.jetty.util.thread.QueuedThreadPool.idleJobPoll(QueuedThreadPool.java:656)
        at org.eclipse.jetty.util.thread.QueuedThreadPool.access$800(QueuedThreadPool.java:46)
        at org.eclipse.jetty.util.thread.QueuedThreadPool$2.run(QueuedThreadPool.java:720)
        at java.lang.Thread.run(Thread.java:748)
   7) Thread[id=2777, name=Scheduler-1859528979, state=TIMED_WAITING, group=TGRP-LegacyFieldFacetCloudTest]
        at sun.misc.Unsafe.park(Native Method)
        at java.util.concurrent.locks.LockSupport.parkNanos(LockSupport.java:215)
        at java.util.concurrent.locks.AbstractQueuedSynchronizer$ConditionObject.awaitNanos(AbstractQueuedSynchronizer.java:2078)
        at java.util.concurrent.ScheduledThreadPoolExecutor$DelayedWorkQueue.take(ScheduledThreadPoolExecutor.java:1093)
        at java.util.concurrent.ScheduledThreadPoolExecutor$DelayedWorkQueue.take(ScheduledThreadPoolExecutor.java:809)
        at java.util.concurrent.ThreadPoolExecutor.getTask(ThreadPoolExecutor.java:1074)
        at java.util.concurrent.ThreadPoolExecutor.runWorker(ThreadPoolExecutor.java:1134)
        at java.util.concurrent.ThreadPoolExecutor$Worker.run(ThreadPoolExecutor.java:624)
        at java.lang.Thread.run(Thread.java:748)
   8) Thread[id=2865, name=zkConnectionManagerCallback-1192-thread-1, state=WAITING, group=TGRP-LegacyFieldFacetCloudTest]
        at sun.misc.Unsafe.park(Native Method)
        at java.util.concurrent.locks.LockSupport.park(LockSupport.java:175)
        at java.util.concurrent.locks.AbstractQueuedSynchronizer$ConditionObject.await(AbstractQueuedSynchronizer.java:2039)
        at java.util.concurrent.LinkedBlockingQueue.take(LinkedBlockingQueue.java:442)
        at java.util.concurrent.ThreadPoolExecutor.getTask(ThreadPoolExecutor.java:1074)
        at java.util.concurrent.ThreadPoolExecutor.runWorker(ThreadPoolExecutor.java:1134)
        at java.util.concurrent.ThreadPoolExecutor$Worker.run(ThreadPoolExecutor.java:624)
        at java.lang.Thread.run(Thread.java:748)
   9) Thread[id=2755, name=qtp1004676000-2755, state=RUNNABLE, group=TGRP-LegacyFieldFacetCloudTest]
        at sun.nio.ch.EPollArrayWrapper.epollWait(Native Method)
        at sun.nio.ch.EPollArrayWrapper.poll(EPollArrayWrapper.java:269)
        at sun.nio.ch.EPollSelectorImpl.doSelect(EPollSelectorImpl.java:93)
        at sun.nio.ch.SelectorImpl.lockAndDoSelect(SelectorImpl.java:86)
        at sun.nio.ch.SelectorImpl.select(SelectorImpl.java:97)
        at sun.nio.ch.SelectorImpl.select(SelectorImpl.java:101)
        at org.eclipse.jetty.io.ManagedSelector$SelectorProducer.select(ManagedSelector.java:423)
        at org.eclipse.jetty.io.ManagedSelector$SelectorProducer.produce(ManagedSelector.java:360)
        at org.eclipse.jetty.util.thread.strategy.EatWhatYouKill.produceTask(EatWhatYouKill.java:357)
        at org.eclipse.jetty.util.thread.strategy.EatWhatYouKill.doProduce(EatWhatYouKill.java:181)
        at org.eclipse.jetty.util.thread.strategy.EatWhatYouKill.tryProduce(EatWhatYouKill.java:168)
        at org.eclipse.jetty.util.thread.strategy.EatWhatYouKill.produce(EatWhatYouKill.java:132)
        at org.eclipse.jetty.io.ManagedSelector$$Lambda$142/1246289191.run(Unknown Source)
        at org.eclipse.jetty.util.thread.QueuedThreadPool.runJob(QueuedThreadPool.java:765)
        at org.eclipse.jetty.util.thread.QueuedThreadPool$2.run(QueuedThreadPool.java:683)
        at java.lang.Thread.run(Thread.java:748)
  10) Thread[id=2774, name=qtp1004676000-2774, state=TIMED_WAITING, group=TGRP-LegacyFieldFacetCloudTest]
        at sun.misc.Unsafe.park(Native Method)
        at java.util.concurrent.locks.LockSupport.parkNanos(LockSupport.java:215)
        at java.util.concurrent.locks.AbstractQueuedSynchronizer$ConditionObject.awaitNanos(AbstractQueuedSynchronizer.java:2078)
        at org.eclipse.jetty.util.BlockingArrayQueue.poll(BlockingArrayQueue.java:392)
        at org.eclipse.jetty.util.thread.QueuedThreadPool.idleJobPoll(QueuedThreadPool.java:656)
        at org.eclipse.jetty.util.thread.QueuedThreadPool.access$800(QueuedThreadPool.java:46)
        at org.eclipse.jetty.util.thread.QueuedThreadPool$2.run(QueuedThreadPool.java:720)
        at java.lang.Thread.run(Thread.java:748)
	at __randomizedtesting.SeedInfo.seed([CC778841CC538688]:0)


FAILED:  junit.framework.TestSuite.org.apache.solr.analytics.legacy.facet.LegacyFieldFacetCloudTest

Error Message:
There are still zombie threads that couldn't be terminated:    1) Thread[id=2769, name=qtp1004676000-2769, state=RUNNABLE, group=TGRP-LegacyFieldFacetCloudTest]         at sun.nio.ch.EPollArrayWrapper.epollWait(Native Method)         at sun.nio.ch.EPollArrayWrapper.poll(EPollArrayWrapper.java:269)         at sun.nio.ch.EPollSelectorImpl.doSelect(EPollSelectorImpl.java:93)         at sun.nio.ch.SelectorImpl.lockAndDoSelect(SelectorImpl.java:86)         at sun.nio.ch.SelectorImpl.select(SelectorImpl.java:97)         at sun.nio.ch.SelectorImpl.select(SelectorImpl.java:101)         at org.eclipse.jetty.io.ManagedSelector$SelectorProducer.select(ManagedSelector.java:423)         at org.eclipse.jetty.io.ManagedSelector$SelectorProducer.produce(ManagedSelector.java:360)         at org.eclipse.jetty.util.thread.strategy.EatWhatYouKill.produceTask(EatWhatYouKill.java:357)         at org.eclipse.jetty.util.thread.strategy.EatWhatYouKill.doProduce(EatWhatYouKill.java:181)         at org.eclipse.jetty.util.thread.strategy.EatWhatYouKill.tryProduce(EatWhatYouKill.java:168)         at org.eclipse.jetty.util.thread.strategy.EatWhatYouKill.produce(EatWhatYouKill.java:132)         at org.eclipse.jetty.io.ManagedSelector$$Lambda$142/1246289191.run(Unknown Source)         at org.eclipse.jetty.util.thread.QueuedThreadPool.runJob(QueuedThreadPool.java:765)         at org.eclipse.jetty.util.thread.QueuedThreadPool$2.run(QueuedThreadPool.java:683)         at java.lang.Thread.run(Thread.java:748)    2) Thread[id=2777, name=Scheduler-1859528979, state=TIMED_WAITING, group=TGRP-LegacyFieldFacetCloudTest]         at sun.misc.Unsafe.park(Native Method)         at java.util.concurrent.locks.LockSupport.parkNanos(LockSupport.java:215)         at java.util.concurrent.locks.AbstractQueuedSynchronizer$ConditionObject.awaitNanos(AbstractQueuedSynchronizer.java:2078)         at java.util.concurrent.ScheduledThreadPoolExecutor$DelayedWorkQueue.take(ScheduledThreadPoolExecutor.java:1093)         at java.util.concurrent.ScheduledThreadPoolExecutor$DelayedWorkQueue.take(ScheduledThreadPoolExecutor.java:809)         at java.util.concurrent.ThreadPoolExecutor.getTask(ThreadPoolExecutor.java:1074)         at java.util.concurrent.ThreadPoolExecutor.runWorker(ThreadPoolExecutor.java:1134)         at java.util.concurrent.ThreadPoolExecutor$Worker.run(ThreadPoolExecutor.java:624)         at java.lang.Thread.run(Thread.java:748)    3) Thread[id=2865, name=zkConnectionManagerCallback-1192-thread-1, state=WAITING, group=TGRP-LegacyFieldFacetCloudTest]         at sun.misc.Unsafe.park(Native Method)         at java.util.concurrent.locks.LockSupport.park(LockSupport.java:175)         at java.util.concurrent.locks.AbstractQueuedSynchronizer$ConditionObject.await(AbstractQueuedSynchronizer.java:2039)         at java.util.concurrent.LinkedBlockingQueue.take(LinkedBlockingQueue.java:442)         at java.util.concurrent.ThreadPoolExecutor.getTask(ThreadPoolExecutor.java:1074)         at java.util.concurrent.ThreadPoolExecutor.runWorker(ThreadPoolExecutor.java:1134)         at java.util.concurrent.ThreadPoolExecutor$Worker.run(ThreadPoolExecutor.java:624)         at java.lang.Thread.run(Thread.java:748)    4) Thread[id=2755, name=qtp1004676000-2755, state=RUNNABLE, group=TGRP-LegacyFieldFacetCloudTest]         at sun.nio.ch.EPollArrayWrapper.epollWait(Native Method)         at sun.nio.ch.EPollArrayWrapper.poll(EPollArrayWrapper.java:269)         at sun.nio.ch.EPollSelectorImpl.doSelect(EPollSelectorImpl.java:93)         at sun.nio.ch.SelectorImpl.lockAndDoSelect(SelectorImpl.java:86)         at sun.nio.ch.SelectorImpl.select(SelectorImpl.java:97)         at sun.nio.ch.SelectorImpl.select(SelectorImpl.java:101)         at org.eclipse.jetty.io.ManagedSelector$SelectorProducer.select(ManagedSelector.java:423)         at org.eclipse.jetty.io.ManagedSelector$SelectorProducer.produce(ManagedSelector.java:360)         at org.eclipse.jetty.util.thread.strategy.EatWhatYouKill.produceTask(EatWhatYouKill.java:357)         at org.eclipse.jetty.util.thread.strategy.EatWhatYouKill.doProduce(EatWhatYouKill.java:181)         at org.eclipse.jetty.util.thread.strategy.EatWhatYouKill.tryProduce(EatWhatYouKill.java:168)         at org.eclipse.jetty.util.thread.strategy.EatWhatYouKill.produce(EatWhatYouKill.java:132)         at org.eclipse.jetty.io.ManagedSelector$$Lambda$142/1246289191.run(Unknown Source)         at org.eclipse.jetty.util.thread.QueuedThreadPool.runJob(QueuedThreadPool.java:765)         at org.eclipse.jetty.util.thread.QueuedThreadPool$2.run(QueuedThreadPool.java:683)         at java.lang.Thread.run(Thread.java:748)

Stack Trace:
com.carrotsearch.randomizedtesting.ThreadLeakError: There are still zombie threads that couldn't be terminated:
   1) Thread[id=2769, name=qtp1004676000-2769, state=RUNNABLE, group=TGRP-LegacyFieldFacetCloudTest]
        at sun.nio.ch.EPollArrayWrapper.epollWait(Native Method)
        at sun.nio.ch.EPollArrayWrapper.poll(EPollArrayWrapper.java:269)
        at sun.nio.ch.EPollSelectorImpl.doSelect(EPollSelectorImpl.java:93)
        at sun.nio.ch.SelectorImpl.lockAndDoSelect(SelectorImpl.java:86)
        at sun.nio.ch.SelectorImpl.select(SelectorImpl.java:97)
        at sun.nio.ch.SelectorImpl.select(SelectorImpl.java:101)
        at org.eclipse.jetty.io.ManagedSelector$SelectorProducer.select(ManagedSelector.java:423)
        at org.eclipse.jetty.io.ManagedSelector$SelectorProducer.produce(ManagedSelector.java:360)
        at org.eclipse.jetty.util.thread.strategy.EatWhatYouKill.produceTask(EatWhatYouKill.java:357)
        at org.eclipse.jetty.util.thread.strategy.EatWhatYouKill.doProduce(EatWhatYouKill.java:181)
        at org.eclipse.jetty.util.thread.strategy.EatWhatYouKill.tryProduce(EatWhatYouKill.java:168)
        at org.eclipse.jetty.util.thread.strategy.EatWhatYouKill.produce(EatWhatYouKill.java:132)
        at org.eclipse.jetty.io.ManagedSelector$$Lambda$142/1246289191.run(Unknown Source)
        at org.eclipse.jetty.util.thread.QueuedThreadPool.runJob(QueuedThreadPool.java:765)
        at org.eclipse.jetty.util.thread.QueuedThreadPool$2.run(QueuedThreadPool.java:683)
        at java.lang.Thread.run(Thread.java:748)
   2) Thread[id=2777, name=Scheduler-1859528979, state=TIMED_WAITING, group=TGRP-LegacyFieldFacetCloudTest]
        at sun.misc.Unsafe.park(Native Method)
        at java.util.concurrent.locks.LockSupport.parkNanos(LockSupport.java:215)
        at java.util.concurrent.locks.AbstractQueuedSynchronizer$ConditionObject.awaitNanos(AbstractQueuedSynchronizer.java:2078)
        at java.util.concurrent.ScheduledThreadPoolExecutor$DelayedWorkQueue.take(ScheduledThreadPoolExecutor.java:1093)
        at java.util.concurrent.ScheduledThreadPoolExecutor$DelayedWorkQueue.take(ScheduledThreadPoolExecutor.java:809)
        at java.util.concurrent.ThreadPoolExecutor.getTask(ThreadPoolExecutor.java:1074)
        at java.util.concurrent.ThreadPoolExecutor.runWorker(ThreadPoolExecutor.java:1134)
        at java.util.concurrent.ThreadPoolExecutor$Worker.run(ThreadPoolExecutor.java:624)
        at java.lang.Thread.run(Thread.java:748)
   3) Thread[id=2865, name=zkConnectionManagerCallback-1192-thread-1, state=WAITING, group=TGRP-LegacyFieldFacetCloudTest]
        at sun.misc.Unsafe.park(Native Method)
        at java.util.concurrent.locks.LockSupport.park(LockSupport.java:175)
        at java.util.concurrent.locks.AbstractQueuedSynchronizer$ConditionObject.await(AbstractQueuedSynchronizer.java:2039)
        at java.util.concurrent.LinkedBlockingQueue.take(LinkedBlockingQueue.java:442)
        at java.util.concurrent.ThreadPoolExecutor.getTask(ThreadPoolExecutor.java:1074)
        at java.util.concurrent.ThreadPoolExecutor.runWorker(ThreadPoolExecutor.java:1134)
        at java.util.concurrent.ThreadPoolExecutor$Worker.run(ThreadPoolExecutor.java:624)
        at java.lang.Thread.run(Thread.java:748)
   4) Thread[id=2755, name=qtp1004676000-2755, state=RUNNABLE, group=TGRP-LegacyFieldFacetCloudTest]
        at sun.nio.ch.EPollArrayWrapper.epollWait(Native Method)
        at sun.nio.ch.EPollArrayWrapper.poll(EPollArrayWrapper.java:269)
        at sun.nio.ch.EPollSelectorImpl.doSelect(EPollSelectorImpl.java:93)
        at sun.nio.ch.SelectorImpl.lockAndDoSelect(SelectorImpl.java:86)
        at sun.nio.ch.SelectorImpl.select(SelectorImpl.java:97)
        at sun.nio.ch.SelectorImpl.select(SelectorImpl.java:101)
        at org.eclipse.jetty.io.ManagedSelector$SelectorProducer.select(ManagedSelector.java:423)
        at org.eclipse.jetty.io.ManagedSelector$SelectorProducer.produce(ManagedSelector.java:360)
        at org.eclipse.jetty.util.thread.strategy.EatWhatYouKill.produceTask(EatWhatYouKill.java:357)
        at org.eclipse.jetty.util.thread.strategy.EatWhatYouKill.doProduce(EatWhatYouKill.java:181)
        at org.eclipse.jetty.util.thread.strategy.EatWhatYouKill.tryProduce(EatWhatYouKill.java:168)
        at org.eclipse.jetty.util.thread.strategy.EatWhatYouKill.produce(EatWhatYouKill.java:132)
        at org.eclipse.jetty.io.ManagedSelector$$Lambda$142/1246289191.run(Unknown Source)
        at org.eclipse.jetty.util.thread.QueuedThreadPool.runJob(QueuedThreadPool.java:765)
        at org.eclipse.jetty.util.thread.QueuedThreadPool$2.run(QueuedThreadPool.java:683)
        at java.lang.Thread.run(Thread.java:748)
	at __randomizedtesting.SeedInfo.seed([CC778841CC538688]:0)


FAILED:  org.apache.solr.handler.component.TestDistributedStatsComponentCardinality.test

Error Message:
.responseHeader.status:200!=0

Stack Trace:
junit.framework.AssertionFailedError: .responseHeader.status:200!=0
	at __randomizedtesting.SeedInfo.seed([CFECBB718DB9DC1D:47B884AB2345B1E5]:0)
	at junit.framework.Assert.fail(Assert.java:57)
	at org.apache.solr.BaseDistributedSearchTestCase.compareSolrResponses(BaseDistributedSearchTestCase.java:999)
	at org.apache.solr.BaseDistributedSearchTestCase.compareResponses(BaseDistributedSearchTestCase.java:1026)
	at org.apache.solr.BaseDistributedSearchTestCase.query(BaseDistributedSearchTestCase.java:680)
	at org.apache.solr.BaseDistributedSearchTestCase.query(BaseDistributedSearchTestCase.java:643)
	at org.apache.solr.handler.component.TestDistributedStatsComponentCardinality.test(TestDistributedStatsComponentCardinality.java:142)
	at sun.reflect.NativeMethodAccessorImpl.invoke0(Native Method)
	at sun.reflect.NativeMethodAccessorImpl.invoke(NativeMethodAccessorImpl.java:62)
	at sun.reflect.DelegatingMethodAccessorImpl.invoke(DelegatingMethodAccessorImpl.java:43)
	at java.lang.reflect.Method.invoke(Method.java:498)
	at com.carrotsearch.randomizedtesting.RandomizedRunner.invoke(RandomizedRunner.java:1750)
	at com.carrotsearch.randomizedtesting.RandomizedRunner$8.evaluate(RandomizedRunner.java:938)
	at com.carrotsearch.randomizedtesting.RandomizedRunner$9.evaluate(RandomizedRunner.java:974)
	at com.carrotsearch.randomizedtesting.RandomizedRunner$10.evaluate(RandomizedRunner.java:988)
	at org.apache.solr.BaseDistributedSearchTestCase$ShardsRepeatRule$ShardsFixedStatement.callStatement(BaseDistributedSearchTestCase.java:1082)
	at org.apache.solr.BaseDistributedSearchTestCase$ShardsRepeatRule$ShardsStatement.evaluate(BaseDistributedSearchTestCase.java:1054)
	at com.carrotsearch.randomizedtesting.rules.SystemPropertiesRestoreRule$1.evaluate(SystemPropertiesRestoreRule.java:57)
	at org.apache.lucene.util.TestRuleSetupTeardownChained$1.evaluate(TestRuleSetupTeardownChained.java:49)
	at org.apache.lucene.util.AbstractBeforeAfterRule$1.evaluate(AbstractBeforeAfterRule.java:45)
	at org.apache.lucene.util.TestRuleThreadAndTestName$1.evaluate(TestRuleThreadAndTestName.java:48)
	at org.apache.lucene.util.TestRuleIgnoreAfterMaxFailures$1.evaluate(TestRuleIgnoreAfterMaxFailures.java:64)
	at org.apache.lucene.util.TestRuleMarkFailure$1.evaluate(TestRuleMarkFailure.java:47)
	at com.carrotsearch.randomizedtesting.rules.StatementAdapter.evaluate(StatementAdapter.java:36)
	at com.carrotsearch.randomizedtesting.ThreadLeakControl$StatementRunner.run(ThreadLeakControl.java:368)
	at com.carrotsearch.randomizedtesting.ThreadLeakControl.forkTimeoutingTask(ThreadLeakControl.java:817)
	at com.carrotsearch.randomizedtesting.ThreadLeakControl$3.evaluate(ThreadLeakControl.java:468)
	at com.carrotsearch.randomizedtesting.RandomizedRunner.runSingleTest(RandomizedRunner.java:947)
	at com.carrotsearch.randomizedtesting.RandomizedRunner$5.evaluate(RandomizedRunner.java:832)
	at com.carrotsearch.randomizedtesting.RandomizedRunner$6.evaluate(RandomizedRunner.java:883)
	at com.carrotsearch.randomizedtesting.RandomizedRunner$7.evaluate(RandomizedRunner.java:894)
	at com.carrotsearch.randomizedtesting.rules.StatementAdapter.evaluate(StatementAdapter.java:36)
	at com.carrotsearch.randomizedtesting.rules.SystemPropertiesRestoreRule$1.evaluate(SystemPropertiesRestoreRule.java:57)
	at org.apache.lucene.util.AbstractBeforeAfterRule$1.evaluate(AbstractBeforeAfterRule.java:45)
	at com.carrotsearch.randomizedtesting.rules.StatementAdapter.evaluate(StatementAdapter.java:36)
	at org.apache.lucene.util.TestRuleStoreClassName$1.evaluate(TestRuleStoreClassName.java:41)
	at com.carrotsearch.randomizedtesting.rules.NoShadowingOrOverridesOnMethodsRule$1.evaluate(NoShadowingOrOverridesOnMethodsRule.java:40)
	at com.carrotsearch.randomizedtesting.rules.NoShadowingOrOverridesOnMethodsRule$1.evaluate(NoShadowingOrOverridesOnMethodsRule.java:40)
	at com.carrotsearch.randomizedtesting.rules.StatementAdapter.evaluate(StatementAdapter.java:36)
	at com.carrotsearch.randomizedtesting.rules.StatementAdapter.evaluate(StatementAdapter.java:36)
	at com.carrotsearch.randomizedtesting.rules.StatementAdapter.evaluate(StatementAdapter.java:36)
	at org.apache.lucene.util.TestRuleAssertionsRequired$1.evaluate(TestRuleAssertionsRequired.java:53)
	at org.apache.lucene.util.TestRuleMarkFailure$1.evaluate(TestRuleMarkFailure.java:47)
	at org.apache.lucene.util.TestRuleIgnoreAfterMaxFailures$1.evaluate(TestRuleIgnoreAfterMaxFailures.java:64)
	at org.apache.lucene.util.TestRuleIgnoreTestSuites$1.evaluate(TestRuleIgnoreTestSuites.java:54)
	at com.carrotsearch.randomizedtesting.rules.StatementAdapter.evaluate(StatementAdapter.java:36)
	at com.carrotsearch.randomizedtesting.ThreadLeakControl$StatementRunner.run(ThreadLeakControl.java:368)
	at java.lang.Thread.run(Thread.java:748)




Build Log:
[...truncated 14850 lines...]
   [junit4] Suite: org.apache.solr.handler.component.TestDistributedStatsComponentCardinality
   [junit4]   2> 4295132 INFO  (SUITE-TestDistributedStatsComponentCardinality-seed#[CFECBB718DB9DC1D]-worker) [    ] o.a.s.SolrTestCaseJ4 SecureRandom sanity checks: test.solr.allowed.securerandom=null & java.security.egd=file:/dev/./urandom
   [junit4]   2> Creating dataDir: /home/jenkins/jenkins-slave/workspace/Lucene-Solr-BadApples-Tests-master/solr/build/solr-core/test/J0/temp/solr.handler.component.TestDistributedStatsComponentCardinality_CFECBB718DB9DC1D-001/init-core-data-001
   [junit4]   2> 4295133 WARN  (SUITE-TestDistributedStatsComponentCardinality-seed#[CFECBB718DB9DC1D]-worker) [    ] o.a.s.SolrTestCaseJ4 startTrackingSearchers: numOpens=11 numCloses=11
   [junit4]   2> 4295133 INFO  (SUITE-TestDistributedStatsComponentCardinality-seed#[CFECBB718DB9DC1D]-worker) [    ] o.a.s.SolrTestCaseJ4 Using PointFields (NUMERIC_POINTS_SYSPROP=true) w/NUMERIC_DOCVALUES_SYSPROP=false
   [junit4]   2> 4295151 INFO  (SUITE-TestDistributedStatsComponentCardinality-seed#[CFECBB718DB9DC1D]-worker) [    ] o.a.s.SolrTestCaseJ4 Randomized ssl (false) and clientAuth (false) via: @org.apache.solr.SolrTestCaseJ4$SuppressSSL(bugUrl=https://issues.apache.org/jira/browse/SOLR-9062)
   [junit4]   2> 4295159 INFO  (SUITE-TestDistributedStatsComponentCardinality-seed#[CFECBB718DB9DC1D]-worker) [    ] o.a.s.BaseDistributedSearchTestCase Setting hostContext system property: /
   [junit4]   2> 4295767 INFO  (TEST-TestDistributedStatsComponentCardinality.test-seed#[CFECBB718DB9DC1D]) [    ] o.a.s.SolrTestCaseJ4 Writing core.properties file to /home/jenkins/jenkins-slave/workspace/Lucene-Solr-BadApples-Tests-master/solr/build/solr-core/test/J0/temp/solr.handler.component.TestDistributedStatsComponentCardinality_CFECBB718DB9DC1D-001/tempDir-001/control/cores/collection1
   [junit4]   2> 4295768 WARN  (TEST-TestDistributedStatsComponentCardinality.test-seed#[CFECBB718DB9DC1D]) [    ] o.e.j.s.AbstractConnector Ignoring deprecated socket close linger time
   [junit4]   2> 4295769 INFO  (TEST-TestDistributedStatsComponentCardinality.test-seed#[CFECBB718DB9DC1D]) [    ] o.a.s.c.s.e.JettySolrRunner Start Jetty (original configured port=0)
   [junit4]   2> 4295769 INFO  (TEST-TestDistributedStatsComponentCardinality.test-seed#[CFECBB718DB9DC1D]) [    ] o.a.s.c.s.e.JettySolrRunner Trying to start Jetty on port 0 try number 1 ...
   [junit4]   2> 4295769 INFO  (TEST-TestDistributedStatsComponentCardinality.test-seed#[CFECBB718DB9DC1D]) [    ] o.e.j.s.Server jetty-9.4.14.v20181114; built: 2018-11-14T21:20:31.478Z; git: c4550056e785fb5665914545889f21dc136ad9e6; jvm 1.8.0_191-b12
   [junit4]   2> 4295770 INFO  (TEST-TestDistributedStatsComponentCardinality.test-seed#[CFECBB718DB9DC1D]) [    ] o.e.j.s.session DefaultSessionIdManager workerName=node0
   [junit4]   2> 4295770 INFO  (TEST-TestDistributedStatsComponentCardinality.test-seed#[CFECBB718DB9DC1D]) [    ] o.e.j.s.session No SessionScavenger set, using defaults
   [junit4]   2> 4295770 INFO  (TEST-TestDistributedStatsComponentCardinality.test-seed#[CFECBB718DB9DC1D]) [    ] o.e.j.s.session node0 Scavenging every 660000ms
   [junit4]   2> 4295786 INFO  (TEST-TestDistributedStatsComponentCardinality.test-seed#[CFECBB718DB9DC1D]) [    ] o.e.j.s.h.ContextHandler Started o.e.j.s.ServletContextHandler@2f3f6e78{/,null,AVAILABLE}
   [junit4]   2> 4295788 INFO  (TEST-TestDistributedStatsComponentCardinality.test-seed#[CFECBB718DB9DC1D]) [    ] o.e.j.s.AbstractConnector Started ServerConnector@5437f0ce{HTTP/1.1,[http/1.1, h2c]}{127.0.0.1:43005}
   [junit4]   2> 4295789 INFO  (TEST-TestDistributedStatsComponentCardinality.test-seed#[CFECBB718DB9DC1D]) [    ] o.e.j.s.Server Started @4295869ms
   [junit4]   2> 4295789 INFO  (TEST-TestDistributedStatsComponentCardinality.test-seed#[CFECBB718DB9DC1D]) [    ] o.a.s.c.s.e.JettySolrRunner Jetty properties: {hostContext=/, hostPort=43005, coreRootDirectory=/home/jenkins/jenkins-slave/workspace/Lucene-Solr-BadApples-Tests-master/solr/build/solr-core/test/J0/temp/solr.handler.component.TestDistributedStatsComponentCardinality_CFECBB718DB9DC1D-001/tempDir-001/control/cores}
   [junit4]   2> 4295789 ERROR (TEST-TestDistributedStatsComponentCardinality.test-seed#[CFECBB718DB9DC1D]) [    ] o.a.s.u.StartupLoggingUtils Missing Java Option solr.log.dir. Logging may be missing or incomplete.
   [junit4]   2> 4295789 INFO  (TEST-TestDistributedStatsComponentCardinality.test-seed#[CFECBB718DB9DC1D]) [    ] o.a.s.s.SolrDispatchFilter Using logger factory org.apache.logging.slf4j.Log4jLoggerFactory
   [junit4]   2> 4295789 INFO  (TEST-TestDistributedStatsComponentCardinality.test-seed#[CFECBB718DB9DC1D]) [    ] o.a.s.s.SolrDispatchFilter  ___      _       Welcome to Apache Solr™ version 9.0.0
   [junit4]   2> 4295789 INFO  (TEST-TestDistributedStatsComponentCardinality.test-seed#[CFECBB718DB9DC1D]) [    ] o.a.s.s.SolrDispatchFilter / __| ___| |_ _   Starting in standalone mode on port null
   [junit4]   2> 4295789 INFO  (TEST-TestDistributedStatsComponentCardinality.test-seed#[CFECBB718DB9DC1D]) [    ] o.a.s.s.SolrDispatchFilter \__ \/ _ \ | '_|  Install dir: null
   [junit4]   2> 4295789 INFO  (TEST-TestDistributedStatsComponentCardinality.test-seed#[CFECBB718DB9DC1D]) [    ] o.a.s.s.SolrDispatchFilter |___/\___/_|_|    Start time: 2019-01-17T07:37:31.113Z
   [junit4]   2> 4295789 INFO  (TEST-TestDistributedStatsComponentCardinality.test-seed#[CFECBB718DB9DC1D]) [    ] o.a.s.c.SolrXmlConfig Loading container configuration from /home/jenkins/jenkins-slave/workspace/Lucene-Solr-BadApples-Tests-master/solr/build/solr-core/test/J0/temp/solr.handler.component.TestDistributedStatsComponentCardinality_CFECBB718DB9DC1D-001/tempDir-001/control/solr.xml
   [junit4]   2> 4295805 INFO  (TEST-TestDistributedStatsComponentCardinality.test-seed#[CFECBB718DB9DC1D]) [    ] o.a.s.c.SolrXmlConfig Configuration parameter autoReplicaFailoverWorkLoopDelay is ignored
   [junit4]   2> 4295805 INFO  (TEST-TestDistributedStatsComponentCardinality.test-seed#[CFECBB718DB9DC1D]) [    ] o.a.s.c.SolrXmlConfig Configuration parameter autoReplicaFailoverBadNodeExpiration is ignored
   [junit4]   2> 4295988 INFO  (TEST-TestDistributedStatsComponentCardinality.test-seed#[CFECBB718DB9DC1D]) [    ] o.a.s.c.SolrXmlConfig MBean server found: com.sun.jmx.mbeanserver.JmxMBeanServer@64f73207, but no JMX reporters were configured - adding default JMX reporter.
   [junit4]   2> 4296550 INFO  (TEST-TestDistributedStatsComponentCardinality.test-seed#[CFECBB718DB9DC1D]) [    ] o.a.s.h.c.HttpShardHandlerFactory Host whitelist initialized: WhitelistHostChecker [whitelistHosts=null, whitelistHostCheckingEnabled=false]
   [junit4]   2> 4296564 WARN  (TEST-TestDistributedStatsComponentCardinality.test-seed#[CFECBB718DB9DC1D]) [    ] o.e.j.u.s.S.config No Client EndPointIdentificationAlgorithm configured for SslContextFactory@1b7228ba[provider=null,keyStore=null,trustStore=null]
   [junit4]   2> 4296568 WARN  (TEST-TestDistributedStatsComponentCardinality.test-seed#[CFECBB718DB9DC1D]) [    ] o.e.j.u.s.S.config No Client EndPointIdentificationAlgorithm configured for SslContextFactory@732b7850[provider=null,keyStore=null,trustStore=null]
   [junit4]   2> 4296658 INFO  (TEST-TestDistributedStatsComponentCardinality.test-seed#[CFECBB718DB9DC1D]) [    ] o.a.s.c.TransientSolrCoreCacheDefault Allocating transient cache for 4 transient cores
   [junit4]   2> 4296658 INFO  (TEST-TestDistributedStatsComponentCardinality.test-seed#[CFECBB718DB9DC1D]) [    ] o.a.s.h.a.MetricsHistoryHandler No .system collection, keeping metrics history in memory.
   [junit4]   2> 4296722 INFO  (TEST-TestDistributedStatsComponentCardinality.test-seed#[CFECBB718DB9DC1D]) [    ] o.a.s.m.r.SolrJmxReporter JMX monitoring for 'solr.node' (registry 'solr.node') enabled at server: com.sun.jmx.mbeanserver.JmxMBeanServer@64f73207
   [junit4]   2> 4296743 INFO  (TEST-TestDistributedStatsComponentCardinality.test-seed#[CFECBB718DB9DC1D]) [    ] o.a.s.m.r.SolrJmxReporter JMX monitoring for 'solr.jvm' (registry 'solr.jvm') enabled at server: com.sun.jmx.mbeanserver.JmxMBeanServer@64f73207
   [junit4]   2> 4296743 INFO  (TEST-TestDistributedStatsComponentCardinality.test-seed#[CFECBB718DB9DC1D]) [    ] o.a.s.m.r.SolrJmxReporter JMX monitoring for 'solr.jetty' (registry 'solr.jetty') enabled at server: com.sun.jmx.mbeanserver.JmxMBeanServer@64f73207
   [junit4]   2> 4296744 INFO  (TEST-TestDistributedStatsComponentCardinality.test-seed#[CFECBB718DB9DC1D]) [    ] o.a.s.c.CorePropertiesLocator Found 1 core definitions underneath /home/jenkins/jenkins-slave/workspace/Lucene-Solr-BadApples-Tests-master/solr/build/solr-core/test/J0/temp/solr.handler.component.TestDistributedStatsComponentCardinality_CFECBB718DB9DC1D-001/tempDir-001/control/cores
   [junit4]   2> 4296744 INFO  (TEST-TestDistributedStatsComponentCardinality.test-seed#[CFECBB718DB9DC1D]) [    ] o.a.s.c.CorePropertiesLocator Cores are: [collection1]
   [junit4]   2> 4296745 INFO  (coreLoadExecutor-10631-thread-1) [    x:collection1] o.a.s.c.SolrResourceLoader [null] Added 2 libs to classloader, from paths: [/home/jenkins/jenkins-slave/workspace/Lucene-Solr-BadApples-Tests-master/solr/core/src/test-files/solr/collection1/lib, /home/jenkins/jenkins-slave/workspace/Lucene-Solr-BadApples-Tests-master/solr/core/src/test-files/solr/collection1/lib/classes]
   [junit4]   2> 4296830 INFO  (coreLoadExecutor-10631-thread-1) [    x:collection1] o.a.s.c.SolrConfig Using Lucene MatchVersion: 9.0.0
   [junit4]   2> 4296880 INFO  (coreLoadExecutor-10631-thread-1) [    x:collection1] o.a.s.s.IndexSchema [collection1] Schema name=test
   [junit4]   2> 4297234 INFO  (coreLoadExecutor-10631-thread-1) [    x:collection1] o.a.s.s.IndexSchema Loaded schema test/1.0 with uniqueid field id
   [junit4]   2> 4297285 INFO  (coreLoadExecutor-10631-thread-1) [    x:collection1] o.a.s.c.CoreContainer Creating SolrCore 'collection1' using configuration from configset /home/jenkins/jenkins-slave/workspace/Lucene-Solr-BadApples-Tests-master/solr/core/src/test-files/solr/collection1, trusted=true
   [junit4]   2> 4297286 INFO  (coreLoadExecutor-10631-thread-1) [    x:collection1] o.a.s.m.r.SolrJmxReporter JMX monitoring for 'solr.core.collection1' (registry 'solr.core.collection1') enabled at server: com.sun.jmx.mbeanserver.JmxMBeanServer@64f73207
   [junit4]   2> 4297286 INFO  (coreLoadExecutor-10631-thread-1) [    x:collection1] o.a.s.c.SolrCore [[collection1] ] Opening new SolrCore at [/home/jenkins/jenkins-slave/workspace/Lucene-Solr-BadApples-Tests-master/solr/core/src/test-files/solr/collection1], dataDir=[/home/jenkins/jenkins-slave/workspace/Lucene-Solr-BadApples-Tests-master/solr/build/solr-core/test/J0/temp/solr.handler.component.TestDistributedStatsComponentCardinality_CFECBB718DB9DC1D-001/tempDir-001/control/cores/collection1/data/]
   [junit4]   2> 4297287 INFO  (coreLoadExecutor-10631-thread-1) [    x:collection1] o.a.s.u.RandomMergePolicy RandomMergePolicy wrapping class org.apache.lucene.index.LogDocMergePolicy: [LogDocMergePolicy: minMergeSize=1000, mergeFactor=34, maxMergeSize=9223372036854775807, maxMergeSizeForForcedMerge=9223372036854775807, calibrateSizeByDeletes=true, maxMergeDocs=2147483647, maxCFSSegmentSizeMB=8.796093022207999E12, noCFSRatio=0.6978235822362236]
   [junit4]   2> 4297585 INFO  (coreLoadExecutor-10631-thread-1) [    x:collection1] o.a.s.u.UpdateHandler Using UpdateLog implementation: org.apache.solr.update.UpdateLog
   [junit4]   2> 4297586 INFO  (coreLoadExecutor-10631-thread-1) [    x:collection1] o.a.s.u.UpdateLog Initializing UpdateLog: dataDir= defaultSyncLevel=FLUSH numRecordsToKeep=100 maxNumLogsToKeep=10 numVersionBuckets=65536
   [junit4]   2> 4297588 INFO  (coreLoadExecutor-10631-thread-1) [    x:collection1] o.a.s.u.CommitTracker Hard AutoCommit: disabled
   [junit4]   2> 4297588 INFO  (coreLoadExecutor-10631-thread-1) [    x:collection1] o.a.s.u.CommitTracker Soft AutoCommit: disabled
   [junit4]   2> 4297588 INFO  (coreLoadExecutor-10631-thread-1) [    x:collection1] o.a.s.u.RandomMergePolicy RandomMergePolicy wrapping class org.apache.lucene.index.LogDocMergePolicy: [LogDocMergePolicy: minMergeSize=1000, mergeFactor=50, maxMergeSize=9223372036854775807, maxMergeSizeForForcedMerge=9223372036854775807, calibrateSizeByDeletes=true, maxMergeDocs=2147483647, maxCFSSegmentSizeMB=8.796093022207999E12, noCFSRatio=0.0]
   [junit4]   2> 4297588 INFO  (coreLoadExecutor-10631-thread-1) [    x:collection1] o.a.s.s.SolrIndexSearcher Opening [Searcher@782f44b9[collection1] main]
   [junit4]   2> 4297609 INFO  (coreLoadExecutor-10631-thread-1) [    x:collection1] o.a.s.h.c.SpellCheckComponent Initializing spell checkers
   [junit4]   2> 4297638 INFO  (coreLoadExecutor-10631-thread-1) [    x:collection1] o.a.s.s.DirectSolrSpellChecker init: {name=direct,classname=DirectSolrSpellChecker,field=lowerfilt,minQueryLength=3}
   [junit4]   2> 4297841 INFO  (coreLoadExecutor-10631-thread-1) [    x:collection1] o.a.s.h.ReplicationHandler Commits will be reserved for 10000ms.
   [junit4]   2> 4297841 INFO  (coreLoadExecutor-10631-thread-1) [    x:collection1] o.a.s.u.UpdateLog Could not find max version in index or recent updates, using new clock 1622892245853143040
   [junit4]   2> 4297843 INFO  (searcherExecutor-10632-thread-1-processing-x:collection1) [    x:collection1] o.a.s.h.c.SpellCheckComponent Loading spell index for spellchecker: default
   [junit4]   2> 4297844 INFO  (searcherExecutor-10632-thread-1-processing-x:collection1) [    x:collection1] o.a.s.h.c.SpellCheckComponent Loading spell index for spellchecker: direct
   [junit4]   2> 4297844 INFO  (searcherExecutor-10632-thread-1-processing-x:collection1) [    x:collection1] o.a.s.h.c.SpellCheckComponent Loading spell index for spellchecker: wordbreak
   [junit4]   2> 4297844 INFO  (searcherExecutor-10632-thread-1-processing-x:collection1) [    x:collection1] o.a.s.h.c.SpellCheckComponent Loading spell index for spellchecker: multipleFields
   [junit4]   2> 4297872 INFO  (searcherExecutor-10632-thread-1-processing-x:collection1) [    x:collection1] o.a.s.h.c.SpellCheckComponent Loading spell index for spellchecker: jarowinkler
   [junit4]   2> 4297873 INFO  (searcherExecutor-10632-thread-1-processing-x:collection1) [    x:collection1] o.a.s.h.c.SpellCheckComponent Loading spell index for spellchecker: external
   [junit4]   2> 4297873 INFO  (searcherExecutor-10632-thread-1-processing-x:collection1) [    x:collection1] o.a.s.h.c.SpellCheckComponent Loading spell index for spellchecker: freq
   [junit4]   2> 4297873 INFO  (searcherExecutor-10632-thread-1-processing-x:collection1) [    x:collection1] o.a.s.h.c.SpellCheckComponent Loading spell index for spellchecker: fqcn
   [junit4]   2> 4297873 INFO  (searcherExecutor-10632-thread-1-processing-x:collection1) [    x:collection1] o.a.s.h.c.SpellCheckComponent Loading spell index for spellchecker: perDict
   [junit4]   2> 4297874 INFO  (searcherExecutor-10632-thread-1-processing-x:collection1) [    x:collection1] o.a.s.c.SolrCore [collection1] Registered new searcher Searcher@782f44b9[collection1] main{ExitableDirectoryReader(UninvertingDirectoryReader())}
   [junit4]   2> 4299195 INFO  (TEST-TestDistributedStatsComponentCardinality.test-seed#[CFECBB718DB9DC1D]) [    ] o.a.s.SolrTestCaseJ4 Writing core.properties file to /home/jenkins/jenkins-slave/workspace/Lucene-Solr-BadApples-Tests-master/solr/build/solr-core/test/J0/temp/solr.handler.component.TestDistributedStatsComponentCardinality_CFECBB718DB9DC1D-001/tempDir-001/shard0/cores/collection1
   [junit4]   2> 4299196 WARN  (TEST-TestDistributedStatsComponentCardinality.test-seed#[CFECBB718DB9DC1D]) [    ] o.e.j.s.AbstractConnector Ignoring deprecated socket close linger time
   [junit4]   2> 4299196 INFO  (TEST-TestDistributedStatsComponentCardinality.test-seed#[CFECBB718DB9DC1D]) [    ] o.a.s.c.s.e.JettySolrRunner Start Jetty (original configured port=0)
   [junit4]   2> 4299196 INFO  (TEST-TestDistributedStatsComponentCardinality.test-seed#[CFECBB718DB9DC1D]) [    ] o.a.s.c.s.e.JettySolrRunner Trying to start Jetty on port 0 try number 1 ...
   [junit4]   2> 4299197 INFO  (TEST-TestDistributedStatsComponentCardinality.test-seed#[CFECBB718DB9DC1D]) [    ] o.e.j.s.Server jetty-9.4.14.v20181114; built: 2018-11-14T21:20:31.478Z; git: c4550056e785fb5665914545889f21dc136ad9e6; jvm 1.8.0_191-b12
   [junit4]   2> 4299375 INFO  (TEST-TestDistributedStatsComponentCardinality.test-seed#[CFECBB718DB9DC1D]) [    ] o.e.j.s.session DefaultSessionIdManager workerName=node0
   [junit4]   2> 4299375 INFO  (TEST-TestDistributedStatsComponentCardinality.test-seed#[CFECBB718DB9DC1D]) [    ] o.e.j.s.session No SessionScavenger set, using defaults
   [junit4]   2> 4299375 INFO  (TEST-TestDistributedStatsComponentCardinality.test-seed#[CFECBB718DB9DC1D]) [    ] o.e.j.s.session node0 Scavenging every 600000ms
   [junit4]   2> 4299391 INFO  (TEST-TestDistributedStatsComponentCardinality.test-seed#[CFECBB718DB9DC1D]) [    ] o.e.j.s.h.ContextHandler Started o.e.j.s.ServletContextHandler@72472cad{/,null,AVAILABLE}
   [junit4]   2> 4299395 INFO  (TEST-TestDistributedStatsComponentCardinality.test-seed#[CFECBB718DB9DC1D]) [    ] o.e.j.s.AbstractConnector Started ServerConnector@73f0d904{HTTP/1.1,[http/1.1, h2c]}{127.0.0.1:36666}
   [junit4]   2> 4299395 INFO  (TEST-TestDistributedStatsComponentCardinality.test-seed#[CFECBB718DB9DC1D]) [    ] o.e.j.s.Server Started @4299476ms
   [junit4]   2> 4299395 INFO  (TEST-TestDistributedStatsComponentCardinality.test-seed#[CFECBB718DB9DC1D]) [    ] o.a.s.c.s.e.JettySolrRunner Jetty properties: {hostContext=/, hostPort=36666, coreRootDirectory=/home/jenkins/jenkins-slave/workspace/Lucene-Solr-BadApples-Tests-master/solr/build/solr-core/test/J0/temp/solr.handler.component.TestDistributedStatsComponentCardinality_CFECBB718DB9DC1D-001/tempDir-001/shard0/cores}
   [junit4]   2> 4299396 ERROR (TEST-TestDistributedStatsComponentCardinality.test-seed#[CFECBB718DB9DC1D]) [    ] o.a.s.u.StartupLoggingUtils Missing Java Option solr.log.dir. Logging may be missing or incomplete.
   [junit4]   2> 4299396 INFO  (TEST-TestDistributedStatsComponentCardinality.test-seed#[CFECBB718DB9DC1D]) [    ] o.a.s.s.SolrDispatchFilter Using logger factory org.apache.logging.slf4j.Log4jLoggerFactory
   [junit4]   2> 4299396 INFO  (TEST-TestDistributedStatsComponentCardinality.test-seed#[CFECBB718DB9DC1D]) [    ] o.a.s.s.SolrDispatchFilter  ___      _       Welcome to Apache Solr™ version 9.0.0
   [junit4]   2> 4299396 INFO  (TEST-TestDistributedStatsComponentCardinality.test-seed#[CFECBB718DB9DC1D]) [    ] o.a.s.s.SolrDispatchFilter / __| ___| |_ _   Starting in standalone mode on port null
   [junit4]   2> 4299396 INFO  (TEST-TestDistributedStatsComponentCardinality.test-seed#[CFECBB718DB9DC1D]) [    ] o.a.s.s.SolrDispatchFilter \__ \/ _ \ | '_|  Install dir: null
   [junit4]   2> 4299396 INFO  (TEST-TestDistributedStatsComponentCardinality.test-seed#[CFECBB718DB9DC1D]) [    ] o.a.s.s.SolrDispatchFilter |___/\___/_|_|    Start time: 2019-01-17T07:37:34.720Z
   [junit4]   2> 4299396 INFO  (TEST-TestDistributedStatsComponentCardinality.test-seed#[CFECBB718DB9DC1D]) [    ] o.a.s.c.SolrXmlConfig Loading container configuration from /home/jenkins/jenkins-slave/workspace/Lucene-Solr-BadApples-Tests-master/solr/build/solr-core/test/J0/temp/solr.handler.component.TestDistributedStatsComponentCardinality_CFECBB718DB9DC1D-001/tempDir-001/shard0/solr.xml
   [junit4]   2> 4299436 INFO  (TEST-TestDistributedStatsComponentCardinality.test-seed#[CFECBB718DB9DC1D]) [    ] o.a.s.c.SolrXmlConfig Configuration parameter autoReplicaFailoverWorkLoopDelay is ignored
   [junit4]   2> 4299436 INFO  (TEST-TestDistributedStatsComponentCardinality.test-seed#[CFECBB718DB9DC1D]) [    ] o.a.s.c.SolrXmlConfig Configuration parameter autoReplicaFailoverBadNodeExpiration is ignored
   [junit4]   2> 4299437 INFO  (TEST-TestDistributedStatsComponentCardinality.test-seed#[CFECBB718DB9DC1D]) [    ] o.a.s.c.SolrXmlConfig MBean server found: com.sun.jmx.mbeanserver.JmxMBeanServer@64f73207, but no JMX reporters were configured - adding default JMX reporter.
   [junit4]   2> 4299997 INFO  (TEST-TestDistributedStatsComponentCardinality.test-seed#[CFECBB718DB9DC1D]) [    ] o.a.s.h.c.HttpShardHandlerFactory Host whitelist initialized: WhitelistHostChecker [whitelistHosts=null, whitelistHostCheckingEnabled=false]
   [junit4]   2> 4299998 WARN  (TEST-TestDistributedStatsComponentCardinality.test-seed#[CFECBB718DB9DC1D]) [    ] o.e.j.u.s.S.config No Client EndPointIdentificationAlgorithm configured for SslContextFactory@14f2a25a[provider=null,keyStore=null,trustStore=null]
   [junit4]   2> 4300018 WARN  (TEST-TestDistributedStatsComponentCardinality.test-seed#[CFECBB718DB9DC1D]) [    ] o.e.j.u.s.S.config No Client EndPointIdentificationAlgorithm configured for SslContextFactory@7c8e6e66[provider=null,keyStore=null,trustStore=null]
   [junit4]   2> 4300091 INFO  (TEST-TestDistributedStatsComponentCardinality.test-seed#[CFECBB718DB9DC1D]) [    ] o.a.s.c.TransientSolrCoreCacheDefault Allocating transient cache for 4 transient cores
   [junit4]   2> 4300091 INFO  (TEST-TestDistributedStatsComponentCardinality.test-seed#[CFECBB718DB9DC1D]) [    ] o.a.s.h.a.MetricsHistoryHandler No .system collection, keeping metrics history in memory.
   [junit4]   2> 4300144 INFO  (TEST-TestDistributedStatsComponentCardinality.test-seed#[CFECBB718DB9DC1D]) [    ] o.a.s.m.r.SolrJmxReporter JMX monitoring for 'solr.node' (registry 'solr.node') enabled at server: com.sun.jmx.mbeanserver.JmxMBeanServer@64f73207
   [junit4]   2> 4300187 INFO  (TEST-TestDistributedStatsComponentCardinality.test-seed#[CFECBB718DB9DC1D]) [    ] o.a.s.m.r.SolrJmxReporter JMX monitoring for 'solr.jvm' (registry 'solr.jvm') enabled at server: com.sun.jmx.mbeanserver.JmxMBeanServer@64f73207
   [junit4]   2> 4300187 INFO  (TEST-TestDistributedStatsComponentCardinality.test-seed#[CFECBB718DB9DC1D]) [    ] o.a.s.m.r.SolrJmxReporter JMX monitoring for 'solr.jetty' (registry 'solr.jetty') enabled at server: com.sun.jmx.mbeanserver.JmxMBeanServer@64f73207
   [junit4]   2> 4300189 INFO  (TEST-TestDistributedStatsComponentCardinality.test-seed#[CFECBB718DB9DC1D]) [    ] o.a.s.c.CorePropertiesLocator Found 1 core definitions underneath /home/jenkins/jenkins-slave/workspace/Lucene-Solr-BadApples-Tests-master/solr/build/solr-core/test/J0/temp/solr.handler.component.TestDistributedStatsComponentCardinality_CFECBB718DB9DC1D-001/tempDir-001/shard0/cores
   [junit4]   2> 4300201 INFO  (TEST-TestDistributedStatsComponentCardinality.test-seed#[CFECBB718DB9DC1D]) [    ] o.a.s.c.CorePropertiesLocator Cores are: [collection1]
   [junit4]   2> 4300202 INFO  (coreLoadExecutor-10645-thread-1) [    x:collection1] o.a.s.c.SolrResourceLoader [null] Added 2 libs to classloader, from paths: [/home/jenkins/jenkins-slave/workspace/Lucene-Solr-BadApples-Tests-master/solr/core/src/test-files/solr/collection1/lib, /home/jenkins/jenkins-slave/workspace/Lucene-Solr-BadApples-Tests-master/solr/core/src/test-files/solr/collection1/lib/classes]
   [junit4]   2> 4300340 INFO  (coreLoadExecutor-10645-thread-1) [    x:collection1] o.a.s.c.SolrConfig Using Lucene MatchVersion: 9.0.0
   [junit4]   2> 4300487 INFO  (coreLoadExecutor-10645-thread-1) [    x:collection1] o.a.s.s.IndexSchema [collection1] Schema name=test
   [junit4]   2> 4301030 INFO  (coreLoadExecutor-10645-thread-1) [    x:collection1] o.a.s.s.IndexSchema Loaded schema test/1.0 with uniqueid field id
   [junit4]   2> 4301098 INFO  (coreLoadExecutor-10645-thread-1) [    x:collection1] o.a.s.c.CoreContainer Creating SolrCore 'collection1' using configuration from configset /home/jenkins/jenkins-slave/workspace/Lucene-Solr-BadApples-Tests-master/solr/core/src/test-files/solr/collection1, trusted=true
   [junit4]   2> 4301098 INFO  (coreLoadExecutor-10645-thread-1) [    x:collection1] o.a.s.m.r.SolrJmxReporter JMX monitoring for 'solr.core.collection1' (registry 'solr.core.collection1') enabled at server: com.sun.jmx.mbeanserver.JmxMBeanServer@64f73207
   [junit4]   2> 4301098 INFO  (coreLoadExecutor-10645-thread-1) [    x:collection1] o.a.s.c.SolrCore [[collection1] ] Opening new SolrCore at [/home/jenkins/jenkins-slave/workspace/Lucene-Solr-BadApples-Tests-master/solr/core/src/test-files/solr/collection1], dataDir=[/home/jenkins/jenkins-slave/workspace/Lucene-Solr-BadApples-Tests-master/solr/build/solr-core/test/J0/temp/solr.handler.component.TestDistributedStatsComponentCardinality_CFECBB718DB9DC1D-001/tempDir-001/shard0/cores/collection1/data/]
   [junit4]   2> 4301100 INFO  (coreLoadExecutor-10645-thread-1) [    x:collection1] o.a.s.u.RandomMergePolicy RandomMergePolicy wrapping class org.apache.lucene.index.LogDocMergePolicy: [LogDocMergePolicy: minMergeSize=1000, mergeFactor=34, maxMergeSize=9223372036854775807, maxMergeSizeForForcedMerge=9223372036854775807, calibrateSizeByDeletes=true, maxMergeDocs=2147483647, maxCFSSegmentSizeMB=8.796093022207999E12, noCFSRatio=0.6978235822362236]
   [junit4]   2> 4301332 INFO  (coreLoadExecutor-10645-thread-1) [    x:collection1] o.a.s.u.UpdateHandler Using UpdateLog implementation: org.apache.solr.update.UpdateLog
   [junit4]   2> 4301333 INFO  (coreLoadExecutor-10645-thread-1) [    x:collection1] o.a.s.u.UpdateLog Initializing UpdateLog: dataDir= defaultSyncLevel=FLUSH numRecordsToKeep=100 maxNumLogsToKeep=10 numVersionBuckets=65536
   [junit4]   2> 4301335 INFO  (coreLoadExecutor-10645-thread-1) [    x:collection1] o.a.s.u.CommitTracker Hard AutoCommit: disabled
   [junit4]   2> 4301335 INFO  (coreLoadExecutor-10645-thread-1) [    x:collection1] o.a.s.u.CommitTracker Soft AutoCommit: disabled
   [junit4]   2> 4301335 INFO  (coreLoadExecutor-10645-thread-1) [    x:collection1] o.a.s.u.RandomMergePolicy RandomMergePolicy wrapping class org.apache.lucene.index.LogDocMergePolicy: [LogDocMergePolicy: minMergeSize=1000, mergeFactor=50, maxMergeSize=9223372036854775807, maxMergeSizeForForcedMerge=9223372036854775807, calibrateSizeByDeletes=true, maxMergeDocs=2147483647, maxCFSSegmentSizeMB=8.796093022207999E12, noCFSRatio=0.0]
   [junit4]   2> 4301352 INFO  (coreLoadExecutor-10645-thread-1) [    x:collection1] o.a.s.s.SolrIndexSearcher Opening [Searcher@5a299614[collection1] main]
   [junit4]   2> 4301353 INFO  (coreLoadExecutor-10645-thread-1) [    x:collection1] o.a.s.h.c.SpellCheckComponent Initializing spell checkers
   [junit4]   2> 4301384 INFO  (coreLoadExecutor-10645-thread-1) [    x:collection1] o.a.s.s.DirectSolrSpellChecker init: {name=direct,classname=DirectSolrSpellChecker,field=lowerfilt,minQueryLength=3}
   [junit4]   2> 4301519 INFO  (coreLoadExecutor-10645-thread-1) [    x:collection1] o.a.s.h.ReplicationHandler Commits will be reserved for 10000ms.
   [junit4]   2> 4301519 INFO  (coreLoadExecutor-10645-thread-1) [    x:collection1] o.a.s.u.UpdateLog Could not find max version in index or recent updates, using new clock 1622892249709805568
   [junit4]   2> 4301521 INFO  (searcherExecutor-10646-thread-1-processing-x:collection1) [    x:collection1] o.a.s.h.c.SpellCheckComponent Loading spell index for spellchecker: default
   [junit4]   2> 4301554 INFO  (searcherExecutor-10646-thread-1-processing-x:collection1) [    x:collection1] o.a.s.h.c.SpellCheckComponent Loading spell index for spellchecker: direct
   [junit4]   2> 4301554 INFO  (searcherExecutor-10646-thread-1-processing-x:collection1) [    x:collection1] o.a.s.h.c.SpellCheckComponent Loading spell index for spellchecker: wordbreak
   [junit4]   2> 4301554 INFO  (searcherExecutor-10646-thread-1-processing-x:collection1) [    x:collection1] o.a.s.h.c.SpellCheckComponent Loading spell index for spellchecker: multipleFields
   [junit4]   2> 4301571 INFO  (searcherExecutor-10646-thread-1-processing-x:collection1) [    x:collection1] o.a.s.h.c.SpellCheckComponent Loading spell index for spellchecker: jarowinkler
   [junit4]   2> 4301593 INFO  (searcherExecutor-10646-thread-1-processing-x:collection1) [    x:collection1] o.a.s.h.c.SpellCheckComponent Loading spell index for spellchecker: external
   [junit4]   2> 4301607 INFO  (searcherExecutor-10646-thread-1-processing-x:collection1) [    x:collection1] o.a.s.h.c.SpellCheckComponent Loading spell index for spellchecker: freq
   [junit4]   2> 4301628 INFO  (searcherExecutor-10646-thread-1-processing-x:collection1) [    x:collection1] o.a.s.h.c.SpellCheckComponent Loading spell index for spellchecker: fqcn
   [junit4]   2> 4301643 INFO  (searcherExecutor-10646-thread-1-processing-x:collection1) [    x:collection1] o.a.s.h.c.SpellCheckComponent Loading spell index for spellchecker: perDict
   [junit4]   2> 4301646 INFO  (searcherExecutor-10646-thread-1-processing-x:collection1) [    x:collection1] o.a.s.c.SolrCore [collection1] Registered new searcher Searcher@5a299614[collection1] main{ExitableDirectoryReader(UninvertingDirectoryReader())}
   [junit4]   2> 4302429 INFO  (TEST-TestDistributedStatsComponentCardinality.test-seed#[CFECBB718DB9DC1D]) [    ] o.a.s.SolrTestCaseJ4 Writing core.properties file to /home/jenkins/jenkins-slave/workspace/Lucene-Solr-BadApples-Tests-master/solr/build/solr-core/test/J0/temp/solr.handler.component.TestDistributedStatsComponentCardinality_CFECBB718DB9DC1D-001/tempDir-001/shard1/cores/collection1
   [junit4]   2> 4302430 WARN  (TEST-TestDistributedStatsComponentCardinality.test-seed#[CFECBB718DB9DC1D]) [    ] o.e.j.s.AbstractConnector Ignoring deprecated socket close linger time
   [junit4]   2> 4302430 INFO  (TEST-TestDistributedStatsComponentCardinality.test-seed#[CFECBB718DB9DC1D]) [    ] o.a.s.c.s.e.JettySolrRunner Start Jetty (original configured port=0)
   [junit4]   2> 4302430 INFO  (TEST-TestDistributedStatsComponentCardinality.test-seed#[CFECBB718DB9DC1D]) [    ] o.a.s.c.s.e.JettySolrRunner Trying to start Jetty on port 0 try number 1 ...
   [junit4]   2> 4302430 INFO  (TEST-TestDistributedStatsComponentCardinality.test-seed#[CFECBB718DB9DC1D]) [    ] o.e.j.s.Server jetty-9.4.14.v20181114; built: 2018-11-14T21:20:31.478Z; git: c4550056e785fb5665914545889f21dc136ad9e6; jvm 1.8.0_191-b12
   [junit4]   2> 4302431 INFO  (TEST-TestDistributedStatsComponentCardinality.test-seed#[CFECBB718DB9DC1D]) [    ] o.e.j.s.session DefaultSessionIdManager workerName=node0
   [junit4]   2> 4302431 INFO  (TEST-TestDistributedStatsComponentCardinality.test-seed#[CFECBB718DB9DC1D]) [    ] o.e.j.s.session No SessionScavenger set, using defaults
   [junit4]   2> 4302431 INFO  (TEST-TestDistributedStatsComponentCardinality.test-seed#[CFECBB718DB9DC1D]) [    ] o.e.j.s.session node0 Scavenging every 600000ms
   [junit4]   2> 4302432 INFO  (TEST-TestDistributedStatsComponentCardinality.test-seed#[CFECBB718DB9DC1D]) [    ] o.e.j.s.h.ContextHandler Started o.e.j.s.ServletContextHandler@76db429{/,null,AVAILABLE}
   [junit4]   2> 4302432 INFO  (TEST-TestDistributedStatsComponentCardinality.test-seed#[CFECBB718DB9DC1D]) [    ] o.e.j.s.AbstractConnector Started ServerConnector@78855437{HTTP/1.1,[http/1.1, h2c]}{127.0.0.1:37471}
   [junit4]   2> 4302432 INFO  (TEST-TestDistributedStatsComponentCardinality.test-seed#[CFECBB718DB9DC1D]) [    ] o.e.j.s.Server Started @4302513ms
   [junit4]   2> 4302432 INFO  (TEST-TestDistributedStatsComponentCardinality.test-seed#[CFECBB718DB9DC1D]) [    ] o.a.s.c.s.e.JettySolrRunner Jetty properties: {hostContext=/, hostPort=37471, coreRootDirectory=/home/jenkins/jenkins-slave/workspace/Lucene-Solr-BadApples-Tests-master/solr/build/solr-core/test/J0/temp/solr.handler.component.TestDistributedStatsComponentCardinality_CFECBB718DB9DC1D-001/tempDir-001/shard1/cores}
   [junit4]   2> 4302432 ERROR (TEST-TestDistributedStatsComponentCardinality.test-seed#[CFECBB718DB9DC1D]) [    ] o.a.s.u.StartupLoggingUtils Missing Java Option solr.log.dir. Logging may be missing or incomplete.
   [junit4]   2> 4302432 INFO  (TEST-TestDistributedStatsComponentCardinality.test-seed#[CFECBB718DB9DC1D]) [    ] o.a.s.s.SolrDispatchFilter Using logger factory org.apache.logging.slf4j.Log4jLoggerFactory
   [junit4]   2> 4302432 INFO  (TEST-TestDistributedStatsComponentCardinality.test-seed#[CFECBB718DB9DC1D]) [    ] o.a.s.s.SolrDispatchFilter  ___      _       Welcome to Apache Solr™ version 9.0.0
   [junit4]   2> 4302432 INFO  (TEST-TestDistributedStatsComponentCardinality.test-seed#[CFECBB718DB9DC1D]) [    ] o.a.s.s.SolrDispatchFilter / __| ___| |_ _   Starting in standalone mode on port null
   [junit4]   2> 4302432 INFO  (TEST-TestDistributedStatsComponentCardinality.test-seed#[CFECBB718DB9DC1D]) [    ] o.a.s.s.SolrDispatchFilter \__ \/ _ \ | '_|  Install dir: null
   [junit4]   2> 4302432 INFO  (TEST-TestDistributedStatsComponentCardinality.test-seed#[CFECBB718DB9DC1D]) [    ] o.a.s.s.SolrDispatchFilter |___/\___/_|_|    Start time: 2019-01-17T07:37:37.756Z
   [junit4]   2> 4302433 INFO  (TEST-TestDistributedStatsComponentCardinality.test-seed#[CFECBB718DB9DC1D]) [    ] o.a.s.c.SolrXmlConfig Loading container configuration from /home/jenkins/jenkins-slave/workspace/Lucene-Solr-BadApples-Tests-master/solr/build/solr-core/test/J0/temp/solr.handler.component.TestDistributedStatsComponentCardinality_CFECBB718DB9DC1D-001/tempDir-001/shard1/solr.xml
   [junit4]   2> 4302452 INFO  (TEST-TestDistributedStatsComponentCardinality.test-seed#[CFECBB718DB9DC1D]) [    ] o.a.s.c.SolrXmlConfig Configuration parameter autoReplicaFailoverWorkLoopDelay is ignored
   [junit4]   2> 4302452 INFO  (TEST-TestDistributedStatsComponentCardinality.test-seed#[CFECBB718DB9DC1D]) [    ] o.a.s.c.SolrXmlConfig Configuration parameter autoReplicaFailoverBadNodeExpiration is ignored
   [junit4]   2> 4302454 INFO  (TEST-TestDistributedStatsComponentCardinality.test-seed#[CFECBB718DB9DC1D]) [    ] o.a.s.c.SolrXmlConfig MBean server found: com.sun.jmx.mbeanserver.JmxMBeanServer@64f73207, but no JMX reporters were configured - adding default JMX reporter.
   [junit4]   2> 4302791 INFO  (TEST-TestDistributedStatsComponentCardinality.test-seed#[CFECBB718DB9DC1D]) [    ] o.a.s.h.c.HttpShardHandlerFactory Host whitelist initialized: WhitelistHostChecker [whitelistHosts=null, whitelistHostCheckingEnabled=false]
   [junit4]   2> 4302807 WARN  (TEST-TestDistributedStatsComponentCardinality.test-seed#[CFECBB718DB9DC1D]) [    ] o.e.j.u.s.S.config No Client EndPointIdentificationAlgorithm configured for SslContextFactory@1d8bc7e3[provider=null,keyStore=null,trustStore=null]
   [junit4]   2> 4302811 WARN  (TEST-TestDistributedStatsComponentCardinality.test-seed#[CFECBB718DB9DC1D]) [    ] o.e.j.u.s.S.config No Client EndPointIdentificationAlgorithm configured for SslContextFactory@32ddaecd[provider=null,keyStore=null,trustStore=null]
   [junit4]   2> 4302899 INFO  (TEST-TestDistributedStatsComponentCardinality.test-seed#[CFECBB718DB9DC1D]) [    ] o.a.s.c.TransientSolrCoreCacheDefault Allocating transient cache for 4 transient cores
   [junit4]   2> 4302899 INFO  (TEST-TestDistributedStatsComponentCardinality.test-seed#[CFECBB718DB9DC1D]) [    ] o.a.s.h.a.MetricsHistoryHandler No .system collection, keeping metrics history in memory.
   [junit4]   2> 4303172 INFO  (TEST-TestDistributedStatsComponentCardinality.test-seed#[CFECBB718DB9DC1D]) [    ] o.a.s.m.r.SolrJmxReporter JMX monitoring for 'solr.node' (registry 'solr.node') enabled at server: com.sun.jmx.mbeanserver.JmxMBeanServer@64f73207
   [junit4]   2> 4303211 INFO  (TEST-TestDistributedStatsComponentCardinality.test-seed#[CFECBB718DB9DC1D]) [    ] o.a.s.m.r.SolrJmxReporter JMX monitoring for 'solr.jvm' (registry 'solr.jvm') enabled at server: com.sun.jmx.mbeanserver.JmxMBeanServer@64f73207
   [junit4]   2> 4303211 INFO  (TEST-TestDistributedStatsComponentCardinality.test-seed#[CFECBB718DB9DC1D]) [    ] o.a.s.m.r.SolrJmxReporter JMX monitoring for 'solr.jetty' (registry 'solr.jetty') enabled at server: com.sun.jmx.mbeanserver.JmxMBeanServer@64f73207
   [junit4]   2> 4303225 INFO  (TEST-TestDistributedStatsComponentCardinality.test-seed#[CFECBB718DB9DC1D]) [    ] o.a.s.c.CorePropertiesLocator Found 1 core definitions underneath /home/jenkins/jenkins-slave/workspace/Lucene-Solr-BadApples-Tests-master/solr/build/solr-core/test/J0/temp/solr.handler.component.TestDistributedStatsComponentCardinality_CFECBB718DB9DC1D-001/tempDir-001/shard1/cores
   [junit4]   2> 4303225 INFO  (TEST-TestDistributedStatsComponentCardinality.test-seed#[CFECBB718DB9DC1D]) [    ] o.a.s.c.CorePropertiesLocator Cores are: [collection1]
   [junit4]   2> 4303226 INFO  (coreLoadExecutor-10659-thread-1) [    x:collection1] o.a.s.c.SolrResourceLoader [null] Added 2 libs to classloader, from paths: [/home/jenkins/jenkins-slave/workspace/Lucene-Solr-BadApples-Tests-master/solr/core/src/test-files/solr/collection1/lib, /home/jenkins/jenkins-slave/workspace/Lucene-Solr-BadApples-Tests-master/solr/core/src/test-files/solr/collection1/lib/classes]
   [junit4]   2> 4303446 INFO  (coreLoadExecutor-10659-thread-1) [    x:collection1] o.a.s.c.SolrConfig Using Lucene MatchVersion: 9.0.0
   [junit4]   2> 4303591 INFO  (coreLoadExecutor-10659-thread-1) [    x:collection1] o.a.s.s.IndexSchema [collection1] Schema name=test
   [junit4]   2> 4304270 INFO  (coreLoadExecutor-10659-thread-1) [    x:collection1] o.a.s.s.IndexSchema Loaded schema test/1.0 with uniqueid field id
   [junit4]   2> 4304296 INFO  (coreLoadExecutor-10659-thread-1) [    x:collection1] o.a.s.c.CoreContainer Creating SolrCore 'collection1' using configuration from configset /home/jenkins/jenkins-slave/workspace/Lucene-Solr-BadApples-Tests-master/solr/core/src/test-files/solr/collection1, trusted=true
   [junit4]   2> 4304297 INFO  (coreLoadExecutor-10659-thread-1) [    x:collection1] o.a.s.m.r.SolrJmxReporter JMX monitoring for 'solr.core.collection1' (registry 'solr.core.collection1') enabled at server: com.sun.jmx.mbeanserver.JmxMBeanServer@64f73207
   [junit4]   2> 4304309 INFO  (coreLoadExecutor-10659-thread-1) [    x:collection1] o.a.s.c.SolrCore [[collection1] ] Opening new SolrCore at [/home/jenkins/jenkins-slave/workspace/Lucene-Solr-BadApples-Tests-master/solr/core/src/test-files/solr/collection1], dataDir=[/home/jenkins/jenkins-slave/workspace/Lucene-Solr-BadApples-Tests-master/solr/build/solr-core/test/J0/temp/solr.handler.component.TestDistributedStatsComponentCardinality_CFECBB718DB9DC1D-001/tempDir-001/shard1/cores/collection1/data/]
   [junit4]   2> 4304311 INFO  (coreLoadExecutor-10659-thread-1) [    x:collection1] o.a.s.u.RandomMergePolicy RandomMergePolicy wrapping class org.apache.lucene.index.LogDocMergePolicy: [LogDocMergePolicy: minMergeSize=1000, mergeFactor=34, maxMergeSize=9223372036854775807, maxMergeSizeForForcedMerge=9223372036854775807, calibrateSizeByDeletes=true, maxMergeDocs=2147483647, maxCFSSegmentSizeMB=8.796093022207999E12, noCFSRatio=0.6978235822362236]
   [junit4]   2> 4304529 INFO  (coreLoadExecutor-10659-thread-1) [    x:collection1] o.a.s.u.UpdateHandler Using UpdateLog implementation: org.apache.solr.update.UpdateLog
   [junit4]   2> 4304529 INFO  (coreLoadExecutor-10659-thread-1) [    x:collection1] o.a.s.u.UpdateLog Initializing UpdateLog: dataDir= defaultSyncLevel=FLUSH numRecordsToKeep=100 maxNumLogsToKeep=10 numVersionBuckets=65536
   [junit4]   2> 4304531 INFO  (coreLoadExecutor-10659-thread-1) [    x:collection1] o.a.s.u.CommitTracker Hard AutoCommit: disabled
   [junit4]   2> 4304531 INFO  (coreLoadExecutor-10659-thread-1) [    x:collection1] o.a.s.u.CommitTracker Soft AutoCommit: disabled
   [junit4]   2> 4304531 INFO  (coreLoadExecutor-10659-thread-1) [    x:collection1] o.a.s.u.RandomMergePolicy RandomMergePolicy wrapping class org.apache.lucene.index.LogDocMergePolicy: [LogDocMergePolicy: minMergeSize=1000, mergeFactor=50, maxMergeSize=9223372036854775807, maxMergeSizeForForcedMerge=9223372036854775807, calibrateSizeByDeletes=true, maxMergeDocs=2147483647, maxCFSSegmentSizeMB=8.796093022207999E12, noCFSRatio=0.0]
   [junit4]   2> 4304532 INFO  (coreLoadExecutor-10659-thread-1) [    x:collection1] o.a.s.s.SolrIndexSearcher Opening [Searcher@3f038100[collection1] main]
   [junit4]   2> 4304545 INFO  (coreLoadExecutor-10659-thread-1) [    x:collection1] o.a.s.h.c.SpellCheckComponent Initializing spell checkers
   [junit4]   2> 4304650 INFO  (coreLoadExecutor-10659-thread-1) [    x:collection1] o.a.s.s.DirectSolrSpellChecker init: {name=direct,classname=DirectSolrSpellChecker,field=lowerfilt,minQueryLength=3}
   [junit4]   2> 4304838 INFO  (coreLoadExecutor-10659-thread-1) [    x:collection1] o.a.s.h.ReplicationHandler Commits will be reserved for 10000ms.
   [junit4]   2> 4304838 INFO  (coreLoadExecutor-10659-thread-1) [    x:collection1] o.a.s.u.UpdateLog Could not find max version in index or recent updates, using new clock 1622892253190029312
   [junit4]   2> 4304840 INFO  (searcherExecutor-10660-thread-1-processing-x:collection1) [    x:collection1] o.a.s.h.c.SpellCheckComponent Loading spell index for spellchecker: default
   [junit4]   2> 4304840 INFO  (searcherExecutor-10660-thread-1-processing-x:collection1) [    x:collection1] o.a.s.h.c.SpellCheckComponent Loading spell index for spellchecker: direct
   [junit4]   2> 4304840 INFO  (searcherExecutor-10660-thread-1-processing-x:collection1) [    x:collection1] o.a.s.h.c.SpellCheckComponent Loading spell index for spellchecker: wordbreak
   [junit4]   2> 4304840 INFO  (searcherExecutor-10660-thread-1-processing-x:collection1) [    x:collection1] o.a.s.h.c.SpellCheckComponent Loading spell index for spellchecker: multipleFields
   [junit4]   2> 4304840 INFO  (searcherExecutor-10660-thread-1-processing-x:collection1) [    x:collection1] o.a.s.h.c.SpellCheckComponent Loading spell index for spellchecker: jarowinkler
   [junit4]   2> 4304840 INFO  (searcherExecutor-10660-thread-1-processing-x:collection1) [    x:collection1] o.a.s.h.c.SpellCheckComponent Loading spell index for spellchecker: external
   [junit4]   2> 4304841 INFO  (searcherExecutor-10660-thread-1-processing-x:collection1) [    x:collection1] o.a.s.h.c.SpellCheckComponent Loading spell index for spellchecker: freq
   [junit4]   2> 4304841 INFO  (searcherExecutor-10660-thread-1-processing-x:collection1) [    x:collection1] o.a.s.h.c.SpellCheckComponent Loading spell index for spellchecker: fqcn
   [junit4]   2> 4304841 INFO  (searcherExecutor-10660-thread-1-processing-x:collection1) [    x:collection1] o.a.s.h.c.SpellCheckComponent Loading spell index for spellchecker: perDict
   [junit4]   2> 4304951 INFO  (searcherExecutor-10660-thread-1-processing-x:collection1) [    x:collection1] o.a.s.c.SolrCore [collection1] Registered new searcher Searcher@3f038100[collection1] main{ExitableDirectoryReader(UninvertingDirectoryReader())}
   [junit4]   2> 4304962 INFO  (TEST-TestDistributedStatsComponentCardinality.test-seed#[CFECBB718DB9DC1D]) [    ] o.a.s.SolrTestCaseJ4 ###Starting test
   [junit4]   2> 4304962 INFO  (TEST-TestDistributedStatsComponentCardinality.test-seed#[CFECBB718DB9DC1D]) [    ] o.a.s.h.c.TestDistributedStatsComponentCardinality Building an index of 10719 docs
   [junit4]   2> 4305060 INFO  (qtp954610094-47131) [    x:collection1] o.a.s.u.p.LogUpdateProcessorFactory [collection1]  webapp= path=/update params={wt=javabin&version=2}{add=[1 (1622892253404987392)]} 0 17
   [junit4]   2> 4305133 INFO  (qtp1143880539-47173) [    x:collection1] o.a.s.u.p.LogUpdateProcessorFactory [collection1]  webapp= path=/update params={wt=javabin&version=2}{add=[1 (1622892253459513344)]} 0 37
   [junit4]   2> 4305152 INFO  (qtp954610094-47132) [    x:collection1] o.a.s.u.p.LogUpdateProcessorFactory [collection1]  webapp= path=/update params={wt=javabin&version=2}{add=[2 (1622892253519282176)]} 0 0
   [junit4]   2> 4305206 INFO  (qtp164335132-47152) [    x:collection1] o.a.s.u.p.LogUpdateProcessorFactory [collection1]  webapp= path=/update params={wt=javabin&version=2}{add=[2 (1622892253570662400)]} 0 5
   [junit4]   2> 4305225 INFO  (qtp954610094-47133) [    x:collection1] o.a.s.u.p.LogUpdateProcessorFactory [collection1]  webapp= path=/update params={wt=javabin&version=2}{add=[3 (1622892253595828224)]} 0 0
   [junit4]   2> 4305241 INFO  (qtp1143880539-47174) [    x:collection1] o.a.s.u.p.LogUpdateProcessorFactory [collection1]  webapp= path=/update params={wt=javabin&version=2}{add=[3 (1622892253612605440)]} 0 0
   [junit4]   2> 4305271 INFO  (qtp954610094-47134) [    x:collection1] o.a.s.u.p.LogUpdateProcessorFactory [collection1]  webapp= path=/update params={wt=javabin&version=2}{add=[4 (1622892253644062720)]} 0 0
   [junit4]   2> 4305286 INFO  (qtp164335132-47153) [    x:collection1] o.a.s.u.p.LogUpdateProcessorFactory [collection1]  webapp= path=/update params={wt=javabin&version=2}{add=[4 (1622892253659791360)]} 0 0
   [junit4]   2> 4305289 INFO  (qtp954610094-47130) [    x:collection1] o.a.s.u.p.LogUpdateProcessorFactory [collection1]  webapp= path=/update params={wt=javabin&version=2}{add=[5 (1622892253662937088)]} 0 0
   [junit4]   2> 4305307 INFO  (qtp1143880539-47175) [    x:collection1] o.a.s.u.p.LogUpdateProcessorFactory [collection1]  webapp= path=/update params={wt=javabin&version=2}{add=[5 (1622892253681811456)]} 0 0
   [junit4]   2> 4305308 INFO  (qtp954610094-47131) [    x:collection1] o.a.s.u.p.LogUpdateProcessorFactory [collection1]  webapp= path=/update params={wt=javabin&version=2}{add=[6 (1622892253682860032)]} 0 0
   [junit4]   2> 4305315 INFO  (qtp164335132-47154) [    x:collection1] o.a.s.u.p.LogUpdateProcessorFactory [collection1]  webapp= path=/update params={wt=javabin&version=2}{add=[6 (1622892253689151488)]} 0 0
   [junit4]   2> 4305322 INFO  (qtp954610094-47132) [    x:collection1] o.a.s.u.p.LogUpdateProcessorFactory [collection1]  webapp= path=/update params={wt=javabin&version=2}{add=[7 (1622892253697540096)]} 0 0
   [junit4]   2> 4305343 INFO  (qtp1143880539-47176) [    x:collection1] o.a.s.u.p.LogUpdateProcessorFactory [collection1]  webapp= path=/update params={wt=javabin&version=2}{add=[7 (1622892253718511616)]} 0 0
   [junit4]   2> 4305343 INFO  (qtp954610094-47133) [    x:collection1] o.a.s.u.p.LogUpdateProcessorFactory [collection1]  webapp= path=/update params={wt=javabin&version=2}{add=[8 (1622892253719560192)]} 0 0
   [junit4]   2> 4305344 INFO  (qtp164335132-47155) [    x:collection1] o.a.s.u.p.LogUpdateProcessorFactory [collection1]  webapp= path=/update params={wt=javabin&version=2}{add=[8 (1622892253720608768)]} 0 0
   [junit4]   2> 4305367 INFO  (qtp954610094-47134) [    x:collection1] o.a.s.u.p.LogUpdateProcessorFactory [collection1]  webapp= path=/update params={wt=javabin&version=2}{add=[9 (1622892253744726016)]} 0 0
   [junit4]   2> 4305387 INFO  (qtp1143880539-47172) [    x:collection1] o.a.s.u.p.LogUpdateProcessorFactory [collection1]  webapp= path=/update params={wt=javabin&version=2}{add=[9 (1622892253765697536)]} 0 0
   [junit4]   2> 4305389 INFO  (qtp954610094-47130) [    x:collection1] o.a.s.u.p.LogUpdateProcessorFactory [collection1]  webapp= path=/update params={wt=javabin&version=2}{add=[10 (1622892253767794688)]} 0 0
   [junit4]   2> 4305389 INFO  (qtp1143880539-47173) [    x:collection1] o.a.s.u.p.LogUpdateProcessorFactory [collection1]  webapp= path=/update params={wt=javabin&version=2}{add=[10 (1622892253767794688)]} 0 0
   [junit4]   2> 4305390 INFO  (qtp954610094-47131) [    x:collection1] o.a.s.u.p.LogUpdateProcessorFactory [collection1]  webapp= path=/update params={wt=javabin&version=2}{add=[11 (1622892253768843264)]} 0 0
   [junit4]   2> 4305399 INFO  (qtp164335132-47151) [    x:collection1] o.a.s.u.p.LogUpdateProcessorFactory [collection1]  webapp= path=/update params={wt=javabin&version=2}{add=[11 (1622892253778280448)]} 0 0
   [junit4]   2> 4305415 INFO  (qtp954610094-47132) [    x:collection1] o.a.s.u.p.LogUpdateProcessorFactory [collection1]  webapp= path=/update params={wt=javabin&version=2}{add=[12 (1622892253795057664)]} 0 0
   [junit4]   2> 4305416 INFO  (qtp1143880539-47174) [    x:collection1] o.a.s.u.p.LogUpdateProcessorFactory [collection1]  webapp= path=/update params={wt=javabin&version=2}{add=[12 (1622892253796106240)]} 0 0
   [junit4]   2> 4305417 INFO  (qtp954610094-47133) [    x:collection1] o.a.s.u.p.LogUpdateProcessorFactory [collection1]  webapp= path=/update params={wt=javabin&version=2}{add=[13 (1622892253797154816)]} 0 0
   [junit4]   2> 4305418 INFO  (qtp164335132-47152) [    x:collection1] o.a.s.u.p.LogUpdateProcessorFactory [collection1]  webapp= path=/update params={wt=javabin&version=2}{add=[13 (1622892253798203392)]} 0 0
   [junit4]   2> 4305418 INFO  (qtp954610094-47134) [    x:collection1] o.a.s.u.p.LogUpdateProcessorFactory [collection1]  webapp= path=/update params={wt=javabin&version=2}{add=[14 (1622892253798203392)]} 0 0
   [junit4]   2> 4305419 INFO  (qtp1143880539-47175) [    x:collection1] o.a.s.u.p.LogUpdateProcessorFactory [collection1]  webapp= path=/update params={wt=javabin&version=2}{add=[14 (1622892253799251968)]} 0 0
   [junit4]   2> 4305432 INFO  (qtp954610094-47130) [    x:collection1] o.a.s.u.p.LogUpdateProcessorFactory [collection1]  webapp= path=/update params={wt=javabin&version=2}{add=[15 (1622892253811834880)]} 0 0
   [junit4]   2> 4305432 INFO  (qtp164335132-47153) [    x:collection1] o.a.s.u.p.LogUpdateProcessorFactory [collection1]  webapp= path=/update params={wt=javabin&version=2}{add=[15 (1622892253812883456)]} 0 0
   [junit4]   2> 4305432 INFO  (qtp954610094-47131) [    x:collection1] o.a.s.u.p.LogUpdateProcessorFactory [collection1]  webapp= path=/update params={wt=javabin&version=2}{add=[16 (1622892253812883456)]} 0 0
   [junit4]   2> 4305433 INFO  (qtp1143880539-47176) [    x:collection1] o.a.s.u.p.LogUpdateProcessorFactory [collection1]  webapp= path=/update params={wt=javabin&version=2}{add=[16 (1622892253813932032)]} 0 0
   [junit4]   2> 4305433 INFO  (qtp954610094-47132) [    x:collection1] o.a.s.u.p.LogUpdateProcessorFactory [collection1]  webapp= path=/update params={wt=javabin&version=2}{add=[17 (1622892253813932032)]} 0 0
   [junit4]   2> 4305434 INFO  (qtp164335132-47154) [    x:collection1] o.a.s.u.p.LogUpdateProcessorFactory [collection1]  webapp= path=/update params={wt=javabin&version=2}{add=[17 (1622892253814980608)]} 0 0
   [junit4]   2> 4305434 INFO  (qtp954610094-47133) [    x:collection1] o.a.s.u.p.LogUpdateProcessorFactory [collection1]  webapp= path=/update params={wt=javabin&version=2}{add=[18 (1622892253814980608)]} 0 0
   [junit4]   2> 4305435 INFO  (qtp1143880539-47172) [    x:collection1] o.a.s.u.p.LogUpdateProcessorFactory [collection1]  webapp= path=/update params={wt=javabin&version=2}{add=[18 (1622892253816029184)]} 0 0
   [junit4]   2> 4305452 INFO  (qtp954610094-47134) [    x:collection1] o.a.s.u.p.LogUpdateProcessorFactory [collection1]  webapp= path=/update params={wt=javabin&version=2}{add=[19 (1622892253816029184)]} 0 0
   [junit4]   2> 4305453 INFO  (qtp164335132-47155) [    x:collection1] o.a.s.u.p.LogUpdateProcessorFactory [collection1]  webapp= path=/update params={wt=javabin&version=2}{add=[19 (1622892253833

[...truncated too long message...]

ml

resolve:

ivy-availability-check:
[loadresource] Do not set property disallowed.ivy.jars.list as its length is 0.

-ivy-fail-disallowed-ivy-version:

ivy-fail:

ivy-configure:
[ivy:configure] :: loading settings :: file = /home/jenkins/jenkins-slave/workspace/Lucene-Solr-BadApples-Tests-master/lucene/top-level-ivy-settings.xml

resolve:

ivy-availability-check:
[loadresource] Do not set property disallowed.ivy.jars.list as its length is 0.

-ivy-fail-disallowed-ivy-version:

ivy-fail:

ivy-fail:

ivy-configure:
[ivy:configure] :: loading settings :: file = /home/jenkins/jenkins-slave/workspace/Lucene-Solr-BadApples-Tests-master/lucene/top-level-ivy-settings.xml

resolve:

ivy-availability-check:
[loadresource] Do not set property disallowed.ivy.jars.list as its length is 0.

-ivy-fail-disallowed-ivy-version:

ivy-fail:

ivy-configure:
[ivy:configure] :: loading settings :: file = /home/jenkins/jenkins-slave/workspace/Lucene-Solr-BadApples-Tests-master/lucene/top-level-ivy-settings.xml

resolve:

ivy-availability-check:
[loadresource] Do not set property disallowed.ivy.jars.list as its length is 0.

-ivy-fail-disallowed-ivy-version:

ivy-fail:

ivy-fail:

ivy-configure:
[ivy:configure] :: loading settings :: file = /home/jenkins/jenkins-slave/workspace/Lucene-Solr-BadApples-Tests-master/lucene/top-level-ivy-settings.xml

resolve:

ivy-availability-check:
[loadresource] Do not set property disallowed.ivy.jars.list as its length is 0.

-ivy-fail-disallowed-ivy-version:

ivy-fail:

ivy-fail:

ivy-configure:
[ivy:configure] :: loading settings :: file = /home/jenkins/jenkins-slave/workspace/Lucene-Solr-BadApples-Tests-master/lucene/top-level-ivy-settings.xml

resolve:

ivy-availability-check:
[loadresource] Do not set property disallowed.ivy.jars.list as its length is 0.

-ivy-fail-disallowed-ivy-version:

ivy-fail:

ivy-fail:

ivy-configure:
[ivy:configure] :: loading settings :: file = /home/jenkins/jenkins-slave/workspace/Lucene-Solr-BadApples-Tests-master/lucene/top-level-ivy-settings.xml

resolve:

ivy-availability-check:
[loadresource] Do not set property disallowed.ivy.jars.list as its length is 0.

-ivy-fail-disallowed-ivy-version:

ivy-fail:

ivy-fail:

ivy-configure:
[ivy:configure] :: loading settings :: file = /home/jenkins/jenkins-slave/workspace/Lucene-Solr-BadApples-Tests-master/lucene/top-level-ivy-settings.xml

resolve:

ivy-availability-check:
[loadresource] Do not set property disallowed.ivy.jars.list as its length is 0.

-ivy-fail-disallowed-ivy-version:

ivy-fail:

ivy-fail:

ivy-configure:
[ivy:configure] :: loading settings :: file = /home/jenkins/jenkins-slave/workspace/Lucene-Solr-BadApples-Tests-master/lucene/top-level-ivy-settings.xml

resolve:

ivy-availability-check:
[loadresource] Do not set property disallowed.ivy.jars.list as its length is 0.

-ivy-fail-disallowed-ivy-version:

ivy-fail:

ivy-fail:

ivy-configure:
[ivy:configure] :: loading settings :: file = /home/jenkins/jenkins-slave/workspace/Lucene-Solr-BadApples-Tests-master/lucene/top-level-ivy-settings.xml

resolve:

ivy-availability-check:
[loadresource] Do not set property disallowed.ivy.jars.list as its length is 0.

-ivy-fail-disallowed-ivy-version:

ivy-fail:

ivy-fail:

ivy-configure:
[ivy:configure] :: loading settings :: file = /home/jenkins/jenkins-slave/workspace/Lucene-Solr-BadApples-Tests-master/lucene/top-level-ivy-settings.xml

resolve:

ivy-availability-check:
[loadresource] Do not set property disallowed.ivy.jars.list as its length is 0.

-ivy-fail-disallowed-ivy-version:

ivy-fail:

ivy-fail:

ivy-configure:
[ivy:configure] :: loading settings :: file = /home/jenkins/jenkins-slave/workspace/Lucene-Solr-BadApples-Tests-master/lucene/top-level-ivy-settings.xml

resolve:

ivy-availability-check:
[loadresource] Do not set property disallowed.ivy.jars.list as its length is 0.

-ivy-fail-disallowed-ivy-version:

ivy-fail:

ivy-fail:

ivy-configure:
[ivy:configure] :: loading settings :: file = /home/jenkins/jenkins-slave/workspace/Lucene-Solr-BadApples-Tests-master/lucene/top-level-ivy-settings.xml

resolve:

ivy-availability-check:
[loadresource] Do not set property disallowed.ivy.jars.list as its length is 0.

-ivy-fail-disallowed-ivy-version:

ivy-fail:

ivy-fail:

ivy-configure:
[ivy:configure] :: loading settings :: file = /home/jenkins/jenkins-slave/workspace/Lucene-Solr-BadApples-Tests-master/lucene/top-level-ivy-settings.xml

resolve:

jar-checksums:
    [mkdir] Created dir: /home/jenkins/jenkins-slave/workspace/Lucene-Solr-BadApples-Tests-master/solr/null1407313777
     [copy] Copying 256 files to /home/jenkins/jenkins-slave/workspace/Lucene-Solr-BadApples-Tests-master/solr/null1407313777
   [delete] Deleting directory /home/jenkins/jenkins-slave/workspace/Lucene-Solr-BadApples-Tests-master/solr/null1407313777

check-working-copy:
[ivy:cachepath] :: resolving dependencies :: org.eclipse.jgit#org.eclipse.jgit-caller;working
[ivy:cachepath] 	confs: [default]
[ivy:cachepath] 	found org.eclipse.jgit#org.eclipse.jgit;4.6.0.201612231935-r in public
[ivy:cachepath] 	found com.jcraft#jsch;0.1.53 in public
[ivy:cachepath] 	found com.googlecode.javaewah#JavaEWAH;1.1.6 in public
[ivy:cachepath] 	found org.apache.httpcomponents#httpclient;4.3.6 in public
[ivy:cachepath] 	found org.apache.httpcomponents#httpcore;4.3.3 in public
[ivy:cachepath] 	found commons-logging#commons-logging;1.1.3 in public
[ivy:cachepath] 	found commons-codec#commons-codec;1.6 in public
[ivy:cachepath] 	found org.slf4j#slf4j-api;1.7.2 in public
[ivy:cachepath] :: resolution report :: resolve 35ms :: artifacts dl 6ms
	---------------------------------------------------------------------
	|                  |            modules            ||   artifacts   |
	|       conf       | number| search|dwnlded|evicted|| number|dwnlded|
	---------------------------------------------------------------------
	|      default     |   8   |   0   |   0   |   0   ||   8   |   0   |
	---------------------------------------------------------------------
[wc-checker] Initializing working copy...
[wc-checker] SLF4J: Failed to load class "org.slf4j.impl.StaticLoggerBinder".
[wc-checker] SLF4J: Defaulting to no-operation (NOP) logger implementation
[wc-checker] SLF4J: See http://www.slf4j.org/codes.html#StaticLoggerBinder for further details.
[wc-checker] Checking working copy status...

-jenkins-base:

BUILD SUCCESSFUL
Total time: 227 minutes 46 seconds
Archiving artifacts
java.lang.InterruptedException: no matches found within 10000
	at hudson.FilePath$ValidateAntFileMask.hasMatch(FilePath.java:2847)
	at hudson.FilePath$ValidateAntFileMask.invoke(FilePath.java:2726)
	at hudson.FilePath$ValidateAntFileMask.invoke(FilePath.java:2707)
	at hudson.FilePath$FileCallableWrapper.call(FilePath.java:3086)
Also:   hudson.remoting.Channel$CallSiteStackTrace: Remote call to lucene2
		at hudson.remoting.Channel.attachCallSiteStackTrace(Channel.java:1741)
		at hudson.remoting.UserRequest$ExceptionResponse.retrieve(UserRequest.java:357)
		at hudson.remoting.Channel.call(Channel.java:955)
		at hudson.FilePath.act(FilePath.java:1072)
		at hudson.FilePath.act(FilePath.java:1061)
		at hudson.FilePath.validateAntFileMask(FilePath.java:2705)
		at hudson.tasks.ArtifactArchiver.perform(ArtifactArchiver.java:243)
		at hudson.tasks.BuildStepCompatibilityLayer.perform(BuildStepCompatibilityLayer.java:81)
		at hudson.tasks.BuildStepMonitor$1.perform(BuildStepMonitor.java:20)
		at hudson.model.AbstractBuild$AbstractBuildExecution.perform(AbstractBuild.java:744)
		at hudson.model.AbstractBuild$AbstractBuildExecution.performAllBuildSteps(AbstractBuild.java:690)
		at hudson.model.Build$BuildExecution.post2(Build.java:186)
		at hudson.model.AbstractBuild$AbstractBuildExecution.post(AbstractBuild.java:635)
		at hudson.model.Run.execute(Run.java:1835)
		at hudson.model.FreeStyleBuild.run(FreeStyleBuild.java:43)
		at hudson.model.ResourceController.execute(ResourceController.java:97)
		at hudson.model.Executor.run(Executor.java:429)
Caused: hudson.FilePath$TunneledInterruptedException
	at hudson.FilePath$FileCallableWrapper.call(FilePath.java:3088)
	at hudson.remoting.UserRequest.perform(UserRequest.java:212)
	at hudson.remoting.UserRequest.perform(UserRequest.java:54)
	at hudson.remoting.Request$2.run(Request.java:369)
	at hudson.remoting.InterceptingExecutorService$1.call(InterceptingExecutorService.java:72)
	at java.util.concurrent.FutureTask.run(FutureTask.java:266)
	at java.util.concurrent.ThreadPoolExecutor.runWorker(ThreadPoolExecutor.java:1142)
	at java.util.concurrent.ThreadPoolExecutor$Worker.run(ThreadPoolExecutor.java:617)
	at java.lang.Thread.run(Thread.java:748)
Caused: java.lang.InterruptedException: java.lang.InterruptedException: no matches found within 10000
	at hudson.FilePath.act(FilePath.java:1074)
	at hudson.FilePath.act(FilePath.java:1061)
	at hudson.FilePath.validateAntFileMask(FilePath.java:2705)
	at hudson.tasks.ArtifactArchiver.perform(ArtifactArchiver.java:243)
	at hudson.tasks.BuildStepCompatibilityLayer.perform(BuildStepCompatibilityLayer.java:81)
	at hudson.tasks.BuildStepMonitor$1.perform(BuildStepMonitor.java:20)
	at hudson.model.AbstractBuild$AbstractBuildExecution.perform(AbstractBuild.java:744)
	at hudson.model.AbstractBuild$AbstractBuildExecution.performAllBuildSteps(AbstractBuild.java:690)
	at hudson.model.Build$BuildExecution.post2(Build.java:186)
	at hudson.model.AbstractBuild$AbstractBuildExecution.post(AbstractBuild.java:635)
	at hudson.model.Run.execute(Run.java:1835)
	at hudson.model.FreeStyleBuild.run(FreeStyleBuild.java:43)
	at hudson.model.ResourceController.execute(ResourceController.java:97)
	at hudson.model.Executor.run(Executor.java:429)
No artifacts found that match the file pattern "**/*.events,heapdumps/**,**/hs_err_pid*". Configuration error?
Recording test results
Build step 'Publish JUnit test result report' changed build result to UNSTABLE
Email was triggered for: Unstable (Test Failures)
Sending email for trigger: Unstable (Test Failures)

Mime
View raw message