lucene-dev mailing list archives

Site index · List index
Message view « Date » · « Thread »
Top « Date » · « Thread »
From Apache Jenkins Server <jenk...@builds.apache.org>
Subject [JENKINS] Lucene-Solr-BadApples-NightlyTests-master - Build # 46 - Still Failing
Date Sat, 19 Jan 2019 17:08:43 GMT
Build: https://builds.apache.org/job/Lucene-Solr-BadApples-NightlyTests-master/46/

2 tests failed.
FAILED:  org.apache.solr.cloud.hdfs.HdfsRestartWhileUpdatingTest.test

Error Message:
There are still nodes recoverying - waited for 320 seconds

Stack Trace:
java.lang.AssertionError: There are still nodes recoverying - waited for 320 seconds
	at __randomizedtesting.SeedInfo.seed([1B990FFF714B6410:93CD3025DFB709E8]:0)
	at org.junit.Assert.fail(Assert.java:88)
	at org.apache.solr.cloud.AbstractDistribZkTestBase.waitForRecoveriesToFinish(AbstractDistribZkTestBase.java:195)
	at org.apache.solr.cloud.AbstractFullDistribZkTestBase.waitForRecoveriesToFinish(AbstractFullDistribZkTestBase.java:1038)
	at org.apache.solr.cloud.AbstractFullDistribZkTestBase.waitForThingsToLevelOut(AbstractFullDistribZkTestBase.java:1595)
	at org.apache.solr.cloud.RestartWhileUpdatingTest.test(RestartWhileUpdatingTest.java:144)
	at sun.reflect.NativeMethodAccessorImpl.invoke0(Native Method)
	at sun.reflect.NativeMethodAccessorImpl.invoke(NativeMethodAccessorImpl.java:62)
	at sun.reflect.DelegatingMethodAccessorImpl.invoke(DelegatingMethodAccessorImpl.java:43)
	at java.lang.reflect.Method.invoke(Method.java:498)
	at com.carrotsearch.randomizedtesting.RandomizedRunner.invoke(RandomizedRunner.java:1750)
	at com.carrotsearch.randomizedtesting.RandomizedRunner$8.evaluate(RandomizedRunner.java:938)
	at com.carrotsearch.randomizedtesting.RandomizedRunner$9.evaluate(RandomizedRunner.java:974)
	at com.carrotsearch.randomizedtesting.RandomizedRunner$10.evaluate(RandomizedRunner.java:988)
	at org.apache.solr.BaseDistributedSearchTestCase$ShardsRepeatRule$ShardsFixedStatement.callStatement(BaseDistributedSearchTestCase.java:1082)
	at org.apache.solr.BaseDistributedSearchTestCase$ShardsRepeatRule$ShardsStatement.evaluate(BaseDistributedSearchTestCase.java:1054)
	at com.carrotsearch.randomizedtesting.rules.SystemPropertiesRestoreRule$1.evaluate(SystemPropertiesRestoreRule.java:57)
	at org.apache.lucene.util.TestRuleSetupTeardownChained$1.evaluate(TestRuleSetupTeardownChained.java:49)
	at org.apache.lucene.util.AbstractBeforeAfterRule$1.evaluate(AbstractBeforeAfterRule.java:45)
	at org.apache.lucene.util.TestRuleThreadAndTestName$1.evaluate(TestRuleThreadAndTestName.java:48)
	at org.apache.lucene.util.TestRuleIgnoreAfterMaxFailures$1.evaluate(TestRuleIgnoreAfterMaxFailures.java:64)
	at org.apache.lucene.util.TestRuleMarkFailure$1.evaluate(TestRuleMarkFailure.java:47)
	at com.carrotsearch.randomizedtesting.rules.StatementAdapter.evaluate(StatementAdapter.java:36)
	at com.carrotsearch.randomizedtesting.ThreadLeakControl$StatementRunner.run(ThreadLeakControl.java:368)
	at com.carrotsearch.randomizedtesting.ThreadLeakControl.forkTimeoutingTask(ThreadLeakControl.java:817)
	at com.carrotsearch.randomizedtesting.ThreadLeakControl$3.evaluate(ThreadLeakControl.java:468)
	at com.carrotsearch.randomizedtesting.RandomizedRunner.runSingleTest(RandomizedRunner.java:947)
	at com.carrotsearch.randomizedtesting.RandomizedRunner$5.evaluate(RandomizedRunner.java:832)
	at com.carrotsearch.randomizedtesting.RandomizedRunner$6.evaluate(RandomizedRunner.java:883)
	at com.carrotsearch.randomizedtesting.RandomizedRunner$7.evaluate(RandomizedRunner.java:894)
	at com.carrotsearch.randomizedtesting.rules.StatementAdapter.evaluate(StatementAdapter.java:36)
	at com.carrotsearch.randomizedtesting.rules.SystemPropertiesRestoreRule$1.evaluate(SystemPropertiesRestoreRule.java:57)
	at org.apache.lucene.util.AbstractBeforeAfterRule$1.evaluate(AbstractBeforeAfterRule.java:45)
	at com.carrotsearch.randomizedtesting.rules.StatementAdapter.evaluate(StatementAdapter.java:36)
	at org.apache.lucene.util.TestRuleStoreClassName$1.evaluate(TestRuleStoreClassName.java:41)
	at com.carrotsearch.randomizedtesting.rules.NoShadowingOrOverridesOnMethodsRule$1.evaluate(NoShadowingOrOverridesOnMethodsRule.java:40)
	at com.carrotsearch.randomizedtesting.rules.NoShadowingOrOverridesOnMethodsRule$1.evaluate(NoShadowingOrOverridesOnMethodsRule.java:40)
	at com.carrotsearch.randomizedtesting.rules.StatementAdapter.evaluate(StatementAdapter.java:36)
	at com.carrotsearch.randomizedtesting.rules.StatementAdapter.evaluate(StatementAdapter.java:36)
	at com.carrotsearch.randomizedtesting.rules.StatementAdapter.evaluate(StatementAdapter.java:36)
	at org.apache.lucene.util.TestRuleAssertionsRequired$1.evaluate(TestRuleAssertionsRequired.java:53)
	at org.apache.lucene.util.TestRuleMarkFailure$1.evaluate(TestRuleMarkFailure.java:47)
	at org.apache.lucene.util.TestRuleIgnoreAfterMaxFailures$1.evaluate(TestRuleIgnoreAfterMaxFailures.java:64)
	at org.apache.lucene.util.TestRuleIgnoreTestSuites$1.evaluate(TestRuleIgnoreTestSuites.java:54)
	at com.carrotsearch.randomizedtesting.rules.StatementAdapter.evaluate(StatementAdapter.java:36)
	at com.carrotsearch.randomizedtesting.ThreadLeakControl$StatementRunner.run(ThreadLeakControl.java:368)
	at java.lang.Thread.run(Thread.java:748)


FAILED:  org.apache.solr.cloud.RestartWhileUpdatingTest.test

Error Message:
There are still nodes recoverying - waited for 320 seconds

Stack Trace:
java.lang.AssertionError: There are still nodes recoverying - waited for 320 seconds
	at __randomizedtesting.SeedInfo.seed([1B990FFF714B6410:93CD3025DFB709E8]:0)
	at org.junit.Assert.fail(Assert.java:88)
	at org.apache.solr.cloud.AbstractDistribZkTestBase.waitForRecoveriesToFinish(AbstractDistribZkTestBase.java:195)
	at org.apache.solr.cloud.AbstractFullDistribZkTestBase.waitForRecoveriesToFinish(AbstractFullDistribZkTestBase.java:1038)
	at org.apache.solr.cloud.AbstractFullDistribZkTestBase.waitForThingsToLevelOut(AbstractFullDistribZkTestBase.java:1595)
	at org.apache.solr.cloud.RestartWhileUpdatingTest.test(RestartWhileUpdatingTest.java:144)
	at sun.reflect.NativeMethodAccessorImpl.invoke0(Native Method)
	at sun.reflect.NativeMethodAccessorImpl.invoke(NativeMethodAccessorImpl.java:62)
	at sun.reflect.DelegatingMethodAccessorImpl.invoke(DelegatingMethodAccessorImpl.java:43)
	at java.lang.reflect.Method.invoke(Method.java:498)
	at com.carrotsearch.randomizedtesting.RandomizedRunner.invoke(RandomizedRunner.java:1750)
	at com.carrotsearch.randomizedtesting.RandomizedRunner$8.evaluate(RandomizedRunner.java:938)
	at com.carrotsearch.randomizedtesting.RandomizedRunner$9.evaluate(RandomizedRunner.java:974)
	at com.carrotsearch.randomizedtesting.RandomizedRunner$10.evaluate(RandomizedRunner.java:988)
	at org.apache.solr.BaseDistributedSearchTestCase$ShardsRepeatRule$ShardsFixedStatement.callStatement(BaseDistributedSearchTestCase.java:1082)
	at org.apache.solr.BaseDistributedSearchTestCase$ShardsRepeatRule$ShardsStatement.evaluate(BaseDistributedSearchTestCase.java:1054)
	at com.carrotsearch.randomizedtesting.rules.SystemPropertiesRestoreRule$1.evaluate(SystemPropertiesRestoreRule.java:57)
	at org.apache.lucene.util.TestRuleSetupTeardownChained$1.evaluate(TestRuleSetupTeardownChained.java:49)
	at org.apache.lucene.util.AbstractBeforeAfterRule$1.evaluate(AbstractBeforeAfterRule.java:45)
	at org.apache.lucene.util.TestRuleThreadAndTestName$1.evaluate(TestRuleThreadAndTestName.java:48)
	at org.apache.lucene.util.TestRuleIgnoreAfterMaxFailures$1.evaluate(TestRuleIgnoreAfterMaxFailures.java:64)
	at org.apache.lucene.util.TestRuleMarkFailure$1.evaluate(TestRuleMarkFailure.java:47)
	at com.carrotsearch.randomizedtesting.rules.StatementAdapter.evaluate(StatementAdapter.java:36)
	at com.carrotsearch.randomizedtesting.ThreadLeakControl$StatementRunner.run(ThreadLeakControl.java:368)
	at com.carrotsearch.randomizedtesting.ThreadLeakControl.forkTimeoutingTask(ThreadLeakControl.java:817)
	at com.carrotsearch.randomizedtesting.ThreadLeakControl$3.evaluate(ThreadLeakControl.java:468)
	at com.carrotsearch.randomizedtesting.RandomizedRunner.runSingleTest(RandomizedRunner.java:947)
	at com.carrotsearch.randomizedtesting.RandomizedRunner$5.evaluate(RandomizedRunner.java:832)
	at com.carrotsearch.randomizedtesting.RandomizedRunner$6.evaluate(RandomizedRunner.java:883)
	at com.carrotsearch.randomizedtesting.RandomizedRunner$7.evaluate(RandomizedRunner.java:894)
	at com.carrotsearch.randomizedtesting.rules.StatementAdapter.evaluate(StatementAdapter.java:36)
	at com.carrotsearch.randomizedtesting.rules.SystemPropertiesRestoreRule$1.evaluate(SystemPropertiesRestoreRule.java:57)
	at org.apache.lucene.util.AbstractBeforeAfterRule$1.evaluate(AbstractBeforeAfterRule.java:45)
	at com.carrotsearch.randomizedtesting.rules.StatementAdapter.evaluate(StatementAdapter.java:36)
	at org.apache.lucene.util.TestRuleStoreClassName$1.evaluate(TestRuleStoreClassName.java:41)
	at com.carrotsearch.randomizedtesting.rules.NoShadowingOrOverridesOnMethodsRule$1.evaluate(NoShadowingOrOverridesOnMethodsRule.java:40)
	at com.carrotsearch.randomizedtesting.rules.NoShadowingOrOverridesOnMethodsRule$1.evaluate(NoShadowingOrOverridesOnMethodsRule.java:40)
	at com.carrotsearch.randomizedtesting.rules.StatementAdapter.evaluate(StatementAdapter.java:36)
	at com.carrotsearch.randomizedtesting.rules.StatementAdapter.evaluate(StatementAdapter.java:36)
	at com.carrotsearch.randomizedtesting.rules.StatementAdapter.evaluate(StatementAdapter.java:36)
	at org.apache.lucene.util.TestRuleAssertionsRequired$1.evaluate(TestRuleAssertionsRequired.java:53)
	at org.apache.lucene.util.TestRuleMarkFailure$1.evaluate(TestRuleMarkFailure.java:47)
	at org.apache.lucene.util.TestRuleIgnoreAfterMaxFailures$1.evaluate(TestRuleIgnoreAfterMaxFailures.java:64)
	at org.apache.lucene.util.TestRuleIgnoreTestSuites$1.evaluate(TestRuleIgnoreTestSuites.java:54)
	at com.carrotsearch.randomizedtesting.rules.StatementAdapter.evaluate(StatementAdapter.java:36)
	at com.carrotsearch.randomizedtesting.ThreadLeakControl$StatementRunner.run(ThreadLeakControl.java:368)
	at java.lang.Thread.run(Thread.java:748)




Build Log:
[...truncated 14032 lines...]
   [junit4] JVM J2: stdout was not empty, see: /x1/jenkins/jenkins-slave/workspace/Lucene-Solr-BadApples-NightlyTests-master/checkout/solr/build/solr-core/test/temp/junit4-J2-20190119_151432_8282816604587647437958.sysout
   [junit4] >>> JVM J2 emitted unexpected output (verbatim) ----
   [junit4] java.lang.OutOfMemoryError: Java heap space
   [junit4] Dumping heap to /x1/jenkins/jenkins-slave/workspace/Lucene-Solr-BadApples-NightlyTests-master/checkout/heapdumps/java_pid21223.hprof ...
   [junit4] Heap dump file created [852285094 bytes in 5.555 secs]
   [junit4] <<< JVM J2: EOF ----

   [junit4] JVM J2: stderr was not empty, see: /x1/jenkins/jenkins-slave/workspace/Lucene-Solr-BadApples-NightlyTests-master/checkout/solr/build/solr-core/test/temp/junit4-J2-20190119_151432_8282876645628650944136.syserr
   [junit4] >>> JVM J2 emitted unexpected output (verbatim) ----
   [junit4] WARN: Unhandled exception in event serialization. -> java.lang.OutOfMemoryError: GC overhead limit exceeded
   [junit4] <<< JVM J2: EOF ----

[...truncated 190 lines...]
   [junit4] Suite: org.apache.solr.cloud.hdfs.HdfsRestartWhileUpdatingTest
   [junit4]   2> Creating dataDir: /x1/jenkins/jenkins-slave/workspace/Lucene-Solr-BadApples-NightlyTests-master/checkout/solr/build/solr-core/test/J1/temp/solr.cloud.hdfs.HdfsRestartWhileUpdatingTest_1B990FFF714B6410-001/init-core-data-001
   [junit4]   2> 1977144 WARN  (SUITE-HdfsRestartWhileUpdatingTest-seed#[1B990FFF714B6410]-worker) [    ] o.a.s.SolrTestCaseJ4 startTrackingSearchers: numOpens=8 numCloses=8
   [junit4]   2> 1977144 INFO  (SUITE-HdfsRestartWhileUpdatingTest-seed#[1B990FFF714B6410]-worker) [    ] o.a.s.SolrTestCaseJ4 Using PointFields (NUMERIC_POINTS_SYSPROP=true) w/NUMERIC_DOCVALUES_SYSPROP=true
   [junit4]   2> 1977148 INFO  (SUITE-HdfsRestartWhileUpdatingTest-seed#[1B990FFF714B6410]-worker) [    ] o.a.s.SolrTestCaseJ4 Randomized ssl (true) and clientAuth (true) via: @org.apache.solr.util.RandomizeSSL(reason=, ssl=NaN, value=NaN, clientAuth=NaN)
   [junit4]   2> 1977148 INFO  (SUITE-HdfsRestartWhileUpdatingTest-seed#[1B990FFF714B6410]-worker) [    ] o.a.s.SolrTestCaseJ4 SecureRandom sanity checks: test.solr.allowed.securerandom=null & java.security.egd=file:/dev/./urandom
   [junit4]   2> 1977149 INFO  (SUITE-HdfsRestartWhileUpdatingTest-seed#[1B990FFF714B6410]-worker) [    ] o.a.s.BaseDistributedSearchTestCase Setting hostContext system property: /c/u
   [junit4]   1> Formatting using clusterid: testClusterID
   [junit4]   2> 1977203 WARN  (SUITE-HdfsRestartWhileUpdatingTest-seed#[1B990FFF714B6410]-worker) [    ] o.a.h.m.i.MetricsConfig Cannot locate configuration: tried hadoop-metrics2-namenode.properties,hadoop-metrics2.properties
   [junit4]   2> 1977224 WARN  (SUITE-HdfsRestartWhileUpdatingTest-seed#[1B990FFF714B6410]-worker) [    ] o.a.h.h.HttpRequestLog Jetty request log can only be enabled using Log4j
   [junit4]   2> 1977226 INFO  (SUITE-HdfsRestartWhileUpdatingTest-seed#[1B990FFF714B6410]-worker) [    ] o.m.log jetty-6.1.26
   [junit4]   2> 1977267 INFO  (SUITE-HdfsRestartWhileUpdatingTest-seed#[1B990FFF714B6410]-worker) [    ] o.m.log Extract jar:file:/x1/jenkins/.ivy2/cache/org.apache.hadoop/hadoop-hdfs/tests/hadoop-hdfs-2.7.4-tests.jar!/webapps/hdfs to ./temp/Jetty_localhost_42614_hdfs____vtikat/webapp
   [junit4]   2> 1977741 INFO  (SUITE-HdfsRestartWhileUpdatingTest-seed#[1B990FFF714B6410]-worker) [    ] o.m.log Started HttpServer2$SelectChannelConnectorWithSafeStartup@localhost:42614
   [junit4]   2> 1977857 WARN  (SUITE-HdfsRestartWhileUpdatingTest-seed#[1B990FFF714B6410]-worker) [    ] o.a.h.h.HttpRequestLog Jetty request log can only be enabled using Log4j
   [junit4]   2> 1977858 INFO  (SUITE-HdfsRestartWhileUpdatingTest-seed#[1B990FFF714B6410]-worker) [    ] o.m.log jetty-6.1.26
   [junit4]   2> 1977880 INFO  (SUITE-HdfsRestartWhileUpdatingTest-seed#[1B990FFF714B6410]-worker) [    ] o.m.log Extract jar:file:/x1/jenkins/.ivy2/cache/org.apache.hadoop/hadoop-hdfs/tests/hadoop-hdfs-2.7.4-tests.jar!/webapps/datanode to ./temp/Jetty_localhost_43474_datanode____9lnyft/webapp
   [junit4]   2> 1978460 INFO  (SUITE-HdfsRestartWhileUpdatingTest-seed#[1B990FFF714B6410]-worker) [    ] o.m.log Started HttpServer2$SelectChannelConnectorWithSafeStartup@localhost:43474
   [junit4]   2> 1978543 WARN  (SUITE-HdfsRestartWhileUpdatingTest-seed#[1B990FFF714B6410]-worker) [    ] o.a.h.h.HttpRequestLog Jetty request log can only be enabled using Log4j
   [junit4]   2> 1978544 INFO  (SUITE-HdfsRestartWhileUpdatingTest-seed#[1B990FFF714B6410]-worker) [    ] o.m.log jetty-6.1.26
   [junit4]   2> 1978570 INFO  (SUITE-HdfsRestartWhileUpdatingTest-seed#[1B990FFF714B6410]-worker) [    ] o.m.log Extract jar:file:/x1/jenkins/.ivy2/cache/org.apache.hadoop/hadoop-hdfs/tests/hadoop-hdfs-2.7.4-tests.jar!/webapps/datanode to ./temp/Jetty_localhost_41327_datanode____ssydfm/webapp
   [junit4]   2> 1978631 ERROR (DataNode: [[[DISK]file:/x1/jenkins/jenkins-slave/workspace/Lucene-Solr-BadApples-NightlyTests-master/checkout/solr/build/solr-core/test/J1/temp/solr.cloud.hdfs.HdfsRestartWhileUpdatingTest_1B990FFF714B6410-001/tempDir-001/hdfsBaseDir/data/data1/, [DISK]file:/x1/jenkins/jenkins-slave/workspace/Lucene-Solr-BadApples-NightlyTests-master/checkout/solr/build/solr-core/test/J1/temp/solr.cloud.hdfs.HdfsRestartWhileUpdatingTest_1B990FFF714B6410-001/tempDir-001/hdfsBaseDir/data/data2/]]  heartbeating to localhost/127.0.0.1:42794) [    ] o.a.h.h.s.d.DirectoryScanner dfs.datanode.directoryscan.throttle.limit.ms.per.sec set to value below 1 ms/sec. Assuming default value of 1000
   [junit4]   2> 1978651 INFO  (Block report processor) [    ] BlockStateChange BLOCK* processReport 0x2024c322aa56d7: from storage DS-fcdb5164-8e56-408d-b41b-13b462a1de42 node DatanodeRegistration(127.0.0.1:33272, datanodeUuid=23bb5fc7-7bac-43f8-88a6-f2e6a643953e, infoPort=44184, infoSecurePort=0, ipcPort=41895, storageInfo=lv=-56;cid=testClusterID;nsid=1734812269;c=0), blocks: 0, hasStaleStorage: true, processing time: 0 msecs
   [junit4]   2> 1978651 INFO  (Block report processor) [    ] BlockStateChange BLOCK* processReport 0x2024c322aa56d7: from storage DS-1c36d9fc-9012-44f6-959a-036d719bf1eb node DatanodeRegistration(127.0.0.1:33272, datanodeUuid=23bb5fc7-7bac-43f8-88a6-f2e6a643953e, infoPort=44184, infoSecurePort=0, ipcPort=41895, storageInfo=lv=-56;cid=testClusterID;nsid=1734812269;c=0), blocks: 0, hasStaleStorage: false, processing time: 0 msecs
   [junit4]   2> 1979089 INFO  (SUITE-HdfsRestartWhileUpdatingTest-seed#[1B990FFF714B6410]-worker) [    ] o.m.log Started HttpServer2$SelectChannelConnectorWithSafeStartup@localhost:41327
   [junit4]   2> 1979216 ERROR (DataNode: [[[DISK]file:/x1/jenkins/jenkins-slave/workspace/Lucene-Solr-BadApples-NightlyTests-master/checkout/solr/build/solr-core/test/J1/temp/solr.cloud.hdfs.HdfsRestartWhileUpdatingTest_1B990FFF714B6410-001/tempDir-001/hdfsBaseDir/data/data3/, [DISK]file:/x1/jenkins/jenkins-slave/workspace/Lucene-Solr-BadApples-NightlyTests-master/checkout/solr/build/solr-core/test/J1/temp/solr.cloud.hdfs.HdfsRestartWhileUpdatingTest_1B990FFF714B6410-001/tempDir-001/hdfsBaseDir/data/data4/]]  heartbeating to localhost/127.0.0.1:42794) [    ] o.a.h.h.s.d.DirectoryScanner dfs.datanode.directoryscan.throttle.limit.ms.per.sec set to value below 1 ms/sec. Assuming default value of 1000
   [junit4]   2> 1979229 INFO  (Block report processor) [    ] BlockStateChange BLOCK* processReport 0x2024c3452bcd0e: from storage DS-ee19c920-1598-4fae-b708-cc8f50a3864c node DatanodeRegistration(127.0.0.1:35245, datanodeUuid=390638e6-530b-4ae5-af7a-99fe6464d780, infoPort=46046, infoSecurePort=0, ipcPort=34870, storageInfo=lv=-56;cid=testClusterID;nsid=1734812269;c=0), blocks: 0, hasStaleStorage: true, processing time: 0 msecs
   [junit4]   2> 1979230 INFO  (Block report processor) [    ] BlockStateChange BLOCK* processReport 0x2024c3452bcd0e: from storage DS-6b89699f-0721-4b6b-99d1-d818de742c45 node DatanodeRegistration(127.0.0.1:35245, datanodeUuid=390638e6-530b-4ae5-af7a-99fe6464d780, infoPort=46046, infoSecurePort=0, ipcPort=34870, storageInfo=lv=-56;cid=testClusterID;nsid=1734812269;c=0), blocks: 0, hasStaleStorage: false, processing time: 0 msecs
   [junit4]   2> 1979504 INFO  (TEST-HdfsRestartWhileUpdatingTest.test-seed#[1B990FFF714B6410]) [    ] o.a.s.c.ZkTestServer STARTING ZK TEST SERVER
   [junit4]   2> 1979504 INFO  (ZkTestServer Run Thread) [    ] o.a.s.c.ZkTestServer client port:0.0.0.0/0.0.0.0:0
   [junit4]   2> 1979504 INFO  (ZkTestServer Run Thread) [    ] o.a.s.c.ZkTestServer Starting server
   [junit4]   2> 1979604 INFO  (TEST-HdfsRestartWhileUpdatingTest.test-seed#[1B990FFF714B6410]) [    ] o.a.s.c.ZkTestServer start zk server on port:40686
   [junit4]   2> 1979604 INFO  (TEST-HdfsRestartWhileUpdatingTest.test-seed#[1B990FFF714B6410]) [    ] o.a.s.c.ZkTestServer parse host and port list: 127.0.0.1:40686
   [junit4]   2> 1979604 INFO  (TEST-HdfsRestartWhileUpdatingTest.test-seed#[1B990FFF714B6410]) [    ] o.a.s.c.ZkTestServer connecting to 127.0.0.1 40686
   [junit4]   2> 1979609 INFO  (zkConnectionManagerCallback-4656-thread-1) [    ] o.a.s.c.c.ConnectionManager zkClient has connected
   [junit4]   2> 1979614 INFO  (zkConnectionManagerCallback-4658-thread-1) [    ] o.a.s.c.c.ConnectionManager zkClient has connected
   [junit4]   2> 1979616 INFO  (TEST-HdfsRestartWhileUpdatingTest.test-seed#[1B990FFF714B6410]) [    ] o.a.s.c.ZkTestServer put /x1/jenkins/jenkins-slave/workspace/Lucene-Solr-BadApples-NightlyTests-master/checkout/solr/core/src/test-files/solr/collection1/conf/solrconfig-tlog.xml to /configs/conf1/solrconfig.xml
   [junit4]   2> 1979617 INFO  (TEST-HdfsRestartWhileUpdatingTest.test-seed#[1B990FFF714B6410]) [    ] o.a.s.c.ZkTestServer put /x1/jenkins/jenkins-slave/workspace/Lucene-Solr-BadApples-NightlyTests-master/checkout/solr/core/src/test-files/solr/collection1/conf/schema15.xml to /configs/conf1/schema.xml
   [junit4]   2> 1979618 INFO  (TEST-HdfsRestartWhileUpdatingTest.test-seed#[1B990FFF714B6410]) [    ] o.a.s.c.ZkTestServer put /x1/jenkins/jenkins-slave/workspace/Lucene-Solr-BadApples-NightlyTests-master/checkout/solr/core/src/test-files/solr/collection1/conf/solrconfig.snippet.randomindexconfig.xml to /configs/conf1/solrconfig.snippet.randomindexconfig.xml
   [junit4]   2> 1979620 INFO  (TEST-HdfsRestartWhileUpdatingTest.test-seed#[1B990FFF714B6410]) [    ] o.a.s.c.ZkTestServer put /x1/jenkins/jenkins-slave/workspace/Lucene-Solr-BadApples-NightlyTests-master/checkout/solr/core/src/test-files/solr/collection1/conf/stopwords.txt to /configs/conf1/stopwords.txt
   [junit4]   2> 1979622 INFO  (TEST-HdfsRestartWhileUpdatingTest.test-seed#[1B990FFF714B6410]) [    ] o.a.s.c.ZkTestServer put /x1/jenkins/jenkins-slave/workspace/Lucene-Solr-BadApples-NightlyTests-master/checkout/solr/core/src/test-files/solr/collection1/conf/protwords.txt to /configs/conf1/protwords.txt
   [junit4]   2> 1979623 INFO  (TEST-HdfsRestartWhileUpdatingTest.test-seed#[1B990FFF714B6410]) [    ] o.a.s.c.ZkTestServer put /x1/jenkins/jenkins-slave/workspace/Lucene-Solr-BadApples-NightlyTests-master/checkout/solr/core/src/test-files/solr/collection1/conf/currency.xml to /configs/conf1/currency.xml
   [junit4]   2> 1979624 INFO  (TEST-HdfsRestartWhileUpdatingTest.test-seed#[1B990FFF714B6410]) [    ] o.a.s.c.ZkTestServer put /x1/jenkins/jenkins-slave/workspace/Lucene-Solr-BadApples-NightlyTests-master/checkout/solr/core/src/test-files/solr/collection1/conf/enumsConfig.xml to /configs/conf1/enumsConfig.xml
   [junit4]   2> 1979627 INFO  (TEST-HdfsRestartWhileUpdatingTest.test-seed#[1B990FFF714B6410]) [    ] o.a.s.c.ZkTestServer put /x1/jenkins/jenkins-slave/workspace/Lucene-Solr-BadApples-NightlyTests-master/checkout/solr/core/src/test-files/solr/collection1/conf/open-exchange-rates.json to /configs/conf1/open-exchange-rates.json
   [junit4]   2> 1979628 INFO  (TEST-HdfsRestartWhileUpdatingTest.test-seed#[1B990FFF714B6410]) [    ] o.a.s.c.ZkTestServer put /x1/jenkins/jenkins-slave/workspace/Lucene-Solr-BadApples-NightlyTests-master/checkout/solr/core/src/test-files/solr/collection1/conf/mapping-ISOLatin1Accent.txt to /configs/conf1/mapping-ISOLatin1Accent.txt
   [junit4]   2> 1979629 INFO  (TEST-HdfsRestartWhileUpdatingTest.test-seed#[1B990FFF714B6410]) [    ] o.a.s.c.ZkTestServer put /x1/jenkins/jenkins-slave/workspace/Lucene-Solr-BadApples-NightlyTests-master/checkout/solr/core/src/test-files/solr/collection1/conf/old_synonyms.txt to /configs/conf1/old_synonyms.txt
   [junit4]   2> 1979630 INFO  (TEST-HdfsRestartWhileUpdatingTest.test-seed#[1B990FFF714B6410]) [    ] o.a.s.c.ZkTestServer put /x1/jenkins/jenkins-slave/workspace/Lucene-Solr-BadApples-NightlyTests-master/checkout/solr/core/src/test-files/solr/collection1/conf/synonyms.txt to /configs/conf1/synonyms.txt
   [junit4]   2> 1979634 INFO  (zkConnectionManagerCallback-4662-thread-1) [    ] o.a.s.c.c.ConnectionManager zkClient has connected
   [junit4]   2> 1979637 INFO  (TEST-HdfsRestartWhileUpdatingTest.test-seed#[1B990FFF714B6410]) [    ] o.a.s.c.AbstractFullDistribZkTestBase Will use NRT replicas unless explicitly asked otherwise
   [junit4]   2> 1979820 WARN  (TEST-HdfsRestartWhileUpdatingTest.test-seed#[1B990FFF714B6410]) [    ] o.e.j.s.AbstractConnector Ignoring deprecated socket close linger time
   [junit4]   2> 1979821 INFO  (TEST-HdfsRestartWhileUpdatingTest.test-seed#[1B990FFF714B6410]) [    ] o.a.s.c.s.e.JettySolrRunner Start Jetty (original configured port=0)
   [junit4]   2> 1979821 INFO  (TEST-HdfsRestartWhileUpdatingTest.test-seed#[1B990FFF714B6410]) [    ] o.a.s.c.s.e.JettySolrRunner Trying to start Jetty on port 0 try number 1 ...
   [junit4]   2> 1979821 INFO  (TEST-HdfsRestartWhileUpdatingTest.test-seed#[1B990FFF714B6410]) [    ] o.e.j.s.Server jetty-9.4.14.v20181114; built: 2018-11-14T21:20:31.478Z; git: c4550056e785fb5665914545889f21dc136ad9e6; jvm 1.8.0_191-b12
   [junit4]   2> 1979825 INFO  (TEST-HdfsRestartWhileUpdatingTest.test-seed#[1B990FFF714B6410]) [    ] o.e.j.s.session DefaultSessionIdManager workerName=node0
   [junit4]   2> 1979825 INFO  (TEST-HdfsRestartWhileUpdatingTest.test-seed#[1B990FFF714B6410]) [    ] o.e.j.s.session No SessionScavenger set, using defaults
   [junit4]   2> 1979825 INFO  (TEST-HdfsRestartWhileUpdatingTest.test-seed#[1B990FFF714B6410]) [    ] o.e.j.s.session node0 Scavenging every 600000ms
   [junit4]   2> 1979828 INFO  (TEST-HdfsRestartWhileUpdatingTest.test-seed#[1B990FFF714B6410]) [    ] o.e.j.s.h.ContextHandler Started o.e.j.s.ServletContextHandler@3395b730{/c/u,null,AVAILABLE}
   [junit4]   2> 1979829 WARN  (TEST-HdfsRestartWhileUpdatingTest.test-seed#[1B990FFF714B6410]) [    ] o.e.j.u.s.S.config No Client EndPointIdentificationAlgorithm configured for SslContextFactory@62072312[provider=null,keyStore=null,trustStore=null]
   [junit4]   2> 1979829 INFO  (TEST-HdfsRestartWhileUpdatingTest.test-seed#[1B990FFF714B6410]) [    ] o.e.j.s.AbstractConnector Started ServerConnector@5251f1cd{SSL,[ssl, http/1.1]}{127.0.0.1:36572}
   [junit4]   2> 1979829 INFO  (TEST-HdfsRestartWhileUpdatingTest.test-seed#[1B990FFF714B6410]) [    ] o.e.j.s.Server Started @1979896ms
   [junit4]   2> 1979829 INFO  (TEST-HdfsRestartWhileUpdatingTest.test-seed#[1B990FFF714B6410]) [    ] o.a.s.c.s.e.JettySolrRunner Jetty properties: {solr.data.dir=hdfs://localhost:42794/hdfs__localhost_42794__x1_jenkins_jenkins-slave_workspace_Lucene-Solr-BadApples-NightlyTests-master_checkout_solr_build_solr-core_test_J1_temp_solr.cloud.hdfs.HdfsRestartWhileUpdatingTest_1B990FFF714B6410-001_tempDir-002_control_data, hostContext=/c/u, hostPort=36572, coreRootDirectory=/x1/jenkins/jenkins-slave/workspace/Lucene-Solr-BadApples-NightlyTests-master/checkout/solr/build/solr-core/test/J1/temp/solr.cloud.hdfs.HdfsRestartWhileUpdatingTest_1B990FFF714B6410-001/control-001/cores}
   [junit4]   2> 1979830 ERROR (TEST-HdfsRestartWhileUpdatingTest.test-seed#[1B990FFF714B6410]) [    ] o.a.s.u.StartupLoggingUtils Missing Java Option solr.log.dir. Logging may be missing or incomplete.
   [junit4]   2> 1979830 INFO  (TEST-HdfsRestartWhileUpdatingTest.test-seed#[1B990FFF714B6410]) [    ] o.a.s.s.SolrDispatchFilter Using logger factory org.apache.logging.slf4j.Log4jLoggerFactory
   [junit4]   2> 1979830 INFO  (TEST-HdfsRestartWhileUpdatingTest.test-seed#[1B990FFF714B6410]) [    ] o.a.s.s.SolrDispatchFilter  ___      _       Welcome to Apache Solr? version 9.0.0
   [junit4]   2> 1979830 INFO  (TEST-HdfsRestartWhileUpdatingTest.test-seed#[1B990FFF714B6410]) [    ] o.a.s.s.SolrDispatchFilter / __| ___| |_ _   Starting in cloud mode on port null
   [junit4]   2> 1979830 INFO  (TEST-HdfsRestartWhileUpdatingTest.test-seed#[1B990FFF714B6410]) [    ] o.a.s.s.SolrDispatchFilter \__ \/ _ \ | '_|  Install dir: null
   [junit4]   2> 1979830 INFO  (TEST-HdfsRestartWhileUpdatingTest.test-seed#[1B990FFF714B6410]) [    ] o.a.s.s.SolrDispatchFilter |___/\___/_|_|    Start time: 2019-01-19T15:47:32.810Z
   [junit4]   2> 1979832 INFO  (zkConnectionManagerCallback-4664-thread-1) [    ] o.a.s.c.c.ConnectionManager zkClient has connected
   [junit4]   2> 1979834 INFO  (TEST-HdfsRestartWhileUpdatingTest.test-seed#[1B990FFF714B6410]) [    ] o.a.s.s.SolrDispatchFilter Loading solr.xml from SolrHome (not found in ZooKeeper)
   [junit4]   2> 1979834 INFO  (TEST-HdfsRestartWhileUpdatingTest.test-seed#[1B990FFF714B6410]) [    ] o.a.s.c.SolrXmlConfig Loading container configuration from /x1/jenkins/jenkins-slave/workspace/Lucene-Solr-BadApples-NightlyTests-master/checkout/solr/build/solr-core/test/J1/temp/solr.cloud.hdfs.HdfsRestartWhileUpdatingTest_1B990FFF714B6410-001/control-001/solr.xml
   [junit4]   2> 1979839 INFO  (TEST-HdfsRestartWhileUpdatingTest.test-seed#[1B990FFF714B6410]) [    ] o.a.s.c.SolrXmlConfig Configuration parameter autoReplicaFailoverWorkLoopDelay is ignored
   [junit4]   2> 1979839 INFO  (TEST-HdfsRestartWhileUpdatingTest.test-seed#[1B990FFF714B6410]) [    ] o.a.s.c.SolrXmlConfig Configuration parameter autoReplicaFailoverBadNodeExpiration is ignored
   [junit4]   2> 1979841 INFO  (TEST-HdfsRestartWhileUpdatingTest.test-seed#[1B990FFF714B6410]) [    ] o.a.s.c.SolrXmlConfig MBean server found: com.sun.jmx.mbeanserver.JmxMBeanServer@4c8a08ea, but no JMX reporters were configured - adding default JMX reporter.
   [junit4]   2> 1980210 INFO  (TEST-HdfsRestartWhileUpdatingTest.test-seed#[1B990FFF714B6410]) [    ] o.a.s.h.c.HttpShardHandlerFactory Host whitelist initialized: WhitelistHostChecker [whitelistHosts=null, whitelistHostCheckingEnabled=false]
   [junit4]   2> 1980215 WARN  (TEST-HdfsRestartWhileUpdatingTest.test-seed#[1B990FFF714B6410]) [    ] o.a.s.c.s.i.Http2SolrClient Create Http2SolrClient with HTTP/1.1 transport since Java 8 or lower versions does not support SSL + HTTP/2
   [junit4]   2> 1980221 WARN  (TEST-HdfsRestartWhileUpdatingTest.test-seed#[1B990FFF714B6410]) [    ] o.e.j.u.s.S.config No Client EndPointIdentificationAlgorithm configured for SslContextFactory@4d6e1650[provider=null,keyStore=null,trustStore=null]
   [junit4]   2> 1980227 WARN  (TEST-HdfsRestartWhileUpdatingTest.test-seed#[1B990FFF714B6410]) [    ] o.a.s.c.s.i.Http2SolrClient Create Http2SolrClient with HTTP/1.1 transport since Java 8 or lower versions does not support SSL + HTTP/2
   [junit4]   2> 1980228 WARN  (TEST-HdfsRestartWhileUpdatingTest.test-seed#[1B990FFF714B6410]) [    ] o.e.j.u.s.S.config No Client EndPointIdentificationAlgorithm configured for SslContextFactory@424e2867[provider=null,keyStore=null,trustStore=null]
   [junit4]   2> 1980229 INFO  (TEST-HdfsRestartWhileUpdatingTest.test-seed#[1B990FFF714B6410]) [    ] o.a.s.c.ZkContainer Zookeeper client=127.0.0.1:40686/solr
   [junit4]   2> 1980231 INFO  (zkConnectionManagerCallback-4670-thread-1) [    ] o.a.s.c.c.ConnectionManager zkClient has connected
   [junit4]   2> 1980234 INFO  (zkConnectionManagerCallback-4672-thread-1) [    ] o.a.s.c.c.ConnectionManager zkClient has connected
   [junit4]   2> 1980322 INFO  (TEST-HdfsRestartWhileUpdatingTest.test-seed#[1B990FFF714B6410]) [n:127.0.0.1:36572_c%2Fu    ] o.a.s.c.OverseerElectionContext I am going to be the leader 127.0.0.1:36572_c%2Fu
   [junit4]   2> 1980323 INFO  (TEST-HdfsRestartWhileUpdatingTest.test-seed#[1B990FFF714B6410]) [n:127.0.0.1:36572_c%2Fu    ] o.a.s.c.Overseer Overseer (id=72650538903797765-127.0.0.1:36572_c%2Fu-n_0000000000) starting
   [junit4]   2> 1980330 INFO  (zkConnectionManagerCallback-4679-thread-1) [    ] o.a.s.c.c.ConnectionManager zkClient has connected
   [junit4]   2> 1980333 INFO  (TEST-HdfsRestartWhileUpdatingTest.test-seed#[1B990FFF714B6410]) [n:127.0.0.1:36572_c%2Fu    ] o.a.s.c.s.i.ZkClientClusterStateProvider Cluster at 127.0.0.1:40686/solr ready
   [junit4]   2> 1980334 INFO  (OverseerStateUpdate-72650538903797765-127.0.0.1:36572_c%2Fu-n_0000000000) [n:127.0.0.1:36572_c%2Fu    ] o.a.s.c.Overseer Starting to work on the main queue : 127.0.0.1:36572_c%2Fu
   [junit4]   2> 1980334 INFO  (TEST-HdfsRestartWhileUpdatingTest.test-seed#[1B990FFF714B6410]) [n:127.0.0.1:36572_c%2Fu    ] o.a.s.c.ZkController Register node as live in ZooKeeper:/live_nodes/127.0.0.1:36572_c%2Fu
   [junit4]   2> 1980336 INFO  (OverseerStateUpdate-72650538903797765-127.0.0.1:36572_c%2Fu-n_0000000000) [n:127.0.0.1:36572_c%2Fu    ] o.a.s.c.c.ZkStateReader Updated live nodes from ZooKeeper... (0) -> (1)
   [junit4]   2> 1980337 INFO  (zkCallback-4678-thread-1) [    ] o.a.s.c.c.ZkStateReader Updated live nodes from ZooKeeper... (0) -> (1)
   [junit4]   2> 1980365 INFO  (TEST-HdfsRestartWhileUpdatingTest.test-seed#[1B990FFF714B6410]) [n:127.0.0.1:36572_c%2Fu    ] o.a.s.h.a.MetricsHistoryHandler No .system collection, keeping metrics history in memory.
   [junit4]   2> 1980396 INFO  (TEST-HdfsRestartWhileUpdatingTest.test-seed#[1B990FFF714B6410]) [n:127.0.0.1:36572_c%2Fu    ] o.a.s.m.r.SolrJmxReporter JMX monitoring for 'solr.node' (registry 'solr.node') enabled at server: com.sun.jmx.mbeanserver.JmxMBeanServer@4c8a08ea
   [junit4]   2> 1980411 INFO  (TEST-HdfsRestartWhileUpdatingTest.test-seed#[1B990FFF714B6410]) [n:127.0.0.1:36572_c%2Fu    ] o.a.s.m.r.SolrJmxReporter JMX monitoring for 'solr.jvm' (registry 'solr.jvm') enabled at server: com.sun.jmx.mbeanserver.JmxMBeanServer@4c8a08ea
   [junit4]   2> 1980411 INFO  (TEST-HdfsRestartWhileUpdatingTest.test-seed#[1B990FFF714B6410]) [n:127.0.0.1:36572_c%2Fu    ] o.a.s.m.r.SolrJmxReporter JMX monitoring for 'solr.jetty' (registry 'solr.jetty') enabled at server: com.sun.jmx.mbeanserver.JmxMBeanServer@4c8a08ea
   [junit4]   2> 1980412 INFO  (TEST-HdfsRestartWhileUpdatingTest.test-seed#[1B990FFF714B6410]) [n:127.0.0.1:36572_c%2Fu    ] o.a.s.c.CorePropertiesLocator Found 0 core definitions underneath /x1/jenkins/jenkins-slave/workspace/Lucene-Solr-BadApples-NightlyTests-master/checkout/solr/build/solr-core/test/J1/temp/solr.cloud.hdfs.HdfsRestartWhileUpdatingTest_1B990FFF714B6410-001/control-001/cores
   [junit4]   2> 1980452 INFO  (zkConnectionManagerCallback-4685-thread-1) [    ] o.a.s.c.c.ConnectionManager zkClient has connected
   [junit4]   2> 1980454 INFO  (TEST-HdfsRestartWhileUpdatingTest.test-seed#[1B990FFF714B6410]) [    ] o.a.s.c.c.ZkStateReader Updated live nodes from ZooKeeper... (0) -> (1)
   [junit4]   2> 1980455 INFO  (TEST-HdfsRestartWhileUpdatingTest.test-seed#[1B990FFF714B6410]) [    ] o.a.s.c.s.i.ZkClientClusterStateProvider Cluster at 127.0.0.1:40686/solr ready
   [junit4]   2> 1980479 INFO  (qtp495006951-63416) [n:127.0.0.1:36572_c%2Fu    ] o.a.s.h.a.CollectionsHandler Invoked Collection Action :create with params collection.configName=conf1&name=control_collection&nrtReplicas=1&action=CREATE&numShards=1&createNodeSet=127.0.0.1:36572_c%252Fu&wt=javabin&version=2 and sendToOCPQueue=true
   [junit4]   2> 1980486 INFO  (OverseerThreadFactory-4786-thread-1-processing-n:127.0.0.1:36572_c%2Fu) [n:127.0.0.1:36572_c%2Fu    ] o.a.s.c.a.c.CreateCollectionCmd Create collection control_collection
   [junit4]   2> 1980598 INFO  (qtp495006951-63415) [n:127.0.0.1:36572_c%2Fu    ] o.a.s.s.HttpSolrCall [admin] webapp=null path=/admin/metrics params={prefix=CONTAINER.fs.usableSpace,CONTAINER.fs.totalSpace,CORE.coreName&wt=javabin&version=2&group=solr.node,solr.core} status=0 QTime=0
   [junit4]   2> 1980599 INFO  (qtp495006951-63412) [n:127.0.0.1:36572_c%2Fu    ] o.a.s.s.HttpSolrCall [admin] webapp=null path=/admin/metrics params={prefix=CONTAINER.fs.usableSpace,CONTAINER.fs.totalSpace,CORE.coreName&wt=javabin&version=2&group=solr.node,solr.core} status=0 QTime=0
   [junit4]   2> 1980600 INFO  (qtp495006951-63413) [n:127.0.0.1:36572_c%2Fu    ] o.a.s.s.HttpSolrCall [admin] webapp=null path=/admin/metrics params={prefix=CONTAINER.fs.usableSpace,CONTAINER.fs.totalSpace,CORE.coreName&wt=javabin&version=2&group=solr.node,solr.core} status=0 QTime=0
   [junit4]   2> 1980600 INFO  (qtp495006951-63414) [n:127.0.0.1:36572_c%2Fu    ] o.a.s.s.HttpSolrCall [admin] webapp=null path=/admin/metrics params={prefix=CONTAINER.fs.usableSpace,CONTAINER.fs.totalSpace,CORE.coreName&wt=javabin&version=2&group=solr.node,solr.core} status=0 QTime=0
   [junit4]   2> 1980601 INFO  (qtp495006951-63415) [n:127.0.0.1:36572_c%2Fu    ] o.a.s.s.HttpSolrCall [admin] webapp=null path=/admin/metrics params={prefix=CONTAINER.fs.usableSpace,CONTAINER.fs.totalSpace,CORE.coreName&wt=javabin&version=2&group=solr.node,solr.core} status=0 QTime=0
   [junit4]   2> 1980611 INFO  (qtp495006951-63412) [n:127.0.0.1:36572_c%2Fu    x:control_collection_shard1_replica_n1] o.a.s.h.a.CoreAdminOperation core create command qt=/admin/cores&collection.configName=conf1&newCollection=true&name=control_collection_shard1_replica_n1&action=CREATE&numShards=1&collection=control_collection&shard=shard1&wt=javabin&version=2&replicaType=NRT
   [junit4]   2> 1980612 INFO  (qtp495006951-63412) [n:127.0.0.1:36572_c%2Fu    x:control_collection_shard1_replica_n1] o.a.s.c.TransientSolrCoreCacheDefault Allocating transient cache for 4 transient cores
   [junit4]   2> 1981639 INFO  (qtp495006951-63412) [n:127.0.0.1:36572_c%2Fu c:control_collection s:shard1  x:control_collection_shard1_replica_n1] o.a.s.c.SolrConfig Using Lucene MatchVersion: 9.0.0
   [junit4]   2> 1981657 INFO  (qtp495006951-63412) [n:127.0.0.1:36572_c%2Fu c:control_collection s:shard1  x:control_collection_shard1_replica_n1] o.a.s.s.IndexSchema [control_collection_shard1_replica_n1] Schema name=test
   [junit4]   2> 1981760 INFO  (qtp495006951-63412) [n:127.0.0.1:36572_c%2Fu c:control_collection s:shard1  x:control_collection_shard1_replica_n1] o.a.s.s.IndexSchema Loaded schema test/1.6 with uniqueid field id
   [junit4]   2> 1981782 INFO  (qtp495006951-63412) [n:127.0.0.1:36572_c%2Fu c:control_collection s:shard1  x:control_collection_shard1_replica_n1] o.a.s.c.CoreContainer Creating SolrCore 'control_collection_shard1_replica_n1' using configuration from collection control_collection, trusted=true
   [junit4]   2> 1981783 INFO  (qtp495006951-63412) [n:127.0.0.1:36572_c%2Fu c:control_collection s:shard1  x:control_collection_shard1_replica_n1] o.a.s.m.r.SolrJmxReporter JMX monitoring for 'solr.core.control_collection.shard1.replica_n1' (registry 'solr.core.control_collection.shard1.replica_n1') enabled at server: com.sun.jmx.mbeanserver.JmxMBeanServer@4c8a08ea
   [junit4]   2> 1981783 INFO  (qtp495006951-63412) [n:127.0.0.1:36572_c%2Fu c:control_collection s:shard1  x:control_collection_shard1_replica_n1] o.a.s.c.SolrCore [[control_collection_shard1_replica_n1] ] Opening new SolrCore at [/x1/jenkins/jenkins-slave/workspace/Lucene-Solr-BadApples-NightlyTests-master/checkout/solr/build/solr-core/test/J1/temp/solr.cloud.hdfs.HdfsRestartWhileUpdatingTest_1B990FFF714B6410-001/control-001/cores/control_collection_shard1_replica_n1], dataDir=[/x1/jenkins/jenkins-slave/workspace/Lucene-Solr-BadApples-NightlyTests-master/checkout/solr/build/solr-core/test/J1/temp/solr.cloud.hdfs.HdfsRestartWhileUpdatingTest_1B990FFF714B6410-001/control-001/cores/control_collection_shard1_replica_n1/data/]
   [junit4]   2> 1981788 INFO  (qtp495006951-63412) [n:127.0.0.1:36572_c%2Fu c:control_collection s:shard1  x:control_collection_shard1_replica_n1] o.a.s.u.RandomMergePolicy RandomMergePolicy wrapping class org.apache.lucene.index.TieredMergePolicy: [TieredMergePolicy: maxMergeAtOnce=19, maxMergeAtOnceExplicit=41, maxMergedSegmentMB=97.541015625, floorSegmentMB=1.357421875, forceMergeDeletesPctAllowed=11.115188937090268, segmentsPerTier=12.0, maxCFSSegmentSizeMB=8.796093022207999E12, noCFSRatio=0.5987367564478258, deletesPctAllowed=33.419722422116344
   [junit4]   2> 1981799 WARN  (qtp495006951-63412) [n:127.0.0.1:36572_c%2Fu c:control_collection s:shard1  x:control_collection_shard1_replica_n1] o.a.s.c.RequestHandlers INVALID paramSet a in requestHandler {type = requestHandler,name = /dump,class = DumpRequestHandler,attributes = {initParams=a, name=/dump, class=DumpRequestHandler},args = {defaults={a=A,b=B}}}
   [junit4]   2> 1981886 INFO  (qtp495006951-63412) [n:127.0.0.1:36572_c%2Fu c:control_collection s:shard1  x:control_collection_shard1_replica_n1] o.a.s.u.UpdateHandler Using UpdateLog implementation: org.apache.solr.update.UpdateLog
   [junit4]   2> 1981886 INFO  (qtp495006951-63412) [n:127.0.0.1:36572_c%2Fu c:control_collection s:shard1  x:control_collection_shard1_replica_n1] o.a.s.u.UpdateLog Initializing UpdateLog: dataDir= defaultSyncLevel=FLUSH numRecordsToKeep=100 maxNumLogsToKeep=10 numVersionBuckets=65536
   [junit4]   2> 1981890 INFO  (qtp495006951-63412) [n:127.0.0.1:36572_c%2Fu c:control_collection s:shard1  x:control_collection_shard1_replica_n1] o.a.s.u.CommitTracker Hard AutoCommit: if uncommitted for 30000ms; 
   [junit4]   2> 1981890 INFO  (qtp495006951-63412) [n:127.0.0.1:36572_c%2Fu c:control_collection s:shard1  x:control_collection_shard1_replica_n1] o.a.s.u.CommitTracker Soft AutoCommit: if uncommitted for 3000ms; 
   [junit4]   2> 1981892 INFO  (qtp495006951-63412) [n:127.0.0.1:36572_c%2Fu c:control_collection s:shard1  x:control_collection_shard1_replica_n1] o.a.s.u.RandomMergePolicy RandomMergePolicy wrapping class org.apache.lucene.index.LogByteSizeMergePolicy: [LogByteSizeMergePolicy: minMergeSize=1677721, mergeFactor=8, maxMergeSize=2147483648, maxMergeSizeForForcedMerge=9223372036854775807, calibrateSizeByDeletes=true, maxMergeDocs=2147483647, maxCFSSegmentSizeMB=8.796093022207999E12, noCFSRatio=0.17040485074340178]
   [junit4]   2> 1981893 INFO  (qtp495006951-63412) [n:127.0.0.1:36572_c%2Fu c:control_collection s:shard1  x:control_collection_shard1_replica_n1] o.a.s.s.SolrIndexSearcher Opening [Searcher@bfb0c30[control_collection_shard1_replica_n1] main]
   [junit4]   2> 1981894 INFO  (qtp495006951-63412) [n:127.0.0.1:36572_c%2Fu c:control_collection s:shard1  x:control_collection_shard1_replica_n1] o.a.s.r.ManagedResourceStorage Configured ZooKeeperStorageIO with znodeBase: /configs/conf1
   [junit4]   2> 1981895 INFO  (qtp495006951-63412) [n:127.0.0.1:36572_c%2Fu c:control_collection s:shard1  x:control_collection_shard1_replica_n1] o.a.s.r.ManagedResourceStorage Loaded null at path _rest_managed.json using ZooKeeperStorageIO:path=/configs/conf1
   [junit4]   2> 1981896 INFO  (qtp495006951-63412) [n:127.0.0.1:36572_c%2Fu c:control_collection s:shard1  x:control_collection_shard1_replica_n1] o.a.s.h.ReplicationHandler Commits will be reserved for 10000ms.
   [junit4]   2> 1981896 INFO  (qtp495006951-63412) [n:127.0.0.1:36572_c%2Fu c:control_collection s:shard1  x:control_collection_shard1_replica_n1] o.a.s.u.UpdateLog Could not find max version in index or recent updates, using new clock 1623104269714456576
   [junit4]   2> 1981900 INFO  (searcherExecutor-4791-thread-1-processing-n:127.0.0.1:36572_c%2Fu x:control_collection_shard1_replica_n1 c:control_collection s:shard1) [n:127.0.0.1:36572_c%2Fu c:control_collection s:shard1  x:control_collection_shard1_replica_n1] o.a.s.c.SolrCore [control_collection_shard1_replica_n1] Registered new searcher Searcher@bfb0c30[control_collection_shard1_replica_n1] main{ExitableDirectoryReader(UninvertingDirectoryReader())}
   [junit4]   2> 1981908 INFO  (qtp495006951-63412) [n:127.0.0.1:36572_c%2Fu c:control_collection s:shard1  x:control_collection_shard1_replica_n1] o.a.s.c.ZkShardTerms Successful update of terms at /collections/control_collection/terms/shard1 to Terms{values={core_node2=0}, version=0}
   [junit4]   2> 1981908 INFO  (qtp495006951-63412) [n:127.0.0.1:36572_c%2Fu c:control_collection s:shard1  x:control_collection_shard1_replica_n1] o.a.s.c.ShardLeaderElectionContextBase make sure parent is created /collections/control_collection/leaders/shard1
   [junit4]   2> 1981912 INFO  (qtp495006951-63412) [n:127.0.0.1:36572_c%2Fu c:control_collection s:shard1  x:control_collection_shard1_replica_n1] o.a.s.c.ShardLeaderElectionContext Enough replicas found to continue.
   [junit4]   2> 1981912 INFO  (qtp495006951-63412) [n:127.0.0.1:36572_c%2Fu c:control_collection s:shard1  x:control_collection_shard1_replica_n1] o.a.s.c.ShardLeaderElectionContext I may be the new leader - try and sync
   [junit4]   2> 1981912 INFO  (qtp495006951-63412) [n:127.0.0.1:36572_c%2Fu c:control_collection s:shard1  x:control_collection_shard1_replica_n1] o.a.s.c.SyncStrategy Sync replicas to https://127.0.0.1:36572/c/u/control_collection_shard1_replica_n1/
   [junit4]   2> 1981913 INFO  (qtp495006951-63412) [n:127.0.0.1:36572_c%2Fu c:control_collection s:shard1  x:control_collection_shard1_replica_n1] o.a.s.c.SyncStrategy Sync Success - now sync replicas to me
   [junit4]   2> 1981913 INFO  (qtp495006951-63412) [n:127.0.0.1:36572_c%2Fu c:control_collection s:shard1  x:control_collection_shard1_replica_n1] o.a.s.c.SyncStrategy https://127.0.0.1:36572/c/u/control_collection_shard1_replica_n1/ has no replicas
   [junit4]   2> 1981913 INFO  (qtp495006951-63412) [n:127.0.0.1:36572_c%2Fu c:control_collection s:shard1  x:control_collection_shard1_replica_n1] o.a.s.c.ShardLeaderElectionContextBase Creating leader registration node /collections/control_collection/leaders/shard1/leader after winning as /collections/control_collection/leader_elect/shard1/election/72650538903797765-core_node2-n_0000000000
   [junit4]   2> 1981916 INFO  (qtp495006951-63412) [n:127.0.0.1:36572_c%2Fu c:control_collection s:shard1  x:control_collection_shard1_replica_n1] o.a.s.c.ShardLeaderElectionContext I am the new leader: https://127.0.0.1:36572/c/u/control_collection_shard1_replica_n1/ shard1
   [junit4]   2> 1982018 INFO  (zkCallback-4671-thread-1) [    ] o.a.s.c.c.ZkStateReader A cluster state change: [WatchedEvent state:SyncConnected type:NodeDataChanged path:/collections/control_collection/state.json] for collection [control_collection] has occurred - updating... (live nodes size: [1])
   [junit4]   2> 1982018 INFO  (zkCallback-4671-thread-2) [    ] o.a.s.c.c.ZkStateReader A cluster state change: [WatchedEvent state:SyncConnected type:NodeDataChanged path:/collections/control_collection/state.json] for collection [control_collection] has occurred - updating... (live nodes size: [1])
   [junit4]   2> 1982021 INFO  (qtp495006951-63412) [n:127.0.0.1:36572_c%2Fu c:control_collection s:shard1  x:control_collection_shard1_replica_n1] o.a.s.c.ZkController I am the leader, no recovery necessary
   [junit4]   2> 1982025 INFO  (qtp495006951-63412) [n:127.0.0.1:36572_c%2Fu c:control_collection s:shard1  x:control_collection_shard1_replica_n1] o.a.s.s.HttpSolrCall [admin] webapp=null path=/admin/cores params={qt=/admin/cores&collection.configName=conf1&newCollection=true&name=control_collection_shard1_replica_n1&action=CREATE&numShards=1&collection=control_collection&shard=shard1&wt=javabin&version=2&replicaType=NRT} status=0 QTime=1413
   [junit4]   2> 1982029 INFO  (qtp495006951-63416) [n:127.0.0.1:36572_c%2Fu    ] o.a.s.h.a.CollectionsHandler Wait for new collection to be active for at most 45 seconds. Check all shard replicas
   [junit4]   2> 1982125 INFO  (zkCallback-4671-thread-2) [    ] o.a.s.c.c.ZkStateReader A cluster state change: [WatchedEvent state:SyncConnected type:NodeDataChanged path:/collections/control_collection/state.json] for collection [control_collection] has occurred - updating... (live nodes size: [1])
   [junit4]   2> 1982125 INFO  (zkCallback-4671-thread-3) [    ] o.a.s.c.c.ZkStateReader A cluster state change: [WatchedEvent state:SyncConnected type:NodeDataChanged path:/collections/control_collection/state.json] for collection [control_collection] has occurred - updating... (live nodes size: [1])
   [junit4]   2> 1982125 INFO  (zkCallback-4671-thread-1) [    ] o.a.s.c.c.ZkStateReader A cluster state change: [WatchedEvent state:SyncConnected type:NodeDataChanged path:/collections/control_collection/state.json] for collection [control_collection] has occurred - updating... (live nodes size: [1])
   [junit4]   2> 1982126 INFO  (qtp495006951-63416) [n:127.0.0.1:36572_c%2Fu    ] o.a.s.s.HttpSolrCall [admin] webapp=null path=/admin/collections params={collection.configName=conf1&name=control_collection&nrtReplicas=1&action=CREATE&numShards=1&createNodeSet=127.0.0.1:36572_c%252Fu&wt=javabin&version=2} status=0 QTime=1647
   [junit4]   2> 1982133 INFO  (zkConnectionManagerCallback-4691-thread-1) [    ] o.a.s.c.c.ConnectionManager zkClient has connected
   [junit4]   2> 1982135 INFO  (TEST-HdfsRestartWhileUpdatingTest.test-seed#[1B990FFF714B6410]) [    ] o.a.s.c.c.ZkStateReader Updated live nodes from ZooKeeper... (0) -> (1)
   [junit4]   2> 1982136 INFO  (TEST-HdfsRestartWhileUpdatingTest.test-seed#[1B990FFF714B6410]) [    ] o.a.s.c.s.i.ZkClientClusterStateProvider Cluster at 127.0.0.1:40686/solr ready
   [junit4]   2> 1982136 INFO  (TEST-HdfsRestartWhileUpdatingTest.test-seed#[1B990FFF714B6410]) [    ] o.a.s.c.ChaosMonkey monkey: init - expire sessions:false cause connection loss:false
   [junit4]   2> 1982139 INFO  (qtp495006951-63416) [n:127.0.0.1:36572_c%2Fu    ] o.a.s.h.a.CollectionsHandler Invoked Collection Action :create with params collection.configName=conf1&name=collection1&nrtReplicas=1&action=CREATE&numShards=1&createNodeSet=&stateFormat=1&wt=javabin&version=2 and sendToOCPQueue=true
   [junit4]   2> 1982142 INFO  (OverseerThreadFactory-4786-thread-2-processing-n:127.0.0.1:36572_c%2Fu) [n:127.0.0.1:36572_c%2Fu    ] o.a.s.c.a.c.CreateCollectionCmd Create collection collection1
   [junit4]   2> 1982143 INFO  (OverseerCollectionConfigSetProcessor-72650538903797765-127.0.0.1:36572_c%2Fu-n_0000000000) [n:127.0.0.1:36572_c%2Fu    ] o.a.s.c.OverseerTaskQueue Response ZK path: /overseer/collection-queue-work/qnr-0000000000 doesn't exist.  Requestor may have disconnected from ZooKeeper
   [junit4]   2> 1982346 WARN  (OverseerThreadFactory-4786-thread-2-processing-n:127.0.0.1:36572_c%2Fu) [n:127.0.0.1:36572_c%2Fu    ] o.a.s.c.a.c.CreateCollectionCmd It is unusual to create a collection (collection1) without cores.
   [junit4]   2> 1982349 INFO  (qtp495006951-63416) [n:127.0.0.1:36572_c%2Fu    ] o.a.s.h.a.CollectionsHandler Wait for new collection to be active for at most 45 seconds. Check all shard replicas
   [junit4]   2> 1982350 INFO  (qtp495006951-63416) [n:127.0.0.1:36572_c%2Fu    ] o.a.s.s.HttpSolrCall [admin] webapp=null path=/admin/collections params={collection.configName=conf1&name=collection1&nrtReplicas=1&action=CREATE&numShards=1&createNodeSet=&stateFormat=1&wt=javabin&version=2} status=0 QTime=211
   [junit4]   2> 1982352 INFO  (TEST-HdfsRestartWhileUpdatingTest.test-seed#[1B990FFF714B6410]) [    ] o.a.s.c.AbstractFullDistribZkTestBase Creating jetty instances pullReplicaCount=0 numOtherReplicas=3
   [junit4]   2> 1982570 INFO  (TEST-HdfsRestartWhileUpdatingTest.test-seed#[1B990FFF714B6410]) [    ] o.a.s.c.AbstractFullDistribZkTestBase create jetty 1 in directory /x1/jenkins/jenkins-slave/workspace/Lucene-Solr-BadApples-NightlyTests-master/checkout/solr/build/solr-core/test/J1/temp/solr.cloud.hdfs.HdfsRestartWhileUpdatingTest_1B990FFF714B6410-001/shard-1-001 of type NRT
   [junit4]   2> 1982578 WARN  (closeThreadPool-4692-thread-1) [    ] o.e.j.s.AbstractConnector Ignoring deprecated socket close linger time
   [junit4]   2> 1982578 INFO  (closeThreadPool-4692-thread-1) [    ] o.a.s.c.s.e.JettySolrRunner Start Jetty (original configured port=0)
   [junit4]   2> 1982578 INFO  (closeThreadPool-4692-thread-1) [    ] o.a.s.c.s.e.JettySolrRunner Trying to start Jetty on port 0 try number 1 ...
   [junit4]   2> 1982578 INFO  (closeThreadPool-4692-thread-1) [    ] o.e.j.s.Server jetty-9.4.14.v20181114; built: 2018-11-14T21:20:31.478Z; git: c4550056e785fb5665914545889f21dc136ad9e6; jvm 1.8.0_191-b12
   [junit4]   2> 1982579 INFO  (closeThreadPool-4692-thread-1) [    ] o.e.j.s.session DefaultSessionIdManager workerName=node0
   [junit4]   2> 1982579 INFO  (closeThreadPool-4692-thread-1) [    ] o.e.j.s.session No SessionScavenger set, using defaults
   [junit4]   2> 1982579 INFO  (closeThreadPool-4692-thread-1) [    ] o.e.j.s.session node0 Scavenging every 600000ms
   [junit4]   2> 1982580 INFO  (closeThreadPool-4692-thread-1) [    ] o.e.j.s.h.ContextHandler Started o.e.j.s.ServletContextHandler@2fe06f73{/c/u,null,AVAILABLE}
   [junit4]   2> 1982580 WARN  (closeThreadPool-4692-thread-1) [    ] o.e.j.u.s.S.config No Client EndPointIdentificationAlgorithm configured for SslContextFactory@3a1a47a6[provider=null,keyStore=null,trustStore=null]
   [junit4]   2> 1982581 INFO  (closeThreadPool-4692-thread-1) [    ] o.e.j.s.AbstractConnector Started ServerConnector@46541373{SSL,[ssl, http/1.1]}{127.0.0.1:35515}
   [junit4]   2> 1982581 INFO  (closeThreadPool-4692-thread-1) [    ] o.e.j.s.Server Started @1982647ms
   [junit4]   2> 1982581 INFO  (closeThreadPool-4692-thread-1) [    ] o.a.s.c.s.e.JettySolrRunner Jetty properties: {solr.data.dir=hdfs://localhost:42794/hdfs__localhost_42794__x1_jenkins_jenkins-slave_workspace_Lucene-Solr-BadApples-NightlyTests-master_checkout_solr_build_solr-core_test_J1_temp_solr.cloud.hdfs.HdfsRestartWhileUpdatingTest_1B990FFF714B6410-001_tempDir-002_jetty1, replicaType=NRT, solrconfig=solrconfig.xml, hostContext=/c/u, hostPort=35515, coreRootDirectory=/x1/jenkins/jenkins-slave/workspace/Lucene-Solr-BadApples-NightlyTests-master/checkout/solr/build/solr-core/test/J1/temp/solr.cloud.hdfs.HdfsRestartWhileUpdatingTest_1B990FFF714B6410-001/shard-1-001/cores}
   [junit4]   2> 1982581 ERROR (closeThreadPool-4692-thread-1) [    ] o.a.s.u.StartupLoggingUtils Missing Java Option solr.log.dir. Logging may be missing or incomplete.
   [junit4]   2> 1982581 INFO  (closeThreadPool-4692-thread-1) [    ] o.a.s.s.SolrDispatchFilter Using logger factory org.apache.logging.slf4j.Log4jLoggerFactory
   [junit4]   2> 1982581 INFO  (closeThreadPool-4692-thread-1) [    ] o.a.s.s.SolrDispatchFilter  ___      _       Welcome to Apache Solr? version 9.0.0
   [junit4]   2> 1982582 INFO  (closeThreadPool-4692-thread-1) [    ] o.a.s.s.SolrDispatchFilter / __| ___| |_ _   Starting in cloud mode on port null
   [junit4]   2> 1982582 INFO  (closeThreadPool-4692-thread-1) [    ] o.a.s.s.SolrDispatchFilter \__ \/ _ \ | '_|  Install dir: null
   [junit4]   2> 1982582 INFO  (closeThreadPool-4692-thread-1) [    ] o.a.s.s.SolrDispatchFilter |___/\___/_|_|    Start time: 2019-01-19T15:47:35.562Z
   [junit4]   2> 1982587 INFO  (zkConnectionManagerCallback-4694-thread-1) [    ] o.a.s.c.c.ConnectionManager zkClient has connected
   [junit4]   2> 1982588 INFO  (closeThreadPool-4692-thread-1) [    ] o.a.s.s.SolrDispatchFilter Loading solr.xml from SolrHome (not found in ZooKeeper)
   [junit4]   2> 1982588 INFO  (closeThreadPool-4692-thread-1) [    ] o.a.s.c.SolrXmlConfig Loading container configuration from /x1/jenkins/jenkins-slave/workspace/Lucene-Solr-BadApples-NightlyTests-master/checkout/solr/build/solr-core/test/J1/temp/solr.cloud.hdfs.HdfsRestartWhileUpdatingTest_1B990FFF714B6410-001/shard-1-001/solr.xml
   [junit4]   2> 1982593 INFO  (closeThreadPool-4692-thread-1) [    ] o.a.s.c.SolrXmlConfig Configuration parameter autoReplicaFailoverWorkLoopDelay is ignored
   [junit4]   2> 1982593 INFO  (closeThreadPool-4692-thread-1) [    ] o.a.s.c.SolrXmlConfig Configuration parameter autoReplicaFailoverBadNodeExpiration is ignored
   [junit4]   2> 1982595 INFO  (closeThreadPool-4692-thread-1) [    ] o.a.s.c.SolrXmlConfig MBean server found: com.sun.jmx.mbeanserver.JmxMBeanServer@4c8a08ea, but no JMX reporters were configured - adding default JMX reporter.
   [junit4]   2> 1982807 INFO  (TEST-HdfsRestartWhileUpdatingTest.test-seed#[1B990FFF714B6410]) [    ] o.a.s.c.AbstractFullDistribZkTestBase create jetty 2 in directory /x1/jenkins/jenkins-slave/workspace/Lucene-Solr-BadApples-NightlyTests-master/checkout/solr/build/solr-core/test/J1/temp/solr.cloud.hdfs.HdfsRestartWhileUpdatingTest_1B990FFF714B6410-001/shard-2-001 of type NRT
   [junit4]   2> 1982823 WARN  (closeThreadPool-4692-thread-2) [    ] o.e.j.s.AbstractConnector Ignoring deprecated socket close linger time
   [junit4]   2> 1982823 INFO  (closeThreadPool-4692-thread-2) [    ] o.a.s.c.s.e.JettySolrRunner Start Jetty (original configured port=0)
   [junit4]   2> 1982823 INFO  (closeThreadPool-4692-thread-2) [    ] o.a.s.c.s.e.JettySolrRunner Trying to start Jetty on port 0 try number 1 ...
   [junit4]   2> 1982823 INFO  (closeThreadPool-4692-thread-2) [    ] o.e.j.s.Server jetty-9.4.14.v20181114; built: 2018-11-14T21:20:31.478Z; git: c4550056e785fb5665914545889f21dc136ad9e6; jvm 1.8.0_191-b12
   [junit4]   2> 1982828 INFO  (closeThreadPool-4692-thread-2) [    ] o.e.j.s.session DefaultSessionIdManager workerName=node0
   [junit4]   2> 1982828 INFO  (closeThreadPool-4692-thread-2) [    ] o.e.j.s.session No SessionScavenger set, using defaults
   [junit4]   2> 1982828 INFO  (closeThreadPool-4692-thread-2) [    ] o.e.j.s.session node0 Scavenging every 660000ms
   [junit4]   2> 1982834 INFO  (closeThreadPool-4692-thread-2) [    ] o.e.j.s.h.ContextHandler Started o.e.j.s.ServletContextHandler@450cc04f{/c/u,null,AVAILABLE}
   [junit4]   2> 1982834 WARN  (closeThreadPool-4692-thread-2) [    ] o.e.j.u.s.S.config No Client EndPointIdentificationAlgorithm configured for SslContextFactory@f123e41[provider=null,keyStore=null,trustStore=null]
   [junit4]   2> 1982835 INFO  (closeThreadPool-4692-thread-2) [    ] o.e.j.s.AbstractConnector Started ServerConnector@67a2bc67{SSL,[ssl, http/1.1]}{127.0.0.1:32823}
   [junit4]   2> 1982835 INFO  (closeThreadPool-4692-thread-2) [    ] o.e.j.s.Server Started @1982901ms
   [junit4]   2> 1982835 INFO  (closeThreadPool-4692-thread-2) [    ] o.a.s.c.s.e.JettySolrRunner Jetty properties: {solr.data.dir=hdfs://localhost:42794/hdfs__localhost_42794__x1_jenkins_jenkins-slave_workspace_Lucene-Solr-BadApples-NightlyTests-master_checkout_solr_build_solr-core_test_J1_temp_solr.cloud.hdfs.HdfsRestartWhileUpdatingTest_1B990FFF714B6410-001_tempDir-002_jetty2, replicaType=NRT, solrconfig=solrconfig.xml, hostContext=/c/u, hostPort=32823, coreRootDirectory=/x1/jenkins/jenkins-slave/workspace/Lucene-Solr-BadApples-NightlyTests-master/checkout/solr/build/solr-core/test/J1/temp/solr.cloud.hdfs.HdfsRestartWhileUpdatingTest_1B990FFF714B6410-001/shard-2-001/cores}
   [junit4]   2> 1982835 ERROR (closeThreadPool-4692-thread-2) [    ] o.a.s.u.StartupLoggingUtils Missing Java Option solr.log.dir. Logging may be missing or incomplete.
   [junit4]   2> 1982835 INFO  (closeThreadPool-4692-thread-2) [    ] o.a.s.s.SolrDispatchFilter Using logger factory org.apache.logging.slf4j.Log4jLoggerFactory
   [junit4]   2> 1982836 INFO  (closeThreadPool-4692-thread-2) [    ] o.a.s.s.SolrDispatchFilter  ___      _       Welcome to Apache Solr? version 9.0.0
   [junit4]   2> 1982836 INFO  (closeThreadPool-4692-thread-2) [    ] o.a.s.s.SolrDispatchFilter / __| ___| |_ _   Starting in cloud mode on port null
   [junit4]   2> 1982836 INFO  (closeThreadPool-4692-thread-2) [    ] o.a.s.s.SolrDispatchFilter \__ \/ _ \ | '_|  Install dir: null
   [junit4]   2> 1982836 INFO  (closeThreadPool-4692-thread-2) [    ] o.a.s.s.SolrDispatchFilter |___/\___/_|_|    Start time: 2019-01-19T15:47:35.816Z
   [junit4]   2> 1982843 INFO  (zkConnectionManagerCallback-4696-thread-1) [    ] o.a.s.c.c.ConnectionManager zkClient has connected
   [junit4]   2> 1982845 INFO  (closeThreadPool-4692-thread-2) [    ] o.a.s.s.SolrDispatchFilter Loading solr.xml from SolrHome (not found in ZooKeeper)
   [junit4]   2> 1982845 INFO  (closeThreadPool-4692-thread-2) [    ] o.a.s.c.SolrXmlConfig Loading container configuration from /x1/jenkins/jenkins-slave/workspace/Lucene-Solr-BadApples-NightlyTests-master/checkout/solr/build/solr-core/test/J1/temp/solr.cloud.hdfs.HdfsRestartWhileUpdatingTest_1B990FFF714B6410-001/shard-2-001/solr.xml
   [junit4]   2> 1982850 INFO  (closeThreadPool-4692-thread-2) [    ] o.a.s.c.SolrXmlConfig Configuration parameter autoReplicaFailoverWorkLoopDelay is ignored
   [junit4]   2> 1982850 INFO  (closeThreadPool-4692-thread-2) [    ] o.a.s.c.SolrXmlConfig Configuration parameter autoReplicaFailoverBadNodeExpiration is ignored
   [junit4]   2> 1982852 INFO  (closeThreadPool-4692-thread-2) [    ] o.a.s.c.SolrXmlConfig MBean server found: com.sun.jmx.mbeanserver.JmxMBeanServer@4c8a08ea, but no JMX reporters were configured - adding default JMX reporter.
   [junit4]   2> 1983016 INFO  (closeThreadPool-4692-thread-2) [    ] o.a.s.h.c.HttpShardHandlerFactory Host whitelist initialized: WhitelistHostChecker [whitelistHosts=null, whitelistHostCheckingEnabled=false]
   [junit4]   2> 1983017 WARN  (closeThreadPool-4692-thread-2) [    ] o.a.s.c.s.i.Http2SolrClient Create Http2SolrClient with HTTP/1.1 transport since Java 8 or lower versions does not support SSL + HTTP/2
   [junit4]   2> 1983018 WARN  (closeThreadPool-4692-thread-2) [    ] o.e.j.u.s.S.config No Client EndPointIdentificationAlgorithm configured for SslContextFactory@4d787a4d[provider=null,keyStore=null,trustStore=null]
   [junit4]   2> 1983022 WARN  (closeThreadPool-4692-thread-2) [    ] o.a.s.c.s.i.Http2SolrClient Create Http2SolrClient with HTTP/1.1 transport since Java 8 or lower versions does not support SSL + HTTP/2
   [junit4]   2> 1983023 WARN  (closeThreadPool-4692-thread-2) [    ] o.e.j.u.s.S.config No Client EndPointIdentificationAlgorithm configured for SslContextFactory@7c0ad810[provider=null,keyStore=null,trustStore=null]
   [junit4]   2> 1983025 INFO  (closeThreadPool-4692-thread-2) [    ] o.a.s.c.ZkContainer Zookeeper client=127.0.0.1:40686/solr
   [junit4]   2> 1983026 INFO  (zkConnectionManagerCallback-4702-thread-1) [    ] o.a.s.c.c.ConnectionManager zkClient has connected
   [junit4]   2> 1983029 INFO  (zkConnectionManagerCallback-4704-thread-1) [    ] o.a.s.c.c.ConnectionManager zkClient has connected
   [junit4]   2> 1983036 INFO  (closeThreadPool-4692-thread-2) [n:127.0.0.1:32823_c%2Fu    ] o.a.s.c.c.ZkStateReader Updated live nodes from ZooKeeper... (0) -> (1)
   [junit4]   2> 1983042 INFO  (closeThreadPool-4692-thread-2) [n:127.0.0.1:32823_c%2Fu    ] o.a.s.c.ZkController Publish node=127.0.0.1:32823_c%2Fu as DOWN
   [junit4]   2> 1983044 INFO  (closeThreadPool-4692-thread-2) [n:127.0.0.1:32823_c%2Fu    ] o.a.s.c.TransientSolrCoreCacheDefault Allocating transient cache for 4 transient cores
   [junit4]   2> 1983044 INFO  (closeThreadPool-4692-thread-2) [n:127.0.0.1:32823_c%2Fu    ] o.a.s.c.ZkController Register node as live in ZooKeeper:/live_nodes/127.0.0.1:32823_c%2Fu
   [junit4]   2> 1983046 INFO  (zkCallback-4690-thread-1) [    ] o.a.s.c.c.ZkStateReader Updated live nodes from ZooKeeper... (1) -> (2)
   [junit4]   2> 1983046 INFO  (zkCallback-4671-thread-4) [    ] o.a.s.c.c.ZkStateReader Updated live nodes from ZooKeeper... (1) -> (2)
   [junit4]   2> 1983046 INFO  (zkCallback-4678-thread-1) [    ] o.a.s.c.c.ZkStateReader Updated live nodes from ZooKeeper... (1) -> (2)
   [junit4]   2> 1983047 INFO  (zkCallback-4703-thread-1) [    ] o.a.s.c.c.ZkStateReader Updated live nodes from ZooKeeper... (1) -> (2)
   [junit4]   2> 1983067 INFO  (closeThreadPool-4692-thread-1) [    ] o.a.s.h.c.HttpShardHandlerFactory Host whitelist initialized: WhitelistHostChecker [whitelistHosts=null, whitelistHostCheckingEnabled=false]
   [junit4]   2> 1983068 WARN  (closeThreadPool-4692-thread-1) [    ] o.a.s.c.s.i.Http2SolrClient Create Http2SolrClient with HTTP/1.1 transport since Java 8 or lower versions does not support SSL + HTTP/2
   [junit4]   2> 1983081 WARN  (closeThreadPool-4692-thread-1) [    ] o.e.j.u.s.S.config No Client EndPointIdentificationAlgorithm configured for SslContextFactory@17261b11[provider=null,keyStore=null,trustStore=null]
   [junit4]   2> 1983087 WARN  (closeThreadPool-4692-thread-1) [    ] o.a.s.c.s.i.Http2SolrClient Create Http2SolrClient with HTTP/1.1 transport since Java 8 or lower versions does not support SSL + HTTP/2
   [junit4]   2> 1983088 WARN  (closeThreadPool-4692-thread-1) [    ] o.e.j.u.s.S.config No Client EndPointIdentificationAlgorithm configured for SslContextFactory@7b99b734[provider=null,keyStore=null,trustStore=null]
   [junit4]   2> 1983089 INFO  (closeThreadPool-4692-thread-1) [    ] o.a.s.c.ZkContainer Zookeeper client=127.0.0.1:40686/solr
   [junit4]   2> 1983093 INFO  (zkConnectionManagerCallback-4712-thread-1) [    ] o.a.s.c.c.ConnectionManager zkClient has connected
   [junit4]   2> 1983093 INFO  (zkConnectionManagerCallback-4717-thread-1) [    ] o.a.s.c.c.ConnectionManager zkClient has connected
   [junit4]   2> 1983096 INFO  (closeThreadPool-4692-thread-2) [n:127.0.0.1:32823_c%2Fu    ] o.a.s.c.c.ZkStateReader Updated live nodes from ZooKeeper... (0) -> (2)
   [junit4]   2> 1983096 INFO  (zkConnectionManagerCallback-4719-thread-1) [    ] o.a.s.c.c.ConnectionManager zkClient has connected
   [junit4]   2> 1983102 INFO  (closeThreadPool-4692-thread-2) [n:127.0.0.1:32823_c%2Fu    ] o.a.s.c.s.i.ZkClientClusterStateProvider Cluster at 127.0.0.1:40686/solr ready
   [junit4]   2> 1983103 INFO  (closeThreadPool-4692-thread-2) [n:127.0.0.1:32823_c%2Fu    ] o.a.s.h.a.MetricsHistoryHandler No .system collection, keeping metrics history in memory.
   [junit4]   2> 1983113 INFO  (closeThreadPool-4692-thread-1) [n:127.0.0.1:35515_c%2Fu    ] o.a.s.c.c.ZkStateReader Updated live nodes from ZooKeeper... (0) -> (2)
   [junit4]   2> 1983118 INFO  (closeThreadPool-4692-thread-1) [n:127.0.0.1:35515_c%2Fu    ] o.a.s.c.ZkController Publish node=127.0.0.1:35515_c%2Fu as DOWN
   [junit4]   2> 1983119 INFO  (closeThreadPool-4692-thread-1) [n:127.0.0.1:35515_c%2Fu    ] o.a.s.c.TransientSolrCoreCacheDefault Allocating transient cache for 4 transient cores
   [junit4]   2> 1983119 INFO  (closeThreadPool-4692-thread-1) [n:127.0.0.1:35515_c%2Fu    ] o.a.s.c.ZkController Register node as live in ZooKeeper:/live_nodes/127.0.0.1:35515_c%2Fu
   [junit4]   2> 1983121 INFO  (zkCallback-4678-thread-1) [    ] o.a.s.c.c.ZkStateReader Updated live nodes from ZooKeeper... (2) -> (3)
   [junit4]   2> 1983121 INFO  (zkCallback-4703-thread-1) [    ] o.a.s.c.c.ZkStateReader Updated live nodes from ZooKeeper... (2) -> (3)
   [junit4]   2> 1983121 INFO  (zkCallback-4690-thread-1) [    ] o.a.s.c.c.ZkStateReader Updated live nodes from ZooKeeper... (2) -> (3)
   [junit4]   2> 1983121 INFO  (zkCallback-4671-thread-4) [    ] o.a.s.c.c.ZkStateReader Updated live nodes from ZooKeeper... (2) -> (3)
   [junit4]   2> 1983128 INFO  (zkCallback-4718-thread-1) [    ] o.a.s.c.c.ZkStateReader Updated live nodes from ZooKeeper... (2) -> (3)
   [junit4]   2> 1983129 INFO  (zkCallback-4716-thread-1) [    ] o.a.s.c.c.ZkStateReader Updated live nodes from ZooKeeper... (2) -> (3)
   [junit4]   2> 1983160 INFO  (closeThreadPool-4692-thread-2) [n:127.0.0.1:32823_c%2Fu    ] o.a.s.m.r.SolrJmxReporter JMX monitoring for 'solr.node' (registry 'solr.node') enabled at server: com.sun.jmx.mbeanserver.JmxMBeanServer@4c8a08ea
   [junit4]   2> 1983166 INFO  (zkConnectionManagerCallback-4727-thread-1) [    ] o.a.s.c.c.ConnectionManager zkClient has connected
   [junit4]   2> 1983166 INFO  (TEST-HdfsRestartWhileUpdatingTest.test-seed#[1B990FFF714B6410]) [    ] o.a.s.c.AbstractFullDistribZkTestBase create jetty 3 in directory /x1/jenkins/jenkins-slave/workspace/Lucene-Solr-BadApples-NightlyTests-master/checkout/solr/build/solr-core/test/J1/temp/solr.cloud.hdfs.HdfsRestartWhileUpdatingTest_1B990FFF714B6410-001/shard-3-001 of type NRT
   [junit4]   2> 1983167 INFO  (closeThreadPool-4692-thread-1) [n:127.0.0.1:35515_c%2Fu    ] o.a.s.c.c.ZkStateReader Updated live nodes from ZooKeeper... (0) -> (3)
   [junit4]   2> 1983168 WARN  (closeThreadPool-4692-thread-3) [    ] o.e.j.s.AbstractConnector Ignoring deprecated socket close linger time
   [junit4]   2> 1983170 INFO  (closeThreadPool-4692-thread-3) [    ] o.a.s.c.s.e.JettySolrRunner Start Jetty (original configured port=0)
   [junit4]   2> 1983170 INFO  (closeThreadPool-4692-thread-3) [    ] o.a.s.c.s.e.JettySolrRunner Trying to start Jetty on port 0 try number 1 ...
   [junit4]   2> 1983170 INFO  (closeThreadPool-4692-thread-3) [    ] o.e.j.s.Server jetty-9.4.14.v20181114; built: 2018-11-14T21:20:31.478Z; git: c4550056e785fb5665914545889f21dc136ad9e6; jvm 1.8.0_191-b12
   [junit4]   2> 1983171 INFO  (closeThreadPool-4692-thread-1) [n:127.0.0.1:35515_c%2Fu    ] o.a.s.c.s.i.ZkClientClusterStateProvider Cluster at 127.0.0.1:40686/solr ready
   [junit4]   2> 1983172 INFO  (closeThreadPool-4692-thread-3) [    ] o.e.j.s.session DefaultSessionIdManager workerName=node0
   [junit4]   2> 1983172 INFO  (closeThreadPool-4692-thread-3) [    ] o.e.j.s.session No SessionScavenger set, using defaults
   [junit4]   2> 1983172 INFO  (closeThreadPool-4692-thread-3) [    ] o.e.j.s.session node0 Scavenging every 660000ms
   [junit4]   2> 1983172 INFO  (closeThreadPool-4692-thread-3) [    ] o.e.j.s.h.ContextHandler Started o.e.j.s.ServletContextHandler@64549b03{/c/u,null,AVAILABLE}
   [junit4]   2> 1983173 WARN  (closeThreadPool-4692-thread-3) [    ] o.e.j.u.s.S.config No Client EndPointIdentificationAlgorithm configured for SslContextFactory@1aeb2eb[provider=null,keyStore=null,trustStore=null]
   [junit4]   2> 1983173 INFO  (closeThreadPool-4692-thread-3) [    ] o.e.j.s.AbstractConnector Started ServerConnector@10b373c5{SSL,[ssl, http/1.1]}{127.0.0.1:41111}
   [junit4]   2> 1983173 INFO  (closeThreadPool-4692-thread-3) [    ] o.e.j.s.Server Started @1983240ms
   [junit4]   2> 1983173 INFO  (closeThreadPool-4692-thread-3) [    ] o.a.s.c.s.e.JettySolrRunner Jetty properties: {solr.data.dir=hdfs://localhost:42794/hdfs__localhost_42794__x1_jenkins_jenkins-slave_workspace_Lucene-Solr-BadApples-NightlyTests-master_checkout_solr_build_solr-core_test_J1_temp_solr.cloud.hdfs.HdfsRestartWhileUpdatingTest_1B990FFF714B6410-001_tempDir-002_jetty3, replicaType=NRT, solrconfig=solrconfig.xml, hostContext=/c/u, hostPort=41111, coreRootDirectory=/x1/jenkins/jenkins-slave/workspace/Lucene-Solr-BadApples-NightlyTests-master/checkout/solr/build/solr-core/test/J1/temp/solr.cloud.hdfs.HdfsRestartWhileUpdatingTest_1B990FFF714B6410-001/shard-3-001/cores}
   [junit4]   2> 1983173 INFO  (closeThreadPool-4692-thread-1) [n:127.0.0.1:35515_c%2Fu    ] o.a.s.h.a.MetricsHistoryHandler No .system collection, keeping metrics history in memory.
   [junit4]   2> 1983174 ERROR (closeThreadPool-4692-thread-3) [    ] o.a.s.u.StartupLoggingUtils Missing Java Option solr.log.dir. Logging may be missing or incomplete.
   [junit4]   2> 1983174 INFO  (closeThreadPool-4692-thread-3) [    ] o.a.s.s.SolrDispatchFilter Using logger factory org.apache.logging.slf4j.Log4jLoggerFactory
   [junit4]   2> 1983174 INFO  (closeThreadPool-4692-thread-3) [    ] o.a.s.s.SolrDispatchFilter  ___      _       Welcome to Apache Solr? version 9.0.0
   [junit4]   2> 1983174 INFO  (closeThreadPool-4692-thread-3) [    ] o.a.s.s.SolrDispatchFilter / __| ___| |_ _   Starting in cloud mode on port null
   [junit4]   2> 1983174 INFO  (closeThreadPool-4692-thread-3) [    ] o.a.s.s.SolrDispatchFilter \__ \/ _ \ | '_|  Install dir: null
   [junit4]   2> 1983174 INFO  (closeThreadPool-4692-thread-3) [    ] o.a.s.s.SolrDispatchFilter |___/\___/_|_|    Start time: 2019-01-19T15:47:36.154Z
   [junit4]   2> 1983183 INFO  (closeThreadPool-4692-thread-2) [n:127.0.0.1:32823_c%2Fu    ] o.a.s.m.r.SolrJmxReporter JMX monitoring for 'solr.jvm' (registry 'solr.jvm') enabled at server: com.sun.jmx.mbeanserver.JmxMBeanServer@4c8a08ea
   [junit4]   2> 1983184 INFO  (closeThreadPool-4692-thread-2) [n:127.0.0.1:32823_c%2Fu    ] o.a.s.m.r.SolrJmxReporter JMX monitoring for 'solr.jetty' (registry 'solr.jetty') enabled at server: com.sun.jmx.mbeanserver.JmxMBeanServer@4c8a08ea
   [junit4]   2> 1983186 INFO  (closeThreadPool-4692-thread-2) [n:127.0.0.1:32823_c%2Fu    ] o.a.s.c.CorePropertiesLocator Found 0 core definitions underneath /x1/jenkins/jenkins-slave/workspace/Lucene-Solr-BadApples-NightlyTests-master/checkout/solr/build/solr-core/test/J1/temp/solr.cloud.hdfs.HdfsRestartWhileUpdatingTest_1B990FFF714B6410-001/shard-2-001/cores
   [junit4]   2> 1983197 INFO  (zkConnectionManagerCallback-4730-thread-1) [    ] o.a.s.c.c.ConnectionManager zkClient has connected
   [junit4]   2> 1983198 INFO  (closeThreadPool-4692-thread-3) [    ] o.a.s.s.SolrDispatchFilter Loading solr.xml from SolrHome (not found in ZooKeeper)
   [junit4]   2> 1983198 INFO  (closeThreadPool-4692-thread-3) [    ] o.a.s.c.SolrXmlConfig Loading container configuration from /x1/jenkins/jenkins-slave/workspace/Lucene-Solr-BadApples-NightlyTests-master/checkout/solr/build/solr-core/test/J1/temp/solr.cloud.hdfs.HdfsRestartWhileUpdatingTest_1B990FFF714B6410-001/shard-3-001/solr.xml
   [junit4]   2> 1983203 INFO  (closeThreadPool-4692-thread-3) [    ] o.a.s.c.SolrXmlConfig Configuration parameter autoReplicaFailoverWorkLoopDelay is ignored
   [junit4]   2> 1983203 INFO  (closeThreadPool-4692-thread-3) [    ] o.a.s.c.SolrXmlConfig Configuration parameter autoReplicaFailoverBadNodeExpiration is ignored
   [junit4]   2> 1983206 INFO  (closeThreadPool-4692-thread-3) [    ] o.a.s.c.SolrXmlConfig MBean server found: com.sun.jmx.mbeanserver.JmxMBeanServer@4c8a08ea, but no JMX reporters were configured - adding default JMX reporter.
   [junit4]   2> 1983229 INFO  (closeThreadPool-4692-thread-1) [n:127.0.0.1:35515_c%2Fu    ] o.a.s.m.r.SolrJmxReporter JMX monitoring for 'solr.node' (registry 'solr.node') enabled at server: com.sun.jmx.mbeanserver.JmxMBeanServer@4c8a08ea
   [junit4]   2> 1983255 INFO  (closeThreadPool-4692-thread-1) [n:127.0.0.1:35515_c%2Fu    ] o.a.s.m.r.SolrJmxReporter JMX monitoring for 'solr.jvm' (registry 'solr.jvm') enabled at server: com.sun.jmx.mbeanserver.JmxMBeanServer@4c8a08ea
   [junit4]   2> 1983255 INFO  (closeThreadPool-4692-thread-1) [n:127.0.0.1:35515_c%2Fu    ] o.a.s.m.r.SolrJmxReporter JMX monitoring for 'solr.jetty' (registry 'solr.jetty') enabled at server: com.sun.jmx.mbeanserver.JmxMBeanServer@4c8a08ea
   [junit4]   2> 1983257 INFO  (closeThreadPool-4692-thread-1) [n:127.0.0.1:35515_c%2Fu    ] o.a.s.c.CorePropertiesLocator Found 0 core definitions underneath /x1/jenkins/jenkins-slave/workspace/Lucene-Solr-BadApples-NightlyTests-master/checkout/solr/build/solr-core/test/J1/temp/solr.cloud.hdfs.HdfsRestartWhileUpdatingTest_1B990FFF714B6410-001/shard-1-001/cores
   [junit4]   2> 1983438 INFO  (closeThreadPool-4692-thread-3) [    ] o.a.s.h.c.HttpShardHandlerFactory Host whitelist initialized: WhitelistHostChecker [whitelistHosts=null, whitelistHostCheckingEnabled=false]
   [junit4]   2> 1983438 WARN  (closeThreadPool-4692-thread-3) [    ] o.a.s.c.s.i.Http2SolrClient Create Http2SolrClient with HTTP/1.1 transport since Java 8 or lower versions does not support SSL + HTTP/2
   [junit4]   2> 1983440 WARN  (closeThreadPool-4692-thread-3) [    ] o.e.j.u.s.S.config No Client EndPointIdentificationAlgorithm configured for SslContextFactory@429c4907[provider=null,keyStore=null,trustStore=null]
   [junit4]   2> 1983443 WARN  (closeThreadPool-4692-thread-3) [    ] o.a.s.c.s.i.Http2SolrClient Create Http2SolrClient with HTTP/1.1 transport since Java 8 or lower versions does not support SSL + HTTP/2
   [junit4]   2> 1983444 WARN  (closeThreadPool-4692-thread-3) [    ] o.e.j.u.s.S.config No Client EndPointIdentificationAlgorithm configured for SslContextFactory@47f457c9[provider=null,keyStore=null,trustStore=null]
   [junit4]   2> 1983445 INFO  (closeThreadPool-4692-thread-3) [    ] o.a.s.c.ZkContainer Zookeeper client=127.0.0.1:40686/solr
   [junit4]   2> 1983447 INFO  (zkConnectionManagerCallback-4736-thread-1) [    ] o.a.s.c.c.ConnectionManager zkClient has connected
   [junit4]   2> 1983450 INFO  (zkConnectionManagerCallback-4738-thread-1) [    ] o.a.s.c.c.ConnectionManager zkClient has connected
   [junit4]   2> 1983458 INFO  (closeThreadPool-4692-thread-3) [n:127.0.0.1:41111_c%2Fu    ] o.a.s.c.c.ZkStateReader Updated live nodes from ZooKeeper... (0) -> (3)
   [junit4]   2> 1983463 INFO  (closeThreadPool-4692-thread-3) [n:127.0.0.1:41111_c%2Fu    ] o.a.s.c.ZkController Publish node=127.0.0.1:41111_c%2Fu as DOWN
   [junit4]   2> 1983465 INFO  (closeThreadPool-4692-thread-3) [n:127.0.0.1:41111_c%2Fu    ] o.a.s.c.TransientSolrCoreCacheDefault Allocating transient cache for 4 transient cores
   [junit4]   2> 1983465 INFO  (closeThreadPool-4692-thread-3) [n:127.0.0.1:41111_c%2Fu    ] o.a.s.c.ZkController Register node as live in ZooKeeper:/live_nodes/127.0.0.1:41111_c%2Fu
   [junit4]   2> 1983467 INFO  (zkCallback-4690-thread-1) [    ] o.a.s.c.c.ZkStateReader Updated live nodes from ZooKeeper... (3) -> (4)
   [junit4]   2> 1983467 INFO  (zkCallback-4671-thread-4) [    ] o.a.s.c.c.ZkStateReader Updated live nodes from ZooKeeper... (3) -> (4)
   [junit4]   2> 1983468 INFO  (zkCallback-4703-thread-1) [    ] o.a.s.c.c.ZkStateReader Updated live nodes from ZooKeeper... (3) -> (4)
   [junit4]   2> 1983468 INFO  (zkCallback-4678-thread-1) [    ] o.a.s.c.c.ZkStateReader Updated live nodes from ZooKeeper... (3) -> (4)
   [junit4]   2> 1983468 INFO  (zkCallback-4718-thread-1) [    ] o.a.s.c.c.ZkStateReader Updated live nodes from ZooKeeper... (3) -> (4)
   [junit4]   2> 1983468 INFO  (zkCallback-4716-thread-1) [    ] o.a.s.c.c.ZkStateReader Updated live nodes from ZooKeeper... (3) -> (4)
   [junit4]   2> 1983469 INFO  (zkCallback-4737-thread-1) [    ] o.a.s.c.c.ZkStateReader Updated live nodes from ZooKeeper... (3) -> (4)
   [junit4]   2> 1983469 INFO  (zkCallback-4726-thread-1) [    ] o.a.s.c.c.ZkStateReader Updated live nodes from ZooKeeper... (3) -> (4)
   [junit4]   2> 1983497 INFO  (zkConnectionManagerCallback-4745-thread-1) [    ] o.a.s.c.c.ConnectionManager zkClient has connected
   [junit4]   2> 1983500 INFO  (closeThreadPool-4692-thread-3) [n:127.0.0.1:41111_c%2Fu    ] o.a.s.c.c.ZkStateReader Updated live nodes from ZooKeeper... (0) -> (4)
   [junit4]   2> 1983502 INFO  (closeThreadPool-4692-thread-3) [n:127.0.0.1:41111_c%2Fu    ] o.a.s.c.s.i.ZkClientClusterStateProvider Cluster at 127.0.0.1:40686/solr ready
   [junit4]   2> 1983502 INFO  (closeThreadPool-4692-thread-3) [n:127.0.0.1:41111_c%2Fu    ] o.a.s.h.a.MetricsHistoryHandler No .system collection, keeping metrics history in memory.
   [junit4]   2> 1983534 INFO  (closeThreadPool-4692-thread-3) [n:127.0.0.1:41111_c%2Fu    ] o.a.s.m.r.SolrJmxReporter JMX monitoring for 'solr.node' (registry 'solr.node') enabled at server: com.sun.jmx.mbeanserver.JmxMBeanServer@4c8a08ea
   [junit4]   2> 1983551 INFO  (closeThreadPool-4692-thread-3) [n:127.0.0.1:41111_c%2Fu    ] o.a.s.m.r.SolrJmxReporter JMX monitoring for 'solr.jvm' (registry 'solr.jvm') enabled at server: com.sun.jmx.mbeanserver.JmxMBeanServer@4c8a08ea
   [junit4]   2> 1983551 INFO  (closeThreadPool-4692-thread-3) [n:127.0.0.1:41111_c%2Fu    ] o.a.s.m.r.SolrJmxReporter JMX monitoring for 'solr.jetty' (registry 'solr.jetty') enabled at server: com.sun.jmx.mbeanserver.JmxMBeanServer@4c8a08ea
   [junit4]   2> 1983553 INFO  (closeThreadPool-4692-thread-3) [n:127.0.0.1:41111_c%2Fu    ] o.a.s.c.CorePropertiesLocator Found 0 core definitions underneath /x1/jenkins/jenkins-slave/workspace/Lucene-Solr-BadApples-NightlyTests-master/checkout/solr/build/solr-core/test/J1/temp/solr.cloud.hdfs.HdfsRestartWhileUpdatingTest_1B990FFF714B6410-001/shard-3-001/cores
   [junit4]   2> 1983653 INFO  (qtp964604967-63492) [n:127.0.0.1:32823_c%2Fu    ] o.a.s.h.a.CollectionsHandler Invoked Collection Action :addreplica with params node=127.0.0.1:35515_c%252Fu&action=ADDREPLICA&collection=collection1&shard=shard1&type=NRT&wt=javabin&version=2 and sendToOCPQueue=true
   [junit4]   2> 1983670 INFO  (qtp964604967-63493) [n:127.0.0.1:32823_c%2Fu    ] o.a.s.h.a.CollectionsHandler Invoked Collection Action :addreplica with params node=127.0.0.1:32823_c%252Fu&action=ADDREPLICA&collection=collection1&shard=shard1&type=NRT&wt=javabin&version=2 and sendToOCPQueue=true
   [junit4]   2> 1983671 INFO  (OverseerCollectionConfigSetProcessor-72650538903797765-127.0.0.1:36572_c%2Fu-n_0000000000) [n:127.0.0.1:36572_c%2Fu    ] o.a.s.c.OverseerTaskQueue Response ZK path: /overseer/collection-queue-work/qnr-0000000002 doesn't exist.  Requestor may have disconnected from ZooKeeper
   [junit4]   2> 1983678 INFO  (qtp964604967-63491) [n:127.0.0.1:32823_c%2Fu    ] o.a.s.h.a.CollectionsHandler Invoked Collection Action :addreplica with params node=127.0.0.1:41111_c%252Fu&action=ADDREPLICA&collection=collection1&shard=shard1&type=NRT&wt=javabin&version=2 and sendToOCPQueue=true
   [junit4]   2> 1983682 INFO  (qtp964604967-63490) [n:127.0.0.1:32823_c%2Fu    ] o.a.s.s.HttpSolrCall [admin] webapp=null path=/admin/metrics params={prefix=CONTAINER.fs.usableSpace,CONTAINER.fs.totalSpace,CORE.coreName&wt=javabin&version=2&group=solr.node,solr.core} status=0 QTime=0
   [junit4]   2> 1983683 INFO  (qtp964604967-63489) [n:127.0.0.1:32823_c%2Fu    ] o.a.s.s.HttpSolrCall [admin] webapp=null path=/admin/metrics params={prefix=CONTAINER.fs.usableSpace,CONTAINER.fs.totalSpace,CORE.coreName&wt=javabin&version=2&group=solr.node,solr.core} status=0 QTime=0
   [junit4]   2> 1983684 INFO  (qtp964604967-63490) [n:127.0.0.1:32823_c%2Fu    ] o.a.s.s.HttpSolrCall [admin] webapp=null path=/admin/metrics params={prefix=CONTAINER.fs.usableSpace,CONTAINER.fs.totalSpace,CORE.coreName&wt=javabin&version=2&group=solr.node,solr.core} status=0 QTime=0
   [junit4]   2> 1983685 INFO  (qtp964604967-63489) [n:127.0.0.1:32823_c%2Fu    ] o.a.s.s.HttpSolrCall [admin] webapp=null path=/admin/metrics params={prefix=CONTAINER.fs.usableSpace,CONTAINER.fs.totalSpace,CORE.coreName&wt=javabin&version=2&group=solr.node,solr.core} status=0 QTime=0
   [junit4]   2> 1983686 INFO  (qtp964604967-63490) [n:127.0.0.1:32823_c%2Fu    ] o.a.s.s.HttpSolrCall [admin] webapp=null path=/admin/metrics params={prefix=CONTAINER.fs.usableSpace,CONTAINER.fs.totalSpace,CORE.coreName&wt=javabin&version=2&group=solr.node,solr.core} status=0 QTime=0
   [junit4]   2> 1983712 INFO  (qtp550116991-63478) [n:127.0.0.1:35515_c%2Fu    ] o.a.s.s.HttpSolrCall [admin] webapp=null path=/admin/metrics params={prefix=CONTAINER.fs.usableSpace,CONTAINER.fs.totalSpace,CORE.coreName&wt=javabin&version=2&group=solr.node,solr.core} status=0 QTime=0
   [junit4]   2> 1983714 INFO  (qtp550116991-63479) [n:127.0.0.1:35515_c%2Fu    ] o.a.s.s.HttpSolrCall [admin] webapp=null path=/admin/metrics params={prefix=CONTAINER.fs.usableSpace,CONTAINER.fs.totalSpace,CORE.coreName&wt=javabin&version=2&group=solr.node,solr.core} status=0 QTime=0
   [junit4]   2> 1983715 INFO  (qtp550116991-63480) [n:127.0.0.1:35515_c%2Fu    ] o.a.s.s.HttpSolrCall [admin] webapp=null path=/admin/metrics params={prefix=CONTAINER.fs.usableSpace,CONTAINER.fs.totalSpace,CORE.coreName&wt=javabin&version=2&group=solr.node,solr.core} status=0 QTime=0
   [junit4]   2> 1983716 INFO  (qtp550116991-63474) [n:127.0.0.1:35515_c%2Fu    ] o.a.s.s.HttpSolrCall [admin] webapp=null path=/admin/metrics params={prefix=CONTAINER.fs.usableSpace,CONTAINER.fs.totalSpace,CORE.coreName&wt=javabin&version=2&group=solr.node,solr.core} status=0 QTime=0
   [junit4]   2> 1983717 INFO  (qtp550116991-63478) [n:127.0.0.1:35515_c%2Fu    ] o.a.s.s.HttpSolrCall [admin] webapp=null path=/admin/metrics params={prefix=CONTAINER.fs.usableSpace,CONTAINER.fs.totalSpace,CORE.coreName&wt=javabin&version=2&group=solr.node,solr.core} status=0 QTime=0
   [junit4]   2> 1983720 INFO  (qtp495006951-63413) [n:127.0.0.1:36572_c%2Fu    ] o.a.s.s.HttpSolrCall [admin] webapp=null path=/admin/metrics params={wt=javabin&version=2&key=solr.core.control_collection.shard1.replica_n1:INDEX.sizeInBytes} status=0 QTime=0
   [junit4]   2> 1983722 INFO  (qtp495006951-63414) [n:127.0.0.1:36572_c%2Fu    ] o.a.s.s.HttpSolrCall [admin] webapp=null path=/admin/metrics params={wt=javabin&version=2&key=solr.core.control_collection.shard1.replica_n1:INDEX.sizeInBytes} status=0 QTime=0
   [junit4]   2> 1983723 INFO  (qtp495006951-63415) [n:127.0.0.1:36572_c%2Fu    ] o.a.s.s.HttpSolrCall [admin] webapp=null path=/admin/metrics params={wt=javabin&version=2&key=solr.core.control_collection.shard1.replica_n1:INDEX.sizeInBytes} status=0 QTime=0
   [junit4]   2> 1983724 INFO  (qtp495006951-63412) [n:127.0.0.1:36572_c%2Fu    ] o.a.s.s.HttpSolrCall [admin] webapp=null path=/admin/metrics params={prefix=CONTAINER.fs.usableSpace,CONTAINER.fs.totalSpace,CORE.coreName&wt=javabin&version=2&group=solr.node,solr.core} status=0 QTime=0
   [junit4]   2> 1983725 INFO  (qtp495006951-63416) [n:127.0.0.1:36572_c%2Fu    ] o.a.s.s.HttpSolrCall [admin] webapp=null path=/admin/metrics params={prefix=CONTAINER.fs.usableSpace,CONTAINER.fs.totalSpace,CORE.coreName&wt=javabin&version=2&group=solr.node,solr.core} status=0 QTime=0
   [junit4]   2> 1983726 INFO  (qtp495006951-63413) [n:127.0.0.1:36572_c%2Fu    ] o.a.s.s.HttpSolrCall [admin] webapp=null path=/admin/metrics params={prefix=CONTAINER.fs.usableSpace,CONTAINER.fs.totalSpace,CORE.coreName&wt=javabin&version=2&group=solr.node,solr.core} status=0 QTime=0
   [junit4]   2> 1983727 INFO  (qtp495006951-63414) [n:127.0.0.1:36572_c%2Fu    ] o.a.s.s.HttpSolrCall [admin] webapp=null path=/admin/metrics params={prefix=CONTAINER.fs.usableSpace,CONTAINER.fs.totalSpace,CORE.coreName&wt=javabin&version=2&group=solr.node,solr.core} status=0 QTime=0
   [junit4]   2> 1983728 INFO  (qtp495006951-63415) [n:127.0.0.1:36572_c%2Fu    ] o.a.s.s.HttpSolrCall [admin] webapp=null path=/admin/metrics params={prefix=CONTAINER.fs.usableSpace,CONTAINER.fs.totalSpace,CORE.coreName&wt=javabin&version=2&group=solr.node,solr.core} status=0 QTime=0
   [junit4]   2> 1983745 INFO  (qtp1036819764-63537) [n:127.0.0.1:41111_c%2Fu    ] o.a.s.s.HttpSolrCall [admin] webapp=null path=/admin/metrics params={prefix=CONTAINER.fs.usableSpace,CONTAINER.fs.totalSpace,CORE.coreName&wt=javabin&version=2&group=solr.node,solr.core} status=0 QTime=0
   [junit4]   2> 1983747 INFO  (qtp1036819764-63538) [n:127.0.0.1:41111_c%2Fu    ] o.a.s.s.HttpSolrCall [admin] webapp=null path=/admin/metrics params={prefix=CONTAINER.fs.usableSpace,CONTAINER.fs.totalSpace,CORE.coreName&wt=javabin&version=2&group=solr.node,solr.core} status=0 QTime=0
   [junit4]   2> 1983748 INFO  (qtp1036819764-63539) [n:127.0.0.1:41111_c%2Fu    ] o.a.s.s.HttpSolrCall [admin] webapp=null path=/admin/metrics params={prefix=CONTAINER.fs.usableSpace,CONTAINER.fs.totalSpace,CORE.coreName&wt=javabin&version=2&group=solr.node,solr.core} status=0 QTime=0
   [junit4]   2> 1983749 INFO  (qtp1036819764-63540) [n:127.0.0.1:41111_c%2Fu    ] o.a.s.s.HttpSolrCall [admin] webapp=null path=/admin/metrics params={prefix=CONTAINER.fs.usableSpace,CONTAINER.fs.totalSpace,CORE.coreName&wt=javabin&version=2&group=solr.node,solr.core} status=0 QTime=0
   [junit4]   2> 1983750 INFO  (qtp1036819764-63542) [n:127.0.0.1:41111_c%2Fu    ] o.a.s.s.HttpSolrCall [admin] webapp=null path=/admin/metrics params={prefix=CONTAINER.fs.usableSpace,CONTAINER.fs.totalSpace,CORE.coreName&wt=javabin&version=2&group=solr.node,solr.core} status=0 QTime=0
   [junit4]   2> 1983752 INFO  (OverseerThreadFactory-4786-thread-3-processing-n:127.0.0.1:36572_c%2Fu) [n:127.0.0.1:36572_c%2Fu c:collection1 s:shard1  ] o.a.s.c.a.c.AddReplicaCmd Node Identified 127.0.0.1:35515_c%2Fu for creating new replica of shard shard1 for collection collection1
   [junit4]   2> 1983761 INFO  (OverseerThreadFactory-4786-thread-3-processing-n:127.0.0.1:36572_c%2Fu) [n:127.0.0.1:36572_c%2Fu c:collection1 s:shard1  ] o.a.s.c.a.c.AddReplicaCmd Returning CreateReplica command.
   [junit4]   2> 1983791 INFO  (qtp550116991-63479) [n:127.0.0.1:35515_c%2Fu    x:collection1_shard1_replica_n1] o.a.s.h.a.CoreAdminOperation core create command qt=/admin/cores&collection.configName=conf1&name=collection1_shard1_replica_n1&action=CREATE&collection=collection1&shard=shard1&wt=javabin&version=2&replicaType=NRT
   [junit4]   2> 1984828 INFO  (qtp550116991-63479) [n:127.0.0.1:35515_c%2Fu c:collection1 s:shard1  x:collection1_shard1_replica_n1] o.a.s.c.SolrConfig Using Lucene MatchVersion: 9.0.0
   [junit4]   2> 1984857 INFO  (qtp550116991-63479) [n:127.0.0.1:35515_c%2Fu c:collection1 s:shard1  x:collection1_shard1_replica_n1] o.a.s.s.IndexSchema [collection1_shard1_replica_n1] Schema name=test
   [junit4]   2> 1984994 INFO  (qtp550116991-63479) [n:127.0.0.1:35515_c%2Fu c:collection1 s:shard1  x:collection1_shard1_replica_n1] o.a.s.s.IndexSchema Loaded schema test/1.6 with uniqueid field id
   [junit4]   2> 1985022 INFO  (qtp550116991-63479) [n:127.0.0.1:35515_c%2Fu c:collection1 s:shard1  x:collection1_shard1_replica_n1] o.a.s.c.CoreContainer Creating SolrCore 'collection1_shard1_replica_n1' using configuration from collection collection1, trusted=true
   [junit4]   2> 1985023 INFO  (qtp550116991-63479) [n:127.0.0.1:35515_c%2Fu c:collection1 s:shard1  x:collection1_shard1_replica_n1] o.a.s.m.r.SolrJmxReporter JMX monitoring for 'solr.core.collection1.shard1.replica_n1' (registry 'solr.core.collection1.shard1.replica_n1') enabled at server: com.sun.jmx.mbeanserver.JmxMBeanServer@4c8a08ea
   [junit4]   2> 1985023 INFO  (qtp550116991-63479) [n:127.0.0.1:35515_c%2Fu c:collection1 s:shard1  x:collection1_shard1_replica_n1] o.a.s.c.SolrCore [[collection1_shard1_replica_n1] ] Opening new SolrCore at [/x1/jenkins/jenkins-slave/workspace/Lucene-Solr-BadApples-NightlyTests-master/checkout/solr/build/solr-core/test/J1/temp/solr.cloud.hdfs.HdfsRestartWhileUpdatingTest_1B990FFF714B6410-001/shard-1-001/cores/collection1_shard1_replica_n1], dataDir=[/x1/jenkins/jenkins-slave/workspace/Lucene-Solr-BadApples-NightlyTests-master/checkout/solr/build/solr-core/test/J1/temp/solr.cloud.hdfs.HdfsRestartWhileUpdatingTest_1B990FFF714B6410-001/shard-1-001/cores/collection1_shard1_replica_n1/data/]
   [junit4]   2> 1985027 INFO  (qtp550116991-63479) [n:127.0.0.1:35515_c%2Fu c:collection1 s:shard1  x:collection1_shard1_replica_n1] o.a.s.u.RandomMergePolicy RandomMergePolicy wrapping class org.apache.lucene.index.TieredMergePolicy: [TieredMergePolicy: maxMergeAtOnce=19, maxMergeAtOnceExplicit=41, maxMergedSegmentMB=97.541015625, floorSegmentMB=1.357421875, forceMergeDeletesPctAllowed=11.115188937090268, segmentsPerTier=12.0, maxCFSSegmentSizeMB=8.796093022207999E12, noCFSRatio=0.5987367564478258, deletesPctAllowed=33.419722422116344
   [junit4]   2> 1985038 WARN  (qtp550116991-63479) [n:127.0.0.1:35515_c%2Fu c:collection1 s:shard1  x:collection1_shard1_replica_n1] o.a.s.c.RequestHandlers INVALID paramSet a in requestHandler {type = requestHandler,name = /dump,class = DumpRequestHandler,attributes = {initParams=a, name=/dump, class=DumpRequestHandler},args = {defaults={a=A,b=B}}}
   [junit4]   2> 1985128 INFO  (qtp550116991-63479) [n:127.0.0.1:35515_c%2Fu c:collection1 s:shard1  x:collection1_shard1_replica_n1] o.a.s.u.UpdateHandler Using UpdateLog implementation: org.apache.solr.update.UpdateLog
   [junit4]   2> 1985128 INFO  (qtp550116991-63479) [n:127.0.0.1:35515_c%2Fu c:collection1 s:shard1  x:collection1_shard1_replica_n1] o.a.s.u.UpdateLog Initializing UpdateLog: dataDir= defaultSyncLevel=FLUSH numRecordsToKeep=100 maxNumLogsToKeep=10 numVersionBuckets=65536
   [junit4]   2> 1985131 INFO  (qtp550116991-63479) [n:127.0.0.1:35515_c%2Fu c:collection1 s:shard1  x:collection1_shard1_replica_n1] o.a.s.u.CommitTracker Hard AutoCommit: if uncommitted for 

[...truncated too long message...]

-Solr-BadApples-NightlyTests-master/checkout/solr/core/test-lib/apacheds-interceptors-event-2.0.0-M15.jar:/x1/jenkins/jenkins-slave/workspace/Lucene-Solr-BadApples-NightlyTests-master/checkout/solr/core/test-lib/apacheds-interceptors-exception-2.0.0-M15.jar:/x1/jenkins/jenkins-slave/workspace/Lucene-Solr-BadApples-NightlyTests-master/checkout/solr/core/test-lib/apacheds-interceptors-journal-2.0.0-M15.jar:/x1/jenkins/jenkins-slave/workspace/Lucene-Solr-BadApples-NightlyTests-master/checkout/solr/core/test-lib/apacheds-interceptors-normalization-2.0.0-M15.jar:/x1/jenkins/jenkins-slave/workspace/Lucene-Solr-BadApples-NightlyTests-master/checkout/solr/core/test-lib/apacheds-interceptors-operational-2.0.0-M15.jar:/x1/jenkins/jenkins-slave/workspace/Lucene-Solr-BadApples-NightlyTests-master/checkout/solr/core/test-lib/apacheds-interceptors-referral-2.0.0-M15.jar:/x1/jenkins/jenkins-slave/workspace/Lucene-Solr-BadApples-NightlyTests-master/checkout/solr/core/test-lib/apacheds-interceptors-schema-2.0.0-M15.jar:/x1/jenkins/jenkins-slave/workspace/Lucene-Solr-BadApples-NightlyTests-master/checkout/solr/core/test-lib/apacheds-interceptors-subtree-2.0.0-M15.jar:/x1/jenkins/jenkins-slave/workspace/Lucene-Solr-BadApples-NightlyTests-master/checkout/solr/core/test-lib/apacheds-interceptors-trigger-2.0.0-M15.jar:/x1/jenkins/jenkins-slave/workspace/Lucene-Solr-BadApples-NightlyTests-master/checkout/solr/core/test-lib/apacheds-jdbm-partition-2.0.0-M15.jar:/x1/jenkins/jenkins-slave/workspace/Lucene-Solr-BadApples-NightlyTests-master/checkout/solr/core/test-lib/apacheds-jdbm1-2.0.0-M2.jar:/x1/jenkins/jenkins-slave/workspace/Lucene-Solr-BadApples-NightlyTests-master/checkout/solr/core/test-lib/apacheds-kerberos-codec-2.0.0-M15.jar:/x1/jenkins/jenkins-slave/workspace/Lucene-Solr-BadApples-NightlyTests-master/checkout/solr/core/test-lib/apacheds-ldif-partition-2.0.0-M15.jar:/x1/jenkins/jenkins-slave/workspace/Lucene-Solr-BadApples-NightlyTests-master/checkout/solr/core/test-lib/apacheds-mavibot-partition-2.0.0-M15.jar:/x1/jenkins/jenkins-slave/workspace/Lucene-Solr-BadApples-NightlyTests-master/checkout/solr/core/test-lib/apacheds-protocol-kerberos-2.0.0-M15.jar:/x1/jenkins/jenkins-slave/workspace/Lucene-Solr-BadApples-NightlyTests-master/checkout/solr/core/test-lib/apacheds-protocol-ldap-2.0.0-M15.jar:/x1/jenkins/jenkins-slave/workspace/Lucene-Solr-BadApples-NightlyTests-master/checkout/solr/core/test-lib/apacheds-protocol-shared-2.0.0-M15.jar:/x1/jenkins/jenkins-slave/workspace/Lucene-Solr-BadApples-NightlyTests-master/checkout/solr/core/test-lib/apacheds-xdbm-partition-2.0.0-M15.jar:/x1/jenkins/jenkins-slave/workspace/Lucene-Solr-BadApples-NightlyTests-master/checkout/solr/core/test-lib/api-all-1.0.0-M20.jar:/x1/jenkins/jenkins-slave/workspace/Lucene-Solr-BadApples-NightlyTests-master/checkout/solr/core/test-lib/bcprov-jdk15on-1.60.jar:/x1/jenkins/jenkins-slave/workspace/Lucene-Solr-BadApples-NightlyTests-master/checkout/solr/core/test-lib/byte-buddy-1.9.3.jar:/x1/jenkins/jenkins-slave/workspace/Lucene-Solr-BadApples-NightlyTests-master/checkout/solr/core/test-lib/commons-collections-3.2.2.jar:/x1/jenkins/jenkins-slave/workspace/Lucene-Solr-BadApples-NightlyTests-master/checkout/solr/core/test-lib/ehcache-core-2.4.4.jar:/x1/jenkins/jenkins-slave/workspace/Lucene-Solr-BadApples-NightlyTests-master/checkout/solr/core/test-lib/hadoop-common-2.7.4-tests.jar:/x1/jenkins/jenkins-slave/workspace/Lucene-Solr-BadApples-NightlyTests-master/checkout/solr/core/test-lib/hadoop-hdfs-2.7.4-tests.jar:/x1/jenkins/jenkins-slave/workspace/Lucene-Solr-BadApples-NightlyTests-master/checkout/solr/core/test-lib/hadoop-minikdc-2.7.4.jar:/x1/jenkins/jenkins-slave/workspace/Lucene-Solr-BadApples-NightlyTests-master/checkout/solr/core/test-lib/htrace-core-3.2.0-incubating.jar:/x1/jenkins/jenkins-slave/workspace/Lucene-Solr-BadApples-NightlyTests-master/checkout/solr/core/test-lib/jersey-core-1.9.jar:/x1/jenkins/jenkins-slave/workspace/Lucene-Solr-BadApples-NightlyTests-master/checkout/solr/core/test-lib/jersey-server-1.9.jar:/x1/jenkins/jenkins-slave/workspace/Lucene-Solr-BadApples-NightlyTests-master/checkout/solr/core/test-lib/jetty-6.1.26.jar:/x1/jenkins/jenkins-slave/workspace/Lucene-Solr-BadApples-NightlyTests-master/checkout/solr/core/test-lib/jetty-sslengine-6.1.26.jar:/x1/jenkins/jenkins-slave/workspace/Lucene-Solr-BadApples-NightlyTests-master/checkout/solr/core/test-lib/jetty-util-6.1.26.jar:/x1/jenkins/jenkins-slave/workspace/Lucene-Solr-BadApples-NightlyTests-master/checkout/solr/core/test-lib/mina-core-2.0.0-M5.jar:/x1/jenkins/jenkins-slave/workspace/Lucene-Solr-BadApples-NightlyTests-master/checkout/solr/core/test-lib/mockito-core-2.23.4.jar:/x1/jenkins/jenkins-slave/workspace/Lucene-Solr-BadApples-NightlyTests-master/checkout/solr/core/test-lib/netty-all-4.0.36.Final.jar:/x1/jenkins/jenkins-slave/workspace/Lucene-Solr-BadApples-NightlyTests-master/checkout/solr/core/test-lib/objenesis-2.6.jar:/x1/jenkins/jenkins-slave/workspace/Lucene-Solr-BadApples-NightlyTests-master/checkout/lucene/build/analysis/icu/lucene-analyzers-icu-9.0.0-SNAPSHOT.jar:/x1/jenkins/jenkins-slave/workspace/Lucene-Solr-BadApples-NightlyTests-master/checkout/solr/build/contrib/solr-analysis-extras/classes/java:/x1/jenkins/jenkins-slave/workspace/Lucene-Solr-BadApples-NightlyTests-master/checkout/lucene/build/queryparser/classes/test:/x1/jenkins/jenkins-slave/workspace/Lucene-Solr-BadApples-NightlyTests-master/checkout/lucene/build/backward-codecs/classes/test:/x1/jenkins/jenkins-slave/workspace/Lucene-Solr-BadApples-NightlyTests-master/checkout/solr/contrib/analysis-extras/lib/icu4j-62.1.jar:/home/jenkins/tools/ant/apache-ant-1.8.4/lib/ant-launcher.jar:/x1/jenkins/.ant/lib/ivy-2.4.0.jar:/home/jenkins/tools/ant/apache-ant-1.8.4/lib/ant-junit.jar:/home/jenkins/tools/ant/apache-ant-1.8.4/lib/ant-apache-log4j.jar:/home/jenkins/tools/ant/apache-ant-1.8.4/lib/ant-junit4.jar:/home/jenkins/tools/ant/apache-ant-1.8.4/lib/ant-jai.jar:/home/jenkins/tools/ant/apache-ant-1.8.4/lib/ant-javamail.jar:/home/jenkins/tools/ant/apache-ant-1.8.4/lib/ant-apache-bsf.jar:/home/jenkins/tools/ant/apache-ant-1.8.4/lib/ant-commons-net.jar:/home/jenkins/tools/ant/apache-ant-1.8.4/lib/ant-antlr.jar:/home/jenkins/tools/ant/apache-ant-1.8.4/lib/ant-jsch.jar:/home/jenkins/tools/ant/apache-ant-1.8.4/lib/ant-apache-oro.jar:/home/jenkins/tools/ant/apache-ant-1.8.4/lib/ant-commons-logging.jar:/home/jenkins/tools/ant/apache-ant-1.8.4/lib/ant.jar:/home/jenkins/tools/ant/apache-ant-1.8.4/lib/ant-netrexx.jar:/home/jenkins/tools/ant/apache-ant-1.8.4/lib/ant-testutil.jar:/home/jenkins/tools/ant/apache-ant-1.8.4/lib/ant-jdepend.jar:/home/jenkins/tools/ant/apache-ant-1.8.4/lib/ant-apache-bcel.jar:/home/jenkins/tools/ant/apache-ant-1.8.4/lib/ant-apache-xalan2.jar:/home/jenkins/tools/ant/apache-ant-1.8.4/lib/ant-apache-resolver.jar:/home/jenkins/tools/ant/apache-ant-1.8.4/lib/ant-jmf.jar:/home/jenkins/tools/ant/apache-ant-1.8.4/lib/ant-apache-regexp.jar:/home/jenkins/tools/ant/apache-ant-1.8.4/lib/ant-swing.jar:/usr/local/asfpackages/java/jdk1.8.0_191/lib/tools.jar:/x1/jenkins/.ivy2/cache/com.carrotsearch.randomizedtesting/junit4-ant/jars/junit4-ant-2.7.2.jar com.carrotsearch.ant.tasks.junit4.slave.SlaveMainSafe -eventsfile /x1/jenkins/jenkins-slave/workspace/Lucene-Solr-BadApples-NightlyTests-master/checkout/solr/build/solr-core/test/temp/junit4-J2-20190119_151432_8288247385733212930642.events @/x1/jenkins/jenkins-slave/workspace/Lucene-Solr-BadApples-NightlyTests-master/checkout/solr/build/solr-core/test/temp/junit4-J2-20190119_151432_8281767076447586153977.suites -stdin
   [junit4] ERROR: JVM J2 ended with an exception: Quit event not received from the forked process? This may indicate JVM crash or runner bugs.
   [junit4] 	at com.carrotsearch.ant.tasks.junit4.JUnit4.executeSlave(JUnit4.java:1563)
   [junit4] 	at com.carrotsearch.ant.tasks.junit4.JUnit4.access$000(JUnit4.java:123)
   [junit4] 	at com.carrotsearch.ant.tasks.junit4.JUnit4$2.call(JUnit4.java:997)
   [junit4] 	at com.carrotsearch.ant.tasks.junit4.JUnit4$2.call(JUnit4.java:994)
   [junit4] 	at java.util.concurrent.FutureTask.run(FutureTask.java:266)
   [junit4] 	at java.util.concurrent.ThreadPoolExecutor.runWorker(ThreadPoolExecutor.java:1149)
   [junit4] 	at java.util.concurrent.ThreadPoolExecutor$Worker.run(ThreadPoolExecutor.java:624)
   [junit4] 	at java.lang.Thread.run(Thread.java:748)

BUILD FAILED
/x1/jenkins/jenkins-slave/workspace/Lucene-Solr-BadApples-NightlyTests-master/checkout/build.xml:661: The following error occurred while executing this line:
/x1/jenkins/jenkins-slave/workspace/Lucene-Solr-BadApples-NightlyTests-master/checkout/build.xml:577: The following error occurred while executing this line:
/x1/jenkins/jenkins-slave/workspace/Lucene-Solr-BadApples-NightlyTests-master/checkout/build.xml:59: The following error occurred while executing this line:
/x1/jenkins/jenkins-slave/workspace/Lucene-Solr-BadApples-NightlyTests-master/checkout/solr/build.xml:267: The following error occurred while executing this line:
/x1/jenkins/jenkins-slave/workspace/Lucene-Solr-BadApples-NightlyTests-master/checkout/solr/common-build.xml:558: The following error occurred while executing this line:
/x1/jenkins/jenkins-slave/workspace/Lucene-Solr-BadApples-NightlyTests-master/checkout/lucene/common-build.xml:1572: The following error occurred while executing this line:
/x1/jenkins/jenkins-slave/workspace/Lucene-Solr-BadApples-NightlyTests-master/checkout/lucene/common-build.xml:1099: At least one slave process threw an exception, first: Quit event not received from the forked process? This may indicate JVM crash or runner bugs.

Total time: 307 minutes 54 seconds
Build step 'Invoke Ant' marked build as failure
Archiving artifacts
[Fast Archiver] No artifacts from Lucene-Solr-BadApples-NightlyTests-master #43 to compare, so performing full copy of artifacts
Recording test results
Email was triggered for: Failure - Any
Sending email for trigger: Failure - Any

Mime
View raw message