lucene-dev mailing list archives

Site index · List index
Message view « Date » · « Thread »
Top « Date » · « Thread »
From Apache Jenkins Server <jenk...@builds.apache.org>
Subject [JENKINS] Lucene-Solr-BadApples-NightlyTests-8.x - Build # 3 - Unstable
Date Sat, 02 Feb 2019 08:56:46 GMT
Build: https://builds.apache.org/job/Lucene-Solr-BadApples-NightlyTests-8.x/3/

2 tests failed.
FAILED:  org.apache.solr.cloud.FullSolrCloudDistribCmdsTest.test

Error Message:
Timeout occured while waiting response from server at: http://127.0.0.1:36218/tu_byy/gg/control_collection

Stack Trace:
org.apache.solr.client.solrj.SolrServerException: Timeout occured while waiting response from server at: http://127.0.0.1:36218/tu_byy/gg/control_collection
	at org.apache.solr.client.solrj.impl.HttpSolrClient.executeMethod(HttpSolrClient.java:661)
	at org.apache.solr.client.solrj.impl.HttpSolrClient.request(HttpSolrClient.java:256)
	at org.apache.solr.client.solrj.impl.HttpSolrClient.request(HttpSolrClient.java:245)
	at org.apache.solr.client.solrj.SolrRequest.process(SolrRequest.java:207)
	at org.apache.solr.client.solrj.SolrClient.commit(SolrClient.java:504)
	at org.apache.solr.client.solrj.SolrClient.commit(SolrClient.java:479)
	at org.apache.solr.cloud.AbstractFullDistribZkTestBase.commit(AbstractFullDistribZkTestBase.java:1725)
	at org.apache.solr.cloud.FullSolrCloudDistribCmdsTest.testIndexingBatchPerRequestWithHttpSolrClient(FullSolrCloudDistribCmdsTest.java:658)
	at org.apache.solr.cloud.FullSolrCloudDistribCmdsTest.test(FullSolrCloudDistribCmdsTest.java:154)
	at sun.reflect.NativeMethodAccessorImpl.invoke0(Native Method)
	at sun.reflect.NativeMethodAccessorImpl.invoke(NativeMethodAccessorImpl.java:62)
	at sun.reflect.DelegatingMethodAccessorImpl.invoke(DelegatingMethodAccessorImpl.java:43)
	at java.lang.reflect.Method.invoke(Method.java:498)
	at com.carrotsearch.randomizedtesting.RandomizedRunner.invoke(RandomizedRunner.java:1750)
	at com.carrotsearch.randomizedtesting.RandomizedRunner$8.evaluate(RandomizedRunner.java:938)
	at com.carrotsearch.randomizedtesting.RandomizedRunner$9.evaluate(RandomizedRunner.java:974)
	at com.carrotsearch.randomizedtesting.RandomizedRunner$10.evaluate(RandomizedRunner.java:988)
	at org.apache.solr.BaseDistributedSearchTestCase$ShardsRepeatRule$ShardsFixedStatement.callStatement(BaseDistributedSearchTestCase.java:1082)
	at org.apache.solr.BaseDistributedSearchTestCase$ShardsRepeatRule$ShardsStatement.evaluate(BaseDistributedSearchTestCase.java:1054)
	at com.carrotsearch.randomizedtesting.rules.SystemPropertiesRestoreRule$1.evaluate(SystemPropertiesRestoreRule.java:57)
	at org.apache.lucene.util.TestRuleSetupTeardownChained$1.evaluate(TestRuleSetupTeardownChained.java:49)
	at org.apache.lucene.util.AbstractBeforeAfterRule$1.evaluate(AbstractBeforeAfterRule.java:45)
	at org.apache.lucene.util.TestRuleThreadAndTestName$1.evaluate(TestRuleThreadAndTestName.java:48)
	at org.apache.lucene.util.TestRuleIgnoreAfterMaxFailures$1.evaluate(TestRuleIgnoreAfterMaxFailures.java:64)
	at org.apache.lucene.util.TestRuleMarkFailure$1.evaluate(TestRuleMarkFailure.java:47)
	at com.carrotsearch.randomizedtesting.rules.StatementAdapter.evaluate(StatementAdapter.java:36)
	at com.carrotsearch.randomizedtesting.ThreadLeakControl$StatementRunner.run(ThreadLeakControl.java:368)
	at com.carrotsearch.randomizedtesting.ThreadLeakControl.forkTimeoutingTask(ThreadLeakControl.java:817)
	at com.carrotsearch.randomizedtesting.ThreadLeakControl$3.evaluate(ThreadLeakControl.java:468)
	at com.carrotsearch.randomizedtesting.RandomizedRunner.runSingleTest(RandomizedRunner.java:947)
	at com.carrotsearch.randomizedtesting.RandomizedRunner$5.evaluate(RandomizedRunner.java:832)
	at com.carrotsearch.randomizedtesting.RandomizedRunner$6.evaluate(RandomizedRunner.java:883)
	at com.carrotsearch.randomizedtesting.RandomizedRunner$7.evaluate(RandomizedRunner.java:894)
	at com.carrotsearch.randomizedtesting.rules.StatementAdapter.evaluate(StatementAdapter.java:36)
	at com.carrotsearch.randomizedtesting.rules.SystemPropertiesRestoreRule$1.evaluate(SystemPropertiesRestoreRule.java:57)
	at org.apache.lucene.util.AbstractBeforeAfterRule$1.evaluate(AbstractBeforeAfterRule.java:45)
	at com.carrotsearch.randomizedtesting.rules.StatementAdapter.evaluate(StatementAdapter.java:36)
	at org.apache.lucene.util.TestRuleStoreClassName$1.evaluate(TestRuleStoreClassName.java:41)
	at com.carrotsearch.randomizedtesting.rules.NoShadowingOrOverridesOnMethodsRule$1.evaluate(NoShadowingOrOverridesOnMethodsRule.java:40)
	at com.carrotsearch.randomizedtesting.rules.NoShadowingOrOverridesOnMethodsRule$1.evaluate(NoShadowingOrOverridesOnMethodsRule.java:40)
	at com.carrotsearch.randomizedtesting.rules.StatementAdapter.evaluate(StatementAdapter.java:36)
	at com.carrotsearch.randomizedtesting.rules.StatementAdapter.evaluate(StatementAdapter.java:36)
	at com.carrotsearch.randomizedtesting.rules.StatementAdapter.evaluate(StatementAdapter.java:36)
	at org.apache.lucene.util.TestRuleAssertionsRequired$1.evaluate(TestRuleAssertionsRequired.java:53)
	at org.apache.lucene.util.TestRuleMarkFailure$1.evaluate(TestRuleMarkFailure.java:47)
	at org.apache.lucene.util.TestRuleIgnoreAfterMaxFailures$1.evaluate(TestRuleIgnoreAfterMaxFailures.java:64)
	at org.apache.lucene.util.TestRuleIgnoreTestSuites$1.evaluate(TestRuleIgnoreTestSuites.java:54)
	at com.carrotsearch.randomizedtesting.rules.StatementAdapter.evaluate(StatementAdapter.java:36)
	at com.carrotsearch.randomizedtesting.ThreadLeakControl$StatementRunner.run(ThreadLeakControl.java:368)
	at java.lang.Thread.run(Thread.java:748)
Caused by: java.net.SocketTimeoutException: Read timed out
	at java.net.SocketInputStream.socketRead0(Native Method)
	at java.net.SocketInputStream.socketRead(SocketInputStream.java:116)
	at java.net.SocketInputStream.read(SocketInputStream.java:171)
	at java.net.SocketInputStream.read(SocketInputStream.java:141)
	at org.apache.http.impl.io.SessionInputBufferImpl.streamRead(SessionInputBufferImpl.java:137)
	at org.apache.http.impl.io.SessionInputBufferImpl.fillBuffer(SessionInputBufferImpl.java:153)
	at org.apache.http.impl.io.SessionInputBufferImpl.readLine(SessionInputBufferImpl.java:282)
	at org.apache.http.impl.conn.DefaultHttpResponseParser.parseHead(DefaultHttpResponseParser.java:138)
	at org.apache.http.impl.conn.DefaultHttpResponseParser.parseHead(DefaultHttpResponseParser.java:56)
	at org.apache.http.impl.io.AbstractMessageParser.parse(AbstractMessageParser.java:259)
	at org.apache.http.impl.DefaultBHttpClientConnection.receiveResponseHeader(DefaultBHttpClientConnection.java:163)
	at org.apache.http.impl.conn.CPoolProxy.receiveResponseHeader(CPoolProxy.java:165)
	at org.apache.http.protocol.HttpRequestExecutor.doReceiveResponse(HttpRequestExecutor.java:273)
	at org.apache.http.protocol.HttpRequestExecutor.execute(HttpRequestExecutor.java:125)
	at org.apache.http.impl.execchain.MainClientExec.execute(MainClientExec.java:272)
	at org.apache.http.impl.execchain.ProtocolExec.execute(ProtocolExec.java:185)
	at org.apache.http.impl.execchain.RetryExec.execute(RetryExec.java:89)
	at org.apache.http.impl.execchain.RedirectExec.execute(RedirectExec.java:110)
	at org.apache.http.impl.client.InternalHttpClient.doExecute(InternalHttpClient.java:185)
	at org.apache.http.impl.client.CloseableHttpClient.execute(CloseableHttpClient.java:83)
	at org.apache.http.impl.client.CloseableHttpClient.execute(CloseableHttpClient.java:56)
	at org.apache.solr.client.solrj.impl.HttpSolrClient.executeMethod(HttpSolrClient.java:549)
	... 49 more


FAILED:  org.apache.solr.cloud.hdfs.HdfsRestartWhileUpdatingTest.test

Error Message:
There are still nodes recoverying - waited for 320 seconds

Stack Trace:
java.lang.AssertionError: There are still nodes recoverying - waited for 320 seconds
	at __randomizedtesting.SeedInfo.seed([2E0D173E7C17D84F:A65928E4D2EBB5B7]:0)
	at org.junit.Assert.fail(Assert.java:88)
	at org.apache.solr.cloud.AbstractDistribZkTestBase.waitForRecoveriesToFinish(AbstractDistribZkTestBase.java:195)
	at org.apache.solr.cloud.AbstractFullDistribZkTestBase.waitForRecoveriesToFinish(AbstractFullDistribZkTestBase.java:1038)
	at org.apache.solr.cloud.AbstractFullDistribZkTestBase.waitForThingsToLevelOut(AbstractFullDistribZkTestBase.java:1595)
	at org.apache.solr.cloud.RestartWhileUpdatingTest.test(RestartWhileUpdatingTest.java:144)
	at sun.reflect.NativeMethodAccessorImpl.invoke0(Native Method)
	at sun.reflect.NativeMethodAccessorImpl.invoke(NativeMethodAccessorImpl.java:62)
	at sun.reflect.DelegatingMethodAccessorImpl.invoke(DelegatingMethodAccessorImpl.java:43)
	at java.lang.reflect.Method.invoke(Method.java:498)
	at com.carrotsearch.randomizedtesting.RandomizedRunner.invoke(RandomizedRunner.java:1750)
	at com.carrotsearch.randomizedtesting.RandomizedRunner$8.evaluate(RandomizedRunner.java:938)
	at com.carrotsearch.randomizedtesting.RandomizedRunner$9.evaluate(RandomizedRunner.java:974)
	at com.carrotsearch.randomizedtesting.RandomizedRunner$10.evaluate(RandomizedRunner.java:988)
	at org.apache.solr.BaseDistributedSearchTestCase$ShardsRepeatRule$ShardsFixedStatement.callStatement(BaseDistributedSearchTestCase.java:1082)
	at org.apache.solr.BaseDistributedSearchTestCase$ShardsRepeatRule$ShardsStatement.evaluate(BaseDistributedSearchTestCase.java:1054)
	at com.carrotsearch.randomizedtesting.rules.SystemPropertiesRestoreRule$1.evaluate(SystemPropertiesRestoreRule.java:57)
	at org.apache.lucene.util.TestRuleSetupTeardownChained$1.evaluate(TestRuleSetupTeardownChained.java:49)
	at org.apache.lucene.util.AbstractBeforeAfterRule$1.evaluate(AbstractBeforeAfterRule.java:45)
	at org.apache.lucene.util.TestRuleThreadAndTestName$1.evaluate(TestRuleThreadAndTestName.java:48)
	at org.apache.lucene.util.TestRuleIgnoreAfterMaxFailures$1.evaluate(TestRuleIgnoreAfterMaxFailures.java:64)
	at org.apache.lucene.util.TestRuleMarkFailure$1.evaluate(TestRuleMarkFailure.java:47)
	at com.carrotsearch.randomizedtesting.rules.StatementAdapter.evaluate(StatementAdapter.java:36)
	at com.carrotsearch.randomizedtesting.ThreadLeakControl$StatementRunner.run(ThreadLeakControl.java:368)
	at com.carrotsearch.randomizedtesting.ThreadLeakControl.forkTimeoutingTask(ThreadLeakControl.java:817)
	at com.carrotsearch.randomizedtesting.ThreadLeakControl$3.evaluate(ThreadLeakControl.java:468)
	at com.carrotsearch.randomizedtesting.RandomizedRunner.runSingleTest(RandomizedRunner.java:947)
	at com.carrotsearch.randomizedtesting.RandomizedRunner$5.evaluate(RandomizedRunner.java:832)
	at com.carrotsearch.randomizedtesting.RandomizedRunner$6.evaluate(RandomizedRunner.java:883)
	at com.carrotsearch.randomizedtesting.RandomizedRunner$7.evaluate(RandomizedRunner.java:894)
	at com.carrotsearch.randomizedtesting.rules.StatementAdapter.evaluate(StatementAdapter.java:36)
	at com.carrotsearch.randomizedtesting.rules.SystemPropertiesRestoreRule$1.evaluate(SystemPropertiesRestoreRule.java:57)
	at org.apache.lucene.util.AbstractBeforeAfterRule$1.evaluate(AbstractBeforeAfterRule.java:45)
	at com.carrotsearch.randomizedtesting.rules.StatementAdapter.evaluate(StatementAdapter.java:36)
	at org.apache.lucene.util.TestRuleStoreClassName$1.evaluate(TestRuleStoreClassName.java:41)
	at com.carrotsearch.randomizedtesting.rules.NoShadowingOrOverridesOnMethodsRule$1.evaluate(NoShadowingOrOverridesOnMethodsRule.java:40)
	at com.carrotsearch.randomizedtesting.rules.NoShadowingOrOverridesOnMethodsRule$1.evaluate(NoShadowingOrOverridesOnMethodsRule.java:40)
	at com.carrotsearch.randomizedtesting.rules.StatementAdapter.evaluate(StatementAdapter.java:36)
	at com.carrotsearch.randomizedtesting.rules.StatementAdapter.evaluate(StatementAdapter.java:36)
	at com.carrotsearch.randomizedtesting.rules.StatementAdapter.evaluate(StatementAdapter.java:36)
	at org.apache.lucene.util.TestRuleAssertionsRequired$1.evaluate(TestRuleAssertionsRequired.java:53)
	at org.apache.lucene.util.TestRuleMarkFailure$1.evaluate(TestRuleMarkFailure.java:47)
	at org.apache.lucene.util.TestRuleIgnoreAfterMaxFailures$1.evaluate(TestRuleIgnoreAfterMaxFailures.java:64)
	at org.apache.lucene.util.TestRuleIgnoreTestSuites$1.evaluate(TestRuleIgnoreTestSuites.java:54)
	at com.carrotsearch.randomizedtesting.rules.StatementAdapter.evaluate(StatementAdapter.java:36)
	at com.carrotsearch.randomizedtesting.ThreadLeakControl$StatementRunner.run(ThreadLeakControl.java:368)
	at java.lang.Thread.run(Thread.java:748)




Build Log:
[...truncated 13867 lines...]
   [junit4] Suite: org.apache.solr.cloud.hdfs.HdfsRestartWhileUpdatingTest
   [junit4]   2> 1076960 INFO  (SUITE-HdfsRestartWhileUpdatingTest-seed#[2E0D173E7C17D84F]-worker) [    ] o.a.s.SolrTestCaseJ4 SecureRandom sanity checks: test.solr.allowed.securerandom=null & java.security.egd=file:/dev/./urandom
   [junit4]   2> Creating dataDir: /x1/jenkins/jenkins-slave/workspace/Lucene-Solr-BadApples-NightlyTests-8.x/checkout/solr/build/solr-core/test/J1/temp/solr.cloud.hdfs.HdfsRestartWhileUpdatingTest_2E0D173E7C17D84F-001/init-core-data-001
   [junit4]   2> 1076992 WARN  (SUITE-HdfsRestartWhileUpdatingTest-seed#[2E0D173E7C17D84F]-worker) [    ] o.a.s.SolrTestCaseJ4 startTrackingSearchers: numOpens=2 numCloses=2
   [junit4]   2> 1077000 INFO  (SUITE-HdfsRestartWhileUpdatingTest-seed#[2E0D173E7C17D84F]-worker) [    ] o.a.s.SolrTestCaseJ4 Using PointFields (NUMERIC_POINTS_SYSPROP=true) w/NUMERIC_DOCVALUES_SYSPROP=false
   [junit4]   2> 1077002 INFO  (SUITE-HdfsRestartWhileUpdatingTest-seed#[2E0D173E7C17D84F]-worker) [    ] o.a.s.SolrTestCaseJ4 Randomized ssl (false) and clientAuth (true) via: @org.apache.solr.util.RandomizeSSL(reason=, value=NaN, ssl=NaN, clientAuth=NaN)
   [junit4]   2> 1077002 INFO  (SUITE-HdfsRestartWhileUpdatingTest-seed#[2E0D173E7C17D84F]-worker) [    ] o.a.s.BaseDistributedSearchTestCase Setting hostContext system property: /
   [junit4]   2> 1078139 WARN  (SUITE-HdfsRestartWhileUpdatingTest-seed#[2E0D173E7C17D84F]-worker) [    ] o.a.h.u.NativeCodeLoader Unable to load native-hadoop library for your platform... using builtin-java classes where applicable
   [junit4]   1> Formatting using clusterid: testClusterID
   [junit4]   2> 1079662 WARN  (SUITE-HdfsRestartWhileUpdatingTest-seed#[2E0D173E7C17D84F]-worker) [    ] o.a.h.m.i.MetricsConfig Cannot locate configuration: tried hadoop-metrics2-namenode.properties,hadoop-metrics2.properties
   [junit4]   2> 1080001 INFO  (SUITE-HdfsRestartWhileUpdatingTest-seed#[2E0D173E7C17D84F]-worker) [    ] o.m.log Logging to org.apache.logging.slf4j.Log4jLogger@5689dc2d via org.mortbay.log.Slf4jLog
   [junit4]   2> 1080060 WARN  (SUITE-HdfsRestartWhileUpdatingTest-seed#[2E0D173E7C17D84F]-worker) [    ] o.a.h.h.HttpRequestLog Jetty request log can only be enabled using Log4j
   [junit4]   2> 1080648 INFO  (SUITE-HdfsRestartWhileUpdatingTest-seed#[2E0D173E7C17D84F]-worker) [    ] o.m.log jetty-6.1.26
   [junit4]   2> 1080740 INFO  (SUITE-HdfsRestartWhileUpdatingTest-seed#[2E0D173E7C17D84F]-worker) [    ] o.m.log Extract jar:file:/x1/jenkins/.ivy2/cache/org.apache.hadoop/hadoop-hdfs/tests/hadoop-hdfs-2.7.4-tests.jar!/webapps/hdfs to ./temp/Jetty_localhost_33957_hdfs____.aymmu3/webapp
   [junit4]   2> 1081714 INFO  (SUITE-HdfsRestartWhileUpdatingTest-seed#[2E0D173E7C17D84F]-worker) [    ] o.m.log Started HttpServer2$SelectChannelConnectorWithSafeStartup@localhost:33957
   [junit4]   2> 1083116 WARN  (SUITE-HdfsRestartWhileUpdatingTest-seed#[2E0D173E7C17D84F]-worker) [    ] o.a.h.h.HttpRequestLog Jetty request log can only be enabled using Log4j
   [junit4]   2> 1083123 INFO  (SUITE-HdfsRestartWhileUpdatingTest-seed#[2E0D173E7C17D84F]-worker) [    ] o.m.log jetty-6.1.26
   [junit4]   2> 1083145 INFO  (SUITE-HdfsRestartWhileUpdatingTest-seed#[2E0D173E7C17D84F]-worker) [    ] o.m.log Extract jar:file:/x1/jenkins/.ivy2/cache/org.apache.hadoop/hadoop-hdfs/tests/hadoop-hdfs-2.7.4-tests.jar!/webapps/datanode to ./temp/Jetty_localhost_37711_datanode____lxp3bu/webapp
   [junit4]   2> 1083585 INFO  (SUITE-HdfsRestartWhileUpdatingTest-seed#[2E0D173E7C17D84F]-worker) [    ] o.m.log Started HttpServer2$SelectChannelConnectorWithSafeStartup@localhost:37711
   [junit4]   2> 1084410 WARN  (SUITE-HdfsRestartWhileUpdatingTest-seed#[2E0D173E7C17D84F]-worker) [    ] o.a.h.h.HttpRequestLog Jetty request log can only be enabled using Log4j
   [junit4]   2> 1084417 INFO  (SUITE-HdfsRestartWhileUpdatingTest-seed#[2E0D173E7C17D84F]-worker) [    ] o.m.log jetty-6.1.26
   [junit4]   2> 1084486 INFO  (SUITE-HdfsRestartWhileUpdatingTest-seed#[2E0D173E7C17D84F]-worker) [    ] o.m.log Extract jar:file:/x1/jenkins/.ivy2/cache/org.apache.hadoop/hadoop-hdfs/tests/hadoop-hdfs-2.7.4-tests.jar!/webapps/datanode to ./temp/Jetty_localhost_43628_datanode____atwu4k/webapp
   [junit4]   2> 1085202 INFO  (SUITE-HdfsRestartWhileUpdatingTest-seed#[2E0D173E7C17D84F]-worker) [    ] o.m.log Started HttpServer2$SelectChannelConnectorWithSafeStartup@localhost:43628
   [junit4]   2> 1085902 ERROR (DataNode: [[[DISK]file:/x1/jenkins/jenkins-slave/workspace/Lucene-Solr-BadApples-NightlyTests-8.x/checkout/solr/build/solr-core/test/J1/temp/solr.cloud.hdfs.HdfsRestartWhileUpdatingTest_2E0D173E7C17D84F-001/tempDir-001/hdfsBaseDir/data/data1/, [DISK]file:/x1/jenkins/jenkins-slave/workspace/Lucene-Solr-BadApples-NightlyTests-8.x/checkout/solr/build/solr-core/test/J1/temp/solr.cloud.hdfs.HdfsRestartWhileUpdatingTest_2E0D173E7C17D84F-001/tempDir-001/hdfsBaseDir/data/data2/]]  heartbeating to localhost/127.0.0.1:37384) [    ] o.a.h.h.s.d.DirectoryScanner dfs.datanode.directoryscan.throttle.limit.ms.per.sec set to value below 1 ms/sec. Assuming default value of 1000
   [junit4]   2> 1085917 ERROR (DataNode: [[[DISK]file:/x1/jenkins/jenkins-slave/workspace/Lucene-Solr-BadApples-NightlyTests-8.x/checkout/solr/build/solr-core/test/J1/temp/solr.cloud.hdfs.HdfsRestartWhileUpdatingTest_2E0D173E7C17D84F-001/tempDir-001/hdfsBaseDir/data/data3/, [DISK]file:/x1/jenkins/jenkins-slave/workspace/Lucene-Solr-BadApples-NightlyTests-8.x/checkout/solr/build/solr-core/test/J1/temp/solr.cloud.hdfs.HdfsRestartWhileUpdatingTest_2E0D173E7C17D84F-001/tempDir-001/hdfsBaseDir/data/data4/]]  heartbeating to localhost/127.0.0.1:37384) [    ] o.a.h.h.s.d.DirectoryScanner dfs.datanode.directoryscan.throttle.limit.ms.per.sec set to value below 1 ms/sec. Assuming default value of 1000
   [junit4]   2> 1086194 INFO  (Block report processor) [    ] BlockStateChange BLOCK* processReport 0x2454048bdeae55: from storage DS-42d47155-a33d-4491-8ae2-017ed58506e1 node DatanodeRegistration(127.0.0.1:34993, datanodeUuid=a0cafcd7-b37e-4093-8399-66001113d717, infoPort=33194, infoSecurePort=0, ipcPort=46454, storageInfo=lv=-56;cid=testClusterID;nsid=1119015528;c=0), blocks: 0, hasStaleStorage: true, processing time: 3 msecs
   [junit4]   2> 1086194 INFO  (Block report processor) [    ] BlockStateChange BLOCK* processReport 0x2454048bdea9cb: from storage DS-ce4516a8-fab6-42d4-b362-c149b3651ebe node DatanodeRegistration(127.0.0.1:43838, datanodeUuid=9dc8b129-35eb-4099-b359-28a1d16f7d40, infoPort=40504, infoSecurePort=0, ipcPort=44078, storageInfo=lv=-56;cid=testClusterID;nsid=1119015528;c=0), blocks: 0, hasStaleStorage: true, processing time: 0 msecs
   [junit4]   2> 1086194 INFO  (Block report processor) [    ] BlockStateChange BLOCK* processReport 0x2454048bdeae55: from storage DS-07956d48-a2c2-41e9-b0c1-2ca1100b0916 node DatanodeRegistration(127.0.0.1:34993, datanodeUuid=a0cafcd7-b37e-4093-8399-66001113d717, infoPort=33194, infoSecurePort=0, ipcPort=46454, storageInfo=lv=-56;cid=testClusterID;nsid=1119015528;c=0), blocks: 0, hasStaleStorage: false, processing time: 0 msecs
   [junit4]   2> 1086194 INFO  (Block report processor) [    ] BlockStateChange BLOCK* processReport 0x2454048bdea9cb: from storage DS-1cd8e89e-cb84-4da1-ab7e-197ccba9f14d node DatanodeRegistration(127.0.0.1:43838, datanodeUuid=9dc8b129-35eb-4099-b359-28a1d16f7d40, infoPort=40504, infoSecurePort=0, ipcPort=44078, storageInfo=lv=-56;cid=testClusterID;nsid=1119015528;c=0), blocks: 0, hasStaleStorage: false, processing time: 0 msecs
   [junit4]   2> 1087125 INFO  (TEST-HdfsRestartWhileUpdatingTest.test-seed#[2E0D173E7C17D84F]) [    ] o.a.s.c.ZkTestServer STARTING ZK TEST SERVER
   [junit4]   2> 1087125 INFO  (ZkTestServer Run Thread) [    ] o.a.s.c.ZkTestServer client port:0.0.0.0/0.0.0.0:0
   [junit4]   2> 1087125 INFO  (ZkTestServer Run Thread) [    ] o.a.s.c.ZkTestServer Starting server
   [junit4]   2> 1087225 INFO  (TEST-HdfsRestartWhileUpdatingTest.test-seed#[2E0D173E7C17D84F]) [    ] o.a.s.c.ZkTestServer start zk server on port:42433
   [junit4]   2> 1087225 INFO  (TEST-HdfsRestartWhileUpdatingTest.test-seed#[2E0D173E7C17D84F]) [    ] o.a.s.c.ZkTestServer parse host and port list: 127.0.0.1:42433
   [junit4]   2> 1087225 INFO  (TEST-HdfsRestartWhileUpdatingTest.test-seed#[2E0D173E7C17D84F]) [    ] o.a.s.c.ZkTestServer connecting to 127.0.0.1 42433
   [junit4]   2> 1087245 INFO  (zkConnectionManagerCallback-3352-thread-1) [    ] o.a.s.c.c.ConnectionManager zkClient has connected
   [junit4]   2> 1087259 INFO  (zkConnectionManagerCallback-3354-thread-1) [    ] o.a.s.c.c.ConnectionManager zkClient has connected
   [junit4]   2> 1087262 INFO  (TEST-HdfsRestartWhileUpdatingTest.test-seed#[2E0D173E7C17D84F]) [    ] o.a.s.c.ZkTestServer put /x1/jenkins/jenkins-slave/workspace/Lucene-Solr-BadApples-NightlyTests-8.x/checkout/solr/core/src/test-files/solr/collection1/conf/solrconfig-tlog.xml to /configs/conf1/solrconfig.xml
   [junit4]   2> 1087264 INFO  (TEST-HdfsRestartWhileUpdatingTest.test-seed#[2E0D173E7C17D84F]) [    ] o.a.s.c.ZkTestServer put /x1/jenkins/jenkins-slave/workspace/Lucene-Solr-BadApples-NightlyTests-8.x/checkout/solr/core/src/test-files/solr/collection1/conf/schema15.xml to /configs/conf1/schema.xml
   [junit4]   2> 1087270 INFO  (TEST-HdfsRestartWhileUpdatingTest.test-seed#[2E0D173E7C17D84F]) [    ] o.a.s.c.ZkTestServer put /x1/jenkins/jenkins-slave/workspace/Lucene-Solr-BadApples-NightlyTests-8.x/checkout/solr/core/src/test-files/solr/collection1/conf/solrconfig.snippet.randomindexconfig.xml to /configs/conf1/solrconfig.snippet.randomindexconfig.xml
   [junit4]   2> 1087294 INFO  (TEST-HdfsRestartWhileUpdatingTest.test-seed#[2E0D173E7C17D84F]) [    ] o.a.s.c.ZkTestServer put /x1/jenkins/jenkins-slave/workspace/Lucene-Solr-BadApples-NightlyTests-8.x/checkout/solr/core/src/test-files/solr/collection1/conf/stopwords.txt to /configs/conf1/stopwords.txt
   [junit4]   2> 1087303 INFO  (TEST-HdfsRestartWhileUpdatingTest.test-seed#[2E0D173E7C17D84F]) [    ] o.a.s.c.ZkTestServer put /x1/jenkins/jenkins-slave/workspace/Lucene-Solr-BadApples-NightlyTests-8.x/checkout/solr/core/src/test-files/solr/collection1/conf/protwords.txt to /configs/conf1/protwords.txt
   [junit4]   2> 1087305 INFO  (TEST-HdfsRestartWhileUpdatingTest.test-seed#[2E0D173E7C17D84F]) [    ] o.a.s.c.ZkTestServer put /x1/jenkins/jenkins-slave/workspace/Lucene-Solr-BadApples-NightlyTests-8.x/checkout/solr/core/src/test-files/solr/collection1/conf/currency.xml to /configs/conf1/currency.xml
   [junit4]   2> 1087306 INFO  (TEST-HdfsRestartWhileUpdatingTest.test-seed#[2E0D173E7C17D84F]) [    ] o.a.s.c.ZkTestServer put /x1/jenkins/jenkins-slave/workspace/Lucene-Solr-BadApples-NightlyTests-8.x/checkout/solr/core/src/test-files/solr/collection1/conf/enumsConfig.xml to /configs/conf1/enumsConfig.xml
   [junit4]   2> 1087308 INFO  (TEST-HdfsRestartWhileUpdatingTest.test-seed#[2E0D173E7C17D84F]) [    ] o.a.s.c.ZkTestServer put /x1/jenkins/jenkins-slave/workspace/Lucene-Solr-BadApples-NightlyTests-8.x/checkout/solr/core/src/test-files/solr/collection1/conf/open-exchange-rates.json to /configs/conf1/open-exchange-rates.json
   [junit4]   2> 1087309 INFO  (TEST-HdfsRestartWhileUpdatingTest.test-seed#[2E0D173E7C17D84F]) [    ] o.a.s.c.ZkTestServer put /x1/jenkins/jenkins-slave/workspace/Lucene-Solr-BadApples-NightlyTests-8.x/checkout/solr/core/src/test-files/solr/collection1/conf/mapping-ISOLatin1Accent.txt to /configs/conf1/mapping-ISOLatin1Accent.txt
   [junit4]   2> 1087310 INFO  (TEST-HdfsRestartWhileUpdatingTest.test-seed#[2E0D173E7C17D84F]) [    ] o.a.s.c.ZkTestServer put /x1/jenkins/jenkins-slave/workspace/Lucene-Solr-BadApples-NightlyTests-8.x/checkout/solr/core/src/test-files/solr/collection1/conf/old_synonyms.txt to /configs/conf1/old_synonyms.txt
   [junit4]   2> 1087312 INFO  (TEST-HdfsRestartWhileUpdatingTest.test-seed#[2E0D173E7C17D84F]) [    ] o.a.s.c.ZkTestServer put /x1/jenkins/jenkins-slave/workspace/Lucene-Solr-BadApples-NightlyTests-8.x/checkout/solr/core/src/test-files/solr/collection1/conf/synonyms.txt to /configs/conf1/synonyms.txt
   [junit4]   2> 1087313 INFO  (TEST-HdfsRestartWhileUpdatingTest.test-seed#[2E0D173E7C17D84F]) [    ] o.a.s.c.AbstractFullDistribZkTestBase Will use NRT replicas unless explicitly asked otherwise
   [junit4]   2> 1087562 WARN  (TEST-HdfsRestartWhileUpdatingTest.test-seed#[2E0D173E7C17D84F]) [    ] o.e.j.s.AbstractConnector Ignoring deprecated socket close linger time
   [junit4]   2> 1087563 INFO  (TEST-HdfsRestartWhileUpdatingTest.test-seed#[2E0D173E7C17D84F]) [    ] o.a.s.c.s.e.JettySolrRunner Start Jetty (original configured port=0)
   [junit4]   2> 1087563 INFO  (TEST-HdfsRestartWhileUpdatingTest.test-seed#[2E0D173E7C17D84F]) [    ] o.a.s.c.s.e.JettySolrRunner Trying to start Jetty on port 0 try number 1 ...
   [junit4]   2> 1087563 INFO  (TEST-HdfsRestartWhileUpdatingTest.test-seed#[2E0D173E7C17D84F]) [    ] o.e.j.s.Server jetty-9.4.14.v20181114; built: 2018-11-14T21:20:31.478Z; git: c4550056e785fb5665914545889f21dc136ad9e6; jvm 1.8.0_191-b12
   [junit4]   2> 1087565 INFO  (TEST-HdfsRestartWhileUpdatingTest.test-seed#[2E0D173E7C17D84F]) [    ] o.e.j.s.session DefaultSessionIdManager workerName=node0
   [junit4]   2> 1087565 INFO  (TEST-HdfsRestartWhileUpdatingTest.test-seed#[2E0D173E7C17D84F]) [    ] o.e.j.s.session No SessionScavenger set, using defaults
   [junit4]   2> 1087565 INFO  (TEST-HdfsRestartWhileUpdatingTest.test-seed#[2E0D173E7C17D84F]) [    ] o.e.j.s.session node0 Scavenging every 660000ms
   [junit4]   2> 1087565 INFO  (TEST-HdfsRestartWhileUpdatingTest.test-seed#[2E0D173E7C17D84F]) [    ] o.e.j.s.h.ContextHandler Started o.e.j.s.ServletContextHandler@72f2c76b{/,null,AVAILABLE}
   [junit4]   2> 1087566 INFO  (TEST-HdfsRestartWhileUpdatingTest.test-seed#[2E0D173E7C17D84F]) [    ] o.e.j.s.AbstractConnector Started ServerConnector@587e7d4d{HTTP/1.1,[http/1.1, h2c]}{127.0.0.1:36019}
   [junit4]   2> 1087566 INFO  (TEST-HdfsRestartWhileUpdatingTest.test-seed#[2E0D173E7C17D84F]) [    ] o.e.j.s.Server Started @1087680ms
   [junit4]   2> 1087566 INFO  (TEST-HdfsRestartWhileUpdatingTest.test-seed#[2E0D173E7C17D84F]) [    ] o.a.s.c.s.e.JettySolrRunner Jetty properties: {solr.data.dir=hdfs://localhost:37384/hdfs__localhost_37384__x1_jenkins_jenkins-slave_workspace_Lucene-Solr-BadApples-NightlyTests-8.x_checkout_solr_build_solr-core_test_J1_temp_solr.cloud.hdfs.HdfsRestartWhileUpdatingTest_2E0D173E7C17D84F-001_tempDir-002_control_data, replicaType=NRT, hostContext=/, hostPort=36019, coreRootDirectory=/x1/jenkins/jenkins-slave/workspace/Lucene-Solr-BadApples-NightlyTests-8.x/checkout/solr/build/solr-core/test/J1/../../../../../../../../../../../x1/jenkins/jenkins-slave/workspace/Lucene-Solr-BadApples-NightlyTests-8.x/checkout/solr/build/solr-core/test/J1/temp/solr.cloud.hdfs.HdfsRestartWhileUpdatingTest_2E0D173E7C17D84F-001/control-001/cores}
   [junit4]   2> 1087566 ERROR (TEST-HdfsRestartWhileUpdatingTest.test-seed#[2E0D173E7C17D84F]) [    ] o.a.s.u.StartupLoggingUtils Missing Java Option solr.log.dir. Logging may be missing or incomplete.
   [junit4]   2> 1087566 INFO  (TEST-HdfsRestartWhileUpdatingTest.test-seed#[2E0D173E7C17D84F]) [    ] o.a.s.s.SolrDispatchFilter Using logger factory org.apache.logging.slf4j.Log4jLoggerFactory
   [junit4]   2> 1087566 INFO  (TEST-HdfsRestartWhileUpdatingTest.test-seed#[2E0D173E7C17D84F]) [    ] o.a.s.s.SolrDispatchFilter  ___      _       Welcome to Apache Solr™ version 8.0.0
   [junit4]   2> 1087566 INFO  (TEST-HdfsRestartWhileUpdatingTest.test-seed#[2E0D173E7C17D84F]) [    ] o.a.s.s.SolrDispatchFilter / __| ___| |_ _   Starting in cloud mode on port null
   [junit4]   2> 1087567 INFO  (TEST-HdfsRestartWhileUpdatingTest.test-seed#[2E0D173E7C17D84F]) [    ] o.a.s.s.SolrDispatchFilter \__ \/ _ \ | '_|  Install dir: null
   [junit4]   2> 1087567 INFO  (TEST-HdfsRestartWhileUpdatingTest.test-seed#[2E0D173E7C17D84F]) [    ] o.a.s.s.SolrDispatchFilter |___/\___/_|_|    Start time: 2019-02-02T06:58:37.212Z
   [junit4]   2> 1087602 INFO  (zkConnectionManagerCallback-3356-thread-1) [    ] o.a.s.c.c.ConnectionManager zkClient has connected
   [junit4]   2> 1087604 INFO  (TEST-HdfsRestartWhileUpdatingTest.test-seed#[2E0D173E7C17D84F]) [    ] o.a.s.s.SolrDispatchFilter Loading solr.xml from SolrHome (not found in ZooKeeper)
   [junit4]   2> 1087604 INFO  (TEST-HdfsRestartWhileUpdatingTest.test-seed#[2E0D173E7C17D84F]) [    ] o.a.s.c.SolrXmlConfig Loading container configuration from /x1/jenkins/jenkins-slave/workspace/Lucene-Solr-BadApples-NightlyTests-8.x/checkout/solr/build/solr-core/test/J1/temp/solr.cloud.hdfs.HdfsRestartWhileUpdatingTest_2E0D173E7C17D84F-001/control-001/solr.xml
   [junit4]   2> 1087613 INFO  (TEST-HdfsRestartWhileUpdatingTest.test-seed#[2E0D173E7C17D84F]) [    ] o.a.s.c.SolrXmlConfig Configuration parameter autoReplicaFailoverWorkLoopDelay is ignored
   [junit4]   2> 1087613 INFO  (TEST-HdfsRestartWhileUpdatingTest.test-seed#[2E0D173E7C17D84F]) [    ] o.a.s.c.SolrXmlConfig Configuration parameter autoReplicaFailoverBadNodeExpiration is ignored
   [junit4]   2> 1087623 INFO  (TEST-HdfsRestartWhileUpdatingTest.test-seed#[2E0D173E7C17D84F]) [    ] o.a.s.c.SolrXmlConfig MBean server found: com.sun.jmx.mbeanserver.JmxMBeanServer@3cfb3832, but no JMX reporters were configured - adding default JMX reporter.
   [junit4]   2> 1087977 INFO  (TEST-HdfsRestartWhileUpdatingTest.test-seed#[2E0D173E7C17D84F]) [    ] o.a.s.h.c.HttpShardHandlerFactory Host whitelist initialized: WhitelistHostChecker [whitelistHosts=null, whitelistHostCheckingEnabled=false]
   [junit4]   2> 1087993 WARN  (TEST-HdfsRestartWhileUpdatingTest.test-seed#[2E0D173E7C17D84F]) [    ] o.e.j.u.s.S.config No Client EndPointIdentificationAlgorithm configured for SslContextFactory@640f0720[provider=null,keyStore=null,trustStore=null]
   [junit4]   2> 1088016 WARN  (TEST-HdfsRestartWhileUpdatingTest.test-seed#[2E0D173E7C17D84F]) [    ] o.e.j.u.s.S.config No Client EndPointIdentificationAlgorithm configured for SslContextFactory@78f0011e[provider=null,keyStore=null,trustStore=null]
   [junit4]   2> 1088018 INFO  (TEST-HdfsRestartWhileUpdatingTest.test-seed#[2E0D173E7C17D84F]) [    ] o.a.s.c.ZkContainer Zookeeper client=127.0.0.1:42433/solr
   [junit4]   2> 1088024 INFO  (zkConnectionManagerCallback-3362-thread-1) [    ] o.a.s.c.c.ConnectionManager zkClient has connected
   [junit4]   2> 1088030 INFO  (zkConnectionManagerCallback-3364-thread-1) [    ] o.a.s.c.c.ConnectionManager zkClient has connected
   [junit4]   2> 1088151 INFO  (TEST-HdfsRestartWhileUpdatingTest.test-seed#[2E0D173E7C17D84F]) [n:127.0.0.1:36019_    ] o.a.s.c.OverseerElectionContext I am going to be the leader 127.0.0.1:36019_
   [junit4]   2> 1088152 INFO  (TEST-HdfsRestartWhileUpdatingTest.test-seed#[2E0D173E7C17D84F]) [n:127.0.0.1:36019_    ] o.a.s.c.Overseer Overseer (id=72727731004964868-127.0.0.1:36019_-n_0000000000) starting
   [junit4]   2> 1088173 INFO  (zkConnectionManagerCallback-3371-thread-1) [    ] o.a.s.c.c.ConnectionManager zkClient has connected
   [junit4]   2> 1088178 INFO  (TEST-HdfsRestartWhileUpdatingTest.test-seed#[2E0D173E7C17D84F]) [n:127.0.0.1:36019_    ] o.a.s.c.s.i.ZkClientClusterStateProvider Cluster at 127.0.0.1:42433/solr ready
   [junit4]   2> 1088179 INFO  (TEST-HdfsRestartWhileUpdatingTest.test-seed#[2E0D173E7C17D84F]) [n:127.0.0.1:36019_    ] o.a.s.c.ZkController Register node as live in ZooKeeper:/live_nodes/127.0.0.1:36019_
   [junit4]   2> 1088180 INFO  (OverseerStateUpdate-72727731004964868-127.0.0.1:36019_-n_0000000000) [n:127.0.0.1:36019_    ] o.a.s.c.Overseer Starting to work on the main queue : 127.0.0.1:36019_
   [junit4]   2> 1088181 INFO  (zkCallback-3370-thread-1) [    ] o.a.s.c.c.ZkStateReader Updated live nodes from ZooKeeper... (0) -> (1)
   [junit4]   2> 1088187 INFO  (zkCallback-3363-thread-1) [    ] o.a.s.c.c.ZkStateReader Updated live nodes from ZooKeeper... (0) -> (1)
   [junit4]   2> 1088241 INFO  (TEST-HdfsRestartWhileUpdatingTest.test-seed#[2E0D173E7C17D84F]) [n:127.0.0.1:36019_    ] o.a.s.h.a.MetricsHistoryHandler No .system collection, keeping metrics history in memory.
   [junit4]   2> 1088299 INFO  (TEST-HdfsRestartWhileUpdatingTest.test-seed#[2E0D173E7C17D84F]) [n:127.0.0.1:36019_    ] o.a.s.m.r.SolrJmxReporter JMX monitoring for 'solr.node' (registry 'solr.node') enabled at server: com.sun.jmx.mbeanserver.JmxMBeanServer@3cfb3832
   [junit4]   2> 1088318 INFO  (TEST-HdfsRestartWhileUpdatingTest.test-seed#[2E0D173E7C17D84F]) [n:127.0.0.1:36019_    ] o.a.s.m.r.SolrJmxReporter JMX monitoring for 'solr.jvm' (registry 'solr.jvm') enabled at server: com.sun.jmx.mbeanserver.JmxMBeanServer@3cfb3832
   [junit4]   2> 1088319 INFO  (TEST-HdfsRestartWhileUpdatingTest.test-seed#[2E0D173E7C17D84F]) [n:127.0.0.1:36019_    ] o.a.s.m.r.SolrJmxReporter JMX monitoring for 'solr.jetty' (registry 'solr.jetty') enabled at server: com.sun.jmx.mbeanserver.JmxMBeanServer@3cfb3832
   [junit4]   2> 1088321 INFO  (TEST-HdfsRestartWhileUpdatingTest.test-seed#[2E0D173E7C17D84F]) [n:127.0.0.1:36019_    ] o.a.s.c.CorePropertiesLocator Found 0 core definitions underneath /x1/jenkins/jenkins-slave/workspace/Lucene-Solr-BadApples-NightlyTests-8.x/checkout/solr/build/solr-core/test/J1/../../../../../../../../../../../x1/jenkins/jenkins-slave/workspace/Lucene-Solr-BadApples-NightlyTests-8.x/checkout/solr/build/solr-core/test/J1/temp/solr.cloud.hdfs.HdfsRestartWhileUpdatingTest_2E0D173E7C17D84F-001/control-001/cores
   [junit4]   2> 1088356 INFO  (zkConnectionManagerCallback-3377-thread-1) [    ] o.a.s.c.c.ConnectionManager zkClient has connected
   [junit4]   2> 1088358 INFO  (TEST-HdfsRestartWhileUpdatingTest.test-seed#[2E0D173E7C17D84F]) [    ] o.a.s.c.c.ZkStateReader Updated live nodes from ZooKeeper... (0) -> (1)
   [junit4]   2> 1088359 INFO  (TEST-HdfsRestartWhileUpdatingTest.test-seed#[2E0D173E7C17D84F]) [    ] o.a.s.c.s.i.ZkClientClusterStateProvider Cluster at 127.0.0.1:42433/solr ready
   [junit4]   2> 1088361 INFO  (qtp1449730296-10590) [n:127.0.0.1:36019_    ] o.a.s.h.a.CollectionsHandler Invoked Collection Action :create with params collection.configName=conf1&name=control_collection&nrtReplicas=1&action=CREATE&numShards=1&createNodeSet=127.0.0.1:36019_&wt=javabin&version=2 and sendToOCPQueue=true
   [junit4]   2> 1088370 INFO  (OverseerThreadFactory-4016-thread-1-processing-n:127.0.0.1:36019_) [n:127.0.0.1:36019_    ] o.a.s.c.a.c.CreateCollectionCmd Create collection control_collection
   [junit4]   2> 1088486 INFO  (qtp1449730296-10592) [n:127.0.0.1:36019_    ] o.a.s.s.HttpSolrCall [admin] webapp=null path=/admin/metrics params={prefix=CONTAINER.fs.usableSpace,CONTAINER.fs.totalSpace,CORE.coreName&wt=javabin&version=2&group=solr.node,solr.core} status=0 QTime=0
   [junit4]   2> 1088487 INFO  (qtp1449730296-10593) [n:127.0.0.1:36019_    ] o.a.s.s.HttpSolrCall [admin] webapp=null path=/admin/metrics params={prefix=CONTAINER.fs.usableSpace,CONTAINER.fs.totalSpace,CORE.coreName&wt=javabin&version=2&group=solr.node,solr.core} status=0 QTime=0
   [junit4]   2> 1088489 INFO  (qtp1449730296-10589) [n:127.0.0.1:36019_    ] o.a.s.s.HttpSolrCall [admin] webapp=null path=/admin/metrics params={prefix=CONTAINER.fs.usableSpace,CONTAINER.fs.totalSpace,CORE.coreName&wt=javabin&version=2&group=solr.node,solr.core} status=0 QTime=0
   [junit4]   2> 1088490 INFO  (qtp1449730296-10591) [n:127.0.0.1:36019_    ] o.a.s.s.HttpSolrCall [admin] webapp=null path=/admin/metrics params={prefix=CONTAINER.fs.usableSpace,CONTAINER.fs.totalSpace,CORE.coreName&wt=javabin&version=2&group=solr.node,solr.core} status=0 QTime=0
   [junit4]   2> 1088491 INFO  (qtp1449730296-10592) [n:127.0.0.1:36019_    ] o.a.s.s.HttpSolrCall [admin] webapp=null path=/admin/metrics params={prefix=CONTAINER.fs.usableSpace,CONTAINER.fs.totalSpace,CORE.coreName&wt=javabin&version=2&group=solr.node,solr.core} status=0 QTime=0
   [junit4]   2> 1088498 INFO  (qtp1449730296-10593) [n:127.0.0.1:36019_    x:control_collection_shard1_replica_n1] o.a.s.h.a.CoreAdminOperation core create command qt=/admin/cores&collection.configName=conf1&newCollection=true&name=control_collection_shard1_replica_n1&action=CREATE&numShards=1&collection=control_collection&shard=shard1&wt=javabin&version=2&replicaType=NRT
   [junit4]   2> 1088499 INFO  (qtp1449730296-10593) [n:127.0.0.1:36019_    x:control_collection_shard1_replica_n1] o.a.s.c.TransientSolrCoreCacheDefault Allocating transient cache for 4 transient cores
   [junit4]   2> 1089546 INFO  (qtp1449730296-10593) [n:127.0.0.1:36019_ c:control_collection s:shard1  x:control_collection_shard1_replica_n1] o.a.s.c.SolrConfig Using Lucene MatchVersion: 8.0.0
   [junit4]   2> 1089587 INFO  (qtp1449730296-10593) [n:127.0.0.1:36019_ c:control_collection s:shard1  x:control_collection_shard1_replica_n1] o.a.s.s.IndexSchema [control_collection_shard1_replica_n1] Schema name=test
   [junit4]   2> 1089731 INFO  (qtp1449730296-10593) [n:127.0.0.1:36019_ c:control_collection s:shard1  x:control_collection_shard1_replica_n1] o.a.s.s.IndexSchema Loaded schema test/1.6 with uniqueid field id
   [junit4]   2> 1089756 INFO  (qtp1449730296-10593) [n:127.0.0.1:36019_ c:control_collection s:shard1  x:control_collection_shard1_replica_n1] o.a.s.c.CoreContainer Creating SolrCore 'control_collection_shard1_replica_n1' using configuration from collection control_collection, trusted=true
   [junit4]   2> 1089757 INFO  (qtp1449730296-10593) [n:127.0.0.1:36019_ c:control_collection s:shard1  x:control_collection_shard1_replica_n1] o.a.s.m.r.SolrJmxReporter JMX monitoring for 'solr.core.control_collection.shard1.replica_n1' (registry 'solr.core.control_collection.shard1.replica_n1') enabled at server: com.sun.jmx.mbeanserver.JmxMBeanServer@3cfb3832
   [junit4]   2> 1089757 INFO  (qtp1449730296-10593) [n:127.0.0.1:36019_ c:control_collection s:shard1  x:control_collection_shard1_replica_n1] o.a.s.c.SolrCore [[control_collection_shard1_replica_n1] ] Opening new SolrCore at [/x1/jenkins/jenkins-slave/workspace/Lucene-Solr-BadApples-NightlyTests-8.x/checkout/solr/build/solr-core/test/J1/temp/solr.cloud.hdfs.HdfsRestartWhileUpdatingTest_2E0D173E7C17D84F-001/control-001/cores/control_collection_shard1_replica_n1], dataDir=[/x1/jenkins/jenkins-slave/workspace/Lucene-Solr-BadApples-NightlyTests-8.x/checkout/solr/build/solr-core/test/J1/../../../../../../../../../../../x1/jenkins/jenkins-slave/workspace/Lucene-Solr-BadApples-NightlyTests-8.x/checkout/solr/build/solr-core/test/J1/temp/solr.cloud.hdfs.HdfsRestartWhileUpdatingTest_2E0D173E7C17D84F-001/control-001/cores/control_collection_shard1_replica_n1/data/]
   [junit4]   2> 1089762 INFO  (qtp1449730296-10593) [n:127.0.0.1:36019_ c:control_collection s:shard1  x:control_collection_shard1_replica_n1] o.a.s.u.RandomMergePolicy RandomMergePolicy wrapping class org.apache.lucene.index.TieredMergePolicy: [TieredMergePolicy: maxMergeAtOnce=12, maxMergeAtOnceExplicit=22, maxMergedSegmentMB=93.8671875, floorSegmentMB=0.4306640625, forceMergeDeletesPctAllowed=16.99785388532473, segmentsPerTier=33.0, maxCFSSegmentSizeMB=8.796093022207999E12, noCFSRatio=1.0, deletesPctAllowed=21.17305630026683
   [junit4]   2> 1089774 WARN  (qtp1449730296-10593) [n:127.0.0.1:36019_ c:control_collection s:shard1  x:control_collection_shard1_replica_n1] o.a.s.c.RequestHandlers INVALID paramSet a in requestHandler {type = requestHandler,name = /dump,class = DumpRequestHandler,attributes = {initParams=a, name=/dump, class=DumpRequestHandler},args = {defaults={a=A,b=B}}}
   [junit4]   2> 1089865 INFO  (qtp1449730296-10593) [n:127.0.0.1:36019_ c:control_collection s:shard1  x:control_collection_shard1_replica_n1] o.a.s.u.UpdateHandler Using UpdateLog implementation: org.apache.solr.update.UpdateLog
   [junit4]   2> 1089865 INFO  (qtp1449730296-10593) [n:127.0.0.1:36019_ c:control_collection s:shard1  x:control_collection_shard1_replica_n1] o.a.s.u.UpdateLog Initializing UpdateLog: dataDir= defaultSyncLevel=FLUSH numRecordsToKeep=100 maxNumLogsToKeep=10 numVersionBuckets=65536
   [junit4]   2> 1089868 INFO  (qtp1449730296-10593) [n:127.0.0.1:36019_ c:control_collection s:shard1  x:control_collection_shard1_replica_n1] o.a.s.u.CommitTracker Hard AutoCommit: if uncommitted for 30000ms; 
   [junit4]   2> 1089868 INFO  (qtp1449730296-10593) [n:127.0.0.1:36019_ c:control_collection s:shard1  x:control_collection_shard1_replica_n1] o.a.s.u.CommitTracker Soft AutoCommit: if uncommitted for 3000ms; 
   [junit4]   2> 1089871 INFO  (qtp1449730296-10593) [n:127.0.0.1:36019_ c:control_collection s:shard1  x:control_collection_shard1_replica_n1] o.a.s.u.RandomMergePolicy RandomMergePolicy wrapping class org.apache.lucene.index.LogByteSizeMergePolicy: [LogByteSizeMergePolicy: minMergeSize=1677721, mergeFactor=2, maxMergeSize=2147483648, maxMergeSizeForForcedMerge=9223372036854775807, calibrateSizeByDeletes=false, maxMergeDocs=2147483647, maxCFSSegmentSizeMB=8.796093022207999E12, noCFSRatio=1.0]
   [junit4]   2> 1089872 INFO  (qtp1449730296-10593) [n:127.0.0.1:36019_ c:control_collection s:shard1  x:control_collection_shard1_replica_n1] o.a.s.s.SolrIndexSearcher Opening [Searcher@6ea52bb1[control_collection_shard1_replica_n1] main]
   [junit4]   2> 1089879 INFO  (qtp1449730296-10593) [n:127.0.0.1:36019_ c:control_collection s:shard1  x:control_collection_shard1_replica_n1] o.a.s.r.ManagedResourceStorage Configured ZooKeeperStorageIO with znodeBase: /configs/conf1
   [junit4]   2> 1089880 INFO  (qtp1449730296-10593) [n:127.0.0.1:36019_ c:control_collection s:shard1  x:control_collection_shard1_replica_n1] o.a.s.r.ManagedResourceStorage Loaded null at path _rest_managed.json using ZooKeeperStorageIO:path=/configs/conf1
   [junit4]   2> 1089881 INFO  (qtp1449730296-10593) [n:127.0.0.1:36019_ c:control_collection s:shard1  x:control_collection_shard1_replica_n1] o.a.s.h.ReplicationHandler Commits will be reserved for 10000ms.
   [junit4]   2> 1089881 INFO  (qtp1449730296-10593) [n:127.0.0.1:36019_ c:control_collection s:shard1  x:control_collection_shard1_replica_n1] o.a.s.u.UpdateLog Could not find max version in index or recent updates, using new clock 1624339350317694976
   [junit4]   2> 1089887 INFO  (searcherExecutor-4021-thread-1-processing-n:127.0.0.1:36019_ x:control_collection_shard1_replica_n1 c:control_collection s:shard1) [n:127.0.0.1:36019_ c:control_collection s:shard1  x:control_collection_shard1_replica_n1] o.a.s.c.SolrCore [control_collection_shard1_replica_n1] Registered new searcher Searcher@6ea52bb1[control_collection_shard1_replica_n1] main{ExitableDirectoryReader(UninvertingDirectoryReader())}
   [junit4]   2> 1089892 INFO  (qtp1449730296-10593) [n:127.0.0.1:36019_ c:control_collection s:shard1  x:control_collection_shard1_replica_n1] o.a.s.c.ZkShardTerms Successful update of terms at /collections/control_collection/terms/shard1 to Terms{values={core_node2=0}, version=0}
   [junit4]   2> 1089892 INFO  (qtp1449730296-10593) [n:127.0.0.1:36019_ c:control_collection s:shard1  x:control_collection_shard1_replica_n1] o.a.s.c.ShardLeaderElectionContextBase make sure parent is created /collections/control_collection/leaders/shard1
   [junit4]   2> 1089897 INFO  (qtp1449730296-10593) [n:127.0.0.1:36019_ c:control_collection s:shard1  x:control_collection_shard1_replica_n1] o.a.s.c.ShardLeaderElectionContext Enough replicas found to continue.
   [junit4]   2> 1089898 INFO  (qtp1449730296-10593) [n:127.0.0.1:36019_ c:control_collection s:shard1  x:control_collection_shard1_replica_n1] o.a.s.c.ShardLeaderElectionContext I may be the new leader - try and sync
   [junit4]   2> 1089898 INFO  (qtp1449730296-10593) [n:127.0.0.1:36019_ c:control_collection s:shard1  x:control_collection_shard1_replica_n1] o.a.s.c.SyncStrategy Sync replicas to http://127.0.0.1:36019/control_collection_shard1_replica_n1/
   [junit4]   2> 1089898 INFO  (qtp1449730296-10593) [n:127.0.0.1:36019_ c:control_collection s:shard1  x:control_collection_shard1_replica_n1] o.a.s.c.SyncStrategy Sync Success - now sync replicas to me
   [junit4]   2> 1089899 INFO  (qtp1449730296-10593) [n:127.0.0.1:36019_ c:control_collection s:shard1  x:control_collection_shard1_replica_n1] o.a.s.c.SyncStrategy http://127.0.0.1:36019/control_collection_shard1_replica_n1/ has no replicas
   [junit4]   2> 1089899 INFO  (qtp1449730296-10593) [n:127.0.0.1:36019_ c:control_collection s:shard1  x:control_collection_shard1_replica_n1] o.a.s.c.ShardLeaderElectionContextBase Creating leader registration node /collections/control_collection/leaders/shard1/leader after winning as /collections/control_collection/leader_elect/shard1/election/72727731004964868-core_node2-n_0000000000
   [junit4]   2> 1089902 INFO  (qtp1449730296-10593) [n:127.0.0.1:36019_ c:control_collection s:shard1  x:control_collection_shard1_replica_n1] o.a.s.c.ShardLeaderElectionContext I am the new leader: http://127.0.0.1:36019/control_collection_shard1_replica_n1/ shard1
   [junit4]   2> 1090004 INFO  (zkCallback-3363-thread-1) [    ] o.a.s.c.c.ZkStateReader A cluster state change: [WatchedEvent state:SyncConnected type:NodeDataChanged path:/collections/control_collection/state.json] for collection [control_collection] has occurred - updating... (live nodes size: [1])
   [junit4]   2> 1090005 INFO  (qtp1449730296-10593) [n:127.0.0.1:36019_ c:control_collection s:shard1  x:control_collection_shard1_replica_n1] o.a.s.c.ZkController I am the leader, no recovery necessary
   [junit4]   2> 1090007 INFO  (qtp1449730296-10593) [n:127.0.0.1:36019_ c:control_collection s:shard1  x:control_collection_shard1_replica_n1] o.a.s.s.HttpSolrCall [admin] webapp=null path=/admin/cores params={qt=/admin/cores&collection.configName=conf1&newCollection=true&name=control_collection_shard1_replica_n1&action=CREATE&numShards=1&collection=control_collection&shard=shard1&wt=javabin&version=2&replicaType=NRT} status=0 QTime=1509
   [junit4]   2> 1090011 INFO  (qtp1449730296-10590) [n:127.0.0.1:36019_    ] o.a.s.h.a.CollectionsHandler Wait for new collection to be active for at most 45 seconds. Check all shard replicas
   [junit4]   2> 1090107 INFO  (zkCallback-3363-thread-2) [    ] o.a.s.c.c.ZkStateReader A cluster state change: [WatchedEvent state:SyncConnected type:NodeDataChanged path:/collections/control_collection/state.json] for collection [control_collection] has occurred - updating... (live nodes size: [1])
   [junit4]   2> 1090108 INFO  (zkCallback-3363-thread-1) [    ] o.a.s.c.c.ZkStateReader A cluster state change: [WatchedEvent state:SyncConnected type:NodeDataChanged path:/collections/control_collection/state.json] for collection [control_collection] has occurred - updating... (live nodes size: [1])
   [junit4]   2> 1090108 INFO  (qtp1449730296-10590) [n:127.0.0.1:36019_    ] o.a.s.s.HttpSolrCall [admin] webapp=null path=/admin/collections params={collection.configName=conf1&name=control_collection&nrtReplicas=1&action=CREATE&numShards=1&createNodeSet=127.0.0.1:36019_&wt=javabin&version=2} status=0 QTime=1747
   [junit4]   2> 1090110 WARN  (NIOServerCxn.Factory:0.0.0.0/0.0.0.0:0) [    ] o.a.z.s.NIOServerCnxn Unable to read additional data from client sessionid 0x102617c6bdf0006, likely client has closed socket
   [junit4]   2> 1090119 INFO  (zkConnectionManagerCallback-3383-thread-1) [    ] o.a.s.c.c.ConnectionManager zkClient has connected
   [junit4]   2> 1090121 INFO  (TEST-HdfsRestartWhileUpdatingTest.test-seed#[2E0D173E7C17D84F]) [    ] o.a.s.c.c.ZkStateReader Updated live nodes from ZooKeeper... (0) -> (1)
   [junit4]   2> 1090123 INFO  (TEST-HdfsRestartWhileUpdatingTest.test-seed#[2E0D173E7C17D84F]) [    ] o.a.s.c.s.i.ZkClientClusterStateProvider Cluster at 127.0.0.1:42433/solr ready
   [junit4]   2> 1090123 INFO  (TEST-HdfsRestartWhileUpdatingTest.test-seed#[2E0D173E7C17D84F]) [    ] o.a.s.c.ChaosMonkey monkey: init - expire sessions:false cause connection loss:false
   [junit4]   2> 1090124 INFO  (qtp1449730296-10593) [n:127.0.0.1:36019_    ] o.a.s.h.a.CollectionsHandler Invoked Collection Action :create with params collection.configName=conf1&name=collection1&nrtReplicas=1&action=CREATE&numShards=1&createNodeSet=&stateFormat=2&wt=javabin&version=2 and sendToOCPQueue=true
   [junit4]   2> 1090128 INFO  (OverseerThreadFactory-4016-thread-2-processing-n:127.0.0.1:36019_) [n:127.0.0.1:36019_    ] o.a.s.c.a.c.CreateCollectionCmd Create collection collection1
   [junit4]   2> 1090128 INFO  (OverseerCollectionConfigSetProcessor-72727731004964868-127.0.0.1:36019_-n_0000000000) [n:127.0.0.1:36019_    ] o.a.s.c.OverseerTaskQueue Response ZK path: /overseer/collection-queue-work/qnr-0000000000 doesn't exist.  Requestor may have disconnected from ZooKeeper
   [junit4]   2> 1090336 WARN  (OverseerThreadFactory-4016-thread-2-processing-n:127.0.0.1:36019_) [n:127.0.0.1:36019_    ] o.a.s.c.a.c.CreateCollectionCmd It is unusual to create a collection (collection1) without cores.
   [junit4]   2> 1090338 INFO  (qtp1449730296-10593) [n:127.0.0.1:36019_    ] o.a.s.h.a.CollectionsHandler Wait for new collection to be active for at most 45 seconds. Check all shard replicas
   [junit4]   2> 1090340 INFO  (qtp1449730296-10593) [n:127.0.0.1:36019_    ] o.a.s.s.HttpSolrCall [admin] webapp=null path=/admin/collections params={collection.configName=conf1&name=collection1&nrtReplicas=1&action=CREATE&numShards=1&createNodeSet=&stateFormat=2&wt=javabin&version=2} status=0 QTime=216
   [junit4]   2> 1090341 INFO  (TEST-HdfsRestartWhileUpdatingTest.test-seed#[2E0D173E7C17D84F]) [    ] o.a.s.c.AbstractFullDistribZkTestBase Creating jetty instances pullReplicaCount=0 numOtherReplicas=3
   [junit4]   2> 1090513 INFO  (TEST-HdfsRestartWhileUpdatingTest.test-seed#[2E0D173E7C17D84F]) [    ] o.a.s.c.AbstractFullDistribZkTestBase create jetty 1 in directory /x1/jenkins/jenkins-slave/workspace/Lucene-Solr-BadApples-NightlyTests-8.x/checkout/solr/build/solr-core/test/J1/temp/solr.cloud.hdfs.HdfsRestartWhileUpdatingTest_2E0D173E7C17D84F-001/shard-1-001 of type NRT
   [junit4]   2> 1090521 WARN  (closeThreadPool-3384-thread-1) [    ] o.e.j.s.AbstractConnector Ignoring deprecated socket close linger time
   [junit4]   2> 1090521 INFO  (closeThreadPool-3384-thread-1) [    ] o.a.s.c.s.e.JettySolrRunner Start Jetty (original configured port=0)
   [junit4]   2> 1090521 INFO  (closeThreadPool-3384-thread-1) [    ] o.a.s.c.s.e.JettySolrRunner Trying to start Jetty on port 0 try number 1 ...
   [junit4]   2> 1090521 INFO  (closeThreadPool-3384-thread-1) [    ] o.e.j.s.Server jetty-9.4.14.v20181114; built: 2018-11-14T21:20:31.478Z; git: c4550056e785fb5665914545889f21dc136ad9e6; jvm 1.8.0_191-b12
   [junit4]   2> 1090523 INFO  (closeThreadPool-3384-thread-1) [    ] o.e.j.s.session DefaultSessionIdManager workerName=node0
   [junit4]   2> 1090523 INFO  (closeThreadPool-3384-thread-1) [    ] o.e.j.s.session No SessionScavenger set, using defaults
   [junit4]   2> 1090523 INFO  (closeThreadPool-3384-thread-1) [    ] o.e.j.s.session node0 Scavenging every 660000ms
   [junit4]   2> 1090524 INFO  (closeThreadPool-3384-thread-1) [    ] o.e.j.s.h.ContextHandler Started o.e.j.s.ServletContextHandler@4d7f7031{/,null,AVAILABLE}
   [junit4]   2> 1090525 INFO  (closeThreadPool-3384-thread-1) [    ] o.e.j.s.AbstractConnector Started ServerConnector@63cc976f{HTTP/1.1,[http/1.1, h2c]}{127.0.0.1:33694}
   [junit4]   2> 1090525 INFO  (closeThreadPool-3384-thread-1) [    ] o.e.j.s.Server Started @1090639ms
   [junit4]   2> 1090525 INFO  (closeThreadPool-3384-thread-1) [    ] o.a.s.c.s.e.JettySolrRunner Jetty properties: {solr.data.dir=hdfs://localhost:37384/hdfs__localhost_37384__x1_jenkins_jenkins-slave_workspace_Lucene-Solr-BadApples-NightlyTests-8.x_checkout_solr_build_solr-core_test_J1_temp_solr.cloud.hdfs.HdfsRestartWhileUpdatingTest_2E0D173E7C17D84F-001_tempDir-002_jetty1, replicaType=NRT, solrconfig=solrconfig.xml, hostContext=/, hostPort=33694, coreRootDirectory=/x1/jenkins/jenkins-slave/workspace/Lucene-Solr-BadApples-NightlyTests-8.x/checkout/solr/build/solr-core/test/J1/../../../../../../../../../../../x1/jenkins/jenkins-slave/workspace/Lucene-Solr-BadApples-NightlyTests-8.x/checkout/solr/build/solr-core/test/J1/temp/solr.cloud.hdfs.HdfsRestartWhileUpdatingTest_2E0D173E7C17D84F-001/shard-1-001/cores}
   [junit4]   2> 1090526 ERROR (closeThreadPool-3384-thread-1) [    ] o.a.s.u.StartupLoggingUtils Missing Java Option solr.log.dir. Logging may be missing or incomplete.
   [junit4]   2> 1090526 INFO  (closeThreadPool-3384-thread-1) [    ] o.a.s.s.SolrDispatchFilter Using logger factory org.apache.logging.slf4j.Log4jLoggerFactory
   [junit4]   2> 1090526 INFO  (closeThreadPool-3384-thread-1) [    ] o.a.s.s.SolrDispatchFilter  ___      _       Welcome to Apache Solr™ version 8.0.0
   [junit4]   2> 1090526 INFO  (closeThreadPool-3384-thread-1) [    ] o.a.s.s.SolrDispatchFilter / __| ___| |_ _   Starting in cloud mode on port null
   [junit4]   2> 1090526 INFO  (closeThreadPool-3384-thread-1) [    ] o.a.s.s.SolrDispatchFilter \__ \/ _ \ | '_|  Install dir: null
   [junit4]   2> 1090526 INFO  (closeThreadPool-3384-thread-1) [    ] o.a.s.s.SolrDispatchFilter |___/\___/_|_|    Start time: 2019-02-02T06:58:40.171Z
   [junit4]   2> 1090532 INFO  (zkConnectionManagerCallback-3386-thread-1) [    ] o.a.s.c.c.ConnectionManager zkClient has connected
   [junit4]   2> 1090534 INFO  (closeThreadPool-3384-thread-1) [    ] o.a.s.s.SolrDispatchFilter Loading solr.xml from SolrHome (not found in ZooKeeper)
   [junit4]   2> 1090534 INFO  (closeThreadPool-3384-thread-1) [    ] o.a.s.c.SolrXmlConfig Loading container configuration from /x1/jenkins/jenkins-slave/workspace/Lucene-Solr-BadApples-NightlyTests-8.x/checkout/solr/build/solr-core/test/J1/temp/solr.cloud.hdfs.HdfsRestartWhileUpdatingTest_2E0D173E7C17D84F-001/shard-1-001/solr.xml
   [junit4]   2> 1090539 INFO  (closeThreadPool-3384-thread-1) [    ] o.a.s.c.SolrXmlConfig Configuration parameter autoReplicaFailoverWorkLoopDelay is ignored
   [junit4]   2> 1090539 INFO  (closeThreadPool-3384-thread-1) [    ] o.a.s.c.SolrXmlConfig Configuration parameter autoReplicaFailoverBadNodeExpiration is ignored
   [junit4]   2> 1090541 INFO  (closeThreadPool-3384-thread-1) [    ] o.a.s.c.SolrXmlConfig MBean server found: com.sun.jmx.mbeanserver.JmxMBeanServer@3cfb3832, but no JMX reporters were configured - adding default JMX reporter.
   [junit4]   2> 1090727 INFO  (TEST-HdfsRestartWhileUpdatingTest.test-seed#[2E0D173E7C17D84F]) [    ] o.a.s.c.AbstractFullDistribZkTestBase create jetty 2 in directory /x1/jenkins/jenkins-slave/workspace/Lucene-Solr-BadApples-NightlyTests-8.x/checkout/solr/build/solr-core/test/J1/temp/solr.cloud.hdfs.HdfsRestartWhileUpdatingTest_2E0D173E7C17D84F-001/shard-2-001 of type NRT
   [junit4]   2> 1090730 WARN  (closeThreadPool-3384-thread-2) [    ] o.e.j.s.AbstractConnector Ignoring deprecated socket close linger time
   [junit4]   2> 1090730 INFO  (closeThreadPool-3384-thread-2) [    ] o.a.s.c.s.e.JettySolrRunner Start Jetty (original configured port=0)
   [junit4]   2> 1090730 INFO  (closeThreadPool-3384-thread-2) [    ] o.a.s.c.s.e.JettySolrRunner Trying to start Jetty on port 0 try number 1 ...
   [junit4]   2> 1090730 INFO  (closeThreadPool-3384-thread-2) [    ] o.e.j.s.Server jetty-9.4.14.v20181114; built: 2018-11-14T21:20:31.478Z; git: c4550056e785fb5665914545889f21dc136ad9e6; jvm 1.8.0_191-b12
   [junit4]   2> 1090759 INFO  (closeThreadPool-3384-thread-2) [    ] o.e.j.s.session DefaultSessionIdManager workerName=node0
   [junit4]   2> 1090759 INFO  (closeThreadPool-3384-thread-2) [    ] o.e.j.s.session No SessionScavenger set, using defaults
   [junit4]   2> 1090759 INFO  (closeThreadPool-3384-thread-2) [    ] o.e.j.s.session node0 Scavenging every 660000ms
   [junit4]   2> 1090759 INFO  (closeThreadPool-3384-thread-2) [    ] o.e.j.s.h.ContextHandler Started o.e.j.s.ServletContextHandler@4ffab838{/,null,AVAILABLE}
   [junit4]   2> 1090760 INFO  (closeThreadPool-3384-thread-2) [    ] o.e.j.s.AbstractConnector Started ServerConnector@7b14be02{HTTP/1.1,[http/1.1, h2c]}{127.0.0.1:36302}
   [junit4]   2> 1090760 INFO  (closeThreadPool-3384-thread-2) [    ] o.e.j.s.Server Started @1090874ms
   [junit4]   2> 1090760 INFO  (closeThreadPool-3384-thread-2) [    ] o.a.s.c.s.e.JettySolrRunner Jetty properties: {solr.data.dir=hdfs://localhost:37384/hdfs__localhost_37384__x1_jenkins_jenkins-slave_workspace_Lucene-Solr-BadApples-NightlyTests-8.x_checkout_solr_build_solr-core_test_J1_temp_solr.cloud.hdfs.HdfsRestartWhileUpdatingTest_2E0D173E7C17D84F-001_tempDir-002_jetty2, replicaType=NRT, solrconfig=solrconfig.xml, hostContext=/, hostPort=36302, coreRootDirectory=/x1/jenkins/jenkins-slave/workspace/Lucene-Solr-BadApples-NightlyTests-8.x/checkout/solr/build/solr-core/test/J1/../../../../../../../../../../../x1/jenkins/jenkins-slave/workspace/Lucene-Solr-BadApples-NightlyTests-8.x/checkout/solr/build/solr-core/test/J1/temp/solr.cloud.hdfs.HdfsRestartWhileUpdatingTest_2E0D173E7C17D84F-001/shard-2-001/cores}
   [junit4]   2> 1090761 ERROR (closeThreadPool-3384-thread-2) [    ] o.a.s.u.StartupLoggingUtils Missing Java Option solr.log.dir. Logging may be missing or incomplete.
   [junit4]   2> 1090761 INFO  (closeThreadPool-3384-thread-2) [    ] o.a.s.s.SolrDispatchFilter Using logger factory org.apache.logging.slf4j.Log4jLoggerFactory
   [junit4]   2> 1090761 INFO  (closeThreadPool-3384-thread-2) [    ] o.a.s.s.SolrDispatchFilter  ___      _       Welcome to Apache Solr™ version 8.0.0
   [junit4]   2> 1090761 INFO  (closeThreadPool-3384-thread-2) [    ] o.a.s.s.SolrDispatchFilter / __| ___| |_ _   Starting in cloud mode on port null
   [junit4]   2> 1090761 INFO  (closeThreadPool-3384-thread-2) [    ] o.a.s.s.SolrDispatchFilter \__ \/ _ \ | '_|  Install dir: null
   [junit4]   2> 1090761 INFO  (closeThreadPool-3384-thread-2) [    ] o.a.s.s.SolrDispatchFilter |___/\___/_|_|    Start time: 2019-02-02T06:58:40.406Z
   [junit4]   2> 1090811 INFO  (zkConnectionManagerCallback-3388-thread-1) [    ] o.a.s.c.c.ConnectionManager zkClient has connected
   [junit4]   2> 1090813 INFO  (closeThreadPool-3384-thread-2) [    ] o.a.s.s.SolrDispatchFilter Loading solr.xml from SolrHome (not found in ZooKeeper)
   [junit4]   2> 1090813 INFO  (closeThreadPool-3384-thread-2) [    ] o.a.s.c.SolrXmlConfig Loading container configuration from /x1/jenkins/jenkins-slave/workspace/Lucene-Solr-BadApples-NightlyTests-8.x/checkout/solr/build/solr-core/test/J1/temp/solr.cloud.hdfs.HdfsRestartWhileUpdatingTest_2E0D173E7C17D84F-001/shard-2-001/solr.xml
   [junit4]   2> 1090820 INFO  (closeThreadPool-3384-thread-2) [    ] o.a.s.c.SolrXmlConfig Configuration parameter autoReplicaFailoverWorkLoopDelay is ignored
   [junit4]   2> 1090820 INFO  (closeThreadPool-3384-thread-2) [    ] o.a.s.c.SolrXmlConfig Configuration parameter autoReplicaFailoverBadNodeExpiration is ignored
   [junit4]   2> 1090822 INFO  (closeThreadPool-3384-thread-2) [    ] o.a.s.c.SolrXmlConfig MBean server found: com.sun.jmx.mbeanserver.JmxMBeanServer@3cfb3832, but no JMX reporters were configured - adding default JMX reporter.
   [junit4]   2> 1090822 INFO  (closeThreadPool-3384-thread-1) [    ] o.a.s.h.c.HttpShardHandlerFactory Host whitelist initialized: WhitelistHostChecker [whitelistHosts=null, whitelistHostCheckingEnabled=false]
   [junit4]   2> 1090825 WARN  (closeThreadPool-3384-thread-1) [    ] o.e.j.u.s.S.config No Client EndPointIdentificationAlgorithm configured for SslContextFactory@54f5e9db[provider=null,keyStore=null,trustStore=null]
   [junit4]   2> 1090849 WARN  (closeThreadPool-3384-thread-1) [    ] o.e.j.u.s.S.config No Client EndPointIdentificationAlgorithm configured for SslContextFactory@187e5cdf[provider=null,keyStore=null,trustStore=null]
   [junit4]   2> 1090850 INFO  (closeThreadPool-3384-thread-1) [    ] o.a.s.c.ZkContainer Zookeeper client=127.0.0.1:42433/solr
   [junit4]   2> 1090908 INFO  (zkConnectionManagerCallback-3394-thread-1) [    ] o.a.s.c.c.ConnectionManager zkClient has connected
   [junit4]   2> 1090928 INFO  (zkConnectionManagerCallback-3396-thread-1) [    ] o.a.s.c.c.ConnectionManager zkClient has connected
   [junit4]   2> 1090932 INFO  (closeThreadPool-3384-thread-1) [n:127.0.0.1:33694_    ] o.a.s.c.c.ZkStateReader Updated live nodes from ZooKeeper... (0) -> (1)
   [junit4]   2> 1090936 INFO  (closeThreadPool-3384-thread-1) [n:127.0.0.1:33694_    ] o.a.s.c.ZkController Publish node=127.0.0.1:33694_ as DOWN
   [junit4]   2> 1090937 INFO  (closeThreadPool-3384-thread-1) [n:127.0.0.1:33694_    ] o.a.s.c.TransientSolrCoreCacheDefault Allocating transient cache for 4 transient cores
   [junit4]   2> 1090937 INFO  (closeThreadPool-3384-thread-1) [n:127.0.0.1:33694_    ] o.a.s.c.ZkController Register node as live in ZooKeeper:/live_nodes/127.0.0.1:33694_
   [junit4]   2> 1090938 INFO  (zkCallback-3370-thread-1) [    ] o.a.s.c.c.ZkStateReader Updated live nodes from ZooKeeper... (1) -> (2)
   [junit4]   2> 1090938 INFO  (zkCallback-3363-thread-3) [    ] o.a.s.c.c.ZkStateReader Updated live nodes from ZooKeeper... (1) -> (2)
   [junit4]   2> 1090952 INFO  (zkCallback-3382-thread-1) [    ] o.a.s.c.c.ZkStateReader Updated live nodes from ZooKeeper... (1) -> (2)
   [junit4]   2> 1090954 INFO  (closeThreadPool-3384-thread-2) [    ] o.a.s.h.c.HttpShardHandlerFactory Host whitelist initialized: WhitelistHostChecker [whitelistHosts=null, whitelistHostCheckingEnabled=false]
   [junit4]   2> 1090964 INFO  (zkCallback-3395-thread-1) [    ] o.a.s.c.c.ZkStateReader Updated live nodes from ZooKeeper... (1) -> (2)
   [junit4]   2> 1090970 WARN  (closeThreadPool-3384-thread-2) [    ] o.e.j.u.s.S.config No Client EndPointIdentificationAlgorithm configured for SslContextFactory@7cd271c2[provider=null,keyStore=null,trustStore=null]
   [junit4]   2> 1090985 WARN  (closeThreadPool-3384-thread-2) [    ] o.e.j.u.s.S.config No Client EndPointIdentificationAlgorithm configured for SslContextFactory@479e4bc5[provider=null,keyStore=null,trustStore=null]
   [junit4]   2> 1090986 INFO  (TEST-HdfsRestartWhileUpdatingTest.test-seed#[2E0D173E7C17D84F]) [    ] o.a.s.c.AbstractFullDistribZkTestBase create jetty 3 in directory /x1/jenkins/jenkins-slave/workspace/Lucene-Solr-BadApples-NightlyTests-8.x/checkout/solr/build/solr-core/test/J1/temp/solr.cloud.hdfs.HdfsRestartWhileUpdatingTest_2E0D173E7C17D84F-001/shard-3-001 of type NRT
   [junit4]   2> 1090986 INFO  (closeThreadPool-3384-thread-2) [    ] o.a.s.c.ZkContainer Zookeeper client=127.0.0.1:42433/solr
   [junit4]   2> 1090988 WARN  (closeThreadPool-3384-thread-3) [    ] o.e.j.s.AbstractConnector Ignoring deprecated socket close linger time
   [junit4]   2> 1090989 INFO  (closeThreadPool-3384-thread-3) [    ] o.a.s.c.s.e.JettySolrRunner Start Jetty (original configured port=0)
   [junit4]   2> 1090989 INFO  (closeThreadPool-3384-thread-3) [    ] o.a.s.c.s.e.JettySolrRunner Trying to start Jetty on port 0 try number 1 ...
   [junit4]   2> 1090989 INFO  (closeThreadPool-3384-thread-3) [    ] o.e.j.s.Server jetty-9.4.14.v20181114; built: 2018-11-14T21:20:31.478Z; git: c4550056e785fb5665914545889f21dc136ad9e6; jvm 1.8.0_191-b12
   [junit4]   2> 1090991 INFO  (closeThreadPool-3384-thread-3) [    ] o.e.j.s.session DefaultSessionIdManager workerName=node0
   [junit4]   2> 1090991 INFO  (closeThreadPool-3384-thread-3) [    ] o.e.j.s.session No SessionScavenger set, using defaults
   [junit4]   2> 1090991 INFO  (closeThreadPool-3384-thread-3) [    ] o.e.j.s.session node0 Scavenging every 660000ms
   [junit4]   2> 1090992 INFO  (zkConnectionManagerCallback-3404-thread-1) [    ] o.a.s.c.c.ConnectionManager zkClient has connected
   [junit4]   2> 1090993 INFO  (closeThreadPool-3384-thread-3) [    ] o.e.j.s.h.ContextHandler Started o.e.j.s.ServletContextHandler@2c1818db{/,null,AVAILABLE}
   [junit4]   2> 1090994 INFO  (closeThreadPool-3384-thread-1) [n:127.0.0.1:33694_    ] o.a.s.c.c.ZkStateReader Updated live nodes from ZooKeeper... (0) -> (2)
   [junit4]   2> 1090997 INFO  (closeThreadPool-3384-thread-1) [n:127.0.0.1:33694_    ] o.a.s.c.s.i.ZkClientClusterStateProvider Cluster at 127.0.0.1:42433/solr ready
   [junit4]   2> 1091000 INFO  (closeThreadPool-3384-thread-1) [n:127.0.0.1:33694_    ] o.a.s.h.a.MetricsHistoryHandler No .system collection, keeping metrics history in memory.
   [junit4]   2> 1091004 INFO  (closeThreadPool-3384-thread-3) [    ] o.e.j.s.AbstractConnector Started ServerConnector@53d2ad55{HTTP/1.1,[http/1.1, h2c]}{127.0.0.1:41763}
   [junit4]   2> 1091004 INFO  (closeThreadPool-3384-thread-3) [    ] o.e.j.s.Server Started @1091118ms
   [junit4]   2> 1091004 INFO  (closeThreadPool-3384-thread-3) [    ] o.a.s.c.s.e.JettySolrRunner Jetty properties: {solr.data.dir=hdfs://localhost:37384/hdfs__localhost_37384__x1_jenkins_jenkins-slave_workspace_Lucene-Solr-BadApples-NightlyTests-8.x_checkout_solr_build_solr-core_test_J1_temp_solr.cloud.hdfs.HdfsRestartWhileUpdatingTest_2E0D173E7C17D84F-001_tempDir-002_jetty3, replicaType=NRT, solrconfig=solrconfig.xml, hostContext=/, hostPort=41763, coreRootDirectory=/x1/jenkins/jenkins-slave/workspace/Lucene-Solr-BadApples-NightlyTests-8.x/checkout/solr/build/solr-core/test/J1/../../../../../../../../../../../x1/jenkins/jenkins-slave/workspace/Lucene-Solr-BadApples-NightlyTests-8.x/checkout/solr/build/solr-core/test/J1/temp/solr.cloud.hdfs.HdfsRestartWhileUpdatingTest_2E0D173E7C17D84F-001/shard-3-001/cores}
   [junit4]   2> 1091004 ERROR (closeThreadPool-3384-thread-3) [    ] o.a.s.u.StartupLoggingUtils Missing Java Option solr.log.dir. Logging may be missing or incomplete.
   [junit4]   2> 1091004 INFO  (closeThreadPool-3384-thread-3) [    ] o.a.s.s.SolrDispatchFilter Using logger factory org.apache.logging.slf4j.Log4jLoggerFactory
   [junit4]   2> 1091004 INFO  (closeThreadPool-3384-thread-3) [    ] o.a.s.s.SolrDispatchFilter  ___      _       Welcome to Apache Solr™ version 8.0.0
   [junit4]   2> 1091004 INFO  (closeThreadPool-3384-thread-3) [    ] o.a.s.s.SolrDispatchFilter / __| ___| |_ _   Starting in cloud mode on port null
   [junit4]   2> 1091004 INFO  (closeThreadPool-3384-thread-3) [    ] o.a.s.s.SolrDispatchFilter \__ \/ _ \ | '_|  Install dir: null
   [junit4]   2> 1091004 INFO  (closeThreadPool-3384-thread-3) [    ] o.a.s.s.SolrDispatchFilter |___/\___/_|_|    Start time: 2019-02-02T06:58:40.649Z
   [junit4]   2> 1091006 INFO  (zkConnectionManagerCallback-3409-thread-1) [    ] o.a.s.c.c.ConnectionManager zkClient has connected
   [junit4]   2> 1091007 INFO  (zkConnectionManagerCallback-3412-thread-1) [    ] o.a.s.c.c.ConnectionManager zkClient has connected
   [junit4]   2> 1091008 INFO  (closeThreadPool-3384-thread-3) [    ] o.a.s.s.SolrDispatchFilter Loading solr.xml from SolrHome (not found in ZooKeeper)
   [junit4]   2> 1091009 INFO  (closeThreadPool-3384-thread-3) [    ] o.a.s.c.SolrXmlConfig Loading container configuration from /x1/jenkins/jenkins-slave/workspace/Lucene-Solr-BadApples-NightlyTests-8.x/checkout/solr/build/solr-core/test/J1/temp/solr.cloud.hdfs.HdfsRestartWhileUpdatingTest_2E0D173E7C17D84F-001/shard-3-001/solr.xml
   [junit4]   2> 1091014 INFO  (closeThreadPool-3384-thread-3) [    ] o.a.s.c.SolrXmlConfig Configuration parameter autoReplicaFailoverWorkLoopDelay is ignored
   [junit4]   2> 1091014 INFO  (closeThreadPool-3384-thread-3) [    ] o.a.s.c.SolrXmlConfig Configuration parameter autoReplicaFailoverBadNodeExpiration is ignored
   [junit4]   2> 1091016 INFO  (closeThreadPool-3384-thread-3) [    ] o.a.s.c.SolrXmlConfig MBean server found: com.sun.jmx.mbeanserver.JmxMBeanServer@3cfb3832, but no JMX reporters were configured - adding default JMX reporter.
   [junit4]   2> 1091035 INFO  (closeThreadPool-3384-thread-1) [n:127.0.0.1:33694_    ] o.a.s.m.r.SolrJmxReporter JMX monitoring for 'solr.node' (registry 'solr.node') enabled at server: com.sun.jmx.mbeanserver.JmxMBeanServer@3cfb3832
   [junit4]   2> 1091048 INFO  (zkConnectionManagerCallback-3414-thread-1) [    ] o.a.s.c.c.ConnectionManager zkClient has connected
   [junit4]   2> 1091053 INFO  (closeThreadPool-3384-thread-2) [n:127.0.0.1:36302_    ] o.a.s.c.c.ZkStateReader Updated live nodes from ZooKeeper... (0) -> (2)
   [junit4]   2> 1091058 INFO  (closeThreadPool-3384-thread-2) [n:127.0.0.1:36302_    ] o.a.s.c.ZkController Publish node=127.0.0.1:36302_ as DOWN
   [junit4]   2> 1091059 INFO  (closeThreadPool-3384-thread-2) [n:127.0.0.1:36302_    ] o.a.s.c.TransientSolrCoreCacheDefault Allocating transient cache for 4 transient cores
   [junit4]   2> 1091059 INFO  (closeThreadPool-3384-thread-2) [n:127.0.0.1:36302_    ] o.a.s.c.ZkController Register node as live in ZooKeeper:/live_nodes/127.0.0.1:36302_
   [junit4]   2> 1091060 INFO  (zkCallback-3382-thread-1) [    ] o.a.s.c.c.ZkStateReader Updated live nodes from ZooKeeper... (2) -> (3)
   [junit4]   2> 1091061 INFO  (zkCallback-3370-thread-1) [    ] o.a.s.c.c.ZkStateReader Updated live nodes from ZooKeeper... (2) -> (3)
   [junit4]   2> 1091061 INFO  (zkCallback-3395-thread-1) [    ] o.a.s.c.c.ZkStateReader Updated live nodes from ZooKeeper... (2) -> (3)
   [junit4]   2> 1091061 INFO  (zkCallback-3363-thread-3) [    ] o.a.s.c.c.ZkStateReader Updated live nodes from ZooKeeper... (2) -> (3)
   [junit4]   2> 1091064 INFO  (closeThreadPool-3384-thread-1) [n:127.0.0.1:33694_    ] o.a.s.m.r.SolrJmxReporter JMX monitoring for 'solr.jvm' (registry 'solr.jvm') enabled at server: com.sun.jmx.mbeanserver.JmxMBeanServer@3cfb3832
   [junit4]   2> 1091064 INFO  (closeThreadPool-3384-thread-1) [n:127.0.0.1:33694_    ] o.a.s.m.r.SolrJmxReporter JMX monitoring for 'solr.jetty' (registry 'solr.jetty') enabled at server: com.sun.jmx.mbeanserver.JmxMBeanServer@3cfb3832
   [junit4]   2> 1091067 INFO  (closeThreadPool-3384-thread-1) [n:127.0.0.1:33694_    ] o.a.s.c.CorePropertiesLocator Found 0 core definitions underneath /x1/jenkins/jenkins-slave/workspace/Lucene-Solr-BadApples-NightlyTests-8.x/checkout/solr/build/solr-core/test/J1/../../../../../../../../../../../x1/jenkins/jenkins-slave/workspace/Lucene-Solr-BadApples-NightlyTests-8.x/checkout/solr/build/solr-core/test/J1/temp/solr.cloud.hdfs.HdfsRestartWhileUpdatingTest_2E0D173E7C17D84F-001/shard-1-001/cores
   [junit4]   2> 1091068 INFO  (zkCallback-3403-thread-1) [    ] o.a.s.c.c.ZkStateReader Updated live nodes from ZooKeeper... (2) -> (3)
   [junit4]   2> 1091080 INFO  (zkCallback-3413-thread-1) [    ] o.a.s.c.c.ZkStateReader Updated live nodes from ZooKeeper... (2) -> (3)
   [junit4]   2> 1091176 INFO  (zkConnectionManagerCallback-3421-thread-1) [    ] o.a.s.c.c.ConnectionManager zkClient has connected
   [junit4]   2> 1091179 INFO  (closeThreadPool-3384-thread-2) [n:127.0.0.1:36302_    ] o.a.s.c.c.ZkStateReader Updated live nodes from ZooKeeper... (0) -> (3)
   [junit4]   2> 1091181 INFO  (closeThreadPool-3384-thread-2) [n:127.0.0.1:36302_    ] o.a.s.c.s.i.ZkClientClusterStateProvider Cluster at 127.0.0.1:42433/solr ready
   [junit4]   2> 1091214 INFO  (closeThreadPool-3384-thread-2) [n:127.0.0.1:36302_    ] o.a.s.h.a.MetricsHistoryHandler No .system collection, keeping metrics history in memory.
   [junit4]   2> 1091228 INFO  (closeThreadPool-3384-thread-3) [    ] o.a.s.h.c.HttpShardHandlerFactory Host whitelist initialized: WhitelistHostChecker [whitelistHosts=null, whitelistHostCheckingEnabled=false]
   [junit4]   2> 1091238 WARN  (closeThreadPool-3384-thread-3) [    ] o.e.j.u.s.S.config No Client EndPointIdentificationAlgorithm configured for SslContextFactory@35fa6316[provider=null,keyStore=null,trustStore=null]
   [junit4]   2> 1091251 INFO  (closeThreadPool-3384-thread-2) [n:127.0.0.1:36302_    ] o.a.s.m.r.SolrJmxReporter JMX monitoring for 'solr.node' (registry 'solr.node') enabled at server: com.sun.jmx.mbeanserver.JmxMBeanServer@3cfb3832
   [junit4]   2> 1091253 WARN  (closeThreadPool-3384-thread-3) [    ] o.e.j.u.s.S.config No Client EndPointIdentificationAlgorithm configured for SslContextFactory@45cda114[provider=null,keyStore=null,trustStore=null]
   [junit4]   2> 1091254 INFO  (closeThreadPool-3384-thread-3) [    ] o.a.s.c.ZkContainer Zookeeper client=127.0.0.1:42433/solr
   [junit4]   2> 1091260 INFO  (zkConnectionManagerCallback-3428-thread-1) [    ] o.a.s.c.c.ConnectionManager zkClient has connected
   [junit4]   2> 1091275 INFO  (zkConnectionManagerCallback-3430-thread-1) [    ] o.a.s.c.c.ConnectionManager zkClient has connected
   [junit4]   2> 1091275 INFO  (closeThreadPool-3384-thread-2) [n:127.0.0.1:36302_    ] o.a.s.m.r.SolrJmxReporter JMX monitoring for 'solr.jvm' (registry 'solr.jvm') enabled at server: com.sun.jmx.mbeanserver.JmxMBeanServer@3cfb3832
   [junit4]   2> 1091276 INFO  (closeThreadPool-3384-thread-2) [n:127.0.0.1:36302_    ] o.a.s.m.r.SolrJmxReporter JMX monitoring for 'solr.jetty' (registry 'solr.jetty') enabled at server: com.sun.jmx.mbeanserver.JmxMBeanServer@3cfb3832
   [junit4]   2> 1091279 INFO  (closeThreadPool-3384-thread-2) [n:127.0.0.1:36302_    ] o.a.s.c.CorePropertiesLocator Found 0 core definitions underneath /x1/jenkins/jenkins-slave/workspace/Lucene-Solr-BadApples-NightlyTests-8.x/checkout/solr/build/solr-core/test/J1/../../../../../../../../../../../x1/jenkins/jenkins-slave/workspace/Lucene-Solr-BadApples-NightlyTests-8.x/checkout/solr/build/solr-core/test/J1/temp/solr.cloud.hdfs.HdfsRestartWhileUpdatingTest_2E0D173E7C17D84F-001/shard-2-001/cores
   [junit4]   2> 1091283 INFO  (closeThreadPool-3384-thread-3) [n:127.0.0.1:41763_    ] o.a.s.c.c.ZkStateReader Updated live nodes from ZooKeeper... (0) -> (3)
   [junit4]   2> 1091289 INFO  (closeThreadPool-3384-thread-3) [n:127.0.0.1:41763_    ] o.a.s.c.ZkController Publish node=127.0.0.1:41763_ as DOWN
   [junit4]   2> 1091290 INFO  (closeThreadPool-3384-thread-3) [n:127.0.0.1:41763_    ] o.a.s.c.TransientSolrCoreCacheDefault Allocating transient cache for 4 transient cores
   [junit4]   2> 1091290 INFO  (closeThreadPool-3384-thread-3) [n:127.0.0.1:41763_    ] o.a.s.c.ZkController Register node as live in ZooKeeper:/live_nodes/127.0.0.1:41763_
   [junit4]   2> 1091291 INFO  (zkCallback-3382-thread-1) [    ] o.a.s.c.c.ZkStateReader Updated live nodes from ZooKeeper... (3) -> (4)
   [junit4]   2> 1091291 INFO  (zkCallback-3370-thread-1) [    ] o.a.s.c.c.ZkStateReader Updated live nodes from ZooKeeper... (3) -> (4)
   [junit4]   2> 1091291 INFO  (zkCallback-3413-thread-1) [    ] o.a.s.c.c.ZkStateReader Updated live nodes from ZooKeeper... (3) -> (4)
   [junit4]   2> 1091291 INFO  (zkCallback-3395-thread-1) [    ] o.a.s.c.c.ZkStateReader Updated live nodes from ZooKeeper... (3) -> (4)
   [junit4]   2> 1091291 INFO  (zkCallback-3429-thread-1) [    ] o.a.s.c.c.ZkStateReader Updated live nodes from ZooKeeper... (3) -> (4)
   [junit4]   2> 1091292 INFO  (zkCallback-3403-thread-1) [    ] o.a.s.c.c.ZkStateReader Updated live nodes from ZooKeeper... (3) -> (4)
   [junit4]   2> 1091292 INFO  (zkCallback-3363-thread-3) [    ] o.a.s.c.c.ZkStateReader Updated live nodes from ZooKeeper... (3) -> (4)
   [junit4]   2> 1091304 INFO  (zkCallback-3420-thread-1) [    ] o.a.s.c.c.ZkStateReader Updated live nodes from ZooKeeper... (3) -> (4)
   [junit4]   2> 1091324 INFO  (zkConnectionManagerCallback-3437-thread-1) [    ] o.a.s.c.c.ConnectionManager zkClient has connected
   [junit4]   2> 1091325 INFO  (closeThreadPool-3384-thread-3) [n:127.0.0.1:41763_    ] o.a.s.c.c.ZkStateReader Updated live nodes from ZooKeeper... (0) -> (4)
   [junit4]   2> 1091327 INFO  (closeThreadPool-3384-thread-3) [n:127.0.0.1:41763_    ] o.a.s.c.s.i.ZkClientClusterStateProvider Cluster at 127.0.0.1:42433/solr ready
   [junit4]   2> 1091327 INFO  (closeThreadPool-3384-thread-3) [n:127.0.0.1:41763_    ] o.a.s.h.a.MetricsHistoryHandler No .system collection, keeping metrics history in memory.
   [junit4]   2> 1091365 INFO  (closeThreadPool-3384-thread-3) [n:127.0.0.1:41763_    ] o.a.s.m.r.SolrJmxReporter JMX monitoring for 'solr.node' (registry 'solr.node') enabled at server: com.sun.jmx.mbeanserver.JmxMBeanServer@3cfb3832
   [junit4]   2> 1091405 INFO  (closeThreadPool-3384-thread-3) [n:127.0.0.1:41763_    ] o.a.s.m.r.SolrJmxReporter JMX monitoring for 'solr.jvm' (registry 'solr.jvm') enabled at server: com.sun.jmx.mbeanserver.JmxMBeanServer@3cfb3832
   [junit4]   2> 1091405 INFO  (closeThreadPool-3384-thread-3) [n:127.0.0.1:41763_    ] o.a.s.m.r.SolrJmxReporter JMX monitoring for 'solr.jetty' (registry 'solr.jetty') enabled at server: com.sun.jmx.mbeanserver.JmxMBeanServer@3cfb3832
   [junit4]   2> 1091408 INFO  (closeThreadPool-3384-thread-3) [n:127.0.0.1:41763_    ] o.a.s.c.CorePropertiesLocator Found 0 core definitions underneath /x1/jenkins/jenkins-slave/workspace/Lucene-Solr-BadApples-NightlyTests-8.x/checkout/solr/build/solr-core/test/J1/../../../../../../../../../../../x1/jenkins/jenkins-slave/workspace/Lucene-Solr-BadApples-NightlyTests-8.x/checkout/solr/build/solr-core/test/J1/temp/solr.cloud.hdfs.HdfsRestartWhileUpdatingTest_2E0D173E7C17D84F-001/shard-3-001/cores
   [junit4]   2> 1091530 INFO  (qtp1550210796-10649) [n:127.0.0.1:33694_    ] o.a.s.h.a.CollectionsHandler Invoked Collection Action :addreplica with params node=127.0.0.1:41763_&action=ADDREPLICA&collection=collection1&shard=shard1&type=NRT&wt=javabin&version=2 and sendToOCPQueue=true
   [junit4]   2> 1091531 INFO  (qtp1550210796-10652) [n:127.0.0.1:33694_    ] o.a.s.h.a.CollectionsHandler Invoked Collection Action :addreplica with params node=127.0.0.1:36302_&action=ADDREPLICA&collection=collection1&shard=shard1&type=NRT&wt=javabin&version=2 and sendToOCPQueue=true
   [junit4]   2> 1091531 INFO  (qtp1550210796-10648) [n:127.0.0.1:33694_    ] o.a.s.h.a.CollectionsHandler Invoked Collection Action :addreplica with params node=127.0.0.1:33694_&action=ADDREPLICA&collection=collection1&shard=shard1&type=NRT&wt=javabin&version=2 and sendToOCPQueue=true
   [junit4]   2> 1091535 INFO  (OverseerCollectionConfigSetProcessor-72727731004964868-127.0.0.1:36019_-n_0000000000) [n:127.0.0.1:36019_    ] o.a.s.c.OverseerTaskQueue Response ZK path: /overseer/collection-queue-work/qnr-0000000002 doesn't exist.  Requestor may have disconnected from ZooKeeper
   [junit4]   2> 1091544 INFO  (qtp1550210796-10651) [n:127.0.0.1:33694_    ] o.a.s.s.HttpSolrCall [admin] webapp=null path=/admin/metrics params={prefix=CONTAINER.fs.usableSpace,CONTAINER.fs.totalSpace,CORE.coreName&wt=javabin&version=2&group=solr.node,solr.core} status=0 QTime=1
   [junit4]   2> 1091549 INFO  (qtp1550210796-10650) [n:127.0.0.1:33694_    ] o.a.s.s.HttpSolrCall [admin] webapp=null path=/admin/metrics params={prefix=CONTAINER.fs.usableSpace,CONTAINER.fs.totalSpace,CORE.coreName&wt=javabin&version=2&group=solr.node,solr.core} status=0 QTime=0
   [junit4]   2> 1091550 INFO  (qtp1550210796-10651) [n:127.0.0.1:33694_    ] o.a.s.s.HttpSolrCall [admin] webapp=null path=/admin/metrics params={prefix=CONTAINER.fs.usableSpace,CONTAINER.fs.totalSpace,CORE.coreName&wt=javabin&version=2&group=solr.node,solr.core} status=0 QTime=0
   [junit4]   2> 1091552 INFO  (qtp1550210796-10650) [n:127.0.0.1:33694_    ] o.a.s.s.HttpSolrCall [admin] webapp=null path=/admin/metrics params={prefix=CONTAINER.fs.usableSpace,CONTAINER.fs.totalSpace,CORE.coreName&wt=javabin&version=2&group=solr.node,solr.core} status=0 QTime=0
   [junit4]   2> 1091553 INFO  (qtp1550210796-10651) [n:127.0.0.1:33694_    ] o.a.s.s.HttpSolrCall [admin] webapp=null path=/admin/metrics params={prefix=CONTAINER.fs.usableSpace,CONTAINER.fs.totalSpace,CORE.coreName&wt=javabin&version=2&group=solr.node,solr.core} status=0 QTime=0
   [junit4]   2> 1091556 INFO  (qtp1449730296-10590) [n:127.0.0.1:36019_    ] o.a.s.s.HttpSolrCall [admin] webapp=null path=/admin/metrics params={wt=javabin&version=2&key=solr.core.control_collection.shard1.replica_n1:INDEX.sizeInBytes} status=0 QTime=0
   [junit4]   2> 1091557 INFO  (qtp1449730296-10589) [n:127.0.0.1:36019_    ] o.a.s.s.HttpSolrCall [admin] webapp=null path=/admin/metrics params={wt=javabin&version=2&key=solr.core.control_collection.shard1.replica_n1:INDEX.sizeInBytes} status=0 QTime=0
   [junit4]   2> 1091561 INFO  (qtp1449730296-10591) [n:127.0.0.1:36019_    ] o.a.s.s.HttpSolrCall [admin] webapp=null path=/admin/metrics params={wt=javabin&version=2&key=solr.core.control_collection.shard1.replica_n1:INDEX.sizeInBytes} status=0 QTime=0
   [junit4]   2> 1091562 INFO  (qtp1449730296-10592) [n:127.0.0.1:36019_    ] o.a.s.s.HttpSolrCall [admin] webapp=null path=/admin/metrics params={prefix=CONTAINER.fs.usableSpace,CONTAINER.fs.totalSpace,CORE.coreName&wt=javabin&version=2&group=solr.node,solr.core} status=0 QTime=0
   [junit4]   2> 1091563 INFO  (qtp1449730296-10593) [n:127.0.0.1:36019_    ] o.a.s.s.HttpSolrCall [admin] webapp=null path=/admin/metrics params={prefix=CONTAINER.fs.usableSpace,CONTAINER.fs.totalSpace,CORE.coreName&wt=javabin&version=2&group=solr.node,solr.core} status=0 QTime=0
   [junit4]   2> 1091564 INFO  (qtp1449730296-10590) [n:127.0.0.1:36019_    ] o.a.s.s.HttpSolrCall [admin] webapp=null path=/admin/metrics params={prefix=CONTAINER.fs.usableSpace,CONTAINER.fs.totalSpace,CORE.coreName&wt=javabin&version=2&group=solr.node,solr.core} status=0 QTime=0
   [junit4]   2> 1091565 INFO  (qtp1449730296-10589) [n:127.0.0.1:36019_    ] o.a.s.s.HttpSolrCall [admin] webapp=null path=/admin/metrics params={prefix=CONTAINER.fs.usableSpace,CONTAINER.fs.totalSpace,CORE.coreName&wt=javabin&version=2&group=solr.node,solr.core} status=0 QTime=0
   [junit4]   2> 1091566 INFO  (qtp1449730296-10591) [n:127.0.0.1:36019_    ] o.a.s.s.HttpSolrCall [admin] webapp=null path=/admin/metrics params={prefix=CONTAINER.fs.usableSpace,CONTAINER.fs.totalSpace,CORE.coreName&wt=javabin&version=2&group=solr.node,solr.core} status=0 QTime=0
   [junit4]   2> 1091573 INFO  (qtp900114753-10662) [n:127.0.0.1:36302_    ] o.a.s.s.HttpSolrCall [admin] webapp=null path=/admin/metrics params={prefix=CONTAINER.fs.usableSpace,CONTAINER.fs.totalSpace,CORE.coreName&wt=javabin&version=2&group=solr.node,solr.core} status=0 QTime=0
   [junit4]   2> 1091574 INFO  (qtp900114753-10663) [n:127.0.0.1:36302_    ] o.a.s.s.HttpSolrCall [admin] webapp=null path=/admin/metrics params={prefix=CONTAINER.fs.usableSpace,CONTAINER.fs.totalSpace,CORE.coreName&wt=javabin&version=2&group=solr.node,solr.core} status=0 QTime=0
   [junit4]   2> 1091575 INFO  (qtp900114753-10664) [n:127.0.0.1:36302_    ] o.a.s.s.HttpSolrCall [admin] webapp=null path=/admin/metrics params={prefix=CONTAINER.fs.usableSpace,CONTAINER.fs.totalSpace,CORE.coreName&wt=javabin&version=2&group=solr.node,solr.core} status=0 QTime=0
   [junit4]   2> 1091576 INFO  (qtp900114753-10665) [n:127.0.0.1:36302_    ] o.a.s.s.HttpSolrCall [admin] webapp=null path=/admin/metrics params={prefix=CONTAINER.fs.usableSpace,CONTAINER.fs.totalSpace,CORE.coreName&wt=javabin&version=2&group=solr.node,solr.core} status=0 QTime=0
   [junit4]   2> 1091576 INFO  (qtp900114753-10661) [n:127.0.0.1:36302_    ] o.a.s.s.HttpSolrCall [admin] webapp=null path=/admin/metrics params={prefix=CONTAINER.fs.usableSpace,CONTAINER.fs.totalSpace,CORE.coreName&wt=javabin&version=2&group=solr.node,solr.core} status=0 QTime=0
   [junit4]   2> 1091578 INFO  (qtp208181776-10695) [n:127.0.0.1:41763_    ] o.a.s.s.HttpSolrCall [admin] webapp=null path=/admin/metrics params={prefix=CONTAINER.fs.usableSpace,CONTAINER.fs.totalSpace,CORE.coreName&wt=javabin&version=2&group=solr.node,solr.core} status=0 QTime=0
   [junit4]   2> 1091579 INFO  (qtp208181776-10696) [n:127.0.0.1:41763_    ] o.a.s.s.HttpSolrCall [admin] webapp=null path=/admin/metrics params={prefix=CONTAINER.fs.usableSpace,CONTAINER.fs.totalSpace,CORE.coreName&wt=javabin&version=2&group=solr.node,solr.core} status=0 QTime=0
   [junit4]   2> 1091580 INFO  (qtp208181776-10698) [n:127.0.0.1:41763_    ] o.a.s.s.HttpSolrCall [admin] webapp=null path=/admin/metrics params={prefix=CONTAINER.fs.usableSpace,CONTAINER.fs.totalSpace,CORE.coreName&wt=javabin&version=2&group=solr.node,solr.core} status=0 QTime=0
   [junit4]   2> 1091581 INFO  (qtp208181776-10699) [n:127.0.0.1:41763_    ] o.a.s.s.HttpSolrCall [admin] webapp=null path=/admin/metrics params={prefix=CONTAINER.fs.usableSpace,CONTAINER.fs.totalSpace,CORE.coreName&wt=javabin&version=2&group=solr.node,solr.core} status=0 QTime=0
   [junit4]   2> 1091582 INFO  (qtp208181776-10694) [n:127.0.0.1:41763_    ] o.a.s.s.HttpSolrCall [admin] webapp=null path=/admin/metrics params={prefix=CONTAINER.fs.usableSpace,CONTAINER.fs.totalSpace,CORE.coreName&wt=javabin&version=2&group=solr.node,solr.core} status=0 QTime=0
   [junit4]   2> 1091583 INFO  (OverseerThreadFactory-4016-thread-3-processing-n:127.0.0.1:36019_) [n:127.0.0.1:36019_ c:collection1 s:shard1  ] o.a.s.c.a.c.AddReplicaCmd Node Identified 127.0.0.1:41763_ for creating new replica of shard shard1 for collection collection1
   [junit4]   2> 1091585 INFO  (OverseerThreadFactory-4016-thread-3-processing-n:127.0.0.1:36019_) [n:127.0.0.1:36019_ c:collection1 s:shard1  ] o.a.s.c.a.c.AddReplicaCmd Returning CreateReplica command.
   [junit4]   2> 1091623 INFO  (qtp208181776-10698) [n:127.0.0.1:41763_    x:collection1_shard1_replica_n1] o.a.s.h.a.CoreAdminOperation core create command qt=/admin/cores&collection.configName=conf1&name=collection1_shard1_replica_n1&action=CREATE&collection=collection1&shard=shard1&wt=javabin&version=2&replicaType=NRT
   [junit4]   2> 1092648 INFO  (qtp208181776-10698) [n:127.0.0.1:41763_ c:collection1 s:shard1  x:collection1_shard1_replica_n1] o.a.s.c.SolrConfig Using Lucene MatchVersion: 8.0.0
   [junit4]   2> 1092667 INFO  (qtp208181776-10698) [n:127.0.0.1:41763_ c:collection1 s:shard1  x:collection1_shard1_replica_n1] o.a.s.s.IndexSchema [collection1_shard1_replica_n1] Schema name=test
   [junit4]   2> 1092833 INFO  (qtp208181776-10698) [n:127.0.0.1:41763_ c:collection1 s:shard1  x:collection1_shard1_replica_n1] o.a.s.s.IndexSchema Loaded schema test/1.6 with uniqueid field id
   [junit4]   2> 1092867 INFO  (qtp208181776-10698) [n:127.0.0.1:41763_ c:collection1 s:shard1  x:collection1_shard1_replica_n1] o.a.s.c.CoreContainer Creating SolrCore 'collection1_shard1_replica_n1' using configuration from collection collection1, trusted=true
   [junit4]   2> 1092868 INFO  (qtp208181776-10698) [n:127.0.0.1:41763_ c:collection1 s:shard1  x:collection1_shard1_replica_n1] o.a.s.m.r.SolrJmxReporter JMX monitoring for 'solr.core.collection1.shard1.replica_n1' (registry 'solr.core.collection1.shard1.replica_n1') enabled at server: com.sun.jmx.mbeanserver.JmxMBeanServer@3cfb3832
   [junit4]   2> 1092868 INFO  (qtp208181776-10698) [n:127.0.0.1:41763_ c:collection1 s:shard1  x:collection1_shard1_replica_n1] o.a.s.c.SolrCore [[collection1_shard1_replica_n1] ] Opening new SolrCore at [/x1/jenkins/jenkins-slave/workspace/Lucene-Solr-BadApples-NightlyTests-8.x/checkout/solr/build/solr-core/test/J1/temp/solr.cloud.hdfs.HdfsRestartWhileUpdatingTest_2E0D173E7C17D84F-001/shard-3-001/cores/collection1_shard1_replica_n1], dataDir=[/x1/jenkins/jenkins-slave/workspace/Lucene-Solr-BadApples-NightlyTests-8.x/checkout/solr/build/solr-core/test/J1/../../../../../../../../../../../x1/jenkins/jenkins-slave/workspace/Lucene-Solr-BadApples-NightlyTests-8.x/checkout/solr/build/solr-core/test/J1/temp/solr.cloud.hdfs.HdfsRestartWhileUpdatingTest_2E0D173E7C17D84F-001/shard-3-001/cores/collection1_shard1_replica_n1/data/]
   [junit4]   2> 1092873 INFO  (qtp208181776-10698) [n:127.0.0.1:41763_ c:collection1 s:shard1  x:collection1_shard1_replica_n1] o.a.s.u.RandomMergePolicy RandomMergePolicy wrapping class org.apache.lucene.index.TieredMergePolicy: [TieredMergePolicy: maxMergeAtOnce=12, maxMergeAtOnceExplicit=22, maxMergedSegmentMB=93.8671875, floorSegmentMB=0.4306640625, forceMergeDeletesPctAllowed=16.99785388532473, segmentsPerTier=33.0, maxCFSSegmentSizeMB=8.796093022207999E12, noCFSRatio=1.0, deletesPctAllowed=21.17305630026683
   [junit4]   2> 1092886 WARN  (qtp208181776-10698) [n:127.0.0.1:41763_ c:collection1 s:shard1  x:collection1_shard1_replica_n1] o.a.s.c.RequestHandlers INVALID paramSet a in requestHandler {type = requestHandler,name = /dump,class = DumpRequestHandler,attributes = {initParams=a, name=/dump, class=DumpRequestHandler},args = {defaults={a=A,b=B}}}
   [junit4]   2> 1092955 INFO  (qtp208181776-10698) [n:127.0.0.1:41763_ c:collection1 s:shard1  x:collection1_shard1_replica_n1] o.a.s.u.UpdateHandler Using UpdateLog implementation: org.apache.solr.update.UpdateLog
   [junit4]   2> 1092955 INFO  (qtp208181776-10698) [n:127.0.0.1:41763_ c:collection1 s:shard1  x:collection1_shard1_replica_n1] o.a.s.u.UpdateLog Initializing UpdateLog: dataDir= defaultSyncLevel=FLUSH numRecordsToKeep=100 maxNumLogsToKeep=10 numVersionBuckets=65536
   [junit4]   2> 1092957 INFO  (qtp208181776-10698) [n:127.0.0.1:41763_ c:collection1 s:shard1  x:collection1_shard1_replica_n1] o.a.s.u.CommitTracker Hard AutoCommit: if uncommitted for 30000ms; 
   [junit4]   2> 1092958 INFO  (qtp208181776-10698) [n:127.0.0.1:41763_ c:collection1 s:shard1  x:collection1_shard1_replica_n1] o.a.s.u.CommitTracker Soft AutoCommit: if uncommitted for 3000ms; 
   [junit4]   2> 1092959 INFO  (qtp208181776-10698) [n:127.0.0.1:41763_ c:collection1 s:shard1  x:collection1_shard1_replica_n1] o.a.s.u.RandomMergePolicy RandomMergePolicy wrapping class org.apache.lucene.index.LogByteSizeMergePolicy: [LogByteSizeMergePolicy: minMergeSize=1677721, mergeFactor=2, maxMergeSize=2147483648, maxMergeSizeForForcedMerge=9223372036854775807, calibrateSizeByDeletes=false, maxMergeDocs=2147483647, maxCFSSegmentSizeMB=8.796093022207999E12, noCFSRatio=1.0]
   [junit4]   2> 1092960 INFO  (qtp208181776-10698) [n:127.0.0.1:41763_ c:collection1 s:shard1  x:collection1_shard1_replica_n1] o.a.s.s.SolrIndexSearcher Opening [Searcher@3c69e71b[collection1_shard1_replica_n1] main]
   [junit4]   2> 1092962 INFO  (qtp208181776-10698) [n:127.

[...truncated too long message...]

figure:
[ivy:configure] :: loading settings :: file = /x1/jenkins/jenkins-slave/workspace/Lucene-Solr-BadApples-NightlyTests-8.x/checkout/lucene/top-level-ivy-settings.xml

resolve:

ivy-availability-check:
[loadresource] Do not set property disallowed.ivy.jars.list as its length is 0.

-ivy-fail-disallowed-ivy-version:

ivy-fail:

ivy-fail:

ivy-configure:
[ivy:configure] :: loading settings :: file = /x1/jenkins/jenkins-slave/workspace/Lucene-Solr-BadApples-NightlyTests-8.x/checkout/lucene/top-level-ivy-settings.xml

resolve:

ivy-availability-check:
[loadresource] Do not set property disallowed.ivy.jars.list as its length is 0.

-ivy-fail-disallowed-ivy-version:

ivy-fail:

ivy-configure:
[ivy:configure] :: loading settings :: file = /x1/jenkins/jenkins-slave/workspace/Lucene-Solr-BadApples-NightlyTests-8.x/checkout/lucene/top-level-ivy-settings.xml

resolve:

ivy-availability-check:
[loadresource] Do not set property disallowed.ivy.jars.list as its length is 0.

-ivy-fail-disallowed-ivy-version:

ivy-fail:

ivy-fail:

ivy-configure:
[ivy:configure] :: loading settings :: file = /x1/jenkins/jenkins-slave/workspace/Lucene-Solr-BadApples-NightlyTests-8.x/checkout/lucene/top-level-ivy-settings.xml

resolve:

ivy-availability-check:
[loadresource] Do not set property disallowed.ivy.jars.list as its length is 0.

-ivy-fail-disallowed-ivy-version:

ivy-fail:

ivy-fail:

ivy-configure:
[ivy:configure] :: loading settings :: file = /x1/jenkins/jenkins-slave/workspace/Lucene-Solr-BadApples-NightlyTests-8.x/checkout/lucene/top-level-ivy-settings.xml

resolve:

ivy-availability-check:
[loadresource] Do not set property disallowed.ivy.jars.list as its length is 0.

-ivy-fail-disallowed-ivy-version:

ivy-fail:

ivy-fail:

ivy-configure:
[ivy:configure] :: loading settings :: file = /x1/jenkins/jenkins-slave/workspace/Lucene-Solr-BadApples-NightlyTests-8.x/checkout/lucene/top-level-ivy-settings.xml

resolve:

ivy-availability-check:
[loadresource] Do not set property disallowed.ivy.jars.list as its length is 0.

-ivy-fail-disallowed-ivy-version:

ivy-fail:

ivy-fail:

ivy-configure:
[ivy:configure] :: loading settings :: file = /x1/jenkins/jenkins-slave/workspace/Lucene-Solr-BadApples-NightlyTests-8.x/checkout/lucene/top-level-ivy-settings.xml

resolve:

ivy-availability-check:
[loadresource] Do not set property disallowed.ivy.jars.list as its length is 0.

-ivy-fail-disallowed-ivy-version:

ivy-fail:

ivy-fail:

ivy-configure:
[ivy:configure] :: loading settings :: file = /x1/jenkins/jenkins-slave/workspace/Lucene-Solr-BadApples-NightlyTests-8.x/checkout/lucene/top-level-ivy-settings.xml

resolve:

ivy-availability-check:
[loadresource] Do not set property disallowed.ivy.jars.list as its length is 0.

-ivy-fail-disallowed-ivy-version:

ivy-fail:

ivy-fail:

ivy-configure:
[ivy:configure] :: loading settings :: file = /x1/jenkins/jenkins-slave/workspace/Lucene-Solr-BadApples-NightlyTests-8.x/checkout/lucene/top-level-ivy-settings.xml

resolve:

ivy-availability-check:
[loadresource] Do not set property disallowed.ivy.jars.list as its length is 0.

-ivy-fail-disallowed-ivy-version:

ivy-fail:

ivy-fail:

ivy-configure:
[ivy:configure] :: loading settings :: file = /x1/jenkins/jenkins-slave/workspace/Lucene-Solr-BadApples-NightlyTests-8.x/checkout/lucene/top-level-ivy-settings.xml

resolve:

ivy-availability-check:
[loadresource] Do not set property disallowed.ivy.jars.list as its length is 0.

-ivy-fail-disallowed-ivy-version:

ivy-fail:

ivy-fail:

ivy-configure:
[ivy:configure] :: loading settings :: file = /x1/jenkins/jenkins-slave/workspace/Lucene-Solr-BadApples-NightlyTests-8.x/checkout/lucene/top-level-ivy-settings.xml

resolve:

ivy-availability-check:
[loadresource] Do not set property disallowed.ivy.jars.list as its length is 0.

-ivy-fail-disallowed-ivy-version:

ivy-fail:

ivy-fail:

ivy-configure:
[ivy:configure] :: loading settings :: file = /x1/jenkins/jenkins-slave/workspace/Lucene-Solr-BadApples-NightlyTests-8.x/checkout/lucene/top-level-ivy-settings.xml

resolve:

ivy-availability-check:
[loadresource] Do not set property disallowed.ivy.jars.list as its length is 0.

-ivy-fail-disallowed-ivy-version:

ivy-fail:

ivy-fail:

ivy-configure:
[ivy:configure] :: loading settings :: file = /x1/jenkins/jenkins-slave/workspace/Lucene-Solr-BadApples-NightlyTests-8.x/checkout/lucene/top-level-ivy-settings.xml

resolve:

jar-checksums:
    [mkdir] Created dir: /x1/jenkins/jenkins-slave/workspace/Lucene-Solr-BadApples-NightlyTests-8.x/checkout/solr/null256938136
     [copy] Copying 256 files to /x1/jenkins/jenkins-slave/workspace/Lucene-Solr-BadApples-NightlyTests-8.x/checkout/solr/null256938136
   [delete] Deleting directory /x1/jenkins/jenkins-slave/workspace/Lucene-Solr-BadApples-NightlyTests-8.x/checkout/solr/null256938136

check-working-copy:
[ivy:cachepath] :: resolving dependencies :: org.eclipse.jgit#org.eclipse.jgit-caller;working
[ivy:cachepath] 	confs: [default]
[ivy:cachepath] 	found org.eclipse.jgit#org.eclipse.jgit;4.6.0.201612231935-r in public
[ivy:cachepath] 	found com.jcraft#jsch;0.1.53 in public
[ivy:cachepath] 	found com.googlecode.javaewah#JavaEWAH;1.1.6 in public
[ivy:cachepath] 	found org.apache.httpcomponents#httpclient;4.3.6 in public
[ivy:cachepath] 	found org.apache.httpcomponents#httpcore;4.3.3 in public
[ivy:cachepath] 	found commons-logging#commons-logging;1.1.3 in public
[ivy:cachepath] 	found commons-codec#commons-codec;1.6 in public
[ivy:cachepath] 	found org.slf4j#slf4j-api;1.7.2 in public
[ivy:cachepath] :: resolution report :: resolve 50ms :: artifacts dl 5ms
	---------------------------------------------------------------------
	|                  |            modules            ||   artifacts   |
	|       conf       | number| search|dwnlded|evicted|| number|dwnlded|
	---------------------------------------------------------------------
	|      default     |   8   |   0   |   0   |   0   ||   8   |   0   |
	---------------------------------------------------------------------
[wc-checker] Initializing working copy...
[wc-checker] SLF4J: Failed to load class "org.slf4j.impl.StaticLoggerBinder".
[wc-checker] SLF4J: Defaulting to no-operation (NOP) logger implementation
[wc-checker] SLF4J: See http://www.slf4j.org/codes.html#StaticLoggerBinder for further details.
[wc-checker] Checking working copy status...

-jenkins-base:

BUILD SUCCESSFUL
Total time: 351 minutes 58 seconds
Archiving artifacts
java.lang.InterruptedException: no matches found within 10000
	at hudson.FilePath$ValidateAntFileMask.hasMatch(FilePath.java:2847)
	at hudson.FilePath$ValidateAntFileMask.invoke(FilePath.java:2726)
	at hudson.FilePath$ValidateAntFileMask.invoke(FilePath.java:2707)
	at hudson.FilePath$FileCallableWrapper.call(FilePath.java:3086)
Also:   hudson.remoting.Channel$CallSiteStackTrace: Remote call to lucene
		at hudson.remoting.Channel.attachCallSiteStackTrace(Channel.java:1741)
		at hudson.remoting.UserRequest$ExceptionResponse.retrieve(UserRequest.java:357)
		at hudson.remoting.Channel.call(Channel.java:955)
		at hudson.FilePath.act(FilePath.java:1072)
		at hudson.FilePath.act(FilePath.java:1061)
		at hudson.FilePath.validateAntFileMask(FilePath.java:2705)
		at hudson.tasks.ArtifactArchiver.perform(ArtifactArchiver.java:243)
		at hudson.tasks.BuildStepCompatibilityLayer.perform(BuildStepCompatibilityLayer.java:81)
		at hudson.tasks.BuildStepMonitor$1.perform(BuildStepMonitor.java:20)
		at hudson.model.AbstractBuild$AbstractBuildExecution.perform(AbstractBuild.java:744)
		at hudson.model.AbstractBuild$AbstractBuildExecution.performAllBuildSteps(AbstractBuild.java:690)
		at hudson.model.Build$BuildExecution.post2(Build.java:186)
		at hudson.model.AbstractBuild$AbstractBuildExecution.post(AbstractBuild.java:635)
		at hudson.model.Run.execute(Run.java:1835)
		at hudson.model.FreeStyleBuild.run(FreeStyleBuild.java:43)
		at hudson.model.ResourceController.execute(ResourceController.java:97)
		at hudson.model.Executor.run(Executor.java:429)
Caused: hudson.FilePath$TunneledInterruptedException
	at hudson.FilePath$FileCallableWrapper.call(FilePath.java:3088)
	at hudson.remoting.UserRequest.perform(UserRequest.java:212)
	at hudson.remoting.UserRequest.perform(UserRequest.java:54)
	at hudson.remoting.Request$2.run(Request.java:369)
	at hudson.remoting.InterceptingExecutorService$1.call(InterceptingExecutorService.java:72)
	at java.util.concurrent.FutureTask.run(FutureTask.java:266)
	at java.util.concurrent.ThreadPoolExecutor.runWorker(ThreadPoolExecutor.java:1142)
	at java.util.concurrent.ThreadPoolExecutor$Worker.run(ThreadPoolExecutor.java:617)
	at java.lang.Thread.run(Thread.java:748)
Caused: java.lang.InterruptedException: java.lang.InterruptedException: no matches found within 10000
	at hudson.FilePath.act(FilePath.java:1074)
	at hudson.FilePath.act(FilePath.java:1061)
	at hudson.FilePath.validateAntFileMask(FilePath.java:2705)
	at hudson.tasks.ArtifactArchiver.perform(ArtifactArchiver.java:243)
	at hudson.tasks.BuildStepCompatibilityLayer.perform(BuildStepCompatibilityLayer.java:81)
	at hudson.tasks.BuildStepMonitor$1.perform(BuildStepMonitor.java:20)
	at hudson.model.AbstractBuild$AbstractBuildExecution.perform(AbstractBuild.java:744)
	at hudson.model.AbstractBuild$AbstractBuildExecution.performAllBuildSteps(AbstractBuild.java:690)
	at hudson.model.Build$BuildExecution.post2(Build.java:186)
	at hudson.model.AbstractBuild$AbstractBuildExecution.post(AbstractBuild.java:635)
	at hudson.model.Run.execute(Run.java:1835)
	at hudson.model.FreeStyleBuild.run(FreeStyleBuild.java:43)
	at hudson.model.ResourceController.execute(ResourceController.java:97)
	at hudson.model.Executor.run(Executor.java:429)
No artifacts found that match the file pattern "**/*.events,heapdumps/**,**/hs_err_pid*". Configuration error?
Recording test results
Build step 'Publish JUnit test result report' changed build result to UNSTABLE
Email was triggered for: Unstable (Test Failures)
Sending email for trigger: Unstable (Test Failures)

Mime
View raw message