lucene-dev mailing list archives

Site index · List index
Message view « Date » · « Thread »
Top « Date » · « Thread »
From Apache Jenkins Server <jenk...@builds.apache.org>
Subject [JENKINS] Lucene-Solr-BadApples-Tests-7.x - Build # 283 - Unstable
Date Wed, 06 Feb 2019 20:50:25 GMT
Build: https://builds.apache.org/job/Lucene-Solr-BadApples-Tests-7.x/283/

1 tests failed.
FAILED:  org.apache.solr.cloud.TestWithCollection.testNodeAdded

Error Message:
Timeout occured while waiting response from server at: https://127.0.0.1:37640/solr

Stack Trace:
org.apache.solr.client.solrj.SolrServerException: Timeout occured while waiting response from server at: https://127.0.0.1:37640/solr
	at __randomizedtesting.SeedInfo.seed([78480E3FCDFAE8B2:1D8B58486F5940B1]:0)
	at org.apache.solr.client.solrj.impl.HttpSolrClient.executeMethod(HttpSolrClient.java:654)
	at org.apache.solr.client.solrj.impl.HttpSolrClient.request(HttpSolrClient.java:255)
	at org.apache.solr.client.solrj.impl.HttpSolrClient.request(HttpSolrClient.java:244)
	at org.apache.solr.client.solrj.impl.LBHttpSolrClient.doRequest(LBHttpSolrClient.java:484)
	at org.apache.solr.client.solrj.impl.LBHttpSolrClient.request(LBHttpSolrClient.java:414)
	at org.apache.solr.client.solrj.impl.CloudSolrClient.sendRequest(CloudSolrClient.java:1110)
	at org.apache.solr.client.solrj.impl.CloudSolrClient.requestWithRetryOnStaleState(CloudSolrClient.java:884)
	at org.apache.solr.client.solrj.impl.CloudSolrClient.request(CloudSolrClient.java:817)
	at org.apache.solr.client.solrj.SolrRequest.process(SolrRequest.java:194)
	at org.apache.solr.client.solrj.SolrRequest.process(SolrRequest.java:211)
	at org.apache.solr.cloud.TestWithCollection.testNodeAdded(TestWithCollection.java:445)
	at sun.reflect.NativeMethodAccessorImpl.invoke0(Native Method)
	at sun.reflect.NativeMethodAccessorImpl.invoke(NativeMethodAccessorImpl.java:62)
	at sun.reflect.DelegatingMethodAccessorImpl.invoke(DelegatingMethodAccessorImpl.java:43)
	at java.lang.reflect.Method.invoke(Method.java:498)
	at com.carrotsearch.randomizedtesting.RandomizedRunner.invoke(RandomizedRunner.java:1750)
	at com.carrotsearch.randomizedtesting.RandomizedRunner$8.evaluate(RandomizedRunner.java:938)
	at com.carrotsearch.randomizedtesting.RandomizedRunner$9.evaluate(RandomizedRunner.java:974)
	at com.carrotsearch.randomizedtesting.RandomizedRunner$10.evaluate(RandomizedRunner.java:988)
	at com.carrotsearch.randomizedtesting.rules.SystemPropertiesRestoreRule$1.evaluate(SystemPropertiesRestoreRule.java:57)
	at org.apache.lucene.util.TestRuleSetupTeardownChained$1.evaluate(TestRuleSetupTeardownChained.java:49)
	at org.apache.lucene.util.AbstractBeforeAfterRule$1.evaluate(AbstractBeforeAfterRule.java:45)
	at org.apache.lucene.util.TestRuleThreadAndTestName$1.evaluate(TestRuleThreadAndTestName.java:48)
	at org.apache.lucene.util.TestRuleIgnoreAfterMaxFailures$1.evaluate(TestRuleIgnoreAfterMaxFailures.java:64)
	at org.apache.lucene.util.TestRuleMarkFailure$1.evaluate(TestRuleMarkFailure.java:47)
	at com.carrotsearch.randomizedtesting.rules.StatementAdapter.evaluate(StatementAdapter.java:36)
	at com.carrotsearch.randomizedtesting.ThreadLeakControl$StatementRunner.run(ThreadLeakControl.java:368)
	at com.carrotsearch.randomizedtesting.ThreadLeakControl.forkTimeoutingTask(ThreadLeakControl.java:817)
	at com.carrotsearch.randomizedtesting.ThreadLeakControl$3.evaluate(ThreadLeakControl.java:468)
	at com.carrotsearch.randomizedtesting.RandomizedRunner.runSingleTest(RandomizedRunner.java:947)
	at com.carrotsearch.randomizedtesting.RandomizedRunner$5.evaluate(RandomizedRunner.java:832)
	at com.carrotsearch.randomizedtesting.RandomizedRunner$6.evaluate(RandomizedRunner.java:883)
	at com.carrotsearch.randomizedtesting.RandomizedRunner$7.evaluate(RandomizedRunner.java:894)
	at com.carrotsearch.randomizedtesting.rules.StatementAdapter.evaluate(StatementAdapter.java:36)
	at com.carrotsearch.randomizedtesting.rules.SystemPropertiesRestoreRule$1.evaluate(SystemPropertiesRestoreRule.java:57)
	at org.apache.lucene.util.AbstractBeforeAfterRule$1.evaluate(AbstractBeforeAfterRule.java:45)
	at com.carrotsearch.randomizedtesting.rules.StatementAdapter.evaluate(StatementAdapter.java:36)
	at org.apache.lucene.util.TestRuleStoreClassName$1.evaluate(TestRuleStoreClassName.java:41)
	at com.carrotsearch.randomizedtesting.rules.NoShadowingOrOverridesOnMethodsRule$1.evaluate(NoShadowingOrOverridesOnMethodsRule.java:40)
	at com.carrotsearch.randomizedtesting.rules.NoShadowingOrOverridesOnMethodsRule$1.evaluate(NoShadowingOrOverridesOnMethodsRule.java:40)
	at com.carrotsearch.randomizedtesting.rules.StatementAdapter.evaluate(StatementAdapter.java:36)
	at com.carrotsearch.randomizedtesting.rules.StatementAdapter.evaluate(StatementAdapter.java:36)
	at com.carrotsearch.randomizedtesting.rules.StatementAdapter.evaluate(StatementAdapter.java:36)
	at org.apache.lucene.util.TestRuleAssertionsRequired$1.evaluate(TestRuleAssertionsRequired.java:53)
	at org.apache.lucene.util.TestRuleMarkFailure$1.evaluate(TestRuleMarkFailure.java:47)
	at org.apache.lucene.util.TestRuleIgnoreAfterMaxFailures$1.evaluate(TestRuleIgnoreAfterMaxFailures.java:64)
	at org.apache.lucene.util.TestRuleIgnoreTestSuites$1.evaluate(TestRuleIgnoreTestSuites.java:54)
	at com.carrotsearch.randomizedtesting.rules.StatementAdapter.evaluate(StatementAdapter.java:36)
	at com.carrotsearch.randomizedtesting.ThreadLeakControl$StatementRunner.run(ThreadLeakControl.java:368)
	at java.lang.Thread.run(Thread.java:748)
Caused by: java.net.SocketTimeoutException: Read timed out
	at java.net.SocketInputStream.socketRead0(Native Method)
	at java.net.SocketInputStream.socketRead(SocketInputStream.java:116)
	at java.net.SocketInputStream.read(SocketInputStream.java:171)
	at java.net.SocketInputStream.read(SocketInputStream.java:141)
	at sun.security.ssl.InputRecord.readFully(InputRecord.java:465)
	at sun.security.ssl.InputRecord.read(InputRecord.java:503)
	at sun.security.ssl.SSLSocketImpl.readRecord(SSLSocketImpl.java:975)
	at sun.security.ssl.SSLSocketImpl.readDataRecord(SSLSocketImpl.java:933)
	at sun.security.ssl.AppInputStream.read(AppInputStream.java:105)
	at org.apache.http.impl.io.SessionInputBufferImpl.streamRead(SessionInputBufferImpl.java:137)
	at org.apache.http.impl.io.SessionInputBufferImpl.fillBuffer(SessionInputBufferImpl.java:153)
	at org.apache.http.impl.io.SessionInputBufferImpl.readLine(SessionInputBufferImpl.java:282)
	at org.apache.http.impl.conn.DefaultHttpResponseParser.parseHead(DefaultHttpResponseParser.java:138)
	at org.apache.http.impl.conn.DefaultHttpResponseParser.parseHead(DefaultHttpResponseParser.java:56)
	at org.apache.http.impl.io.AbstractMessageParser.parse(AbstractMessageParser.java:259)
	at org.apache.http.impl.DefaultBHttpClientConnection.receiveResponseHeader(DefaultBHttpClientConnection.java:163)
	at org.apache.http.impl.conn.CPoolProxy.receiveResponseHeader(CPoolProxy.java:165)
	at org.apache.http.protocol.HttpRequestExecutor.doReceiveResponse(HttpRequestExecutor.java:273)
	at org.apache.http.protocol.HttpRequestExecutor.execute(HttpRequestExecutor.java:125)
	at org.apache.http.impl.execchain.MainClientExec.execute(MainClientExec.java:272)
	at org.apache.http.impl.execchain.ProtocolExec.execute(ProtocolExec.java:185)
	at org.apache.http.impl.execchain.RetryExec.execute(RetryExec.java:89)
	at org.apache.http.impl.execchain.RedirectExec.execute(RedirectExec.java:110)
	at org.apache.http.impl.client.InternalHttpClient.doExecute(InternalHttpClient.java:185)
	at org.apache.http.impl.client.CloseableHttpClient.execute(CloseableHttpClient.java:83)
	at org.apache.http.impl.client.CloseableHttpClient.execute(CloseableHttpClient.java:56)
	at org.apache.solr.client.solrj.impl.HttpSolrClient.executeMethod(HttpSolrClient.java:542)
	... 49 more




Build Log:
[...truncated 13547 lines...]
   [junit4] Suite: org.apache.solr.cloud.TestWithCollection
   [junit4]   2> 680956 INFO  (SUITE-TestWithCollection-seed#[78480E3FCDFAE8B2]-worker) [    ] o.a.s.SolrTestCaseJ4 SecureRandom sanity checks: test.solr.allowed.securerandom=null & java.security.egd=file:/dev/./urandom
   [junit4]   2> Creating dataDir: /x1/jenkins/jenkins-slave/workspace/Lucene-Solr-BadApples-Tests-7.x/solr/build/solr-core/test/J2/temp/solr.cloud.TestWithCollection_78480E3FCDFAE8B2-001/init-core-data-001
   [junit4]   2> 680981 WARN  (SUITE-TestWithCollection-seed#[78480E3FCDFAE8B2]-worker) [    ] o.a.s.SolrTestCaseJ4 startTrackingSearchers: numOpens=20 numCloses=20
   [junit4]   2> 680981 INFO  (SUITE-TestWithCollection-seed#[78480E3FCDFAE8B2]-worker) [    ] o.a.s.SolrTestCaseJ4 Using PointFields (NUMERIC_POINTS_SYSPROP=true) w/NUMERIC_DOCVALUES_SYSPROP=false
   [junit4]   2> 680983 INFO  (SUITE-TestWithCollection-seed#[78480E3FCDFAE8B2]-worker) [    ] o.a.s.SolrTestCaseJ4 Randomized ssl (true) and clientAuth (true) via: @org.apache.solr.util.RandomizeSSL(reason=, ssl=NaN, value=NaN, clientAuth=NaN)
   [junit4]   2> 681003 INFO  (TEST-TestWithCollection.testAddReplicaSimple-seed#[78480E3FCDFAE8B2]) [    ] o.a.s.SolrTestCaseJ4 ###Starting testAddReplicaSimple
   [junit4]   2> 681003 INFO  (TEST-TestWithCollection.testAddReplicaSimple-seed#[78480E3FCDFAE8B2]) [    ] o.a.s.c.MiniSolrCloudCluster Starting cluster of 2 servers in /x1/jenkins/jenkins-slave/workspace/Lucene-Solr-BadApples-Tests-7.x/solr/build/solr-core/test/J2/temp/solr.cloud.TestWithCollection_78480E3FCDFAE8B2-001/tempDir-001
   [junit4]   2> 681004 INFO  (TEST-TestWithCollection.testAddReplicaSimple-seed#[78480E3FCDFAE8B2]) [    ] o.a.s.c.ZkTestServer STARTING ZK TEST SERVER
   [junit4]   2> 681007 INFO  (ZkTestServer Run Thread) [    ] o.a.s.c.ZkTestServer client port:0.0.0.0/0.0.0.0:0
   [junit4]   2> 681007 INFO  (ZkTestServer Run Thread) [    ] o.a.s.c.ZkTestServer Starting server
   [junit4]   2> 681107 INFO  (TEST-TestWithCollection.testAddReplicaSimple-seed#[78480E3FCDFAE8B2]) [    ] o.a.s.c.ZkTestServer start zk server on port:37540
   [junit4]   2> 681107 INFO  (TEST-TestWithCollection.testAddReplicaSimple-seed#[78480E3FCDFAE8B2]) [    ] o.a.s.c.ZkTestServer parse host and port list: 127.0.0.1:37540
   [junit4]   2> 681107 INFO  (TEST-TestWithCollection.testAddReplicaSimple-seed#[78480E3FCDFAE8B2]) [    ] o.a.s.c.ZkTestServer connecting to 127.0.0.1 37540
   [junit4]   2> 681139 INFO  (zkConnectionManagerCallback-4209-thread-1) [    ] o.a.s.c.c.ConnectionManager zkClient has connected
   [junit4]   2> 681149 INFO  (zkConnectionManagerCallback-4211-thread-1) [    ] o.a.s.c.c.ConnectionManager zkClient has connected
   [junit4]   2> 681151 INFO  (zkConnectionManagerCallback-4213-thread-1) [    ] o.a.s.c.c.ConnectionManager zkClient has connected
   [junit4]   2> 681154 WARN  (jetty-launcher-4214-thread-1) [    ] o.e.j.s.AbstractConnector Ignoring deprecated socket close linger time
   [junit4]   2> 681155 INFO  (jetty-launcher-4214-thread-1) [    ] o.a.s.c.s.e.JettySolrRunner Start Jetty (original configured port=0)
   [junit4]   2> 681155 INFO  (jetty-launcher-4214-thread-1) [    ] o.a.s.c.s.e.JettySolrRunner Trying to start Jetty on port 0 try number 1 ...
   [junit4]   2> 681155 INFO  (jetty-launcher-4214-thread-1) [    ] o.e.j.s.Server jetty-9.4.14.v20181114; built: 2018-11-14T21:20:31.478Z; git: c4550056e785fb5665914545889f21dc136ad9e6; jvm 1.8.0_191-b12
   [junit4]   2> 681156 WARN  (jetty-launcher-4214-thread-2) [    ] o.e.j.s.AbstractConnector Ignoring deprecated socket close linger time
   [junit4]   2> 681156 INFO  (jetty-launcher-4214-thread-2) [    ] o.a.s.c.s.e.JettySolrRunner Start Jetty (original configured port=0)
   [junit4]   2> 681156 INFO  (jetty-launcher-4214-thread-2) [    ] o.a.s.c.s.e.JettySolrRunner Trying to start Jetty on port 0 try number 1 ...
   [junit4]   2> 681156 INFO  (jetty-launcher-4214-thread-2) [    ] o.e.j.s.Server jetty-9.4.14.v20181114; built: 2018-11-14T21:20:31.478Z; git: c4550056e785fb5665914545889f21dc136ad9e6; jvm 1.8.0_191-b12
   [junit4]   2> 681157 INFO  (jetty-launcher-4214-thread-1) [    ] o.e.j.s.session DefaultSessionIdManager workerName=node0
   [junit4]   2> 681158 INFO  (jetty-launcher-4214-thread-1) [    ] o.e.j.s.session No SessionScavenger set, using defaults
   [junit4]   2> 681158 INFO  (jetty-launcher-4214-thread-1) [    ] o.e.j.s.session node0 Scavenging every 660000ms
   [junit4]   2> 681158 INFO  (jetty-launcher-4214-thread-1) [    ] o.e.j.s.h.ContextHandler Started o.e.j.s.ServletContextHandler@51cb907b{/solr,null,AVAILABLE}
   [junit4]   2> 681181 INFO  (jetty-launcher-4214-thread-2) [    ] o.e.j.s.session DefaultSessionIdManager workerName=node0
   [junit4]   2> 681181 INFO  (jetty-launcher-4214-thread-2) [    ] o.e.j.s.session No SessionScavenger set, using defaults
   [junit4]   2> 681181 INFO  (jetty-launcher-4214-thread-2) [    ] o.e.j.s.session node0 Scavenging every 600000ms
   [junit4]   2> 681182 INFO  (jetty-launcher-4214-thread-2) [    ] o.e.j.s.h.ContextHandler Started o.e.j.s.ServletContextHandler@3b5639b9{/solr,null,AVAILABLE}
   [junit4]   2> 681184 WARN  (jetty-launcher-4214-thread-1) [    ] o.e.j.u.s.S.config No Client EndPointIdentificationAlgorithm configured for SslContextFactory@210449c5[provider=null,keyStore=null,trustStore=null]
   [junit4]   2> 681185 WARN  (jetty-launcher-4214-thread-2) [    ] o.e.j.u.s.S.config No Client EndPointIdentificationAlgorithm configured for SslContextFactory@139d7b56[provider=null,keyStore=null,trustStore=null]
   [junit4]   2> 681186 INFO  (jetty-launcher-4214-thread-2) [    ] o.e.j.s.AbstractConnector Started ServerConnector@4823e478{SSL,[ssl, http/1.1]}{127.0.0.1:36137}
   [junit4]   2> 681186 INFO  (jetty-launcher-4214-thread-2) [    ] o.e.j.s.Server Started @681274ms
   [junit4]   2> 681186 INFO  (jetty-launcher-4214-thread-2) [    ] o.a.s.c.s.e.JettySolrRunner Jetty properties: {hostContext=/solr, hostPort=36137}
   [junit4]   2> 681186 INFO  (jetty-launcher-4214-thread-1) [    ] o.e.j.s.AbstractConnector Started ServerConnector@2f917163{SSL,[ssl, http/1.1]}{127.0.0.1:42150}
   [junit4]   2> 681186 INFO  (jetty-launcher-4214-thread-1) [    ] o.e.j.s.Server Started @681275ms
   [junit4]   2> 681186 INFO  (jetty-launcher-4214-thread-1) [    ] o.a.s.c.s.e.JettySolrRunner Jetty properties: {hostContext=/solr, hostPort=42150}
   [junit4]   2> 681187 ERROR (jetty-launcher-4214-thread-1) [    ] o.a.s.u.StartupLoggingUtils Missing Java Option solr.log.dir. Logging may be missing or incomplete.
   [junit4]   2> 681187 INFO  (jetty-launcher-4214-thread-1) [    ] o.a.s.s.SolrDispatchFilter Using logger factory org.apache.logging.slf4j.Log4jLoggerFactory
   [junit4]   2> 681187 INFO  (jetty-launcher-4214-thread-1) [    ] o.a.s.s.SolrDispatchFilter  ___      _       Welcome to Apache Solr? version 7.8.0
   [junit4]   2> 681187 INFO  (jetty-launcher-4214-thread-1) [    ] o.a.s.s.SolrDispatchFilter / __| ___| |_ _   Starting in cloud mode on port null
   [junit4]   2> 681187 INFO  (jetty-launcher-4214-thread-1) [    ] o.a.s.s.SolrDispatchFilter \__ \/ _ \ | '_|  Install dir: null
   [junit4]   2> 681187 INFO  (jetty-launcher-4214-thread-1) [    ] o.a.s.s.SolrDispatchFilter |___/\___/_|_|    Start time: 2019-02-06T19:55:21.677Z
   [junit4]   2> 681188 ERROR (jetty-launcher-4214-thread-2) [    ] o.a.s.u.StartupLoggingUtils Missing Java Option solr.log.dir. Logging may be missing or incomplete.
   [junit4]   2> 681188 INFO  (jetty-launcher-4214-thread-2) [    ] o.a.s.s.SolrDispatchFilter Using logger factory org.apache.logging.slf4j.Log4jLoggerFactory
   [junit4]   2> 681188 INFO  (jetty-launcher-4214-thread-2) [    ] o.a.s.s.SolrDispatchFilter  ___      _       Welcome to Apache Solr? version 7.8.0
   [junit4]   2> 681188 INFO  (jetty-launcher-4214-thread-2) [    ] o.a.s.s.SolrDispatchFilter / __| ___| |_ _   Starting in cloud mode on port null
   [junit4]   2> 681188 INFO  (jetty-launcher-4214-thread-2) [    ] o.a.s.s.SolrDispatchFilter \__ \/ _ \ | '_|  Install dir: null
   [junit4]   2> 681188 INFO  (jetty-launcher-4214-thread-2) [    ] o.a.s.s.SolrDispatchFilter |___/\___/_|_|    Start time: 2019-02-06T19:55:21.678Z
   [junit4]   2> 681209 INFO  (zkConnectionManagerCallback-4216-thread-1) [    ] o.a.s.c.c.ConnectionManager zkClient has connected
   [junit4]   2> 681210 INFO  (jetty-launcher-4214-thread-1) [    ] o.a.s.s.SolrDispatchFilter solr.xml found in ZooKeeper. Loading...
   [junit4]   2> 681231 INFO  (zkConnectionManagerCallback-4218-thread-1) [    ] o.a.s.c.c.ConnectionManager zkClient has connected
   [junit4]   2> 681232 INFO  (jetty-launcher-4214-thread-2) [    ] o.a.s.s.SolrDispatchFilter solr.xml found in ZooKeeper. Loading...
   [junit4]   2> 681357 INFO  (jetty-launcher-4214-thread-1) [    ] o.a.s.h.c.HttpShardHandlerFactory Host whitelist initialized: WhitelistHostChecker [whitelistHosts=null, whitelistHostCheckingEnabled=true]
   [junit4]   2> 681362 INFO  (jetty-launcher-4214-thread-1) [    ] o.a.s.c.ZkContainer Zookeeper client=127.0.0.1:37540/solr
   [junit4]   2> 681375 INFO  (zkConnectionManagerCallback-4222-thread-1) [    ] o.a.s.c.c.ConnectionManager zkClient has connected
   [junit4]   2> 681410 INFO  (zkConnectionManagerCallback-4224-thread-1) [    ] o.a.s.c.c.ConnectionManager zkClient has connected
   [junit4]   2> 681588 INFO  (jetty-launcher-4214-thread-1) [n:127.0.0.1:42150_solr    ] o.a.s.c.OverseerElectionContext I am going to be the leader 127.0.0.1:42150_solr
   [junit4]   2> 681589 INFO  (jetty-launcher-4214-thread-1) [n:127.0.0.1:42150_solr    ] o.a.s.c.Overseer Overseer (id=72753434534346758-127.0.0.1:42150_solr-n_0000000000) starting
   [junit4]   2> 681610 INFO  (jetty-launcher-4214-thread-2) [    ] o.a.s.h.c.HttpShardHandlerFactory Host whitelist initialized: WhitelistHostChecker [whitelistHosts=null, whitelistHostCheckingEnabled=true]
   [junit4]   2> 681614 INFO  (zkConnectionManagerCallback-4231-thread-1) [    ] o.a.s.c.c.ConnectionManager zkClient has connected
   [junit4]   2> 681618 INFO  (jetty-launcher-4214-thread-1) [n:127.0.0.1:42150_solr    ] o.a.s.c.s.i.ZkClientClusterStateProvider Cluster at 127.0.0.1:37540/solr ready
   [junit4]   2> 681623 INFO  (jetty-launcher-4214-thread-2) [    ] o.a.s.c.ZkContainer Zookeeper client=127.0.0.1:37540/solr
   [junit4]   2> 681625 INFO  (OverseerStateUpdate-72753434534346758-127.0.0.1:42150_solr-n_0000000000) [n:127.0.0.1:42150_solr    ] o.a.s.c.Overseer Starting to work on the main queue : 127.0.0.1:42150_solr
   [junit4]   2> 681625 INFO  (jetty-launcher-4214-thread-1) [n:127.0.0.1:42150_solr    ] o.a.s.c.ZkController Register node as live in ZooKeeper:/live_nodes/127.0.0.1:42150_solr
   [junit4]   2> 681626 DEBUG (OverseerAutoScalingTriggerThread-72753434534346758-127.0.0.1:42150_solr-n_0000000000) [    ] o.a.s.c.a.OverseerTriggerThread Adding .auto_add_replicas and .scheduled_maintenance triggers
   [junit4]   2> 681627 INFO  (OverseerStateUpdate-72753434534346758-127.0.0.1:42150_solr-n_0000000000) [n:127.0.0.1:42150_solr    ] o.a.s.c.c.ZkStateReader Updated live nodes from ZooKeeper... (0) -> (1)
   [junit4]   2> 681627 INFO  (zkConnectionManagerCallback-4235-thread-1) [    ] o.a.s.c.c.ConnectionManager zkClient has connected
   [junit4]   2> 681628 DEBUG (OverseerAutoScalingTriggerThread-72753434534346758-127.0.0.1:42150_solr-n_0000000000) [    ] o.a.s.c.a.OverseerTriggerThread Refreshing /autoscaling.json with znode version 1
   [junit4]   2> 681639 DEBUG (OverseerAutoScalingTriggerThread-72753434534346758-127.0.0.1:42150_solr-n_0000000000) [    ] o.a.s.c.a.OverseerTriggerThread Current znodeVersion 1, lastZnodeVersion 0
   [junit4]   2> 681639 DEBUG (OverseerAutoScalingTriggerThread-72753434534346758-127.0.0.1:42150_solr-n_0000000000) [    ] o.a.s.c.a.OverseerTriggerThread Processed trigger updates upto znodeVersion 1
   [junit4]   2> 681658 DEBUG (OverseerAutoScalingTriggerThread-72753434534346758-127.0.0.1:42150_solr-n_0000000000) [    ] o.a.s.c.a.NodeLostTrigger NodeLostTrigger .auto_add_replicas - Initial livenodes: []
   [junit4]   2> 681658 INFO  (zkCallback-4230-thread-1) [    ] o.a.s.c.c.ZkStateReader Updated live nodes from ZooKeeper... (0) -> (1)
   [junit4]   2> 681659 DEBUG (OverseerAutoScalingTriggerThread-72753434534346758-127.0.0.1:42150_solr-n_0000000000) [    ] o.a.s.c.a.OverseerTriggerThread -- cleaning old nodeLost / nodeAdded markers
   [junit4]   2> 681660 DEBUG (OverseerAutoScalingTriggerThread-72753434534346758-127.0.0.1:42150_solr-n_0000000000) [    ] o.a.s.c.a.OverseerTriggerThread Current znodeVersion 1, lastZnodeVersion 1
   [junit4]   2> 681660 DEBUG (ScheduledTrigger-3654-thread-1) [    ] o.a.s.c.a.NodeLostTrigger Running NodeLostTrigger: .auto_add_replicas with currently live nodes: 1 and last live nodes: 0
   [junit4]   2> 681660 INFO  (zkConnectionManagerCallback-4237-thread-1) [    ] o.a.s.c.c.ConnectionManager zkClient has connected
   [junit4]   2> 681665 INFO  (jetty-launcher-4214-thread-2) [n:127.0.0.1:36137_solr    ] o.a.s.c.c.ZkStateReader Updated live nodes from ZooKeeper... (0) -> (1)
   [junit4]   2> 681672 INFO  (jetty-launcher-4214-thread-2) [n:127.0.0.1:36137_solr    ] o.a.s.c.ZkController Publish node=127.0.0.1:36137_solr as DOWN
   [junit4]   2> 681673 INFO  (jetty-launcher-4214-thread-2) [n:127.0.0.1:36137_solr    ] o.a.s.c.TransientSolrCoreCacheDefault Allocating transient cache for 2147483647 transient cores
   [junit4]   2> 681673 INFO  (jetty-launcher-4214-thread-2) [n:127.0.0.1:36137_solr    ] o.a.s.c.ZkController Register node as live in ZooKeeper:/live_nodes/127.0.0.1:36137_solr
   [junit4]   2> 681675 INFO  (jetty-launcher-4214-thread-1) [n:127.0.0.1:42150_solr    ] o.a.s.h.a.MetricsHistoryHandler No .system collection, keeping metrics history in memory.
   [junit4]   2> 681707 INFO  (zkCallback-4230-thread-1) [    ] o.a.s.c.c.ZkStateReader Updated live nodes from ZooKeeper... (1) -> (2)
   [junit4]   2> 681708 DEBUG (OverseerStateUpdate-72753434534346758-127.0.0.1:42150_solr-n_0000000000) [n:127.0.0.1:42150_solr    ] o.a.s.c.o.NodeMutator DownNode state invoked for node: 127.0.0.1:36137_solr
   [junit4]   2> 681713 INFO  (zkCallback-4236-thread-1) [    ] o.a.s.c.c.ZkStateReader Updated live nodes from ZooKeeper... (1) -> (2)
   [junit4]   2> 681713 INFO  (zkCallback-4223-thread-2) [    ] o.a.s.c.c.ZkStateReader Updated live nodes from ZooKeeper... (1) -> (2)
   [junit4]   2> 681748 INFO  (jetty-launcher-4214-thread-1) [n:127.0.0.1:42150_solr    ] o.a.s.m.r.SolrJmxReporter JMX monitoring for 'solr_42150.solr.node' (registry 'solr.node') enabled at server: com.sun.jmx.mbeanserver.JmxMBeanServer@53f12067
   [junit4]   2> 681766 INFO  (jetty-launcher-4214-thread-1) [n:127.0.0.1:42150_solr    ] o.a.s.m.r.SolrJmxReporter JMX monitoring for 'solr_42150.solr.jvm' (registry 'solr.jvm') enabled at server: com.sun.jmx.mbeanserver.JmxMBeanServer@53f12067
   [junit4]   2> 681766 INFO  (jetty-launcher-4214-thread-1) [n:127.0.0.1:42150_solr    ] o.a.s.m.r.SolrJmxReporter JMX monitoring for 'solr_42150.solr.jetty' (registry 'solr.jetty') enabled at server: com.sun.jmx.mbeanserver.JmxMBeanServer@53f12067
   [junit4]   2> 681768 INFO  (jetty-launcher-4214-thread-1) [n:127.0.0.1:42150_solr    ] o.a.s.c.CorePropertiesLocator Found 0 core definitions underneath /x1/jenkins/jenkins-slave/workspace/Lucene-Solr-BadApples-Tests-7.x/solr/build/solr-core/test/J2/temp/solr.cloud.TestWithCollection_78480E3FCDFAE8B2-001/tempDir-001/node1/.
   [junit4]   2> 681768 INFO  (zkConnectionManagerCallback-4245-thread-1) [    ] o.a.s.c.c.ConnectionManager zkClient has connected
   [junit4]   2> 681774 INFO  (jetty-launcher-4214-thread-2) [n:127.0.0.1:36137_solr    ] o.a.s.c.c.ZkStateReader Updated live nodes from ZooKeeper... (0) -> (2)
   [junit4]   2> 681781 INFO  (jetty-launcher-4214-thread-2) [n:127.0.0.1:36137_solr    ] o.a.s.c.s.i.ZkClientClusterStateProvider Cluster at 127.0.0.1:37540/solr ready
   [junit4]   2> 681807 INFO  (jetty-launcher-4214-thread-2) [n:127.0.0.1:36137_solr    ] o.a.s.h.a.MetricsHistoryHandler No .system collection, keeping metrics history in memory.
   [junit4]   2> 681872 INFO  (jetty-launcher-4214-thread-2) [n:127.0.0.1:36137_solr    ] o.a.s.m.r.SolrJmxReporter JMX monitoring for 'solr_36137.solr.node' (registry 'solr.node') enabled at server: com.sun.jmx.mbeanserver.JmxMBeanServer@53f12067
   [junit4]   2> 681899 INFO  (jetty-launcher-4214-thread-2) [n:127.0.0.1:36137_solr    ] o.a.s.m.r.SolrJmxReporter JMX monitoring for 'solr_36137.solr.jvm' (registry 'solr.jvm') enabled at server: com.sun.jmx.mbeanserver.JmxMBeanServer@53f12067
   [junit4]   2> 681900 INFO  (jetty-launcher-4214-thread-2) [n:127.0.0.1:36137_solr    ] o.a.s.m.r.SolrJmxReporter JMX monitoring for 'solr_36137.solr.jetty' (registry 'solr.jetty') enabled at server: com.sun.jmx.mbeanserver.JmxMBeanServer@53f12067
   [junit4]   2> 681901 INFO  (jetty-launcher-4214-thread-2) [n:127.0.0.1:36137_solr    ] o.a.s.c.CorePropertiesLocator Found 0 core definitions underneath /x1/jenkins/jenkins-slave/workspace/Lucene-Solr-BadApples-Tests-7.x/solr/build/solr-core/test/J2/temp/solr.cloud.TestWithCollection_78480E3FCDFAE8B2-001/tempDir-001/node2/.
   [junit4]   2> 682025 INFO  (zkConnectionManagerCallback-4251-thread-1) [    ] o.a.s.c.c.ConnectionManager zkClient has connected
   [junit4]   2> 682027 INFO  (TEST-TestWithCollection.testAddReplicaSimple-seed#[78480E3FCDFAE8B2]) [    ] o.a.s.c.c.ZkStateReader Updated live nodes from ZooKeeper... (0) -> (2)
   [junit4]   2> 682028 INFO  (TEST-TestWithCollection.testAddReplicaSimple-seed#[78480E3FCDFAE8B2]) [    ] o.a.s.c.s.i.ZkClientClusterStateProvider Cluster at 127.0.0.1:37540/solr ready
   [junit4]   2> 682035 DEBUG (zkCallback-4230-thread-1) [    ] o.a.s.c.a.OverseerTriggerThread Refreshing /autoscaling.json with znode version 2
   [junit4]   2> 682036 DEBUG (OverseerAutoScalingTriggerThread-72753434534346758-127.0.0.1:42150_solr-n_0000000000) [    ] o.a.s.c.a.OverseerTriggerThread Processed trigger updates upto znodeVersion 2
   [junit4]   2> 682039 DEBUG (OverseerAutoScalingTriggerThread-72753434534346758-127.0.0.1:42150_solr-n_0000000000) [    ] o.a.s.c.a.OverseerTriggerThread -- cleaning old nodeLost / nodeAdded markers
   [junit4]   2> 682040 DEBUG (OverseerAutoScalingTriggerThread-72753434534346758-127.0.0.1:42150_solr-n_0000000000) [    ] o.a.s.c.a.OverseerTriggerThread Current znodeVersion 2, lastZnodeVersion 2
   [junit4]   2> 682046 INFO  (TEST-TestWithCollection.testAddReplicaSimple-seed#[78480E3FCDFAE8B2]) [    ] o.a.s.c.TestWithCollection Chosen node 127.0.0.1:42150_solr for collection testAddReplica_abc
   [junit4]   2> 682075 INFO  (qtp253058473-12029) [n:127.0.0.1:42150_solr    ] o.a.s.h.a.CollectionsHandler Invoked Collection Action :create with params pullReplicas=0&name=testAddReplica_abc&nrtReplicas=1&action=CREATE&numShards=1&tlogReplicas=0&createNodeSet=127.0.0.1:42150_solr&wt=javabin&version=2 and sendToOCPQueue=true
   [junit4]   2> 682079 INFO  (OverseerThreadFactory-3656-thread-1-processing-n:127.0.0.1:42150_solr) [n:127.0.0.1:42150_solr    ] o.a.s.c.a.c.CreateCollectionCmd Create collection testAddReplica_abc
   [junit4]   2> 682080 INFO  (OverseerThreadFactory-3656-thread-1-processing-n:127.0.0.1:42150_solr) [n:127.0.0.1:42150_solr    ] o.a.s.c.c.ZkConfigManager Copying zk node /configs/_default/managed-schema to /configs/testAddReplica_abc.AUTOCREATED/managed-schema
   [junit4]   2> 682082 INFO  (OverseerThreadFactory-3656-thread-1-processing-n:127.0.0.1:42150_solr) [n:127.0.0.1:42150_solr    ] o.a.s.c.c.ZkConfigManager Copying zk node /configs/_default/protwords.txt to /configs/testAddReplica_abc.AUTOCREATED/protwords.txt
   [junit4]   2> 682084 INFO  (OverseerThreadFactory-3656-thread-1-processing-n:127.0.0.1:42150_solr) [n:127.0.0.1:42150_solr    ] o.a.s.c.c.ZkConfigManager Copying zk node /configs/_default/solrconfig.xml to /configs/testAddReplica_abc.AUTOCREATED/solrconfig.xml
   [junit4]   2> 682086 INFO  (OverseerThreadFactory-3656-thread-1-processing-n:127.0.0.1:42150_solr) [n:127.0.0.1:42150_solr    ] o.a.s.c.c.ZkConfigManager Copying zk node /configs/_default/synonyms.txt to /configs/testAddReplica_abc.AUTOCREATED/synonyms.txt
   [junit4]   2> 682088 INFO  (OverseerThreadFactory-3656-thread-1-processing-n:127.0.0.1:42150_solr) [n:127.0.0.1:42150_solr    ] o.a.s.c.c.ZkConfigManager Copying zk node /configs/_default/stopwords.txt to /configs/testAddReplica_abc.AUTOCREATED/stopwords.txt
   [junit4]   2> 682092 INFO  (OverseerThreadFactory-3656-thread-1-processing-n:127.0.0.1:42150_solr) [n:127.0.0.1:42150_solr    ] o.a.s.c.c.ZkConfigManager Copying zk node /configs/_default/lang/contractions_it.txt to /configs/testAddReplica_abc.AUTOCREATED/lang/contractions_it.txt
   [junit4]   2> 682094 INFO  (OverseerThreadFactory-3656-thread-1-processing-n:127.0.0.1:42150_solr) [n:127.0.0.1:42150_solr    ] o.a.s.c.c.ZkConfigManager Copying zk node /configs/_default/lang/contractions_ca.txt to /configs/testAddReplica_abc.AUTOCREATED/lang/contractions_ca.txt
   [junit4]   2> 682098 INFO  (OverseerThreadFactory-3656-thread-1-processing-n:127.0.0.1:42150_solr) [n:127.0.0.1:42150_solr    ] o.a.s.c.c.ZkConfigManager Copying zk node /configs/_default/lang/stemdict_nl.txt to /configs/testAddReplica_abc.AUTOCREATED/lang/stemdict_nl.txt
   [junit4]   2> 682105 INFO  (OverseerThreadFactory-3656-thread-1-processing-n:127.0.0.1:42150_solr) [n:127.0.0.1:42150_solr    ] o.a.s.c.c.ZkConfigManager Copying zk node /configs/_default/lang/stopwords_no.txt to /configs/testAddReplica_abc.AUTOCREATED/lang/stopwords_no.txt
   [junit4]   2> 682110 INFO  (OverseerThreadFactory-3656-thread-1-processing-n:127.0.0.1:42150_solr) [n:127.0.0.1:42150_solr    ] o.a.s.c.c.ZkConfigManager Copying zk node /configs/_default/lang/stopwords_hy.txt to /configs/testAddReplica_abc.AUTOCREATED/lang/stopwords_hy.txt
   [junit4]   2> 682113 INFO  (OverseerThreadFactory-3656-thread-1-processing-n:127.0.0.1:42150_solr) [n:127.0.0.1:42150_solr    ] o.a.s.c.c.ZkConfigManager Copying zk node /configs/_default/lang/stopwords_id.txt to /configs/testAddReplica_abc.AUTOCREATED/lang/stopwords_id.txt
   [junit4]   2> 682121 INFO  (OverseerThreadFactory-3656-thread-1-processing-n:127.0.0.1:42150_solr) [n:127.0.0.1:42150_solr    ] o.a.s.c.c.ZkConfigManager Copying zk node /configs/_default/lang/stopwords_hi.txt to /configs/testAddReplica_abc.AUTOCREATED/lang/stopwords_hi.txt
   [junit4]   2> 682130 INFO  (OverseerThreadFactory-3656-thread-1-processing-n:127.0.0.1:42150_solr) [n:127.0.0.1:42150_solr    ] o.a.s.c.c.ZkConfigManager Copying zk node /configs/_default/lang/stopwords_ga.txt to /configs/testAddReplica_abc.AUTOCREATED/lang/stopwords_ga.txt
   [junit4]   2> 682132 INFO  (OverseerThreadFactory-3656-thread-1-processing-n:127.0.0.1:42150_solr) [n:127.0.0.1:42150_solr    ] o.a.s.c.c.ZkConfigManager Copying zk node /configs/_default/lang/stopwords_da.txt to /configs/testAddReplica_abc.AUTOCREATED/lang/stopwords_da.txt
   [junit4]   2> 682134 INFO  (OverseerThreadFactory-3656-thread-1-processing-n:127.0.0.1:42150_solr) [n:127.0.0.1:42150_solr    ] o.a.s.c.c.ZkConfigManager Copying zk node /configs/_default/lang/stopwords_ja.txt to /configs/testAddReplica_abc.AUTOCREATED/lang/stopwords_ja.txt
   [junit4]   2> 682136 INFO  (OverseerThreadFactory-3656-thread-1-processing-n:127.0.0.1:42150_solr) [n:127.0.0.1:42150_solr    ] o.a.s.c.c.ZkConfigManager Copying zk node /configs/_default/lang/stopwords_pt.txt to /configs/testAddReplica_abc.AUTOCREATED/lang/stopwords_pt.txt
   [junit4]   2> 682146 INFO  (OverseerThreadFactory-3656-thread-1-processing-n:127.0.0.1:42150_solr) [n:127.0.0.1:42150_solr    ] o.a.s.c.c.ZkConfigManager Copying zk node /configs/_default/lang/stopwords_hu.txt to /configs/testAddReplica_abc.AUTOCREATED/lang/stopwords_hu.txt
   [junit4]   2> 682151 INFO  (OverseerThreadFactory-3656-thread-1-processing-n:127.0.0.1:42150_solr) [n:127.0.0.1:42150_solr    ] o.a.s.c.c.ZkConfigManager Copying zk node /configs/_default/lang/stopwords_el.txt to /configs/testAddReplica_abc.AUTOCREATED/lang/stopwords_el.txt
   [junit4]   2> 682153 INFO  (OverseerThreadFactory-3656-thread-1-processing-n:127.0.0.1:42150_solr) [n:127.0.0.1:42150_solr    ] o.a.s.c.c.ZkConfigManager Copying zk node /configs/_default/lang/stopwords_ru.txt to /configs/testAddReplica_abc.AUTOCREATED/lang/stopwords_ru.txt
   [junit4]   2> 682155 INFO  (OverseerThreadFactory-3656-thread-1-processing-n:127.0.0.1:42150_solr) [n:127.0.0.1:42150_solr    ] o.a.s.c.c.ZkConfigManager Copying zk node /configs/_default/lang/stopwords_tr.txt to /configs/testAddReplica_abc.AUTOCREATED/lang/stopwords_tr.txt
   [junit4]   2> 682157 INFO  (OverseerThreadFactory-3656-thread-1-processing-n:127.0.0.1:42150_solr) [n:127.0.0.1:42150_solr    ] o.a.s.c.c.ZkConfigManager Copying zk node /configs/_default/lang/stopwords_ar.txt to /configs/testAddReplica_abc.AUTOCREATED/lang/stopwords_ar.txt
   [junit4]   2> 682159 INFO  (OverseerThreadFactory-3656-thread-1-processing-n:127.0.0.1:42150_solr) [n:127.0.0.1:42150_solr    ] o.a.s.c.c.ZkConfigManager Copying zk node /configs/_default/lang/userdict_ja.txt to /configs/testAddReplica_abc.AUTOCREATED/lang/userdict_ja.txt
   [junit4]   2> 682160 INFO  (OverseerThreadFactory-3656-thread-1-processing-n:127.0.0.1:42150_solr) [n:127.0.0.1:42150_solr    ] o.a.s.c.c.ZkConfigManager Copying zk node /configs/_default/lang/stopwords_eu.txt to /configs/testAddReplica_abc.AUTOCREATED/lang/stopwords_eu.txt
   [junit4]   2> 682162 INFO  (OverseerThreadFactory-3656-thread-1-processing-n:127.0.0.1:42150_solr) [n:127.0.0.1:42150_solr    ] o.a.s.c.c.ZkConfigManager Copying zk node /configs/_default/lang/stopwords_it.txt to /configs/testAddReplica_abc.AUTOCREATED/lang/stopwords_it.txt
   [junit4]   2> 682163 INFO  (OverseerThreadFactory-3656-thread-1-processing-n:127.0.0.1:42150_solr) [n:127.0.0.1:42150_solr    ] o.a.s.c.c.ZkConfigManager Copying zk node /configs/_default/lang/stopwords_cz.txt to /configs/testAddReplica_abc.AUTOCREATED/lang/stopwords_cz.txt
   [junit4]   2> 682165 INFO  (OverseerThreadFactory-3656-thread-1-processing-n:127.0.0.1:42150_solr) [n:127.0.0.1:42150_solr    ] o.a.s.c.c.ZkConfigManager Copying zk node /configs/_default/lang/stoptags_ja.txt to /configs/testAddReplica_abc.AUTOCREATED/lang/stoptags_ja.txt
   [junit4]   2> 682166 INFO  (OverseerThreadFactory-3656-thread-1-processing-n:127.0.0.1:42150_solr) [n:127.0.0.1:42150_solr    ] o.a.s.c.c.ZkConfigManager Copying zk node /configs/_default/lang/contractions_fr.txt to /configs/testAddReplica_abc.AUTOCREATED/lang/contractions_fr.txt
   [junit4]   2> 682168 INFO  (OverseerThreadFactory-3656-thread-1-processing-n:127.0.0.1:42150_solr) [n:127.0.0.1:42150_solr    ] o.a.s.c.c.ZkConfigManager Copying zk node /configs/_default/lang/stopwords_de.txt to /configs/testAddReplica_abc.AUTOCREATED/lang/stopwords_de.txt
   [junit4]   2> 682170 INFO  (OverseerThreadFactory-3656-thread-1-processing-n:127.0.0.1:42150_solr) [n:127.0.0.1:42150_solr    ] o.a.s.c.c.ZkConfigManager Copying zk node /configs/_default/lang/stopwords_fa.txt to /configs/testAddReplica_abc.AUTOCREATED/lang/stopwords_fa.txt
   [junit4]   2> 682171 INFO  (OverseerThreadFactory-3656-thread-1-processing-n:127.0.0.1:42150_solr) [n:127.0.0.1:42150_solr    ] o.a.s.c.c.ZkConfigManager Copying zk node /configs/_default/lang/contractions_ga.txt to /configs/testAddReplica_abc.AUTOCREATED/lang/contractions_ga.txt
   [junit4]   2> 682173 INFO  (OverseerThreadFactory-3656-thread-1-processing-n:127.0.0.1:42150_solr) [n:127.0.0.1:42150_solr    ] o.a.s.c.c.ZkConfigManager Copying zk node /configs/_default/lang/stopwords_ca.txt to /configs/testAddReplica_abc.AUTOCREATED/lang/stopwords_ca.txt
   [junit4]   2> 682174 INFO  (OverseerThreadFactory-3656-thread-1-processing-n:127.0.0.1:42150_solr) [n:127.0.0.1:42150_solr    ] o.a.s.c.c.ZkConfigManager Copying zk node /configs/_default/lang/stopwords_nl.txt to /configs/testAddReplica_abc.AUTOCREATED/lang/stopwords_nl.txt
   [junit4]   2> 682176 INFO  (OverseerThreadFactory-3656-thread-1-processing-n:127.0.0.1:42150_solr) [n:127.0.0.1:42150_solr    ] o.a.s.c.c.ZkConfigManager Copying zk node /configs/_default/lang/stopwords_bg.txt to /configs/testAddReplica_abc.AUTOCREATED/lang/stopwords_bg.txt
   [junit4]   2> 682177 INFO  (OverseerThreadFactory-3656-thread-1-processing-n:127.0.0.1:42150_solr) [n:127.0.0.1:42150_solr    ] o.a.s.c.c.ZkConfigManager Copying zk node /configs/_default/lang/stopwords_en.txt to /configs/testAddReplica_abc.AUTOCREATED/lang/stopwords_en.txt
   [junit4]   2> 682192 INFO  (OverseerThreadFactory-3656-thread-1-processing-n:127.0.0.1:42150_solr) [n:127.0.0.1:42150_solr    ] o.a.s.c.c.ZkConfigManager Copying zk node /configs/_default/lang/stopwords_es.txt to /configs/testAddReplica_abc.AUTOCREATED/lang/stopwords_es.txt
   [junit4]   2> 682194 INFO  (OverseerThreadFactory-3656-thread-1-processing-n:127.0.0.1:42150_solr) [n:127.0.0.1:42150_solr    ] o.a.s.c.c.ZkConfigManager Copying zk node /configs/_default/lang/stopwords_lv.txt to /configs/testAddReplica_abc.AUTOCREATED/lang/stopwords_lv.txt
   [junit4]   2> 682196 INFO  (OverseerThreadFactory-3656-thread-1-processing-n:127.0.0.1:42150_solr) [n:127.0.0.1:42150_solr    ] o.a.s.c.c.ZkConfigManager Copying zk node /configs/_default/lang/stopwords_ro.txt to /configs/testAddReplica_abc.AUTOCREATED/lang/stopwords_ro.txt
   [junit4]   2> 682197 INFO  (OverseerThreadFactory-3656-thread-1-processing-n:127.0.0.1:42150_solr) [n:127.0.0.1:42150_solr    ] o.a.s.c.c.ZkConfigManager Copying zk node /configs/_default/lang/stopwords_th.txt to /configs/testAddReplica_abc.AUTOCREATED/lang/stopwords_th.txt
   [junit4]   2> 682199 INFO  (OverseerThreadFactory-3656-thread-1-processing-n:127.0.0.1:42150_solr) [n:127.0.0.1:42150_solr    ] o.a.s.c.c.ZkConfigManager Copying zk node /configs/_default/lang/stopwords_fr.txt to /configs/testAddReplica_abc.AUTOCREATED/lang/stopwords_fr.txt
   [junit4]   2> 682200 INFO  (OverseerThreadFactory-3656-thread-1-processing-n:127.0.0.1:42150_solr) [n:127.0.0.1:42150_solr    ] o.a.s.c.c.ZkConfigManager Copying zk node /configs/_default/lang/stopwords_sv.txt to /configs/testAddReplica_abc.AUTOCREATED/lang/stopwords_sv.txt
   [junit4]   2> 682202 INFO  (OverseerThreadFactory-3656-thread-1-processing-n:127.0.0.1:42150_solr) [n:127.0.0.1:42150_solr    ] o.a.s.c.c.ZkConfigManager Copying zk node /configs/_default/lang/stopwords_fi.txt to /configs/testAddReplica_abc.AUTOCREATED/lang/stopwords_fi.txt
   [junit4]   2> 682204 INFO  (OverseerThreadFactory-3656-thread-1-processing-n:127.0.0.1:42150_solr) [n:127.0.0.1:42150_solr    ] o.a.s.c.c.ZkConfigManager Copying zk node /configs/_default/lang/hyphenations_ga.txt to /configs/testAddReplica_abc.AUTOCREATED/lang/hyphenations_ga.txt
   [junit4]   2> 682205 INFO  (OverseerThreadFactory-3656-thread-1-processing-n:127.0.0.1:42150_solr) [n:127.0.0.1:42150_solr    ] o.a.s.c.c.ZkConfigManager Copying zk node /configs/_default/lang/stopwords_gl.txt to /configs/testAddReplica_abc.AUTOCREATED/lang/stopwords_gl.txt
   [junit4]   2> 682207 INFO  (OverseerThreadFactory-3656-thread-1-processing-n:127.0.0.1:42150_solr) [n:127.0.0.1:42150_solr    ] o.a.s.c.c.ZkConfigManager Copying zk node /configs/_default/params.json to /configs/testAddReplica_abc.AUTOCREATED/params.json
   [junit4]   2> 682219 DEBUG (OverseerStateUpdate-72753434534346758-127.0.0.1:42150_solr-n_0000000000) [n:127.0.0.1:42150_solr    ] o.a.s.c.o.ClusterStateMutator building a new cName: testAddReplica_abc
   [junit4]   2> 682221 DEBUG (OverseerStateUpdate-72753434534346758-127.0.0.1:42150_solr-n_0000000000) [n:127.0.0.1:42150_solr    ] o.a.s.c.o.ZkStateWriter going to create_collection /collections/testAddReplica_abc/state.json
   [junit4]   2> 682529 DEBUG (OverseerThreadFactory-3656-thread-1-processing-n:127.0.0.1:42150_solr) [n:127.0.0.1:42150_solr    ] o.a.s.c.s.c.a.PolicyHelper Creating a new session
   [junit4]   2> 682543 INFO  (qtp253058473-12027) [n:127.0.0.1:42150_solr    ] o.a.s.s.HttpSolrCall [admin] webapp=null path=/admin/metrics params={prefix=CONTAINER.fs.usableSpace,CONTAINER.fs.totalSpace,CORE.coreName&wt=javabin&version=2&group=solr.node,solr.core} status=0 QTime=0
   [junit4]   2> 682544 INFO  (qtp253058473-12028) [n:127.0.0.1:42150_solr    ] o.a.s.s.HttpSolrCall [admin] webapp=null path=/admin/metrics params={prefix=CONTAINER.fs.usableSpace,CONTAINER.fs.totalSpace,CORE.coreName&wt=javabin&version=2&group=solr.node,solr.core} status=0 QTime=0
   [junit4]   2> 682545 INFO  (qtp253058473-12030) [n:127.0.0.1:42150_solr    ] o.a.s.s.HttpSolrCall [admin] webapp=null path=/admin/metrics params={prefix=CONTAINER.fs.usableSpace,CONTAINER.fs.totalSpace,CORE.coreName&wt=javabin&version=2&group=solr.node,solr.core} status=0 QTime=0
   [junit4]   2> 682546 INFO  (qtp253058473-12026) [n:127.0.0.1:42150_solr    ] o.a.s.s.HttpSolrCall [admin] webapp=null path=/admin/metrics params={prefix=CONTAINER.fs.usableSpace,CONTAINER.fs.totalSpace,CORE.coreName&wt=javabin&version=2&group=solr.node,solr.core} status=0 QTime=0
   [junit4]   2> 682547 INFO  (qtp253058473-12027) [n:127.0.0.1:42150_solr    ] o.a.s.s.HttpSolrCall [admin] webapp=null path=/admin/metrics params={prefix=CONTAINER.fs.usableSpace,CONTAINER.fs.totalSpace,CORE.coreName&wt=javabin&version=2&group=solr.node,solr.core} status=0 QTime=0
   [junit4]   2> 682583 INFO  (qtp354864607-12038) [n:127.0.0.1:36137_solr    ] o.a.s.s.HttpSolrCall [admin] webapp=null path=/admin/metrics params={prefix=CONTAINER.fs.usableSpace,CONTAINER.fs.totalSpace,CORE.coreName&wt=javabin&version=2&group=solr.node,solr.core} status=0 QTime=0
   [junit4]   2> 682584 INFO  (qtp354864607-12039) [n:127.0.0.1:36137_solr    ] o.a.s.s.HttpSolrCall [admin] webapp=null path=/admin/metrics params={prefix=CONTAINER.fs.usableSpace,CONTAINER.fs.totalSpace,CORE.coreName&wt=javabin&version=2&group=solr.node,solr.core} status=0 QTime=0
   [junit4]   2> 682585 INFO  (qtp354864607-12035) [n:127.0.0.1:36137_solr    ] o.a.s.s.HttpSolrCall [admin] webapp=null path=/admin/metrics params={prefix=CONTAINER.fs.usableSpace,CONTAINER.fs.totalSpace,CORE.coreName&wt=javabin&version=2&group=solr.node,solr.core} status=0 QTime=0
   [junit4]   2> 682586 INFO  (qtp354864607-12036) [n:127.0.0.1:36137_solr    ] o.a.s.s.HttpSolrCall [admin] webapp=null path=/admin/metrics params={prefix=CONTAINER.fs.usableSpace,CONTAINER.fs.totalSpace,CORE.coreName&wt=javabin&version=2&group=solr.node,solr.core} status=0 QTime=0
   [junit4]   2> 682587 INFO  (qtp354864607-12037) [n:127.0.0.1:36137_solr    ] o.a.s.s.HttpSolrCall [admin] webapp=null path=/admin/metrics params={prefix=CONTAINER.fs.usableSpace,CONTAINER.fs.totalSpace,CORE.coreName&wt=javabin&version=2&group=solr.node,solr.core} status=0 QTime=0
   [junit4]   2> 682587 DEBUG (OverseerThreadFactory-3656-thread-1-processing-n:127.0.0.1:42150_solr) [n:127.0.0.1:42150_solr    ] o.a.s.c.s.c.a.PolicyHelper New session created 
   [junit4]   2> 682588 DEBUG (OverseerThreadFactory-3656-thread-1-processing-n:127.0.0.1:42150_solr) [n:127.0.0.1:42150_solr    ] o.a.s.c.s.c.a.PolicyHelper returnSession, curr-time 10617684929 sessionWrapper.createTime 10617684928657537, this.sessionWrapper.createTime 10617684928657537 
   [junit4]   2> 682595 INFO  (OverseerStateUpdate-72753434534346758-127.0.0.1:42150_solr-n_0000000000) [n:127.0.0.1:42150_solr    ] o.a.s.c.o.SliceMutator createReplica() {
   [junit4]   2>   "operation":"ADDREPLICA",
   [junit4]   2>   "collection":"testAddReplica_abc",
   [junit4]   2>   "shard":"shard1",
   [junit4]   2>   "core":"testAddReplica_abc_shard1_replica_n1",
   [junit4]   2>   "state":"down",
   [junit4]   2>   "base_url":"https://127.0.0.1:42150/solr",
   [junit4]   2>   "type":"NRT",
   [junit4]   2>   "waitForFinalState":"false"} 
   [junit4]   2> 682596 DEBUG (OverseerStateUpdate-72753434534346758-127.0.0.1:42150_solr-n_0000000000) [n:127.0.0.1:42150_solr    ] o.a.s.c.o.SliceMutator Old Slice: shard1:{
   [junit4]   2>   "range":"80000000-7fffffff",
   [junit4]   2>   "state":"active",
   [junit4]   2>   "replicas":{}}
   [junit4]   2> 682596 DEBUG (OverseerStateUpdate-72753434534346758-127.0.0.1:42150_solr-n_0000000000) [n:127.0.0.1:42150_solr    ] o.a.s.c.o.SliceMutator New Slice: shard1:{
   [junit4]   2>   "range":"80000000-7fffffff",
   [junit4]   2>   "state":"active",
   [junit4]   2>   "replicas":{"core_node2":{
   [junit4]   2>       "core":"testAddReplica_abc_shard1_replica_n1",
   [junit4]   2>       "base_url":"https://127.0.0.1:42150/solr",
   [junit4]   2>       "state":"down",
   [junit4]   2>       "node_name":null,
   [junit4]   2>       "type":"NRT"}}}
   [junit4]   2> 682697 DEBUG (OverseerStateUpdate-72753434534346758-127.0.0.1:42150_solr-n_0000000000) [n:127.0.0.1:42150_solr    ] o.a.s.c.o.ZkStateWriter going to update_collection /collections/testAddReplica_abc/state.json version: 0
   [junit4]   2> 682800 INFO  (qtp253058473-12028) [n:127.0.0.1:42150_solr    x:testAddReplica_abc_shard1_replica_n1] o.a.s.h.a.CoreAdminOperation core create command qt=/admin/cores&coreNodeName=core_node2&collection.configName=testAddReplica_abc.AUTOCREATED&newCollection=true&name=testAddReplica_abc_shard1_replica_n1&action=CREATE&numShards=1&collection=testAddReplica_abc&shard=shard1&wt=javabin&version=2&replicaType=NRT
   [junit4]   2> 682800 INFO  (qtp253058473-12028) [n:127.0.0.1:42150_solr    x:testAddReplica_abc_shard1_replica_n1] o.a.s.c.TransientSolrCoreCacheDefault Allocating transient cache for 2147483647 transient cores
   [junit4]   2> 682804 DEBUG (OverseerStateUpdate-72753434534346758-127.0.0.1:42150_solr-n_0000000000) [n:127.0.0.1:42150_solr    ] o.a.s.c.o.ReplicaMutator Update state numShards=1 message={
   [junit4]   2>   "core":"testAddReplica_abc_shard1_replica_n1",
   [junit4]   2>   "core_node_name":"core_node2",
   [junit4]   2>   "roles":null,
   [junit4]   2>   "base_url":"https://127.0.0.1:42150/solr",
   [junit4]   2>   "node_name":"127.0.0.1:42150_solr",
   [junit4]   2>   "numShards":"1",
   [junit4]   2>   "state":"down",
   [junit4]   2>   "shard":"shard1",
   [junit4]   2>   "collection":"testAddReplica_abc",
   [junit4]   2>   "type":"NRT",
   [junit4]   2>   "force_set_state":"false",
   [junit4]   2>   "operation":"state"}
   [junit4]   2> 682805 DEBUG (OverseerStateUpdate-72753434534346758-127.0.0.1:42150_solr-n_0000000000) [n:127.0.0.1:42150_solr    ] o.a.s.c.o.ReplicaMutator Will update state for replica: core_node2:{"core":"testAddReplica_abc_shard1_replica_n1","base_url":"https://127.0.0.1:42150/solr","node_name":"127.0.0.1:42150_solr","state":"down","type":"NRT","force_set_state":"false"}
   [junit4]   2> 682805 DEBUG (OverseerStateUpdate-72753434534346758-127.0.0.1:42150_solr-n_0000000000) [n:127.0.0.1:42150_solr    ] o.a.s.c.o.ReplicaMutator Collection is now: DocCollection(testAddReplica_abc//collections/testAddReplica_abc/state.json/1)={
   [junit4]   2>   "pullReplicas":"0",
   [junit4]   2>   "replicationFactor":"1",
   [junit4]   2>   "router":{"name":"compositeId"},
   [junit4]   2>   "maxShardsPerNode":"1",
   [junit4]   2>   "autoAddReplicas":"false",
   [junit4]   2>   "nrtReplicas":"1",
   [junit4]   2>   "tlogReplicas":"0",
   [junit4]   2>   "shards":{"shard1":{
   [junit4]   2>       "range":"80000000-7fffffff",
   [junit4]   2>       "state":"active",
   [junit4]   2>       "replicas":{"core_node2":{
   [junit4]   2>           "core":"testAddReplica_abc_shard1_replica_n1",
   [junit4]   2>           "base_url":"https://127.0.0.1:42150/solr",
   [junit4]   2>           "node_name":"127.0.0.1:42150_solr",
   [junit4]   2>           "state":"down",
   [junit4]   2>           "type":"NRT",
   [junit4]   2>           "force_set_state":"false"}}}}}
   [junit4]   2> 682907 DEBUG (OverseerStateUpdate-72753434534346758-127.0.0.1:42150_solr-n_0000000000) [n:127.0.0.1:42150_solr    ] o.a.s.c.o.ZkStateWriter going to update_collection /collections/testAddReplica_abc/state.json version: 1
   [junit4]   2> 683821 INFO  (qtp253058473-12028) [n:127.0.0.1:42150_solr c:testAddReplica_abc s:shard1 r:core_node2 x:testAddReplica_abc_shard1_replica_n1] o.a.s.c.RequestParams conf resource params.json loaded . version : 0 
   [junit4]   2> 683821 INFO  (qtp253058473-12028) [n:127.0.0.1:42150_solr c:testAddReplica_abc s:shard1 r:core_node2 x:testAddReplica_abc_shard1_replica_n1] o.a.s.c.RequestParams request params refreshed to version 0
   [junit4]   2> 683822 WARN  (qtp253058473-12028) [n:127.0.0.1:42150_solr c:testAddReplica_abc s:shard1 r:core_node2 x:testAddReplica_abc_shard1_replica_n1] o.a.s.c.SolrConfig Couldn't add files from /x1/jenkins/jenkins-slave/workspace/Lucene-Solr-BadApples-Tests-7.x/solr/build/solr-core/test/J2/temp/solr.cloud.TestWithCollection_78480E3FCDFAE8B2-001/tempDir-001/node1/testAddReplica_abc_shard1_replica_n1/../../../../contrib/extraction/lib filtered by .*\.jar to classpath: /x1/jenkins/jenkins-slave/workspace/Lucene-Solr-BadApples-Tests-7.x/solr/build/solr-core/test/J2/temp/solr.cloud.TestWithCollection_78480E3FCDFAE8B2-001/tempDir-001/node1/testAddReplica_abc_shard1_replica_n1/../../../../contrib/extraction/lib
   [junit4]   2> 683822 WARN  (qtp253058473-12028) [n:127.0.0.1:42150_solr c:testAddReplica_abc s:shard1 r:core_node2 x:testAddReplica_abc_shard1_replica_n1] o.a.s.c.SolrConfig Couldn't add files from /x1/jenkins/jenkins-slave/workspace/Lucene-Solr-BadApples-Tests-7.x/solr/build/solr-core/test/J2/temp/solr.cloud.TestWithCollection_78480E3FCDFAE8B2-001/tempDir-001/node1/testAddReplica_abc_shard1_replica_n1/../../../../dist filtered by solr-cell-\d.*\.jar to classpath: /x1/jenkins/jenkins-slave/workspace/Lucene-Solr-BadApples-Tests-7.x/solr/build/solr-core/test/J2/temp/solr.cloud.TestWithCollection_78480E3FCDFAE8B2-001/tempDir-001/node1/testAddReplica_abc_shard1_replica_n1/../../../../dist
   [junit4]   2> 683822 WARN  (qtp253058473-12028) [n:127.0.0.1:42150_solr c:testAddReplica_abc s:shard1 r:core_node2 x:testAddReplica_abc_shard1_replica_n1] o.a.s.c.SolrConfig Couldn't add files from /x1/jenkins/jenkins-slave/workspace/Lucene-Solr-BadApples-Tests-7.x/solr/build/solr-core/test/J2/temp/solr.cloud.TestWithCollection_78480E3FCDFAE8B2-001/tempDir-001/node1/testAddReplica_abc_shard1_replica_n1/../../../../contrib/clustering/lib filtered by .*\.jar to classpath: /x1/jenkins/jenkins-slave/workspace/Lucene-Solr-BadApples-Tests-7.x/solr/build/solr-core/test/J2/temp/solr.cloud.TestWithCollection_78480E3FCDFAE8B2-001/tempDir-001/node1/testAddReplica_abc_shard1_replica_n1/../../../../contrib/clustering/lib
   [junit4]   2> 683822 WARN  (qtp253058473-12028) [n:127.0.0.1:42150_solr c:testAddReplica_abc s:shard1 r:core_node2 x:testAddReplica_abc_shard1_replica_n1] o.a.s.c.SolrConfig Couldn't add files from /x1/jenkins/jenkins-slave/workspace/Lucene-Solr-BadApples-Tests-7.x/solr/build/solr-core/test/J2/temp/solr.cloud.TestWithCollection_78480E3FCDFAE8B2-001/tempDir-001/node1/testAddReplica_abc_shard1_replica_n1/../../../../dist filtered by solr-clustering-\d.*\.jar to classpath: /x1/jenkins/jenkins-slave/workspace/Lucene-Solr-BadApples-Tests-7.x/solr/build/solr-core/test/J2/temp/solr.cloud.TestWithCollection_78480E3FCDFAE8B2-001/tempDir-001/node1/testAddReplica_abc_shard1_replica_n1/../../../../dist
   [junit4]   2> 683823 WARN  (qtp253058473-12028) [n:127.0.0.1:42150_solr c:testAddReplica_abc s:shard1 r:core_node2 x:testAddReplica_abc_shard1_replica_n1] o.a.s.c.SolrConfig Couldn't add files from /x1/jenkins/jenkins-slave/workspace/Lucene-Solr-BadApples-Tests-7.x/solr/build/solr-core/test/J2/temp/solr.cloud.TestWithCollection_78480E3FCDFAE8B2-001/tempDir-001/node1/testAddReplica_abc_shard1_replica_n1/../../../../contrib/langid/lib filtered by .*\.jar to classpath: /x1/jenkins/jenkins-slave/workspace/Lucene-Solr-BadApples-Tests-7.x/solr/build/solr-core/test/J2/temp/solr.cloud.TestWithCollection_78480E3FCDFAE8B2-001/tempDir-001/node1/testAddReplica_abc_shard1_replica_n1/../../../../contrib/langid/lib
   [junit4]   2> 683823 WARN  (qtp253058473-12028) [n:127.0.0.1:42150_solr c:testAddReplica_abc s:shard1 r:core_node2 x:testAddReplica_abc_shard1_replica_n1] o.a.s.c.SolrConfig Couldn't add files from /x1/jenkins/jenkins-slave/workspace/Lucene-Solr-BadApples-Tests-7.x/solr/build/solr-core/test/J2/temp/solr.cloud.TestWithCollection_78480E3FCDFAE8B2-001/tempDir-001/node1/testAddReplica_abc_shard1_replica_n1/../../../../dist filtered by solr-langid-\d.*\.jar to classpath: /x1/jenkins/jenkins-slave/workspace/Lucene-Solr-BadApples-Tests-7.x/solr/build/solr-core/test/J2/temp/solr.cloud.TestWithCollection_78480E3FCDFAE8B2-001/tempDir-001/node1/testAddReplica_abc_shard1_replica_n1/../../../../dist
   [junit4]   2> 683823 WARN  (qtp253058473-12028) [n:127.0.0.1:42150_solr c:testAddReplica_abc s:shard1 r:core_node2 x:testAddReplica_abc_shard1_replica_n1] o.a.s.c.SolrConfig Couldn't add files from /x1/jenkins/jenkins-slave/workspace/Lucene-Solr-BadApples-Tests-7.x/solr/build/solr-core/test/J2/temp/solr.cloud.TestWithCollection_78480E3FCDFAE8B2-001/tempDir-001/node1/testAddReplica_abc_shard1_replica_n1/../../../../contrib/velocity/lib filtered by .*\.jar to classpath: /x1/jenkins/jenkins-slave/workspace/Lucene-Solr-BadApples-Tests-7.x/solr/build/solr-core/test/J2/temp/solr.cloud.TestWithCollection_78480E3FCDFAE8B2-001/tempDir-001/node1/testAddReplica_abc_shard1_replica_n1/../../../../contrib/velocity/lib
   [junit4]   2> 683823 WARN  (qtp253058473-12028) [n:127.0.0.1:42150_solr c:testAddReplica_abc s:shard1 r:core_node2 x:testAddReplica_abc_shard1_replica_n1] o.a.s.c.SolrConfig Couldn't add files from /x1/jenkins/jenkins-slave/workspace/Lucene-Solr-BadApples-Tests-7.x/solr/build/solr-core/test/J2/temp/solr.cloud.TestWithCollection_78480E3FCDFAE8B2-001/tempDir-001/node1/testAddReplica_abc_shard1_replica_n1/../../../../dist filtered by solr-velocity-\d.*\.jar to classpath: /x1/jenkins/jenkins-slave/workspace/Lucene-Solr-BadApples-Tests-7.x/solr/build/solr-core/test/J2/temp/solr.cloud.TestWithCollection_78480E3FCDFAE8B2-001/tempDir-001/node1/testAddReplica_abc_shard1_replica_n1/../../../../dist
   [junit4]   2> 683833 INFO  (qtp253058473-12028) [n:127.0.0.1:42150_solr c:testAddReplica_abc s:shard1 r:core_node2 x:testAddReplica_abc_shard1_replica_n1] o.a.s.c.SolrConfig Using Lucene MatchVersion: 7.8.0
   [junit4]   2> 683861 INFO  (qtp253058473-12028) [n:127.0.0.1:42150_solr c:testAddReplica_abc s:shard1 r:core_node2 x:testAddReplica_abc_shard1_replica_n1] o.a.s.s.IndexSchema [testAddReplica_abc_shard1_replica_n1] Schema name=default-config
   [junit4]   2> 684128 INFO  (qtp253058473-12028) [n:127.0.0.1:42150_solr c:testAddReplica_abc s:shard1 r:core_node2 x:testAddReplica_abc_shard1_replica_n1] o.a.s.s.IndexSchema Loaded schema default-config/1.6 with uniqueid field id
   [junit4]   2> 684255 INFO  (qtp253058473-12028) [n:127.0.0.1:42150_solr c:testAddReplica_abc s:shard1 r:core_node2 x:testAddReplica_abc_shard1_replica_n1] o.a.s.c.CoreContainer Creating SolrCore 'testAddReplica_abc_shard1_replica_n1' using configuration from collection testAddReplica_abc, trusted=true
   [junit4]   2> 684256 INFO  (qtp253058473-12028) [n:127.0.0.1:42150_solr c:testAddReplica_abc s:shard1 r:core_node2 x:testAddReplica_abc_shard1_replica_n1] o.a.s.m.r.SolrJmxReporter JMX monitoring for 'solr_42150.solr.core.testAddReplica_abc.shard1.replica_n1' (registry 'solr.core.testAddReplica_abc.shard1.replica_n1') enabled at server: com.sun.jmx.mbeanserver.JmxMBeanServer@53f12067
   [junit4]   2> 684256 INFO  (qtp253058473-12028) [n:127.0.0.1:42150_solr c:testAddReplica_abc s:shard1 r:core_node2 x:testAddReplica_abc_shard1_replica_n1] o.a.s.c.SolrCore [[testAddReplica_abc_shard1_replica_n1] ] Opening new SolrCore at [/x1/jenkins/jenkins-slave/workspace/Lucene-Solr-BadApples-Tests-7.x/solr/build/solr-core/test/J2/temp/solr.cloud.TestWithCollection_78480E3FCDFAE8B2-001/tempDir-001/node1/testAddReplica_abc_shard1_replica_n1], dataDir=[/x1/jenkins/jenkins-slave/workspace/Lucene-Solr-BadApples-Tests-7.x/solr/build/solr-core/test/J2/temp/solr.cloud.TestWithCollection_78480E3FCDFAE8B2-001/tempDir-001/node1/./testAddReplica_abc_shard1_replica_n1/data/]
   [junit4]   2> 684267 INFO  (qtp253058473-12028) [n:127.0.0.1:42150_solr c:testAddReplica_abc s:shard1 r:core_node2 x:testAddReplica_abc_shard1_replica_n1] o.a.s.r.XSLTResponseWriter xsltCacheLifetimeSeconds=5
   [junit4]   2> 684352 INFO  (qtp253058473-12028) [n:127.0.0.1:42150_solr c:testAddReplica_abc s:shard1 r:core_node2 x:testAddReplica_abc_shard1_replica_n1] o.a.s.u.UpdateHandler Using UpdateLog implementation: org.apache.solr.update.UpdateLog
   [junit4]   2> 684352 INFO  (qtp253058473-12028) [n:127.0.0.1:42150_solr c:testAddReplica_abc s:shard1 r:core_node2 x:testAddReplica_abc_shard1_replica_n1] o.a.s.u.UpdateLog Initializing UpdateLog: dataDir= defaultSyncLevel=FLUSH numRecordsToKeep=100 maxNumLogsToKeep=10 numVersionBuckets=65536
   [junit4]   2> 684355 INFO  (qtp253058473-12028) [n:127.0.0.1:42150_solr c:testAddReplica_abc s:shard1 r:core_node2 x:testAddReplica_abc_shard1_replica_n1] o.a.s.u.CommitTracker Hard AutoCommit: if uncommitted for 15000ms; 
   [junit4]   2> 684355 INFO  (qtp253058473-12028) [n:127.0.0.1:42150_solr c:testAddReplica_abc s:shard1 r:core_node2 x:testAddReplica_abc_shard1_replica_n1] o.a.s.u.CommitTracker Soft AutoCommit: disabled
   [junit4]   2> 684357 INFO  (qtp253058473-12028) [n:127.0.0.1:42150_solr c:testAddReplica_abc s:shard1 r:core_node2 x:testAddReplica_abc_shard1_replica_n1] o.a.s.s.SolrIndexSearcher Opening [Searcher@6da82bb8[testAddReplica_abc_shard1_replica_n1] main]
   [junit4]   2> 684359 INFO  (qtp253058473-12028) [n:127.0.0.1:42150_solr c:testAddReplica_abc s:shard1 r:core_node2 x:testAddReplica_abc_shard1_replica_n1] o.a.s.r.ManagedResourceStorage Configured ZooKeeperStorageIO with znodeBase: /configs/testAddReplica_abc.AUTOCREATED
   [junit4]   2> 684359 INFO  (qtp253058473-12028) [n:127.0.0.1:42150_solr c:testAddReplica_abc s:shard1 r:core_node2 x:testAddReplica_abc_shard1_replica_n1] o.a.s.r.ManagedResourceStorage Loaded null at path _rest_managed.json using ZooKeeperStorageIO:path=/configs/testAddReplica_abc.AUTOCREATED
   [junit4]   2> 684359 INFO  (qtp253058473-12028) [n:127.0.0.1:42150_solr c:testAddReplica_abc s:shard1 r:core_node2 x:testAddReplica_abc_shard1_replica_n1] o.a.s.s.ZkIndexSchemaReader Creating ZooKeeper watch for the managed schema at /configs/testAddReplica_abc.AUTOCREATED/managed-schema
   [junit4]   2> 684360 INFO  (qtp253058473-12028) [n:127.0.0.1:42150_solr c:testAddReplica_abc s:shard1 r:core_node2 x:testAddReplica_abc_shard1_replica_n1] o.a.s.s.ZkIndexSchemaReader Current schema version 0 is already the latest
   [junit4]   2> 684361 INFO  (qtp253058473-12028) [n:127.0.0.1:42150_solr c:testAddReplica_abc s:shard1 r:core_node2 x:testAddReplica_abc_shard1_replica_n1] o.a.s.h.c.SpellCheckComponent Initializing spell checkers
   [junit4]   2> 684361 INFO  (qtp253058473-12028) [n:127.0.0.1:42150_solr c:testAddReplica_abc s:shard1 r:core_node2 x:testAddReplica_abc_shard1_replica_n1] o.a.s.s.DirectSolrSpellChecker init: {name=default,field=_text_,classname=solr.DirectSolrSpellChecker,distanceMeasure=internal,accuracy=0.5,maxEdits=2,minPrefix=1,maxInspections=5,minQueryLength=4,maxQueryFrequency=0.01}
   [junit4]   2> 684363 INFO  (qtp253058473-12028) [n:127.0.0.1:42150_solr c:testAddReplica_abc s:shard1 r:core_node2 x:testAddReplica_abc_shard1_replica_n1] o.a.s.h.ReplicationHandler Commits will be reserved for 10000ms.
   [junit4]   2> 684363 INFO  (qtp253058473-12028) [n:127.0.0.1:42150_solr c:testAddReplica_abc s:shard1 r:core_node2 x:testAddReplica_abc_shard1_replica_n1] o.a.s.u.UpdateLog Could not find max version in index or recent updates, using new clock 1624750607410659328
   [junit4]   2> 684367 INFO  (searcherExecutor-3665-thread-1-processing-n:127.0.0.1:42150_solr x:testAddReplica_abc_shard1_replica_n1 c:testAddReplica_abc s:shard1 r:core_node2) [n:127.0.0.1:42150_solr c:testAddReplica_abc s:shard1 r:core_node2 x:testAddReplica_abc_shard1_replica_n1] o.a.s.c.QuerySenderListener QuerySenderListener sending requests to Searcher@6da82bb8[testAddReplica_abc_shard1_replica_n1] main{ExitableDirectoryReader(UninvertingDirectoryReader())}
   [junit4]   2> 684367 INFO  (searcherExecutor-3665-thread-1-processing-n:127.0.0.1:42150_solr x:testAddReplica_abc_shard1_replica_n1 c:testAddReplica_abc s:shard1 r:core_node2) [n:127.0.0.1:42150_solr c:testAddReplica_abc s:shard1 r:core_node2 x:testAddReplica_abc_shard1_replica_n1] o.a.s.c.QuerySenderListener QuerySenderListener done.
   [junit4]   2> 684367 INFO  (searcherExecutor-3665-thread-1-processing-n:127.0.0.1:42150_solr x:testAddReplica_abc_shard1_replica_n1 c:testAddReplica_abc s:shard1 r:core_node2) [n:127.0.0.1:42150_solr c:testAddReplica_abc s:shard1 r:core_node2 x:testAddReplica_abc_shard1_replica_n1] o.a.s.h.c.SpellCheckComponent Loading spell index for spellchecker: default
   [junit4]   2> 684368 INFO  (searcherExecutor-3665-thread-1-processing-n:127.0.0.1:42150_solr x:testAddReplica_abc_shard1_replica_n1 c:testAddReplica_abc s:shard1 r:core_node2) [n:127.0.0.1:42150_solr c:testAddReplica_abc s:shard1 r:core_node2 x:testAddReplica_abc_shard1_replica_n1] o.a.s.c.SolrCore [testAddReplica_abc_shard1_replica_n1] Registered new searcher Searcher@6da82bb8[testAddReplica_abc_shard1_replica_n1] main{ExitableDirectoryReader(UninvertingDirectoryReader())}
   [junit4]   2> 684371 INFO  (qtp253058473-12028) [n:127.0.0.1:42150_solr c:testAddReplica_abc s:shard1 r:core_node2 x:testAddReplica_abc_shard1_replica_n1] o.a.s.c.ZkShardTerms Successful update of terms at /collections/testAddReplica_abc/terms/shard1 to Terms{values={core_node2=0}, version=0}
   [junit4]   2> 684371 INFO  (qtp253058473-12028) [n:127.0.0.1:42150_solr c:testAddReplica_abc s:shard1 r:core_node2 x:testAddReplica_abc_shard1_replica_n1] o.a.s.c.ShardLeaderElectionContextBase make sure parent is created /collections/testAddReplica_abc/leaders/shard1
   [junit4]   2> 684380 INFO  (qtp253058473-12028) [n:127.0.0.1:42150_solr c:testAddReplica_abc s:shard1 r:core_node2 x:testAddReplica_abc_shard1_replica_n1] o.a.s.c.ShardLeaderElectionContext Enough replicas found to continue.
   [junit4]   2> 684380 INFO  (qtp253058473-12028) [n:127.0.0.1:42150_solr c:testAddReplica_abc s:shard1 r:core_node2 x:testAddReplica_abc_shard1_replica_n1] o.a.s.c.ShardLeaderElectionContext I may be the new leader - try and sync
   [junit4]   2> 684380 INFO  (qtp253058473-12028) [n:127.0.0.1:42150_solr c:testAddReplica_abc s:shard1 r:core_node2 x:testAddReplica_abc_shard1_replica_n1] o.a.s.c.SyncStrategy Sync replicas to https://127.0.0.1:42150/solr/testAddReplica_abc_shard1_replica_n1/
   [junit4]   2> 684380 INFO  (qtp253058473-12028) [n:127.0.0.1:42150_solr c:testAddReplica_abc s:shard1 r:core_node2 x:testAddReplica_abc_shard1_replica_n1] o.a.s.c.SyncStrategy Sync Success - now sync replicas to me
   [junit4]   2> 684381 INFO  (qtp253058473-12028) [n:127.0.0.1:42150_solr c:testAddReplica_abc s:shard1 r:core_node2 x:testAddReplica_abc_shard1_replica_n1] o.a.s.c.SyncStrategy https://127.0.0.1:42150/solr/testAddReplica_abc_shard1_replica_n1/ has no replicas
   [junit4]   2> 684381 INFO  (qtp253058473-12028) [n:127.0.0.1:42150_solr c:testAddReplica_abc s:shard1 r:core_node2 x:testAddReplica_abc_shard1_replica_n1] o.a.s.c.ShardLeaderElectionContext Found all replicas participating in election, clear LIR
   [junit4]   2> 684381 INFO  (qtp253058473-12028) [n:127.0.0.1:42150_solr c:testAddReplica_abc s:shard1 r:core_node2 x:testAddReplica_abc_shard1_replica_n1] o.a.s.c.ShardLeaderElectionContextBase Creating leader registration node /collections/testAddReplica_abc/leaders/shard1/leader after winning as /collections/testAddReplica_abc/leader_elect/shard1/election/72753434534346758-core_node2-n_0000000000
   [junit4]   2> 684383 INFO  (qtp253058473-12028) [n:127.0.0.1:42150_solr c:testAddReplica_abc s:shard1 r:core_node2 x:testAddReplica_abc_shard1_replica_n1] o.a.s.c.ShardLeaderElectionContext I am the new leader: https://127.0.0.1:42150/solr/testAddReplica_abc_shard1_replica_n1/ shard1
   [junit4]   2> 684484 DEBUG (OverseerStateUpdate-72753434534346758-127.0.0.1:42150_solr-n_0000000000) [n:127.0.0.1:42150_solr    ] o.a.s.c.o.ZkStateWriter going to update_collection /collections/testAddReplica_abc/state.json version: 2
   [junit4]   2> 684485 INFO  (zkCallback-4223-thread-2) [    ] o.a.s.c.c.ZkStateReader A cluster state change: [WatchedEvent state:SyncConnected type:NodeDataChanged path:/collections/testAddReplica_abc/state.json] for collection [testAddReplica_abc] has occurred - updating... (live nodes size: [2])
   [junit4]   2> 684485 INFO  (zkCallback-4223-thread-1) [    ] o.a.s.c.c.ZkStateReader A cluster state change: [WatchedEvent state:SyncConnected type:NodeDataChanged path:/collections/testAddReplica_abc/state.json] for collection [testAddReplica_abc] has occurred - updating... (live nodes size: [2])
   [junit4]   2> 684493 INFO  (qtp253058473-12028) [n:127.0.0.1:42150_solr c:testAddReplica_abc s:shard1 r:core_node2 x:testAddReplica_abc_shard1_replica_n1] o.a.s.c.ZkController I am the leader, no recovery necessary
   [junit4]   2> 684495 DEBUG (OverseerStateUpdate-72753434534346758-127.0.0.1:42150_solr-n_0000000000) [n:127.0.0.1:42150_solr    ] o.a.s.c.o.ReplicaMutator Update state numShards=1 message={
   [junit4]   2>   "core":"testAddReplica_abc_shard1_replica_n1",
   [junit4]   2>   "core_node_name":"core_node2",
   [junit4]   2>   "roles":null,
   [junit4]   2>   "base_url":"https://127.0.0.1:42150/solr",
   [junit4]   2>   "node_name":"127.0.0.1:42150_solr",
   [junit4]   2>   "numShards":"1",
   [junit4]   2>   "state":"active",
   [junit4]   2>   "shard":"shard1",
   [junit4]   2>   "collection":"testAddReplica_abc",
   [junit4]   2>   "type":"NRT",
   [junit4]   2>   "force_set_state":"false",
   [junit4]   2>   "operation":"state"}
   [junit4]   2> 684495 DEBUG (OverseerStateUpdate-72753434534346758-127.0.0.1:42150_solr-n_0000000000) [n:127.0.0.1:42150_solr    ] o.a.s.c.o.ReplicaMutator Will update state for replica: core_node2:{"core":"testAddReplica_abc_shard1_replica_n1","base_url":"https://127.0.0.1:42150/solr","node_name":"127.0.0.1:42150_solr","state":"active","type":"NRT","force_set_state":"false","leader":"true"}
   [junit4]   2> 684495 DEBUG (OverseerStateUpdate-72753434534346758-127.0.0.1:42150_solr-n_0000000000) [n:127.0.0.1:42150_solr    ] o.a.s.c.o.ReplicaMutator Collection is now: DocCollection(testAddReplica_abc//collections/testAddReplica_abc/state.json/3)={
   [junit4]   2>   "pullReplicas":"0",
   [junit4]   2>   "replicationFactor":"1",
   [junit4]   2>   "router":{"name":"compositeId"},
   [junit4]   2>   "maxShardsPerNode":"1",
   [junit4]   2>   "autoAddReplicas":"false",
   [junit4]   2>   "nrtReplicas":"1",
   [junit4]   2>   "tlogReplicas":"0",
   [junit4]   2>   "shards":{"shard1":{
   [junit4]   2>       "range":"80000000-7fffffff",
   [junit4]   2>       "state":"active",
   [junit4]   2>       "replicas":{"core_node2":{
   [junit4]   2>           "core":"testAddReplica_abc_shard1_replica_n1",
   [junit4]   2>           "base_url":"https://127.0.0.1:42150/solr",
   [junit4]   2>           "node_name":"127.0.0.1:42150_solr",
   [junit4]   2>           "state":"active",
   [junit4]   2>           "type":"NRT",
   [junit4]   2>           "force_set_state":"false",
   [junit4]   2>           "leader":"true"}}}}}
   [junit4]   2> 684496 INFO  (qtp253058473-12028) [n:127.0.0.1:42150_solr c:testAddReplica_abc s:shard1 r:core_node2 x:testAddReplica_abc_shard1_replica_n1] o.a.s.s.HttpSolrCall [admin] webapp=null path=/admin/cores params={qt=/admin/cores&coreNodeName=core_node2&collection.configName=testAddReplica_abc.AUTOCREATED&newCollection=true&name=testAddReplica_abc_shard1_replica_n1&action=CREATE&numShards=1&collection=testAddReplica_abc&shard=shard1&wt=javabin&version=2&replicaType=NRT} status=0 QTime=1696
   [junit4]   2> 684497 DEBUG (OverseerThreadFactory-3656-thread-1-processing-n:127.0.0.1:42150_solr) [n:127.0.0.1:42150_solr    ] o.a.s.c.s.c.a.PolicyHelper session set to NULL
   [junit4]   2> 684499 INFO  (qtp253058473-12029) [n:127.0.0.1:42150_solr    ] o.a.s.h.a.CollectionsHandler Wait for new collection to be active for at most 45 seconds. Check all shard replicas
   [junit4]   2> 684596 DEBUG (OverseerStateUpdate-72753434534346758-127.0.0.1:42150_solr-n_0000000000) [n:127.0.0.1:42150_solr    ] o.a.s.c.o.ZkStateWriter going to update_collection /collections/testAddReplica_abc/state.json version: 3
   [junit4]   2> 684597 INFO  (zkCallback-4223-thread-2) [    ] o.a.s.c.c.ZkStateReader A cluster state change: [WatchedEvent state:SyncConnected type:NodeDataChanged path:/collections/testAddReplica_abc/state.json] for collection [testAddReplica_abc] has occurred - updating... (live nodes size: [2])
   [junit4]   2> 684597 INFO  (zkCallback-4223-thread-1) [    ] o.a.s.c.c.ZkStateReader A cluster state change: [WatchedEvent state:SyncConnected type:NodeDataChanged path:/collections/testAddReplica_abc/state.json] for collection [testAddReplica_abc] has occurred - updating... (live nodes size: [2])
   [junit4]   2> 684597 INFO  (zkCallback-4223-thread-3) [    ] o.a.s.c.c.ZkStateReader A cluster state change: [WatchedEvent state:SyncConnected type:NodeDataChanged path:/collections/testAddReplica_abc/state.json] for collection [testAddReplica_abc] has occurred - updating... (live nodes size: [2])
   [junit4]   2> 684598 INFO  (qtp253058473-12029) [n:127.0.0.1:42150_solr    ] o.a.s.s.HttpSolrCall [admin] webapp=null path=/admin/collections params={pullReplicas=0&name=testAddReplica_abc&nrtReplicas=1&action=CREATE&numShards=1&tlogReplicas=0&createNodeSet=127.0.0.1:42150_solr&wt=javabin&version=2} status=0 QTime=2522
   [junit4]   2> 684599 INFO  (qtp253058473-12030) [n:127.0.0.1:42150_solr    ] o.a.s.h.a.CollectionsHandler Invoked Collection Action :create with params pullReplicas=0&withCollection=testAddReplica_abc&name=testAddReplica_xyz&nrtReplicas=1&action=CREATE&numShards=1&tlogReplicas=0&wt=javabin&version=2 and sendToOCPQueue=true
   [junit4]   2> 684601 INFO  (OverseerThreadFactory-3656-thread-2-processing-n:127.0.0.1:42150_solr) [n:127.0.0.1:42150_solr    ] o.a.s.c.a.c.CreateCollectionCmd Create collection testAddReplica_xyz
   [junit4]   2> 684602 INFO  (OverseerCollectionConfigSetProcessor-72753434534346758-127.0.0.1:42150_solr-n_0000000000) [n:127.0.0.1:42150_solr    ] o.a.s.c.OverseerTaskQueue Response ZK path: /overseer/collection-queue-work/qnr-0000000000 doesn't exist.  Requestor may have disconnected from ZooKeeper
   [junit4]   2> 684604 INFO  (OverseerThreadFactory-3656-thread-2-processing-n:127.0.0.1:42150_solr) [n:127.0.0.1:42150_solr    ] o.a.s.c.c.ZkConfigManager Copying zk node /configs/_default/managed-schema to /configs/testAddReplica_xyz.AUTOCREATED/managed-schema
   [junit4]   2> 684606 INFO  (OverseerThreadFactory-3656-thread-2-processing-n:127.0.0.1:42150_solr) [n:127.0.0.1:42150_solr    ] o.a.s.c.c.ZkConfigManager Copying zk node /configs/_default/protwords.txt to /configs/testAddReplica_xyz.AUTOCREATED/protwords.txt
   [junit4]   2> 684607 INFO  (OverseerThreadFactory-3656-thread-2-processing-n:127.0.0.1:42150_solr) [n:127.0.0.1:42150_solr    ] o.a.s.c.c.ZkConfigManager Copying zk node /configs/_default/solrconfig.xml to /configs/testAddReplica_xyz.AUTOCREATED/solrconfig.xml
   [junit4]   2> 684609 INFO  (OverseerThreadFactory-3656-thread-2-processing-n:127.0.0.1:42150_solr) [n:127.0.0.1:42150_solr    ] o.a.s.c.c.ZkConfigManager Copying zk node /configs/_default/synonyms.txt to /configs/testAddReplica_xyz.AUTOCREATED/synonyms.txt
   [junit4]   2> 684611 INFO  (OverseerThreadFactory-3656-thread-2-processing-n:127.0.0.1:42150_solr) [n:127.0.0.1:42150_solr    ] o.a.s.c.c.ZkConfigManager Copying zk node /configs/_default/stopwords.txt to /configs/testAddReplica_xyz.AUTOCREATED/stopwords.txt
   [junit4]   2> 684613 INFO  (OverseerThreadFactory-3656-thread-2-processing-n:127.0.0.1:42150_solr) [n:127.0.0.1:42150_solr    ] o.a.s.c.c.ZkConfigManager Copying zk node /configs/_default/lang/contractions_it.txt to /configs/testAddReplica_xyz.AUTOCREATED/lang/contractions_it.txt
   [junit4]   2> 684615 INFO  (OverseerThreadFactory-3656-thread-2-processing-n:127.0.0.1:42150_solr) [n:127.0.0.1:42150_solr    ] o.a.s.c.c.ZkConfigManager Copying zk node /configs/_default/lang/contractions_ca.txt to /configs/testAddReplica_xyz.AUTOCREATED/lang/contractions_ca.txt
   [junit4]   2> 684617 INFO  (OverseerThreadFactory-3656-thread-2-processing-n:127.0.0.1:42150_solr) [n:127.0.0.1:42150_solr    ] o.a.s.c.c.ZkConfigManager Copying zk node /configs/_default/lang/stemdict_nl.txt to /configs/testAddReplica_xyz.AUTOCREATED/lang/stemdict_nl.txt
   [junit4]   2> 684619 INFO  (OverseerThreadFactory-3656-thread-2-processing-n:127.0.0.1:42150_solr) [n:127.0.0.1:42150_solr    ] o.a.s.c.c.ZkConfigManager Copying zk node /configs/_default/lang/stopwords_no.txt to /configs/testAddReplica_xyz.AUTOCREATED/lang/stopwords_no.txt
   [junit4]   2> 684621 INFO  (OverseerThreadFactory-3656-thread-2-processing-n:127.0.0.1:42150_solr) [n:127.0.0.1:42150_solr    ] o.a.s.c.c.ZkConfigManager Copying zk node /configs/_default/lang/stopwords_hy.txt to /configs/testAddReplica_xyz.AUTOCREATED/lang/stopwords_hy.txt
   [junit4]   2> 684623 INFO  (OverseerThreadFactory-3656-thread-2-processing-n:127.0.0.1:42150_solr) [n:127.0.0.1:42150_solr    ] o.a.s.c.c.ZkConfigManager Copying zk node /configs/_default/lang/stopwords_id.txt to /configs/testAddReplica_xyz.AUTOCREATED/lang/stopwords_id.txt
   [junit4]   2> 684625 INFO  (OverseerThreadFactory-3656-thread-2-processing-n:127.0.0.1:42150_solr) [n:127.0.0.1:42150_solr    ] o.a.s.c.c.ZkConfigManager Copying zk node /configs/_default/lang/stopwords_hi.txt to /configs/testAddReplica_xyz.AUTOCREATED/lang/stopwords_hi.txt
   [junit4]   2> 684627 INFO  (OverseerThreadFactory-3656-thread-2-processing-n:127.0.0.1:42150_solr) [n:127.0.0.1:42150_solr    ] o.a.s.c.c.ZkConfigManager Copying zk node /configs/_default/lang/stopwords_ga.txt to /configs/testAddReplica_xyz.AUTOCREATED/lang/stopwords_ga.txt
   [junit4]   2> 684629 INFO  (OverseerThreadFactory-3656-thread-2-processing-n:127.0.0.1:42150_solr) [n:127.0.0.1:42150_solr    ] o.a.s.c.c.ZkConfigManager Copying zk node /configs/_default/lang/stopwords_da.txt to /configs/testAddReplica_xyz.AUTOCREATED/lang/stopwords_da.txt
   [junit4]   2> 684631 INFO  (OverseerThreadFactory-3656-thread-2-processing-n:127.0.0.1:42150_solr) [n:127.0.0.1:42150_solr    ] o.a.s.c.c.ZkConfigManager Copying zk node /configs/_default/lang/stopwords_ja.txt to /configs/testAddReplica_xyz.AUTOCREATED/lang/stopwords_ja.txt
   [junit4]   2> 684633 INFO  (OverseerThreadFactory-3656-thread-2-processing-n:127.0.0.1:42150_solr) [n:127.0.0.1:42150_solr    ] o.a.s.c.c.ZkConfigManager Copying zk node /configs/_default/lang/stopwords_pt.txt to /configs/testAddReplica_xyz.AUTOCREATED/lang/stopwords_pt.txt
   [junit4]   2> 684635 INFO  (OverseerThreadFactory-3656-thread-2-processing-n:127.0.0.1:42150_solr) [n:127.0.0.1:42150_solr    ] o.a.s.c.c.ZkConfigManager Copying zk node /configs/_default/lang/stopwords_hu.txt to /configs/testAddReplica_xyz.AUTOCREATED/lang/stopwords_hu.txt
   [junit4]   2> 684637 INFO  (OverseerThreadFactory-3656-thread-2-processing-n:127.0.0.1:42150_solr) [n:127.0.0.1:42150_solr    ] o.a.s.c.c.ZkConfigManager Copying zk node /configs/_default/lang/stopwords_el.txt to /configs/testAddReplica_xyz.AUTOCREATED/lang/stopwords_el.txt
   [junit4]   2> 684639 INFO  (OverseerThreadFactory-3656-thread-2-processing-n:127.0.0.1:42150_solr) [n:127.0.0.1:42150_solr    ] o.a.s.c.c.ZkConfigManager Copying zk node /configs/_default/lang/stopwords_ru.txt to /configs/testAddReplica_xyz.AUTOCREATED/lang/stopwords_ru.txt
   [junit4]   2> 684641 INFO  (OverseerThreadFactory-3656-thread-2-processing-n:127.0.0.1:42150_solr) [n:127.0.0.1:42150_solr    ] o.a.s.c.c.ZkConfigManager Copying zk node /configs/_default/lang/stopwords_tr.txt to /configs/testAddReplica_xyz.AUTOCREATED/lang/stopwords_tr.txt
   [junit4]   2> 684643 INFO  (OverseerThreadFactory-3656-thread-2-processing-n:127.0.0.1:42150_solr) [n:127.0.0.1:42150_solr    ] o.a.s.c.c.ZkConfigManager Copying zk node /configs/_default/lang/stopwords_ar.txt to /configs/testAddReplica_xyz.AUTOCREATED/lang/stopwords_ar.txt
   [junit4]   2> 684644 INFO  (OverseerThreadFactory-3656-thread-2-processing-n:127.0.0.1:42150_solr) [n:127.0.0.1:42150_solr    ] o.a.s.c.c.ZkConfigManager Copying zk node /configs/_default/lang/userdict_ja.txt to /configs/testAddReplica_xyz.AUTOCREATED/lang/userdict_ja.txt
   [junit4]   2> 684647 INFO  (OverseerThreadFactory-3656-thread-2-processing-n:127.0.0.1:42150_solr) [n:127.0.0.1:42150_solr    ] o.a.s.c.c.ZkConfigManager Copying zk node /configs/_default/lang/stopwords_eu.txt to /configs/testAddReplica_xyz.AUTOCREATED/lang/stopwords_eu.txt
   [junit4]   2> 684649 INFO  (OverseerThreadFactory-3656-thread-2-processing-n:127.0.0.1:42150_solr) [n:127.0.0.1:42150_solr    ] o.a.s.c.c.ZkConfigManager Copying zk node /configs/_default/lang/stopwords_it.txt to /configs/testAddReplica_xyz.AUTOCREATED/lang/stopwords_it.txt
   [junit4]   2> 684652 INFO  (OverseerThreadFactory-3656-thread-2-processing-n:127.0.0.1:42150_solr) [n:127.0.0.1:42150_solr    ] o.a.s.c.c.ZkConfigManager Copying zk node /configs/_default/lang/stopwords_cz.txt to /configs/testAddReplica_xyz.AUTOCREATED/lang/stopwords_cz.txt
   [junit4]   2> 684655 INFO  (OverseerThreadFactory-3656-thread-2-processing-n:127.0.0.1:42150_solr) [n:127.0.0.1:42150_solr    ] o.a.s.c.c.ZkConfigManager Copying zk node /configs/_default/lang/stoptags_ja.txt to /configs/testAddReplica_xyz.AUTOCREATED/lang/stoptags_ja.txt
   [junit4]   2> 684657 INFO  (OverseerThreadFactory-3656-thread-2-processing-n:127.0.0.1:42150_solr) [n:127.0.0.1:42150_solr    ] o.a.s.c.c.ZkConfigManager Copying zk node /configs/_default/lang/contractions_fr.txt to /configs/testAddReplica_xyz.AUTOCREATED/lang/contractions_fr.txt
   [junit4]   2> 684662 INFO  (OverseerThreadFactory-3656-thread-2-processing-n:127.0.0.1:42150_solr) [n:127.0.0.1:42150_solr    ] o.a.s.c.c.ZkConfigManager Copying zk node /configs/_default/lang/stopwords_de.txt to /configs/testAddReplica_xyz.AUTOCREATED/lang/stopwords_de.txt
   [junit4]   2> 684664 INFO  (OverseerThreadFactory-3656-thread-2-processing-n:127.0.0.1:42150_solr) [n:127.0.0.1:42150_solr    ] o.a.s.c.c.ZkConfigManager Copying zk node /configs/_default/lang/stopwords_fa.txt to /configs/testAddReplica_xyz.AUTOCREATED/lang/stopwords_fa.txt
   [junit4]   2> 684666 INFO  (OverseerThreadFactory-3656-thread-2-processing-n:127.0.0.1:42150_solr) [n:127.0.0.1:42150_solr    ] o.a.s.c.c.ZkConfigManager Copying zk node /configs/_default/lang/contractions_ga.txt to /configs/testAddReplica_xyz.AUTOCREATED/lang/contractions_ga.txt
   [junit4]   2> 684668 INFO  (OverseerThreadFactory-3656-thread-2-processing-n:127.0.0.1:42150_solr) [n:127.0.0.1:42150_solr    ] o.a.s.c.c.ZkConfigManager Copying zk node /configs/_default/lang/stopwords_ca.txt to /configs/testAddReplica_xyz.AUTOCREATED/lang/stopwords_ca.txt
   [junit4]   2> 684669 INFO  (OverseerThreadFactory-3656-thread-2-processing-n:127.0.0.1:42150_solr) [n:127.0.0.1:42150_solr    ] o.a.s.c.c.ZkConfigManager Copying zk node /configs/_default/lang/stopwords_nl.txt to /configs/testAddReplica_xyz.AUTOCREATED/lang/stopwords_nl.txt
   [junit4]   2> 684671 INFO  (OverseerThreadFactory-3656-thread-2-processing-n:127.0.0.1:42150_solr) [n:127.0.0.1:42150_solr    ] o.a.s.c.c.ZkConfigManager Copying zk node /configs/_default/lang/stopwords_bg.txt to /configs/testAddReplica_xyz.AUTOCREATED/lang/stopwords_bg.txt
   [junit4]   2> 684682 INFO  (OverseerThreadFactory-3656-thread-2-processing-n:127.0.0.1:42150_solr) [n:127.0.0.1:42150_solr    ] o.a.s.c.c.ZkConfigManager Copying zk node /configs/_default/lang/stopwords_en.txt to /configs/testAddReplica_xyz.AUTOCREATED/lang/stopwords_en.txt
   [junit4]   2> 684684 INFO  (OverseerThreadFactory-3656-thread-2-processing-n:127.0.0.1:42150_solr) [n:127.0.0.1:42150_solr    ] o.a.s.c.c.ZkConfigManager Copying zk node /configs/_default/lang/stopwords_es.txt to /configs/testAddReplica_xyz.AUTOCREATED/lang/stopwords_es.txt
   [junit4]   2> 684686 INFO  (OverseerThreadFactory-3656-thread-2-processing-n:127.0.0.1:42150_solr) [n:127.0.0.1:42150_solr    ] o.a.s.c.c.ZkConfigManager Copying zk node /configs/_default/lang/stopwords_lv.txt to /configs/testAddReplica_xyz.AUTOCREATED/lang/stopwords_lv.txt
   [junit4]   2> 684687 INFO  (OverseerThreadFactory-3656-thread-2-processing-n:127.0.0.1:42150_solr) [n:127.0.0.1:42150_solr    ] o.a.s.c.c.ZkConfigManager Copying zk node /configs/_default/lang/stopwords_ro.txt to /configs/testAddReplica_xyz.AUTOCREATED/lang/stopwords_ro.txt
   [junit4]   2> 684689 INFO  (OverseerThreadFactory-3656-thread-2-processing-n:127.0.0.1:42150_solr) [n:127.0.0.1:42150_solr    ] o.a.s.c.c.ZkConfigManager Copying zk node /configs/_default/lang/stopwords_th.txt to /configs/testAddReplica_xyz.AUTOCREATED/lang/stopwords_th.txt
   [junit4]   2> 684696 INFO  (OverseerThreadFactory-3656-thread-2-processing-n:127.0.0.1:42150_solr) [n:127.0.0.1:42150_solr    ] o.a.s.c.c.ZkConfigManager Copying zk node /configs/_default/lang/stopwords_fr.txt to /configs/testAddReplica_xyz.AUTOCREATED/lang/stopwords_fr.txt
   [junit4]   2> 684698 INFO  (OverseerThreadFactory-3656-thread-2-processing-n:127.0.0.1:42150_solr) [n:127.0.0.1:42150_solr    ] o.a.s.c.c.ZkConfigManager Copying zk node /configs/_default/lang/stopwords_sv.txt to /configs/testAddReplica_xyz.AUTOCREATED/lang/stopwords_sv.txt
   [junit4]   2> 684699 INFO  (OverseerThreadFactory-3656-thread-2-processing-n:127.0.0.1:42150_solr) [n:127.0.0.1:42150_solr    ] o.a.s.c.c.ZkConfigManager Copying zk node /configs/_default/lang/stopwords_fi.txt to /configs/testAddReplica_xyz.AUTOCREATED/lang/stopwords_fi.txt
   [junit4]   2> 684701 INFO  (OverseerThreadFactory-3656-thread-2-processing-n:127.0.0.1:42150_solr) [n:127.0.0.1:42150_solr    ] o.a.s.c.c.ZkConfigManager Copying zk node /configs/_default/lang/hyphenations_ga.txt to /configs/testAddReplica_xyz.AUTOCREATED/lang/hyphenations_ga.txt
   [junit4]   2> 684703 INFO  (OverseerThreadFactory-3656-thread-2-processing-n:127.0.0.1:42150_solr) [n:127.0.0.1:42150_solr    ] o.a.s.c.c.ZkConfigManager Copying zk node /configs/_default/lang/stopwords_gl.txt to /configs/testAddReplica_xyz.AUTOCREATED/lang/stopwords_gl.txt
   [junit4]   2> 684705 INFO  (OverseerThreadFactory-3656-thread-2-processing-n:127.0.0.1:42150_solr) [n:127.0.0.1:42150_solr    ] o.a.s.c.c.ZkConfigManager Copying zk node /configs/_default/params.json to /configs/testAddReplica_xyz.AUTOCREATED/params.json
   [junit4]   2> 684731 DEBUG (OverseerStateUpdate-72753434534346758-127.0.0.1:42150_solr-n_0000000000) [n:127.0.0.1:42150_solr    ] o.a.s.c.o.ClusterStateMutator building a new cName: testAddReplica_xyz
   [junit4]   2> 684832 DEBUG (OverseerStateUpdate-72753434534346758-127.0.0.1:42150_solr-n_0000000000) [n:127.0.0.1:42150_solr    ] o.a.s.c.o.ZkStateWriter going to create_collection /collections/testAddReplica_xyz/state.json
   [junit4]   2> 684927 DEBUG (OverseerThreadFactory-3656-thread-2-processing-n:127.0.0.1:42150_solr) [n:127.0.0.1:42150_solr    ] o.a.s.c.s.c.a.PolicyHelper Creating a new session
   [junit4]   2> 684943 INFO  (qtp253058473-12026) [n:127.0.0.1:42150_solr    ] o.a.s.s.HttpSolrCall [admin] webapp=null path=/admin/metrics params={wt=javabin&version=2&key=solr.core.testAddReplica_abc.shard1.replica_n1:INDEX.sizeInBytes} status=0 QTime=1
   [junit4]   2> 684944 INFO  (qtp253058473-12027) [n:127.0.0.1:42150_solr    ] o.a.s.s.HttpSolrCall [admin] webapp=null path=/admin/metrics params={wt=javabin&version=2&key=solr.core.testAddReplica_abc.shard1.replica_n1:INDEX.sizeInBytes} status=0 QTime=0
   [junit4]   2> 684950 INFO  (qtp253058473-12028) [n:127.0.0.1:42150_solr    ] o.a.s.s.HttpSolrCall [admin] webapp=null path=/admin/metrics params={wt=javabin&version=2&key=solr.core.testAddReplica_abc.shard1.replica_n1:INDEX.sizeInBytes} status=0 QTime=0
   [junit4]   2> 684956 INFO  (qtp253058473-12029) [n:127.0.0.1:42150_solr    ] o.a.s.s.HttpSolrCall [admin] webapp=null path=/admin/metrics params={prefix=CONTAINER.fs.usableSpace,CONTAINER.fs.totalSpace,CORE.coreName&wt=javabin&version=2&group=solr.node,solr.core} status=0 QTime=1
   [junit4]   2> 684957 INFO  (qtp253058473-12026) [n:127.0.0.1:42150_solr    ] o.a.s.s.HttpSolrCall [admin] webapp=null path=/admin/metrics params={prefix=CONTAINER.fs.usableSpace,CONTAINER.fs.totalSpace,CORE.coreName&wt=javabin&version=2&group=solr.node,solr.core} status=0 QTime=0
   [junit4]   2> 684958 INFO  (qtp253058473-12027) [n:127.0.0.1:42150_solr    ] o.a.s.s.HttpSolrCall [admin] webapp=null path=/admin/metrics params={prefix=CONTAINER.fs.usableSpace,CONTAINER.fs.totalSpace,CORE.coreName&wt=javabin&version=2&group=solr.node,solr.core} status=0 QTime=0
   [junit4]   2> 684959 INFO  (qtp253058473-12028) [n:127.0.0.1:42150_solr    ] o.a.s.s.HttpSolrCall [admin] webapp=null path=/admin/metrics params={prefix=CONTAINER.fs.usableSpace,CONTAINER.fs.totalSpace,CORE.coreName&wt=javabin&version=2&group=solr.node,solr.core} status=0 QTime=0
   [junit4]   2> 684961 INFO  (qtp253058473-12029) [n:127.0.0.1:42150_solr    ] o.a.s.s.HttpSolrCall [admin] webapp=null path=/admin/metrics params={prefix=CONTAINER.fs.usableSpace,CONTAINER.fs.totalSpace,CORE.coreName&wt=javabin&version=2&group=solr.node,solr.core} status=0 QTime=0
   [junit4]   2> 684963 INFO  (qtp354864607-12038) [n:127.0.0.1:36137_solr    ] o.a.s.s.HttpSolrCall [admin] webapp=null path=/admin/metrics params={prefix=CONTAINER.fs.usableSpace,CONTAINER.fs.totalSpace,CORE.coreName&wt=javabin&version=2&group=solr.node,solr.core} status=0 QTime=0
   [junit4]   2> 684964 INFO  (qtp354864607-12039) [n:127.0.0.1:36137_solr    ] o.a.s.s.HttpSolrCall [admin] webapp=null path=/admin/metrics params={prefix=CONTAINER.fs.usableSpace,CONTAINER.fs.totalSpace,CORE.coreName&wt=javabin&version=2&group=solr.node,solr.core} status=0 QTime=0
   [junit4]   2> 684965 INFO  (qtp354864607-12035) [n:127.0.0.1:36137_solr    ] o.a.s.s.HttpSolrCall [admin] webapp=null path=/admin/metrics params={prefix=CONTAINER.fs.usableSpace,CONTAINER.fs.totalSpace,CORE.coreName&wt=javabin&version=2&group=solr.node,solr.core} status=0 QTime=0
   [junit4]   2> 684966 INFO  (qtp354864607-12036) [n:127.0.0.1:36137_solr    ] o.a.s.s.HttpSolrCall [admin] webapp=null path=/admin/metrics params={prefix=CONTAINER.fs.usableSpace,CONTAINER.fs.totalSpace,CORE.coreName&wt=javabin&version=2&group=solr.node,solr.core} status=0 QTime=0
   [junit4]   2> 684967 INFO  (qtp354864607-12037) [n:127.0.0.1:36137_solr    ] o.a.s.s.HttpSolrCall [admin] webapp=null path=/admin/metrics params={prefix=CONTAINER.fs.usableSpace,CONTAINER.fs.totalSpace,CORE.coreName&wt=javabin&version=2&group=solr.node,solr.core} status=0 QTime=0
   [junit4]   2> 684972 DEBUG (OverseerThreadFactory-3656-thread-2-processing-n:127.0.0.1:42150_solr) [n:127.0.0.1:42150_solr    ] o.a.s.c.s.c.a.PolicyHelper New session created 
   [junit4]   2> 684978 DEBUG (OverseerThreadFactory-3656-thread-2-processing-n:127.0.0.1:42150_solr) [n:127.0.0.1:42150_solr    ] o.a.s.c.s.c.a.PolicyHelper returnSession, curr-time 10617687319 sessionWrapper.createTime 10617687313742160, this.sessionWrapper.createTime 10617687313742160 
   [junit4]   2> 684983 INFO  (OverseerStateUpdate-72753434534346758-127.0.0.1:42150_solr-n_0000000000) [n:127.0.0.1:42150_solr    ] o.a.s.c.o.SliceMutator createReplica() {
   [junit4]   2>   "operation":"ADDREPLICA",
   [junit4]   2>   "collection":"testAddReplica_xyz",
   [junit4]   2>   "shard":"shard1",
   [junit4]   2>   "core":"testAddReplica_xyz_shard1_replica_n1",
   [junit4]   2>   "state":"down",
   [junit4]   2>   "base_url":"https://127.0.0.1:42150/solr",
   [junit4]   2>   "type":"NRT",
   [junit4]   2>   "waitForFinalState":"false"} 
   [junit4]   2> 684984 DEBUG (OverseerStateUpdate-72753434534346758-127.0.0.1:42150_solr-n_0000000000) [n:127.0.0.1:42150_solr    ] o.a.s.c.o.SliceMutator Old Slice: shard1:{
   [junit4]   2>   "range":"80000000-7fffffff",
   [junit4]   2>   "state":"active",
   [junit4]   2>   "replicas":{}}
   [junit4]   2> 684984 DEBUG (OverseerStateUpdate-72753434534346758-127.0.0.1:42150_solr-n_0000000000) [n:127.0.0.1:42150_solr    ] o.a.s.c.o.SliceMutator New Slice: shard1:{
   [junit4]   2>   "range":"80000000-7fffffff",
   [junit4]   2>   "state":"active",
   [junit4]   2>   "replicas":{"core_node2":{
   [junit4]   2>       "core":"testAddReplica_xyz_shard1_replica_n1",
   [junit4]   2>       "base_url":"https://127.0.0.1:42150/solr",
   [junit4]   2>       "state":"down",
   [junit4]   2>       "node_name":null,
   [junit4]   2>       "type":"NRT"}}}
   [junit4]   2> 685084 DEBUG (OverseerStateUpdate-72753434534346758-127.0.0.1:42150_solr-n_0000000000) [n:127.0.0.1:42150_solr    ] o.a.s.c.o.ZkStateWriter going to update_collection /collections/testAddReplica_xyz/state.json version: 0
   [junit4]   2> 685195 INFO  (qtp253058473-12026) [n:127.0.0.1:42150_solr    x:testAddReplica_xyz_shard1_replica_n1] o.a.s.h.a.CoreAdminOperation core create command qt=/admin/cores&coreNodeName=core_node2&collection.configName=testAddReplica_xyz.AUTOCREATED&newCollection=true&name=testAddReplica_xyz_shard1_replica_n1&action=CREATE&numShards=1&collection=testAddReplica_xyz&shard=shard1&wt=javabin&version=2&replicaType=NRT
   [junit4]   2> 685211 DEBUG (OverseerStateUpdate-72753434534346758-127.0.0.1:42150_solr-n_0000000000) [n:127.0.0.1:42150_solr    ] o.a.s.c.o.ReplicaMutator Update state numShards=1 message={
   [junit4]   2>   "core":"testAddReplica_xyz_shard1_replica_n1",
   [junit4]   2>   "core_node_name":"core_node2",
   [junit4]   2>   "roles":null,
   [junit4]   2>   "base_url":"https://127.0.0.1:42150/solr",
   [junit4]   2>   "node_name":"127.0.0.1:42150_solr",
   [junit4]   2>   "numShards":"1",
   [junit4]   2>   "state":"down",
   [junit4]   2>   "shard":"shard1",
   [junit4]   2>   "collection":"testAddReplica_xyz",
   [junit4]   2>   "type":"NRT",
   [junit4]   2>   "force_set_state":"false",
   [junit4]   2>   "operation":"state"}
   [junit4]   2> 685211 DEBUG (OverseerStateUpdate-72753

[...truncated too long message...]

ns-slave/workspace/Lucene-Solr-BadApples-Tests-7.x/lucene/top-level-ivy-settings.xml

resolve:

ivy-availability-check:
[loadresource] Do not set property disallowed.ivy.jars.list as its length is 0.

-ivy-fail-disallowed-ivy-version:

ivy-fail:

ivy-configure:
[ivy:configure] :: loading settings :: file = /x1/jenkins/jenkins-slave/workspace/Lucene-Solr-BadApples-Tests-7.x/lucene/top-level-ivy-settings.xml

resolve:

ivy-availability-check:
[loadresource] Do not set property disallowed.ivy.jars.list as its length is 0.

-ivy-fail-disallowed-ivy-version:

ivy-fail:

ivy-fail:

ivy-configure:
[ivy:configure] :: loading settings :: file = /x1/jenkins/jenkins-slave/workspace/Lucene-Solr-BadApples-Tests-7.x/lucene/top-level-ivy-settings.xml

resolve:

ivy-availability-check:
[loadresource] Do not set property disallowed.ivy.jars.list as its length is 0.

-ivy-fail-disallowed-ivy-version:

ivy-fail:

ivy-configure:
[ivy:configure] :: loading settings :: file = /x1/jenkins/jenkins-slave/workspace/Lucene-Solr-BadApples-Tests-7.x/lucene/top-level-ivy-settings.xml

resolve:

ivy-availability-check:
[loadresource] Do not set property disallowed.ivy.jars.list as its length is 0.

-ivy-fail-disallowed-ivy-version:

ivy-fail:

ivy-fail:

ivy-configure:
[ivy:configure] :: loading settings :: file = /x1/jenkins/jenkins-slave/workspace/Lucene-Solr-BadApples-Tests-7.x/lucene/top-level-ivy-settings.xml

resolve:

ivy-availability-check:
[loadresource] Do not set property disallowed.ivy.jars.list as its length is 0.

-ivy-fail-disallowed-ivy-version:

ivy-fail:

ivy-fail:

ivy-configure:
[ivy:configure] :: loading settings :: file = /x1/jenkins/jenkins-slave/workspace/Lucene-Solr-BadApples-Tests-7.x/lucene/top-level-ivy-settings.xml

resolve:

ivy-availability-check:
[loadresource] Do not set property disallowed.ivy.jars.list as its length is 0.

-ivy-fail-disallowed-ivy-version:

ivy-fail:

ivy-fail:

ivy-configure:
[ivy:configure] :: loading settings :: file = /x1/jenkins/jenkins-slave/workspace/Lucene-Solr-BadApples-Tests-7.x/lucene/top-level-ivy-settings.xml

resolve:

ivy-availability-check:
[loadresource] Do not set property disallowed.ivy.jars.list as its length is 0.

-ivy-fail-disallowed-ivy-version:

ivy-fail:

ivy-fail:

ivy-configure:
[ivy:configure] :: loading settings :: file = /x1/jenkins/jenkins-slave/workspace/Lucene-Solr-BadApples-Tests-7.x/lucene/top-level-ivy-settings.xml

resolve:

ivy-availability-check:
[loadresource] Do not set property disallowed.ivy.jars.list as its length is 0.

-ivy-fail-disallowed-ivy-version:

ivy-fail:

ivy-fail:

ivy-configure:
[ivy:configure] :: loading settings :: file = /x1/jenkins/jenkins-slave/workspace/Lucene-Solr-BadApples-Tests-7.x/lucene/top-level-ivy-settings.xml

resolve:

ivy-availability-check:
[loadresource] Do not set property disallowed.ivy.jars.list as its length is 0.

-ivy-fail-disallowed-ivy-version:

ivy-fail:

ivy-fail:

ivy-configure:
[ivy:configure] :: loading settings :: file = /x1/jenkins/jenkins-slave/workspace/Lucene-Solr-BadApples-Tests-7.x/lucene/top-level-ivy-settings.xml

resolve:

ivy-availability-check:
[loadresource] Do not set property disallowed.ivy.jars.list as its length is 0.

-ivy-fail-disallowed-ivy-version:

ivy-fail:

ivy-fail:

ivy-configure:
[ivy:configure] :: loading settings :: file = /x1/jenkins/jenkins-slave/workspace/Lucene-Solr-BadApples-Tests-7.x/lucene/top-level-ivy-settings.xml

resolve:

ivy-availability-check:
[loadresource] Do not set property disallowed.ivy.jars.list as its length is 0.

-ivy-fail-disallowed-ivy-version:

ivy-fail:

ivy-fail:

ivy-configure:
[ivy:configure] :: loading settings :: file = /x1/jenkins/jenkins-slave/workspace/Lucene-Solr-BadApples-Tests-7.x/lucene/top-level-ivy-settings.xml

resolve:

ivy-availability-check:
[loadresource] Do not set property disallowed.ivy.jars.list as its length is 0.

-ivy-fail-disallowed-ivy-version:

ivy-fail:

ivy-fail:

ivy-configure:
[ivy:configure] :: loading settings :: file = /x1/jenkins/jenkins-slave/workspace/Lucene-Solr-BadApples-Tests-7.x/lucene/top-level-ivy-settings.xml

resolve:

ivy-availability-check:
[loadresource] Do not set property disallowed.ivy.jars.list as its length is 0.

-ivy-fail-disallowed-ivy-version:

ivy-fail:

ivy-fail:

ivy-configure:
[ivy:configure] :: loading settings :: file = /x1/jenkins/jenkins-slave/workspace/Lucene-Solr-BadApples-Tests-7.x/lucene/top-level-ivy-settings.xml

resolve:

jar-checksums:
    [mkdir] Created dir: /x1/jenkins/jenkins-slave/workspace/Lucene-Solr-BadApples-Tests-7.x/solr/null1987173547
     [copy] Copying 242 files to /x1/jenkins/jenkins-slave/workspace/Lucene-Solr-BadApples-Tests-7.x/solr/null1987173547
   [delete] Deleting directory /x1/jenkins/jenkins-slave/workspace/Lucene-Solr-BadApples-Tests-7.x/solr/null1987173547

check-working-copy:
[ivy:cachepath] :: resolving dependencies :: org.eclipse.jgit#org.eclipse.jgit-caller;working
[ivy:cachepath] 	confs: [default]
[ivy:cachepath] 	found org.eclipse.jgit#org.eclipse.jgit;4.6.0.201612231935-r in public
[ivy:cachepath] 	found com.jcraft#jsch;0.1.53 in public
[ivy:cachepath] 	found com.googlecode.javaewah#JavaEWAH;1.1.6 in public
[ivy:cachepath] 	found org.apache.httpcomponents#httpclient;4.3.6 in public
[ivy:cachepath] 	found org.apache.httpcomponents#httpcore;4.3.3 in public
[ivy:cachepath] 	found commons-logging#commons-logging;1.1.3 in public
[ivy:cachepath] 	found commons-codec#commons-codec;1.6 in public
[ivy:cachepath] 	found org.slf4j#slf4j-api;1.7.2 in public
[ivy:cachepath] :: resolution report :: resolve 27ms :: artifacts dl 2ms
	---------------------------------------------------------------------
	|                  |            modules            ||   artifacts   |
	|       conf       | number| search|dwnlded|evicted|| number|dwnlded|
	---------------------------------------------------------------------
	|      default     |   8   |   0   |   0   |   0   ||   8   |   0   |
	---------------------------------------------------------------------
[wc-checker] Initializing working copy...
[wc-checker] SLF4J: Failed to load class "org.slf4j.impl.StaticLoggerBinder".
[wc-checker] SLF4J: Defaulting to no-operation (NOP) logger implementation
[wc-checker] SLF4J: See http://www.slf4j.org/codes.html#StaticLoggerBinder for further details.
[wc-checker] Checking working copy status...

-jenkins-base:

BUILD SUCCESSFUL
Total time: 99 minutes 18 seconds
Archiving artifacts
java.lang.InterruptedException: no matches found within 10000
	at hudson.FilePath$ValidateAntFileMask.hasMatch(FilePath.java:2847)
	at hudson.FilePath$ValidateAntFileMask.invoke(FilePath.java:2726)
	at hudson.FilePath$ValidateAntFileMask.invoke(FilePath.java:2707)
	at hudson.FilePath$FileCallableWrapper.call(FilePath.java:3086)
Also:   hudson.remoting.Channel$CallSiteStackTrace: Remote call to lucene
		at hudson.remoting.Channel.attachCallSiteStackTrace(Channel.java:1741)
		at hudson.remoting.UserRequest$ExceptionResponse.retrieve(UserRequest.java:357)
		at hudson.remoting.Channel.call(Channel.java:955)
		at hudson.FilePath.act(FilePath.java:1072)
		at hudson.FilePath.act(FilePath.java:1061)
		at hudson.FilePath.validateAntFileMask(FilePath.java:2705)
		at hudson.tasks.ArtifactArchiver.perform(ArtifactArchiver.java:243)
		at hudson.tasks.BuildStepCompatibilityLayer.perform(BuildStepCompatibilityLayer.java:81)
		at hudson.tasks.BuildStepMonitor$1.perform(BuildStepMonitor.java:20)
		at hudson.model.AbstractBuild$AbstractBuildExecution.perform(AbstractBuild.java:744)
		at hudson.model.AbstractBuild$AbstractBuildExecution.performAllBuildSteps(AbstractBuild.java:690)
		at hudson.model.Build$BuildExecution.post2(Build.java:186)
		at hudson.model.AbstractBuild$AbstractBuildExecution.post(AbstractBuild.java:635)
		at hudson.model.Run.execute(Run.java:1835)
		at hudson.model.FreeStyleBuild.run(FreeStyleBuild.java:43)
		at hudson.model.ResourceController.execute(ResourceController.java:97)
		at hudson.model.Executor.run(Executor.java:429)
Caused: hudson.FilePath$TunneledInterruptedException
	at hudson.FilePath$FileCallableWrapper.call(FilePath.java:3088)
	at hudson.remoting.UserRequest.perform(UserRequest.java:212)
	at hudson.remoting.UserRequest.perform(UserRequest.java:54)
	at hudson.remoting.Request$2.run(Request.java:369)
	at hudson.remoting.InterceptingExecutorService$1.call(InterceptingExecutorService.java:72)
	at java.util.concurrent.FutureTask.run(FutureTask.java:266)
	at java.util.concurrent.ThreadPoolExecutor.runWorker(ThreadPoolExecutor.java:1142)
	at java.util.concurrent.ThreadPoolExecutor$Worker.run(ThreadPoolExecutor.java:617)
	at java.lang.Thread.run(Thread.java:748)
Caused: java.lang.InterruptedException: java.lang.InterruptedException: no matches found within 10000
	at hudson.FilePath.act(FilePath.java:1074)
	at hudson.FilePath.act(FilePath.java:1061)
	at hudson.FilePath.validateAntFileMask(FilePath.java:2705)
	at hudson.tasks.ArtifactArchiver.perform(ArtifactArchiver.java:243)
	at hudson.tasks.BuildStepCompatibilityLayer.perform(BuildStepCompatibilityLayer.java:81)
	at hudson.tasks.BuildStepMonitor$1.perform(BuildStepMonitor.java:20)
	at hudson.model.AbstractBuild$AbstractBuildExecution.perform(AbstractBuild.java:744)
	at hudson.model.AbstractBuild$AbstractBuildExecution.performAllBuildSteps(AbstractBuild.java:690)
	at hudson.model.Build$BuildExecution.post2(Build.java:186)
	at hudson.model.AbstractBuild$AbstractBuildExecution.post(AbstractBuild.java:635)
	at hudson.model.Run.execute(Run.java:1835)
	at hudson.model.FreeStyleBuild.run(FreeStyleBuild.java:43)
	at hudson.model.ResourceController.execute(ResourceController.java:97)
	at hudson.model.Executor.run(Executor.java:429)
No artifacts found that match the file pattern "**/*.events,heapdumps/**,**/hs_err_pid*". Configuration error?
Recording test results
Build step 'Publish JUnit test result report' changed build result to UNSTABLE
Email was triggered for: Unstable (Test Failures)
Sending email for trigger: Unstable (Test Failures)

Mime
View raw message