lucene-dev mailing list archives

Site index · List index
Message view « Date » · « Thread »
Top « Date » · « Thread »
From Apache Jenkins Server <jenk...@builds.apache.org>
Subject [JENKINS] Lucene-Solr-NightlyTests-7.x - Build # 451 - Still Unstable
Date Fri, 08 Feb 2019 23:58:41 GMT
Build: https://builds.apache.org/job/Lucene-Solr-NightlyTests-7.x/451/

1 tests failed.
FAILED:  org.apache.solr.cloud.hdfs.HdfsUnloadDistributedZkTest.test

Error Message:
Captured an uncaught exception in thread: Thread[id=5947, name=testExecutor-1851-thread-6, state=RUNNABLE, group=TGRP-HdfsUnloadDistributedZkTest]

Stack Trace:
com.carrotsearch.randomizedtesting.UncaughtExceptionError: Captured an uncaught exception in thread: Thread[id=5947, name=testExecutor-1851-thread-6, state=RUNNABLE, group=TGRP-HdfsUnloadDistributedZkTest]
Caused by: java.lang.RuntimeException: org.apache.solr.client.solrj.SolrServerException: Timeout occured while waiting response from server at: http://127.0.0.1:44669/u
	at __randomizedtesting.SeedInfo.seed([E637C0C68C28D8FD]:0)
	at org.apache.solr.cloud.BasicDistributedZkTest.lambda$createCollectionInOneInstance$1(BasicDistributedZkTest.java:659)
	at org.apache.solr.common.util.ExecutorUtil$MDCAwareThreadPoolExecutor.lambda$execute$0(ExecutorUtil.java:209)
	at java.util.concurrent.ThreadPoolExecutor.runWorker(ThreadPoolExecutor.java:1149)
	at java.util.concurrent.ThreadPoolExecutor$Worker.run(ThreadPoolExecutor.java:624)
	at java.lang.Thread.run(Thread.java:748)
Caused by: org.apache.solr.client.solrj.SolrServerException: Timeout occured while waiting response from server at: http://127.0.0.1:44669/u
	at org.apache.solr.client.solrj.impl.HttpSolrClient.executeMethod(HttpSolrClient.java:654)
	at org.apache.solr.client.solrj.impl.HttpSolrClient.request(HttpSolrClient.java:255)
	at org.apache.solr.client.solrj.impl.HttpSolrClient.request(HttpSolrClient.java:244)
	at org.apache.solr.client.solrj.SolrRequest.process(SolrRequest.java:194)
	at org.apache.solr.client.solrj.SolrRequest.process(SolrRequest.java:211)
	at org.apache.solr.cloud.BasicDistributedZkTest.lambda$createCollectionInOneInstance$1(BasicDistributedZkTest.java:657)
	... 4 more
Caused by: java.net.SocketTimeoutException: Read timed out
	at java.net.SocketInputStream.socketRead0(Native Method)
	at java.net.SocketInputStream.socketRead(SocketInputStream.java:116)
	at java.net.SocketInputStream.read(SocketInputStream.java:171)
	at java.net.SocketInputStream.read(SocketInputStream.java:141)
	at org.apache.http.impl.io.SessionInputBufferImpl.streamRead(SessionInputBufferImpl.java:137)
	at org.apache.http.impl.io.SessionInputBufferImpl.fillBuffer(SessionInputBufferImpl.java:153)
	at org.apache.http.impl.io.SessionInputBufferImpl.readLine(SessionInputBufferImpl.java:282)
	at org.apache.http.impl.conn.DefaultHttpResponseParser.parseHead(DefaultHttpResponseParser.java:138)
	at org.apache.http.impl.conn.DefaultHttpResponseParser.parseHead(DefaultHttpResponseParser.java:56)
	at org.apache.http.impl.io.AbstractMessageParser.parse(AbstractMessageParser.java:259)
	at org.apache.http.impl.DefaultBHttpClientConnection.receiveResponseHeader(DefaultBHttpClientConnection.java:163)
	at org.apache.http.impl.conn.CPoolProxy.receiveResponseHeader(CPoolProxy.java:165)
	at org.apache.http.protocol.HttpRequestExecutor.doReceiveResponse(HttpRequestExecutor.java:273)
	at org.apache.http.protocol.HttpRequestExecutor.execute(HttpRequestExecutor.java:125)
	at org.apache.http.impl.execchain.MainClientExec.execute(MainClientExec.java:272)
	at org.apache.http.impl.execchain.ProtocolExec.execute(ProtocolExec.java:185)
	at org.apache.http.impl.execchain.RetryExec.execute(RetryExec.java:89)
	at org.apache.http.impl.execchain.RedirectExec.execute(RedirectExec.java:110)
	at org.apache.http.impl.client.InternalHttpClient.doExecute(InternalHttpClient.java:185)
	at org.apache.http.impl.client.CloseableHttpClient.execute(CloseableHttpClient.java:83)
	at org.apache.http.impl.client.CloseableHttpClient.execute(CloseableHttpClient.java:56)
	at org.apache.solr.client.solrj.impl.HttpSolrClient.executeMethod(HttpSolrClient.java:542)
	... 9 more




Build Log:
[...truncated 13388 lines...]
   [junit4] Suite: org.apache.solr.cloud.hdfs.HdfsUnloadDistributedZkTest
   [junit4]   2> 939598 INFO  (SUITE-HdfsUnloadDistributedZkTest-seed#[E637C0C68C28D8FD]-worker) [    ] o.a.s.SolrTestCaseJ4 SecureRandom sanity checks: test.solr.allowed.securerandom=null & java.security.egd=file:/dev/./urandom
   [junit4]   2> Creating dataDir: /home/jenkins/jenkins-slave/workspace/Lucene-Solr-NightlyTests-7.x/checkout/solr/build/solr-core/test/J2/temp/solr.cloud.hdfs.HdfsUnloadDistributedZkTest_E637C0C68C28D8FD-001/init-core-data-001
   [junit4]   2> 939599 WARN  (SUITE-HdfsUnloadDistributedZkTest-seed#[E637C0C68C28D8FD]-worker) [    ] o.a.s.SolrTestCaseJ4 startTrackingSearchers: numOpens=11 numCloses=11
   [junit4]   2> 939599 INFO  (SUITE-HdfsUnloadDistributedZkTest-seed#[E637C0C68C28D8FD]-worker) [    ] o.a.s.SolrTestCaseJ4 Using PointFields (NUMERIC_POINTS_SYSPROP=true) w/NUMERIC_DOCVALUES_SYSPROP=true
   [junit4]   2> 939601 INFO  (SUITE-HdfsUnloadDistributedZkTest-seed#[E637C0C68C28D8FD]-worker) [    ] o.a.s.SolrTestCaseJ4 Randomized ssl (false) and clientAuth (false) via: @org.apache.solr.SolrTestCaseJ4$SuppressSSL(bugUrl=https://issues.apache.org/jira/browse/SOLR-5776)
   [junit4]   2> 939601 INFO  (SUITE-HdfsUnloadDistributedZkTest-seed#[E637C0C68C28D8FD]-worker) [    ] o.a.s.BaseDistributedSearchTestCase Setting hostContext system property: /u/
   [junit4]   2> 942722 WARN  (SUITE-HdfsUnloadDistributedZkTest-seed#[E637C0C68C28D8FD]-worker) [    ] o.a.h.u.NativeCodeLoader Unable to load native-hadoop library for your platform... using builtin-java classes where applicable
   [junit4]   1> Formatting using clusterid: testClusterID
   [junit4]   2> 947906 WARN  (SUITE-HdfsUnloadDistributedZkTest-seed#[E637C0C68C28D8FD]-worker) [    ] o.a.h.m.i.MetricsConfig Cannot locate configuration: tried hadoop-metrics2-namenode.properties,hadoop-metrics2.properties
   [junit4]   2> 949311 INFO  (SUITE-HdfsUnloadDistributedZkTest-seed#[E637C0C68C28D8FD]-worker) [    ] o.m.log Logging to org.apache.logging.slf4j.Log4jLogger@5a2b8779 via org.mortbay.log.Slf4jLog
   [junit4]   2> 949508 WARN  (SUITE-HdfsUnloadDistributedZkTest-seed#[E637C0C68C28D8FD]-worker) [    ] o.a.h.h.HttpRequestLog Jetty request log can only be enabled using Log4j
   [junit4]   2> 951767 INFO  (SUITE-HdfsUnloadDistributedZkTest-seed#[E637C0C68C28D8FD]-worker) [    ] o.m.log jetty-6.1.26
   [junit4]   2> 952026 INFO  (SUITE-HdfsUnloadDistributedZkTest-seed#[E637C0C68C28D8FD]-worker) [    ] o.m.log Extract jar:file:/home/jenkins/.ivy2/cache/org.apache.hadoop/hadoop-hdfs/tests/hadoop-hdfs-2.7.4-tests.jar!/webapps/hdfs to ./temp/Jetty_lucene2.us.west_apache_org_33784_hdfs____sb4m0t/webapp
   [junit4]   2> 954176 INFO  (SUITE-HdfsUnloadDistributedZkTest-seed#[E637C0C68C28D8FD]-worker) [    ] o.m.log Started HttpServer2$SelectChannelConnectorWithSafeStartup@lucene2-us-west.apache.org:33784
   [junit4]   2> 958247 WARN  (SUITE-HdfsUnloadDistributedZkTest-seed#[E637C0C68C28D8FD]-worker) [    ] o.a.h.h.HttpRequestLog Jetty request log can only be enabled using Log4j
   [junit4]   2> 958285 INFO  (SUITE-HdfsUnloadDistributedZkTest-seed#[E637C0C68C28D8FD]-worker) [    ] o.m.log jetty-6.1.26
   [junit4]   2> 958456 INFO  (SUITE-HdfsUnloadDistributedZkTest-seed#[E637C0C68C28D8FD]-worker) [    ] o.m.log Extract jar:file:/home/jenkins/.ivy2/cache/org.apache.hadoop/hadoop-hdfs/tests/hadoop-hdfs-2.7.4-tests.jar!/webapps/datanode to ./temp/Jetty_localhost_33031_datanode____6iv21h/webapp
   [junit4]   2> 959520 INFO  (SUITE-HdfsUnloadDistributedZkTest-seed#[E637C0C68C28D8FD]-worker) [    ] o.m.log Started HttpServer2$SelectChannelConnectorWithSafeStartup@localhost:33031
   [junit4]   2> 961881 WARN  (SUITE-HdfsUnloadDistributedZkTest-seed#[E637C0C68C28D8FD]-worker) [    ] o.a.h.h.HttpRequestLog Jetty request log can only be enabled using Log4j
   [junit4]   2> 961883 INFO  (SUITE-HdfsUnloadDistributedZkTest-seed#[E637C0C68C28D8FD]-worker) [    ] o.m.log jetty-6.1.26
   [junit4]   2> 962140 INFO  (SUITE-HdfsUnloadDistributedZkTest-seed#[E637C0C68C28D8FD]-worker) [    ] o.m.log Extract jar:file:/home/jenkins/.ivy2/cache/org.apache.hadoop/hadoop-hdfs/tests/hadoop-hdfs-2.7.4-tests.jar!/webapps/datanode to ./temp/Jetty_localhost_42061_datanode____c9k2l0/webapp
   [junit4]   2> 963576 INFO  (SUITE-HdfsUnloadDistributedZkTest-seed#[E637C0C68C28D8FD]-worker) [    ] o.m.log Started HttpServer2$SelectChannelConnectorWithSafeStartup@localhost:42061
   [junit4]   2> 967481 ERROR (DataNode: [[[DISK]file:/home/jenkins/jenkins-slave/workspace/Lucene-Solr-NightlyTests-7.x/checkout/solr/build/solr-core/test/J2/temp/solr.cloud.hdfs.HdfsUnloadDistributedZkTest_E637C0C68C28D8FD-001/tempDir-001/hdfsBaseDir/data/data3/, [DISK]file:/home/jenkins/jenkins-slave/workspace/Lucene-Solr-NightlyTests-7.x/checkout/solr/build/solr-core/test/J2/temp/solr.cloud.hdfs.HdfsUnloadDistributedZkTest_E637C0C68C28D8FD-001/tempDir-001/hdfsBaseDir/data/data4/]]  heartbeating to lucene2-us-west.apache.org/127.0.0.1:36517) [    ] o.a.h.h.s.d.DirectoryScanner dfs.datanode.directoryscan.throttle.limit.ms.per.sec set to value below 1 ms/sec. Assuming default value of 1000
   [junit4]   2> 967482 ERROR (DataNode: [[[DISK]file:/home/jenkins/jenkins-slave/workspace/Lucene-Solr-NightlyTests-7.x/checkout/solr/build/solr-core/test/J2/temp/solr.cloud.hdfs.HdfsUnloadDistributedZkTest_E637C0C68C28D8FD-001/tempDir-001/hdfsBaseDir/data/data1/, [DISK]file:/home/jenkins/jenkins-slave/workspace/Lucene-Solr-NightlyTests-7.x/checkout/solr/build/solr-core/test/J2/temp/solr.cloud.hdfs.HdfsUnloadDistributedZkTest_E637C0C68C28D8FD-001/tempDir-001/hdfsBaseDir/data/data2/]]  heartbeating to lucene2-us-west.apache.org/127.0.0.1:36517) [    ] o.a.h.h.s.d.DirectoryScanner dfs.datanode.directoryscan.throttle.limit.ms.per.sec set to value below 1 ms/sec. Assuming default value of 1000
   [junit4]   2> 968494 INFO  (Block report processor) [    ] BlockStateChange BLOCK* processReport 0x71ad30f8a4f087: from storage DS-022354de-3a89-493d-bf68-006143d45e1d node DatanodeRegistration(127.0.0.1:35235, datanodeUuid=80a049ec-4bee-4f4a-96cb-8aa6aaf0ef30, infoPort=35534, infoSecurePort=0, ipcPort=43962, storageInfo=lv=-56;cid=testClusterID;nsid=2081766760;c=0), blocks: 0, hasStaleStorage: true, processing time: 2 msecs
   [junit4]   2> 968495 INFO  (Block report processor) [    ] BlockStateChange BLOCK* processReport 0x71ad30f8a4f087: from storage DS-64b7ea59-f896-4987-9b33-9e9b2c778fd9 node DatanodeRegistration(127.0.0.1:35235, datanodeUuid=80a049ec-4bee-4f4a-96cb-8aa6aaf0ef30, infoPort=35534, infoSecurePort=0, ipcPort=43962, storageInfo=lv=-56;cid=testClusterID;nsid=2081766760;c=0), blocks: 0, hasStaleStorage: false, processing time: 0 msecs
   [junit4]   2> 968515 INFO  (Block report processor) [    ] BlockStateChange BLOCK* processReport 0x71ad30f744964d: from storage DS-16a7257b-7c58-47ff-a2ca-b3ee2ce9c674 node DatanodeRegistration(127.0.0.1:41386, datanodeUuid=28a9f977-aa57-405b-b961-7c84406f6ed7, infoPort=44294, infoSecurePort=0, ipcPort=37128, storageInfo=lv=-56;cid=testClusterID;nsid=2081766760;c=0), blocks: 0, hasStaleStorage: true, processing time: 0 msecs
   [junit4]   2> 968515 INFO  (Block report processor) [    ] BlockStateChange BLOCK* processReport 0x71ad30f744964d: from storage DS-cc6a8c1f-a2bf-4428-9a83-cd22fa7be588 node DatanodeRegistration(127.0.0.1:41386, datanodeUuid=28a9f977-aa57-405b-b961-7c84406f6ed7, infoPort=44294, infoSecurePort=0, ipcPort=37128, storageInfo=lv=-56;cid=testClusterID;nsid=2081766760;c=0), blocks: 0, hasStaleStorage: false, processing time: 0 msecs
   [junit4]   2> 969835 INFO  (TEST-HdfsUnloadDistributedZkTest.test-seed#[E637C0C68C28D8FD]) [    ] o.a.s.c.ZkTestServer STARTING ZK TEST SERVER
   [junit4]   2> 969856 INFO  (ZkTestServer Run Thread) [    ] o.a.s.c.ZkTestServer client port:0.0.0.0/0.0.0.0:0
   [junit4]   2> 969856 INFO  (ZkTestServer Run Thread) [    ] o.a.s.c.ZkTestServer Starting server
   [junit4]   2> 969948 INFO  (TEST-HdfsUnloadDistributedZkTest.test-seed#[E637C0C68C28D8FD]) [    ] o.a.s.c.ZkTestServer start zk server on port:39315
   [junit4]   2> 969948 INFO  (TEST-HdfsUnloadDistributedZkTest.test-seed#[E637C0C68C28D8FD]) [    ] o.a.s.c.ZkTestServer parse host and port list: 127.0.0.1:39315
   [junit4]   2> 969948 INFO  (TEST-HdfsUnloadDistributedZkTest.test-seed#[E637C0C68C28D8FD]) [    ] o.a.s.c.ZkTestServer connecting to 127.0.0.1 39315
   [junit4]   2> 969982 INFO  (zkConnectionManagerCallback-668-thread-1) [    ] o.a.s.c.c.ConnectionManager zkClient has connected
   [junit4]   2> 970021 INFO  (zkConnectionManagerCallback-670-thread-1) [    ] o.a.s.c.c.ConnectionManager zkClient has connected
   [junit4]   2> 970034 INFO  (TEST-HdfsUnloadDistributedZkTest.test-seed#[E637C0C68C28D8FD]) [    ] o.a.s.c.ZkTestServer put /home/jenkins/jenkins-slave/workspace/Lucene-Solr-NightlyTests-7.x/checkout/solr/core/src/test-files/solr/collection1/conf/solrconfig-tlog.xml to /configs/conf1/solrconfig.xml
   [junit4]   2> 970036 INFO  (TEST-HdfsUnloadDistributedZkTest.test-seed#[E637C0C68C28D8FD]) [    ] o.a.s.c.ZkTestServer put /home/jenkins/jenkins-slave/workspace/Lucene-Solr-NightlyTests-7.x/checkout/solr/core/src/test-files/solr/collection1/conf/schema.xml to /configs/conf1/schema.xml
   [junit4]   2> 970052 INFO  (TEST-HdfsUnloadDistributedZkTest.test-seed#[E637C0C68C28D8FD]) [    ] o.a.s.c.ZkTestServer put /home/jenkins/jenkins-slave/workspace/Lucene-Solr-NightlyTests-7.x/checkout/solr/core/src/test-files/solr/collection1/conf/solrconfig.snippet.randomindexconfig.xml to /configs/conf1/solrconfig.snippet.randomindexconfig.xml
   [junit4]   2> 970088 INFO  (TEST-HdfsUnloadDistributedZkTest.test-seed#[E637C0C68C28D8FD]) [    ] o.a.s.c.ZkTestServer put /home/jenkins/jenkins-slave/workspace/Lucene-Solr-NightlyTests-7.x/checkout/solr/core/src/test-files/solr/collection1/conf/stopwords.txt to /configs/conf1/stopwords.txt
   [junit4]   2> 970116 INFO  (TEST-HdfsUnloadDistributedZkTest.test-seed#[E637C0C68C28D8FD]) [    ] o.a.s.c.ZkTestServer put /home/jenkins/jenkins-slave/workspace/Lucene-Solr-NightlyTests-7.x/checkout/solr/core/src/test-files/solr/collection1/conf/protwords.txt to /configs/conf1/protwords.txt
   [junit4]   2> 970117 INFO  (TEST-HdfsUnloadDistributedZkTest.test-seed#[E637C0C68C28D8FD]) [    ] o.a.s.c.ZkTestServer put /home/jenkins/jenkins-slave/workspace/Lucene-Solr-NightlyTests-7.x/checkout/solr/core/src/test-files/solr/collection1/conf/currency.xml to /configs/conf1/currency.xml
   [junit4]   2> 970118 INFO  (TEST-HdfsUnloadDistributedZkTest.test-seed#[E637C0C68C28D8FD]) [    ] o.a.s.c.ZkTestServer put /home/jenkins/jenkins-slave/workspace/Lucene-Solr-NightlyTests-7.x/checkout/solr/core/src/test-files/solr/collection1/conf/enumsConfig.xml to /configs/conf1/enumsConfig.xml
   [junit4]   2> 970119 INFO  (TEST-HdfsUnloadDistributedZkTest.test-seed#[E637C0C68C28D8FD]) [    ] o.a.s.c.ZkTestServer put /home/jenkins/jenkins-slave/workspace/Lucene-Solr-NightlyTests-7.x/checkout/solr/core/src/test-files/solr/collection1/conf/open-exchange-rates.json to /configs/conf1/open-exchange-rates.json
   [junit4]   2> 970120 INFO  (TEST-HdfsUnloadDistributedZkTest.test-seed#[E637C0C68C28D8FD]) [    ] o.a.s.c.ZkTestServer put /home/jenkins/jenkins-slave/workspace/Lucene-Solr-NightlyTests-7.x/checkout/solr/core/src/test-files/solr/collection1/conf/mapping-ISOLatin1Accent.txt to /configs/conf1/mapping-ISOLatin1Accent.txt
   [junit4]   2> 970132 INFO  (TEST-HdfsUnloadDistributedZkTest.test-seed#[E637C0C68C28D8FD]) [    ] o.a.s.c.ZkTestServer put /home/jenkins/jenkins-slave/workspace/Lucene-Solr-NightlyTests-7.x/checkout/solr/core/src/test-files/solr/collection1/conf/old_synonyms.txt to /configs/conf1/old_synonyms.txt
   [junit4]   2> 970133 INFO  (TEST-HdfsUnloadDistributedZkTest.test-seed#[E637C0C68C28D8FD]) [    ] o.a.s.c.ZkTestServer put /home/jenkins/jenkins-slave/workspace/Lucene-Solr-NightlyTests-7.x/checkout/solr/core/src/test-files/solr/collection1/conf/synonyms.txt to /configs/conf1/synonyms.txt
   [junit4]   2> 970134 INFO  (TEST-HdfsUnloadDistributedZkTest.test-seed#[E637C0C68C28D8FD]) [    ] o.a.s.c.AbstractFullDistribZkTestBase Will use NRT replicas unless explicitly asked otherwise
   [junit4]   2> 970668 WARN  (TEST-HdfsUnloadDistributedZkTest.test-seed#[E637C0C68C28D8FD]) [    ] o.e.j.s.AbstractConnector Ignoring deprecated socket close linger time
   [junit4]   2> 970668 INFO  (TEST-HdfsUnloadDistributedZkTest.test-seed#[E637C0C68C28D8FD]) [    ] o.a.s.c.s.e.JettySolrRunner Start Jetty (original configured port=0)
   [junit4]   2> 970668 INFO  (TEST-HdfsUnloadDistributedZkTest.test-seed#[E637C0C68C28D8FD]) [    ] o.a.s.c.s.e.JettySolrRunner Trying to start Jetty on port 0 try number 1 ...
   [junit4]   2> 970668 INFO  (TEST-HdfsUnloadDistributedZkTest.test-seed#[E637C0C68C28D8FD]) [    ] o.e.j.s.Server jetty-9.4.14.v20181114; built: 2018-11-14T21:20:31.478Z; git: c4550056e785fb5665914545889f21dc136ad9e6; jvm 1.8.0_191-b12
   [junit4]   2> 970669 INFO  (TEST-HdfsUnloadDistributedZkTest.test-seed#[E637C0C68C28D8FD]) [    ] o.e.j.s.session DefaultSessionIdManager workerName=node0
   [junit4]   2> 970669 INFO  (TEST-HdfsUnloadDistributedZkTest.test-seed#[E637C0C68C28D8FD]) [    ] o.e.j.s.session No SessionScavenger set, using defaults
   [junit4]   2> 970669 INFO  (TEST-HdfsUnloadDistributedZkTest.test-seed#[E637C0C68C28D8FD]) [    ] o.e.j.s.session node0 Scavenging every 660000ms
   [junit4]   2> 970687 INFO  (TEST-HdfsUnloadDistributedZkTest.test-seed#[E637C0C68C28D8FD]) [    ] o.e.j.s.h.ContextHandler Started o.e.j.s.ServletContextHandler@1082aaf6{/u,null,AVAILABLE}
   [junit4]   2> 970688 INFO  (TEST-HdfsUnloadDistributedZkTest.test-seed#[E637C0C68C28D8FD]) [    ] o.e.j.s.AbstractConnector Started ServerConnector@477e6737{HTTP/1.1,[http/1.1]}{127.0.0.1:43412}
   [junit4]   2> 970688 INFO  (TEST-HdfsUnloadDistributedZkTest.test-seed#[E637C0C68C28D8FD]) [    ] o.e.j.s.Server Started @970745ms
   [junit4]   2> 970688 INFO  (TEST-HdfsUnloadDistributedZkTest.test-seed#[E637C0C68C28D8FD]) [    ] o.a.s.c.s.e.JettySolrRunner Jetty properties: {solr.data.dir=hdfs://lucene2-us-west.apache.org:36517/hdfs__lucene2-us-west.apache.org_36517__home_jenkins_jenkins-slave_workspace_Lucene-Solr-NightlyTests-7.x_checkout_solr_build_solr-core_test_J2_temp_solr.cloud.hdfs.HdfsUnloadDistributedZkTest_E637C0C68C28D8FD-001_tempDir-002_control_data, hostContext=/u, hostPort=43412, coreRootDirectory=/home/jenkins/jenkins-slave/workspace/Lucene-Solr-NightlyTests-7.x/checkout/solr/build/solr-core/test/J2/../../../../../../../../../../../home/jenkins/jenkins-slave/workspace/Lucene-Solr-NightlyTests-7.x/checkout/solr/build/solr-core/test/J2/temp/solr.cloud.hdfs.HdfsUnloadDistributedZkTest_E637C0C68C28D8FD-001/control-001/cores}
   [junit4]   2> 970688 ERROR (TEST-HdfsUnloadDistributedZkTest.test-seed#[E637C0C68C28D8FD]) [    ] o.a.s.u.StartupLoggingUtils Missing Java Option solr.log.dir. Logging may be missing or incomplete.
   [junit4]   2> 970688 INFO  (TEST-HdfsUnloadDistributedZkTest.test-seed#[E637C0C68C28D8FD]) [    ] o.a.s.s.SolrDispatchFilter Using logger factory org.apache.logging.slf4j.Log4jLoggerFactory
   [junit4]   2> 970688 INFO  (TEST-HdfsUnloadDistributedZkTest.test-seed#[E637C0C68C28D8FD]) [    ] o.a.s.s.SolrDispatchFilter  ___      _       Welcome to Apache Solr? version 7.8.0
   [junit4]   2> 970688 INFO  (TEST-HdfsUnloadDistributedZkTest.test-seed#[E637C0C68C28D8FD]) [    ] o.a.s.s.SolrDispatchFilter / __| ___| |_ _   Starting in cloud mode on port null
   [junit4]   2> 970689 INFO  (TEST-HdfsUnloadDistributedZkTest.test-seed#[E637C0C68C28D8FD]) [    ] o.a.s.s.SolrDispatchFilter \__ \/ _ \ | '_|  Install dir: null
   [junit4]   2> 970689 INFO  (TEST-HdfsUnloadDistributedZkTest.test-seed#[E637C0C68C28D8FD]) [    ] o.a.s.s.SolrDispatchFilter |___/\___/_|_|    Start time: 2019-02-08T21:01:39.556Z
   [junit4]   2> 970723 INFO  (zkConnectionManagerCallback-672-thread-1) [    ] o.a.s.c.c.ConnectionManager zkClient has connected
   [junit4]   2> 970743 INFO  (TEST-HdfsUnloadDistributedZkTest.test-seed#[E637C0C68C28D8FD]) [    ] o.a.s.s.SolrDispatchFilter Loading solr.xml from SolrHome (not found in ZooKeeper)
   [junit4]   2> 970743 INFO  (TEST-HdfsUnloadDistributedZkTest.test-seed#[E637C0C68C28D8FD]) [    ] o.a.s.c.SolrXmlConfig Loading container configuration from /home/jenkins/jenkins-slave/workspace/Lucene-Solr-NightlyTests-7.x/checkout/solr/build/solr-core/test/J2/temp/solr.cloud.hdfs.HdfsUnloadDistributedZkTest_E637C0C68C28D8FD-001/control-001/solr.xml
   [junit4]   2> 970779 WARN  (NIOServerCxn.Factory:0.0.0.0/0.0.0.0:0) [    ] o.a.z.s.NIOServerCnxn Unable to read additional data from client sessionid 0x107732cfe980002, likely client has closed socket
   [junit4]   2> 970816 INFO  (TEST-HdfsUnloadDistributedZkTest.test-seed#[E637C0C68C28D8FD]) [    ] o.a.s.c.SolrXmlConfig Configuration parameter autoReplicaFailoverWorkLoopDelay is ignored
   [junit4]   2> 970816 INFO  (TEST-HdfsUnloadDistributedZkTest.test-seed#[E637C0C68C28D8FD]) [    ] o.a.s.c.SolrXmlConfig Configuration parameter autoReplicaFailoverBadNodeExpiration is ignored
   [junit4]   2> 970818 INFO  (TEST-HdfsUnloadDistributedZkTest.test-seed#[E637C0C68C28D8FD]) [    ] o.a.s.c.SolrXmlConfig MBean server found: com.sun.jmx.mbeanserver.JmxMBeanServer@4567f35d, but no JMX reporters were configured - adding default JMX reporter.
   [junit4]   2> 971208 INFO  (TEST-HdfsUnloadDistributedZkTest.test-seed#[E637C0C68C28D8FD]) [    ] o.a.s.h.c.HttpShardHandlerFactory Host whitelist initialized: WhitelistHostChecker [whitelistHosts=null, whitelistHostCheckingEnabled=false]
   [junit4]   2> 971224 INFO  (TEST-HdfsUnloadDistributedZkTest.test-seed#[E637C0C68C28D8FD]) [    ] o.a.s.c.ZkContainer Zookeeper client=127.0.0.1:39315/solr
   [junit4]   2> 971262 INFO  (zkConnectionManagerCallback-676-thread-1) [    ] o.a.s.c.c.ConnectionManager zkClient has connected
   [junit4]   2> 971315 INFO  (zkConnectionManagerCallback-678-thread-1) [    ] o.a.s.c.c.ConnectionManager zkClient has connected
   [junit4]   2> 971738 INFO  (TEST-HdfsUnloadDistributedZkTest.test-seed#[E637C0C68C28D8FD]) [n:127.0.0.1:43412_u    ] o.a.s.c.OverseerElectionContext I am going to be the leader 127.0.0.1:43412_u
   [junit4]   2> 971738 INFO  (TEST-HdfsUnloadDistributedZkTest.test-seed#[E637C0C68C28D8FD]) [n:127.0.0.1:43412_u    ] o.a.s.c.Overseer Overseer (id=74154555962032132-127.0.0.1:43412_u-n_0000000000) starting
   [junit4]   2> 971780 INFO  (zkConnectionManagerCallback-685-thread-1) [    ] o.a.s.c.c.ConnectionManager zkClient has connected
   [junit4]   2> 971798 INFO  (TEST-HdfsUnloadDistributedZkTest.test-seed#[E637C0C68C28D8FD]) [n:127.0.0.1:43412_u    ] o.a.s.c.s.i.ZkClientClusterStateProvider Cluster at 127.0.0.1:39315/solr ready
   [junit4]   2> 971800 INFO  (OverseerStateUpdate-74154555962032132-127.0.0.1:43412_u-n_0000000000) [n:127.0.0.1:43412_u    ] o.a.s.c.Overseer Starting to work on the main queue : 127.0.0.1:43412_u
   [junit4]   2> 971804 INFO  (TEST-HdfsUnloadDistributedZkTest.test-seed#[E637C0C68C28D8FD]) [n:127.0.0.1:43412_u    ] o.a.s.c.ZkController Register node as live in ZooKeeper:/live_nodes/127.0.0.1:43412_u
   [junit4]   2> 971833 INFO  (zkCallback-677-thread-1) [    ] o.a.s.c.c.ZkStateReader Updated live nodes from ZooKeeper... (0) -> (1)
   [junit4]   2> 971870 INFO  (zkCallback-684-thread-1) [    ] o.a.s.c.c.ZkStateReader Updated live nodes from ZooKeeper... (0) -> (1)
   [junit4]   2> 971926 INFO  (TEST-HdfsUnloadDistributedZkTest.test-seed#[E637C0C68C28D8FD]) [n:127.0.0.1:43412_u    ] o.a.s.h.a.MetricsHistoryHandler No .system collection, keeping metrics history in memory.
   [junit4]   2> 972090 INFO  (TEST-HdfsUnloadDistributedZkTest.test-seed#[E637C0C68C28D8FD]) [n:127.0.0.1:43412_u    ] o.a.s.m.r.SolrJmxReporter JMX monitoring for 'solr.node' (registry 'solr.node') enabled at server: com.sun.jmx.mbeanserver.JmxMBeanServer@4567f35d
   [junit4]   2> 972198 INFO  (TEST-HdfsUnloadDistributedZkTest.test-seed#[E637C0C68C28D8FD]) [n:127.0.0.1:43412_u    ] o.a.s.m.r.SolrJmxReporter JMX monitoring for 'solr.jvm' (registry 'solr.jvm') enabled at server: com.sun.jmx.mbeanserver.JmxMBeanServer@4567f35d
   [junit4]   2> 972198 INFO  (TEST-HdfsUnloadDistributedZkTest.test-seed#[E637C0C68C28D8FD]) [n:127.0.0.1:43412_u    ] o.a.s.m.r.SolrJmxReporter JMX monitoring for 'solr.jetty' (registry 'solr.jetty') enabled at server: com.sun.jmx.mbeanserver.JmxMBeanServer@4567f35d
   [junit4]   2> 972200 INFO  (TEST-HdfsUnloadDistributedZkTest.test-seed#[E637C0C68C28D8FD]) [n:127.0.0.1:43412_u    ] o.a.s.c.CorePropertiesLocator Found 0 core definitions underneath /home/jenkins/jenkins-slave/workspace/Lucene-Solr-NightlyTests-7.x/checkout/solr/build/solr-core/test/J2/../../../../../../../../../../../home/jenkins/jenkins-slave/workspace/Lucene-Solr-NightlyTests-7.x/checkout/solr/build/solr-core/test/J2/temp/solr.cloud.hdfs.HdfsUnloadDistributedZkTest_E637C0C68C28D8FD-001/control-001/cores
   [junit4]   2> 972345 INFO  (zkConnectionManagerCallback-691-thread-1) [    ] o.a.s.c.c.ConnectionManager zkClient has connected
   [junit4]   2> 972346 INFO  (TEST-HdfsUnloadDistributedZkTest.test-seed#[E637C0C68C28D8FD]) [    ] o.a.s.c.c.ZkStateReader Updated live nodes from ZooKeeper... (0) -> (1)
   [junit4]   2> 972347 INFO  (TEST-HdfsUnloadDistributedZkTest.test-seed#[E637C0C68C28D8FD]) [    ] o.a.s.c.s.i.ZkClientClusterStateProvider Cluster at 127.0.0.1:39315/solr ready
   [junit4]   2> 972361 INFO  (qtp1621775445-5139) [n:127.0.0.1:43412_u    ] o.a.s.h.a.CollectionsHandler Invoked Collection Action :create with params collection.configName=conf1&name=control_collection&nrtReplicas=1&action=CREATE&numShards=1&createNodeSet=127.0.0.1:43412_u&wt=javabin&version=2 and sendToOCPQueue=true
   [junit4]   2> 972441 INFO  (OverseerThreadFactory-1757-thread-1-processing-n:127.0.0.1:43412_u) [n:127.0.0.1:43412_u    ] o.a.s.c.a.c.CreateCollectionCmd Create collection control_collection
   [junit4]   2> 972549 INFO  (qtp1621775445-5141) [n:127.0.0.1:43412_u    ] o.a.s.s.HttpSolrCall [admin] webapp=null path=/admin/metrics params={prefix=CONTAINER.fs.usableSpace,CONTAINER.fs.totalSpace,CORE.coreName&wt=javabin&version=2&group=solr.node,solr.core} status=0 QTime=0
   [junit4]   2> 972558 INFO  (qtp1621775445-5142) [n:127.0.0.1:43412_u    ] o.a.s.s.HttpSolrCall [admin] webapp=null path=/admin/metrics params={prefix=CONTAINER.fs.usableSpace,CONTAINER.fs.totalSpace,CORE.coreName&wt=javabin&version=2&group=solr.node,solr.core} status=0 QTime=8
   [junit4]   2> 972559 INFO  (qtp1621775445-5138) [n:127.0.0.1:43412_u    ] o.a.s.s.HttpSolrCall [admin] webapp=null path=/admin/metrics params={prefix=CONTAINER.fs.usableSpace,CONTAINER.fs.totalSpace,CORE.coreName&wt=javabin&version=2&group=solr.node,solr.core} status=0 QTime=0
   [junit4]   2> 972560 INFO  (qtp1621775445-5140) [n:127.0.0.1:43412_u    ] o.a.s.s.HttpSolrCall [admin] webapp=null path=/admin/metrics params={prefix=CONTAINER.fs.usableSpace,CONTAINER.fs.totalSpace,CORE.coreName&wt=javabin&version=2&group=solr.node,solr.core} status=0 QTime=0
   [junit4]   2> 972561 INFO  (qtp1621775445-5141) [n:127.0.0.1:43412_u    ] o.a.s.s.HttpSolrCall [admin] webapp=null path=/admin/metrics params={prefix=CONTAINER.fs.usableSpace,CONTAINER.fs.totalSpace,CORE.coreName&wt=javabin&version=2&group=solr.node,solr.core} status=0 QTime=0
   [junit4]   2> 972572 INFO  (qtp1621775445-5142) [n:127.0.0.1:43412_u    x:control_collection_shard1_replica_n1] o.a.s.h.a.CoreAdminOperation core create command qt=/admin/cores&collection.configName=conf1&newCollection=true&name=control_collection_shard1_replica_n1&action=CREATE&numShards=1&collection=control_collection&shard=shard1&wt=javabin&version=2&replicaType=NRT
   [junit4]   2> 972573 INFO  (qtp1621775445-5142) [n:127.0.0.1:43412_u    x:control_collection_shard1_replica_n1] o.a.s.c.TransientSolrCoreCacheDefault Allocating transient cache for 4 transient cores
   [junit4]   2> 973700 INFO  (qtp1621775445-5142) [n:127.0.0.1:43412_u c:control_collection s:shard1  x:control_collection_shard1_replica_n1] o.a.s.c.SolrConfig Using Lucene MatchVersion: 7.8.0
   [junit4]   2> 973788 INFO  (qtp1621775445-5142) [n:127.0.0.1:43412_u c:control_collection s:shard1  x:control_collection_shard1_replica_n1] o.a.s.s.IndexSchema [control_collection_shard1_replica_n1] Schema name=test
   [junit4]   2> 974105 WARN  (qtp1621775445-5142) [n:127.0.0.1:43412_u c:control_collection s:shard1  x:control_collection_shard1_replica_n1] o.a.s.c.SolrResourceLoader Solr loaded a deprecated plugin/analysis class [solr.LowerCaseTokenizerFactory]. Please consult documentation how to replace it accordingly.
   [junit4]   2> 974167 WARN  (qtp1621775445-5142) [n:127.0.0.1:43412_u c:control_collection s:shard1  x:control_collection_shard1_replica_n1] o.a.s.c.SolrResourceLoader Solr loaded a deprecated plugin/analysis class [solr.WordDelimiterFilterFactory]. Please consult documentation how to replace it accordingly.
   [junit4]   2> 974723 INFO  (qtp1621775445-5142) [n:127.0.0.1:43412_u c:control_collection s:shard1  x:control_collection_shard1_replica_n1] o.a.s.s.IndexSchema Loaded schema test/1.0 with uniqueid field id
   [junit4]   2> 974905 INFO  (qtp1621775445-5142) [n:127.0.0.1:43412_u c:control_collection s:shard1  x:control_collection_shard1_replica_n1] o.a.s.c.CoreContainer Creating SolrCore 'control_collection_shard1_replica_n1' using configuration from collection control_collection, trusted=true
   [junit4]   2> 974905 INFO  (qtp1621775445-5142) [n:127.0.0.1:43412_u c:control_collection s:shard1  x:control_collection_shard1_replica_n1] o.a.s.m.r.SolrJmxReporter JMX monitoring for 'solr.core.control_collection.shard1.replica_n1' (registry 'solr.core.control_collection.shard1.replica_n1') enabled at server: com.sun.jmx.mbeanserver.JmxMBeanServer@4567f35d
   [junit4]   2> 974999 INFO  (qtp1621775445-5142) [n:127.0.0.1:43412_u c:control_collection s:shard1  x:control_collection_shard1_replica_n1] o.a.s.c.HdfsDirectoryFactory solr.hdfs.home=hdfs://lucene2-us-west.apache.org:36517/solr_hdfs_home
   [junit4]   2> 974999 INFO  (qtp1621775445-5142) [n:127.0.0.1:43412_u c:control_collection s:shard1  x:control_collection_shard1_replica_n1] o.a.s.c.HdfsDirectoryFactory Solr Kerberos Authentication disabled
   [junit4]   2> 975000 INFO  (qtp1621775445-5142) [n:127.0.0.1:43412_u c:control_collection s:shard1  x:control_collection_shard1_replica_n1] o.a.s.c.SolrCore [[control_collection_shard1_replica_n1] ] Opening new SolrCore at [/home/jenkins/jenkins-slave/workspace/Lucene-Solr-NightlyTests-7.x/checkout/solr/build/solr-core/test/J2/temp/solr.cloud.hdfs.HdfsUnloadDistributedZkTest_E637C0C68C28D8FD-001/control-001/cores/control_collection_shard1_replica_n1], dataDir=[hdfs://lucene2-us-west.apache.org:36517/solr_hdfs_home/control_collection/core_node2/data/]
   [junit4]   2> 975035 INFO  (qtp1621775445-5142) [n:127.0.0.1:43412_u c:control_collection s:shard1  x:control_collection_shard1_replica_n1] o.a.s.c.HdfsDirectoryFactory creating directory factory for path hdfs://lucene2-us-west.apache.org:36517/solr_hdfs_home/control_collection/core_node2/data/snapshot_metadata
   [junit4]   2> 975162 INFO  (qtp1621775445-5142) [n:127.0.0.1:43412_u c:control_collection s:shard1  x:control_collection_shard1_replica_n1] o.a.s.c.HdfsDirectoryFactory Number of slabs of block cache [1] with direct memory allocation set to [true]
   [junit4]   2> 975162 INFO  (qtp1621775445-5142) [n:127.0.0.1:43412_u c:control_collection s:shard1  x:control_collection_shard1_replica_n1] o.a.s.c.HdfsDirectoryFactory Block cache target memory usage, slab size of [8388608] will allocate [1] slabs and use ~[8388608] bytes
   [junit4]   2> 975162 INFO  (qtp1621775445-5142) [n:127.0.0.1:43412_u c:control_collection s:shard1  x:control_collection_shard1_replica_n1] o.a.s.c.HdfsDirectoryFactory Creating new single instance HDFS BlockCache
   [junit4]   2> 977599 INFO  (qtp1621775445-5142) [n:127.0.0.1:43412_u c:control_collection s:shard1  x:control_collection_shard1_replica_n1] o.a.s.s.b.BlockDirectory Block cache on write is disabled
   [junit4]   2> 977619 INFO  (qtp1621775445-5142) [n:127.0.0.1:43412_u c:control_collection s:shard1  x:control_collection_shard1_replica_n1] o.a.s.c.HdfsDirectoryFactory creating directory factory for path hdfs://lucene2-us-west.apache.org:36517/solr_hdfs_home/control_collection/core_node2/data
   [junit4]   2> 977750 INFO  (qtp1621775445-5142) [n:127.0.0.1:43412_u c:control_collection s:shard1  x:control_collection_shard1_replica_n1] o.a.s.c.HdfsDirectoryFactory creating directory factory for path hdfs://lucene2-us-west.apache.org:36517/solr_hdfs_home/control_collection/core_node2/data/index
   [junit4]   2> 977786 INFO  (qtp1621775445-5142) [n:127.0.0.1:43412_u c:control_collection s:shard1  x:control_collection_shard1_replica_n1] o.a.s.c.HdfsDirectoryFactory Number of slabs of block cache [1] with direct memory allocation set to [true]
   [junit4]   2> 977786 INFO  (qtp1621775445-5142) [n:127.0.0.1:43412_u c:control_collection s:shard1  x:control_collection_shard1_replica_n1] o.a.s.c.HdfsDirectoryFactory Block cache target memory usage, slab size of [8388608] will allocate [1] slabs and use ~[8388608] bytes
   [junit4]   2> 977786 INFO  (qtp1621775445-5142) [n:127.0.0.1:43412_u c:control_collection s:shard1  x:control_collection_shard1_replica_n1] o.a.s.c.HdfsDirectoryFactory Creating new single instance HDFS BlockCache
   [junit4]   2> 977839 INFO  (qtp1621775445-5142) [n:127.0.0.1:43412_u c:control_collection s:shard1  x:control_collection_shard1_replica_n1] o.a.s.s.b.BlockDirectory Block cache on write is disabled
   [junit4]   2> 977840 INFO  (qtp1621775445-5142) [n:127.0.0.1:43412_u c:control_collection s:shard1  x:control_collection_shard1_replica_n1] o.a.s.u.RandomMergePolicy RandomMergePolicy wrapping class org.apache.lucene.index.LogDocMergePolicy: [LogDocMergePolicy: minMergeSize=1000, mergeFactor=26, maxMergeSize=9223372036854775807, maxMergeSizeForForcedMerge=9223372036854775807, calibrateSizeByDeletes=true, maxMergeDocs=2147483647, maxCFSSegmentSizeMB=8.796093022207999E12, noCFSRatio=0.6160562764945575]
   [junit4]   2> 982369 INFO  (Block report processor) [    ] BlockStateChange BLOCK* addStoredBlock: blockMap updated: 127.0.0.1:41386 is added to blk_1073741825_1001{UCState=COMMITTED, truncateBlock=null, primaryNodeIndex=-1, replicas=[ReplicaUC[[DISK]DS-16a7257b-7c58-47ff-a2ca-b3ee2ce9c674:NORMAL:127.0.0.1:41386|RBW], ReplicaUC[[DISK]DS-022354de-3a89-493d-bf68-006143d45e1d:NORMAL:127.0.0.1:35235|RBW]]} size 69
   [junit4]   2> 982369 INFO  (Block report processor) [    ] BlockStateChange BLOCK* addStoredBlock: blockMap updated: 127.0.0.1:35235 is added to blk_1073741825_1001 size 69
   [junit4]   2> 982982 WARN  (qtp1621775445-5142) [n:127.0.0.1:43412_u c:control_collection s:shard1  x:control_collection_shard1_replica_n1] o.a.s.c.RequestHandlers INVALID paramSet a in requestHandler {type = requestHandler,name = /dump,class = DumpRequestHandler,attributes = {initParams=a, name=/dump, class=DumpRequestHandler},args = {defaults={a=A,b=B}}}
   [junit4]   2> 983403 INFO  (qtp1621775445-5142) [n:127.0.0.1:43412_u c:control_collection s:shard1  x:control_collection_shard1_replica_n1] o.a.s.u.UpdateHandler Using UpdateLog implementation: org.apache.solr.update.HdfsUpdateLog
   [junit4]   2> 983403 INFO  (qtp1621775445-5142) [n:127.0.0.1:43412_u c:control_collection s:shard1  x:control_collection_shard1_replica_n1] o.a.s.u.UpdateLog Initializing UpdateLog: dataDir= defaultSyncLevel=FLUSH numRecordsToKeep=100 maxNumLogsToKeep=10 numVersionBuckets=65536
   [junit4]   2> 983403 INFO  (qtp1621775445-5142) [n:127.0.0.1:43412_u c:control_collection s:shard1  x:control_collection_shard1_replica_n1] o.a.s.u.HdfsUpdateLog Initializing HdfsUpdateLog: tlogDfsReplication=2
   [junit4]   2> 983493 INFO  (qtp1621775445-5142) [n:127.0.0.1:43412_u c:control_collection s:shard1  x:control_collection_shard1_replica_n1] o.a.s.u.CommitTracker Hard AutoCommit: disabled
   [junit4]   2> 983493 INFO  (qtp1621775445-5142) [n:127.0.0.1:43412_u c:control_collection s:shard1  x:control_collection_shard1_replica_n1] o.a.s.u.CommitTracker Soft AutoCommit: disabled
   [junit4]   2> 983512 INFO  (qtp1621775445-5142) [n:127.0.0.1:43412_u c:control_collection s:shard1  x:control_collection_shard1_replica_n1] o.a.s.u.RandomMergePolicy RandomMergePolicy wrapping class org.apache.lucene.index.TieredMergePolicy: [TieredMergePolicy: maxMergeAtOnce=20, maxMergeAtOnceExplicit=43, maxMergedSegmentMB=82.0712890625, floorSegmentMB=1.9453125, forceMergeDeletesPctAllowed=10.582566117993201, segmentsPerTier=38.0, maxCFSSegmentSizeMB=0.3203125, noCFSRatio=0.19071928889794487, deletesPctAllowed=47.07946777844134
   [junit4]   2> 983987 INFO  (qtp1621775445-5142) [n:127.0.0.1:43412_u c:control_collection s:shard1  x:control_collection_shard1_replica_n1] o.a.s.s.SolrIndexSearcher Opening [Searcher@757dd13e[control_collection_shard1_replica_n1] main]
   [junit4]   2> 983988 INFO  (qtp1621775445-5142) [n:127.0.0.1:43412_u c:control_collection s:shard1  x:control_collection_shard1_replica_n1] o.a.s.r.ManagedResourceStorage Configured ZooKeeperStorageIO with znodeBase: /configs/conf1
   [junit4]   2> 983989 INFO  (qtp1621775445-5142) [n:127.0.0.1:43412_u c:control_collection s:shard1  x:control_collection_shard1_replica_n1] o.a.s.r.ManagedResourceStorage Loaded null at path _rest_managed.json using ZooKeeperStorageIO:path=/configs/conf1
   [junit4]   2> 984044 INFO  (qtp1621775445-5142) [n:127.0.0.1:43412_u c:control_collection s:shard1  x:control_collection_shard1_replica_n1] o.a.s.h.ReplicationHandler Commits will be reserved for 10000ms.
   [junit4]   2> 984045 INFO  (qtp1621775445-5142) [n:127.0.0.1:43412_u c:control_collection s:shard1  x:control_collection_shard1_replica_n1] o.a.s.u.UpdateLog Could not find max version in index or recent updates, using new clock 1624935983126413312
   [junit4]   2> 984061 INFO  (searcherExecutor-1762-thread-1-processing-n:127.0.0.1:43412_u x:control_collection_shard1_replica_n1 c:control_collection s:shard1) [n:127.0.0.1:43412_u c:control_collection s:shard1  x:control_collection_shard1_replica_n1] o.a.s.c.SolrCore [control_collection_shard1_replica_n1] Registered new searcher Searcher@757dd13e[control_collection_shard1_replica_n1] main{ExitableDirectoryReader(UninvertingDirectoryReader())}
   [junit4]   2> 984106 INFO  (qtp1621775445-5142) [n:127.0.0.1:43412_u c:control_collection s:shard1  x:control_collection_shard1_replica_n1] o.a.s.c.ZkShardTerms Successful update of terms at /collections/control_collection/terms/shard1 to Terms{values={core_node2=0}, version=0}
   [junit4]   2> 984106 INFO  (qtp1621775445-5142) [n:127.0.0.1:43412_u c:control_collection s:shard1  x:control_collection_shard1_replica_n1] o.a.s.c.ShardLeaderElectionContextBase make sure parent is created /collections/control_collection/leaders/shard1
   [junit4]   2> 984130 INFO  (qtp1621775445-5142) [n:127.0.0.1:43412_u c:control_collection s:shard1  x:control_collection_shard1_replica_n1] o.a.s.c.ShardLeaderElectionContext Enough replicas found to continue.
   [junit4]   2> 984130 INFO  (qtp1621775445-5142) [n:127.0.0.1:43412_u c:control_collection s:shard1  x:control_collection_shard1_replica_n1] o.a.s.c.ShardLeaderElectionContext I may be the new leader - try and sync
   [junit4]   2> 984130 INFO  (qtp1621775445-5142) [n:127.0.0.1:43412_u c:control_collection s:shard1  x:control_collection_shard1_replica_n1] o.a.s.c.SyncStrategy Sync replicas to http://127.0.0.1:43412/u/control_collection_shard1_replica_n1/
   [junit4]   2> 984131 INFO  (qtp1621775445-5142) [n:127.0.0.1:43412_u c:control_collection s:shard1  x:control_collection_shard1_replica_n1] o.a.s.c.SyncStrategy Sync Success - now sync replicas to me
   [junit4]   2> 984147 INFO  (qtp1621775445-5142) [n:127.0.0.1:43412_u c:control_collection s:shard1  x:control_collection_shard1_replica_n1] o.a.s.c.SyncStrategy http://127.0.0.1:43412/u/control_collection_shard1_replica_n1/ has no replicas
   [junit4]   2> 984147 INFO  (qtp1621775445-5142) [n:127.0.0.1:43412_u c:control_collection s:shard1  x:control_collection_shard1_replica_n1] o.a.s.c.ShardLeaderElectionContext Found all replicas participating in election, clear LIR
   [junit4]   2> 984148 INFO  (qtp1621775445-5142) [n:127.0.0.1:43412_u c:control_collection s:shard1  x:control_collection_shard1_replica_n1] o.a.s.c.ShardLeaderElectionContextBase Creating leader registration node /collections/control_collection/leaders/shard1/leader after winning as /collections/control_collection/leader_elect/shard1/election/74154555962032132-core_node2-n_0000000000
   [junit4]   2> 984164 INFO  (qtp1621775445-5142) [n:127.0.0.1:43412_u c:control_collection s:shard1  x:control_collection_shard1_replica_n1] o.a.s.c.ShardLeaderElectionContext I am the new leader: http://127.0.0.1:43412/u/control_collection_shard1_replica_n1/ shard1
   [junit4]   2> 984201 INFO  (qtp1621775445-5142) [n:127.0.0.1:43412_u c:control_collection s:shard1  x:control_collection_shard1_replica_n1] o.a.s.c.ZkController I am the leader, no recovery necessary
   [junit4]   2> 984213 INFO  (qtp1621775445-5142) [n:127.0.0.1:43412_u c:control_collection s:shard1  x:control_collection_shard1_replica_n1] o.a.s.s.HttpSolrCall [admin] webapp=null path=/admin/cores params={qt=/admin/cores&collection.configName=conf1&newCollection=true&name=control_collection_shard1_replica_n1&action=CREATE&numShards=1&collection=control_collection&shard=shard1&wt=javabin&version=2&replicaType=NRT} status=0 QTime=11641
   [junit4]   2> 984274 INFO  (qtp1621775445-5139) [n:127.0.0.1:43412_u    ] o.a.s.h.a.CollectionsHandler Wait for new collection to be active for at most 45 seconds. Check all shard replicas
   [junit4]   2> 984331 INFO  (zkCallback-677-thread-1) [    ] o.a.s.c.c.ZkStateReader A cluster state change: [WatchedEvent state:SyncConnected type:NodeDataChanged path:/collections/control_collection/state.json] for collection [control_collection] has occurred - updating... (live nodes size: [1])
   [junit4]   2> 984358 INFO  (zkCallback-677-thread-2) [    ] o.a.s.c.c.ZkStateReader A cluster state change: [WatchedEvent state:SyncConnected type:NodeDataChanged path:/collections/control_collection/state.json] for collection [control_collection] has occurred - updating... (live nodes size: [1])
   [junit4]   2> 984366 INFO  (qtp1621775445-5139) [n:127.0.0.1:43412_u    ] o.a.s.s.HttpSolrCall [admin] webapp=null path=/admin/collections params={collection.configName=conf1&name=control_collection&nrtReplicas=1&action=CREATE&numShards=1&createNodeSet=127.0.0.1:43412_u&wt=javabin&version=2} status=0 QTime=12005
   [junit4]   2> 984472 INFO  (zkConnectionManagerCallback-696-thread-1) [    ] o.a.s.c.c.ConnectionManager zkClient has connected
   [junit4]   2> 984473 INFO  (TEST-HdfsUnloadDistributedZkTest.test-seed#[E637C0C68C28D8FD]) [    ] o.a.s.c.c.ZkStateReader Updated live nodes from ZooKeeper... (0) -> (1)
   [junit4]   2> 984474 INFO  (TEST-HdfsUnloadDistributedZkTest.test-seed#[E637C0C68C28D8FD]) [    ] o.a.s.c.s.i.ZkClientClusterStateProvider Cluster at 127.0.0.1:39315/solr ready
   [junit4]   2> 984477 INFO  (TEST-HdfsUnloadDistributedZkTest.test-seed#[E637C0C68C28D8FD]) [    ] o.a.s.c.ChaosMonkey monkey: init - expire sessions:false cause connection loss:false
   [junit4]   2> 984488 INFO  (qtp1621775445-5142) [n:127.0.0.1:43412_u    ] o.a.s.h.a.CollectionsHandler Invoked Collection Action :create with params collection.configName=conf1&name=collection1&nrtReplicas=1&action=CREATE&numShards=2&createNodeSet=&stateFormat=2&wt=javabin&version=2 and sendToOCPQueue=true
   [junit4]   2> 984609 INFO  (OverseerThreadFactory-1757-thread-2-processing-n:127.0.0.1:43412_u) [n:127.0.0.1:43412_u    ] o.a.s.c.a.c.CreateCollectionCmd Create collection collection1
   [junit4]   2> 984666 INFO  (OverseerCollectionConfigSetProcessor-74154555962032132-127.0.0.1:43412_u-n_0000000000) [n:127.0.0.1:43412_u    ] o.a.s.c.OverseerTaskQueue Response ZK path: /overseer/collection-queue-work/qnr-0000000000 doesn't exist.  Requestor may have disconnected from ZooKeeper
   [junit4]   2> 985014 WARN  (OverseerThreadFactory-1757-thread-2-processing-n:127.0.0.1:43412_u) [n:127.0.0.1:43412_u    ] o.a.s.c.a.c.CreateCollectionCmd It is unusual to create a collection (collection1) without cores.
   [junit4]   2> 985061 INFO  (qtp1621775445-5142) [n:127.0.0.1:43412_u    ] o.a.s.h.a.CollectionsHandler Wait for new collection to be active for at most 45 seconds. Check all shard replicas
   [junit4]   2> 985062 INFO  (qtp1621775445-5142) [n:127.0.0.1:43412_u    ] o.a.s.s.HttpSolrCall [admin] webapp=null path=/admin/collections params={collection.configName=conf1&name=collection1&nrtReplicas=1&action=CREATE&numShards=2&createNodeSet=&stateFormat=2&wt=javabin&version=2} status=0 QTime=573
   [junit4]   2> 985087 INFO  (TEST-HdfsUnloadDistributedZkTest.test-seed#[E637C0C68C28D8FD]) [    ] o.a.s.c.AbstractFullDistribZkTestBase Creating jetty instances pullReplicaCount=0 numOtherReplicas=4
   [junit4]   2> 986096 INFO  (TEST-HdfsUnloadDistributedZkTest.test-seed#[E637C0C68C28D8FD]) [    ] o.a.s.c.AbstractFullDistribZkTestBase create jetty 1 in directory /home/jenkins/jenkins-slave/workspace/Lucene-Solr-NightlyTests-7.x/checkout/solr/build/solr-core/test/J2/temp/solr.cloud.hdfs.HdfsUnloadDistributedZkTest_E637C0C68C28D8FD-001/shard-1-001 of type NRT
   [junit4]   2> 986243 WARN  (closeThreadPool-697-thread-1) [    ] o.e.j.s.AbstractConnector Ignoring deprecated socket close linger time
   [junit4]   2> 986243 INFO  (closeThreadPool-697-thread-1) [    ] o.a.s.c.s.e.JettySolrRunner Start Jetty (original configured port=0)
   [junit4]   2> 986243 INFO  (closeThreadPool-697-thread-1) [    ] o.a.s.c.s.e.JettySolrRunner Trying to start Jetty on port 0 try number 1 ...
   [junit4]   2> 986243 INFO  (closeThreadPool-697-thread-1) [    ] o.e.j.s.Server jetty-9.4.14.v20181114; built: 2018-11-14T21:20:31.478Z; git: c4550056e785fb5665914545889f21dc136ad9e6; jvm 1.8.0_191-b12
   [junit4]   2> 986421 INFO  (closeThreadPool-697-thread-1) [    ] o.e.j.s.session DefaultSessionIdManager workerName=node0
   [junit4]   2> 986421 INFO  (closeThreadPool-697-thread-1) [    ] o.e.j.s.session No SessionScavenger set, using defaults
   [junit4]   2> 986421 INFO  (closeThreadPool-697-thread-1) [    ] o.e.j.s.session node0 Scavenging every 660000ms
   [junit4]   2> 986421 INFO  (closeThreadPool-697-thread-1) [    ] o.e.j.s.h.ContextHandler Started o.e.j.s.ServletContextHandler@32560ad9{/u,null,AVAILABLE}
   [junit4]   2> 986423 INFO  (closeThreadPool-697-thread-1) [    ] o.e.j.s.AbstractConnector Started ServerConnector@63572ea8{HTTP/1.1,[http/1.1]}{127.0.0.1:44669}
   [junit4]   2> 986423 INFO  (closeThreadPool-697-thread-1) [    ] o.e.j.s.Server Started @986480ms
   [junit4]   2> 986423 INFO  (closeThreadPool-697-thread-1) [    ] o.a.s.c.s.e.JettySolrRunner Jetty properties: {solr.data.dir=hdfs://lucene2-us-west.apache.org:36517/hdfs__lucene2-us-west.apache.org_36517__home_jenkins_jenkins-slave_workspace_Lucene-Solr-NightlyTests-7.x_checkout_solr_build_solr-core_test_J2_temp_solr.cloud.hdfs.HdfsUnloadDistributedZkTest_E637C0C68C28D8FD-001_tempDir-002_jetty1, solrconfig=solrconfig.xml, hostContext=/u, hostPort=44669, coreRootDirectory=/home/jenkins/jenkins-slave/workspace/Lucene-Solr-NightlyTests-7.x/checkout/solr/build/solr-core/test/J2/temp/solr.cloud.hdfs.HdfsUnloadDistributedZkTest_E637C0C68C28D8FD-001/shard-1-001/cores}
   [junit4]   2> 986423 ERROR (closeThreadPool-697-thread-1) [    ] o.a.s.u.StartupLoggingUtils Missing Java Option solr.log.dir. Logging may be missing or incomplete.
   [junit4]   2> 986423 INFO  (closeThreadPool-697-thread-1) [    ] o.a.s.s.SolrDispatchFilter Using logger factory org.apache.logging.slf4j.Log4jLoggerFactory
   [junit4]   2> 986423 INFO  (closeThreadPool-697-thread-1) [    ] o.a.s.s.SolrDispatchFilter  ___      _       Welcome to Apache Solr? version 7.8.0
   [junit4]   2> 986423 INFO  (closeThreadPool-697-thread-1) [    ] o.a.s.s.SolrDispatchFilter / __| ___| |_ _   Starting in cloud mode on port null
   [junit4]   2> 986423 INFO  (closeThreadPool-697-thread-1) [    ] o.a.s.s.SolrDispatchFilter \__ \/ _ \ | '_|  Install dir: null
   [junit4]   2> 986423 INFO  (closeThreadPool-697-thread-1) [    ] o.a.s.s.SolrDispatchFilter |___/\___/_|_|    Start time: 2019-02-08T21:01:55.290Z
   [junit4]   2> 986458 INFO  (zkConnectionManagerCallback-699-thread-1) [    ] o.a.s.c.c.ConnectionManager zkClient has connected
   [junit4]   2> 986459 INFO  (closeThreadPool-697-thread-1) [    ] o.a.s.s.SolrDispatchFilter Loading solr.xml from SolrHome (not found in ZooKeeper)
   [junit4]   2> 986459 INFO  (closeThreadPool-697-thread-1) [    ] o.a.s.c.SolrXmlConfig Loading container configuration from /home/jenkins/jenkins-slave/workspace/Lucene-Solr-NightlyTests-7.x/checkout/solr/build/solr-core/test/J2/temp/solr.cloud.hdfs.HdfsUnloadDistributedZkTest_E637C0C68C28D8FD-001/shard-1-001/solr.xml
   [junit4]   2> 986531 INFO  (closeThreadPool-697-thread-1) [    ] o.a.s.c.SolrXmlConfig Configuration parameter autoReplicaFailoverWorkLoopDelay is ignored
   [junit4]   2> 986531 INFO  (closeThreadPool-697-thread-1) [    ] o.a.s.c.SolrXmlConfig Configuration parameter autoReplicaFailoverBadNodeExpiration is ignored
   [junit4]   2> 986532 INFO  (closeThreadPool-697-thread-1) [    ] o.a.s.c.SolrXmlConfig MBean server found: com.sun.jmx.mbeanserver.JmxMBeanServer@4567f35d, but no JMX reporters were configured - adding default JMX reporter.
   [junit4]   2> 986680 INFO  (OverseerCollectionConfigSetProcessor-74154555962032132-127.0.0.1:43412_u-n_0000000000) [n:127.0.0.1:43412_u    ] o.a.s.c.OverseerTaskQueue Response ZK path: /overseer/collection-queue-work/qnr-0000000002 doesn't exist.  Requestor may have disconnected from ZooKeeper
   [junit4]   2> 987549 INFO  (TEST-HdfsUnloadDistributedZkTest.test-seed#[E637C0C68C28D8FD]) [    ] o.a.s.c.AbstractFullDistribZkTestBase create jetty 2 in directory /home/jenkins/jenkins-slave/workspace/Lucene-Solr-NightlyTests-7.x/checkout/solr/build/solr-core/test/J2/temp/solr.cloud.hdfs.HdfsUnloadDistributedZkTest_E637C0C68C28D8FD-001/shard-2-001 of type NRT
   [junit4]   2> 987584 WARN  (closeThreadPool-697-thread-2) [    ] o.e.j.s.AbstractConnector Ignoring deprecated socket close linger time
   [junit4]   2> 987584 INFO  (closeThreadPool-697-thread-2) [    ] o.a.s.c.s.e.JettySolrRunner Start Jetty (original configured port=0)
   [junit4]   2> 987584 INFO  (closeThreadPool-697-thread-2) [    ] o.a.s.c.s.e.JettySolrRunner Trying to start Jetty on port 0 try number 1 ...
   [junit4]   2> 987584 INFO  (closeThreadPool-697-thread-2) [    ] o.e.j.s.Server jetty-9.4.14.v20181114; built: 2018-11-14T21:20:31.478Z; git: c4550056e785fb5665914545889f21dc136ad9e6; jvm 1.8.0_191-b12
   [junit4]   2> 987648 INFO  (closeThreadPool-697-thread-2) [    ] o.e.j.s.session DefaultSessionIdManager workerName=node0
   [junit4]   2> 987648 INFO  (closeThreadPool-697-thread-2) [    ] o.e.j.s.session No SessionScavenger set, using defaults
   [junit4]   2> 987648 INFO  (closeThreadPool-697-thread-2) [    ] o.e.j.s.session node0 Scavenging every 600000ms
   [junit4]   2> 987669 INFO  (closeThreadPool-697-thread-2) [    ] o.e.j.s.h.ContextHandler Started o.e.j.s.ServletContextHandler@6128781c{/u,null,AVAILABLE}
   [junit4]   2> 987685 INFO  (closeThreadPool-697-thread-2) [    ] o.e.j.s.AbstractConnector Started ServerConnector@72284c18{HTTP/1.1,[http/1.1]}{127.0.0.1:39846}
   [junit4]   2> 987685 INFO  (closeThreadPool-697-thread-2) [    ] o.e.j.s.Server Started @987742ms
   [junit4]   2> 987685 INFO  (closeThreadPool-697-thread-2) [    ] o.a.s.c.s.e.JettySolrRunner Jetty properties: {solr.data.dir=hdfs://lucene2-us-west.apache.org:36517/hdfs__lucene2-us-west.apache.org_36517__home_jenkins_jenkins-slave_workspace_Lucene-Solr-NightlyTests-7.x_checkout_solr_build_solr-core_test_J2_temp_solr.cloud.hdfs.HdfsUnloadDistributedZkTest_E637C0C68C28D8FD-001_tempDir-002_jetty2, solrconfig=solrconfig.xml, hostContext=/u, hostPort=39846, coreRootDirectory=/home/jenkins/jenkins-slave/workspace/Lucene-Solr-NightlyTests-7.x/checkout/solr/build/solr-core/test/J2/temp/solr.cloud.hdfs.HdfsUnloadDistributedZkTest_E637C0C68C28D8FD-001/shard-2-001/cores}
   [junit4]   2> 987685 ERROR (closeThreadPool-697-thread-2) [    ] o.a.s.u.StartupLoggingUtils Missing Java Option solr.log.dir. Logging may be missing or incomplete.
   [junit4]   2> 987685 INFO  (closeThreadPool-697-thread-2) [    ] o.a.s.s.SolrDispatchFilter Using logger factory org.apache.logging.slf4j.Log4jLoggerFactory
   [junit4]   2> 987685 INFO  (closeThreadPool-697-thread-2) [    ] o.a.s.s.SolrDispatchFilter  ___      _       Welcome to Apache Solr? version 7.8.0
   [junit4]   2> 987685 INFO  (closeThreadPool-697-thread-2) [    ] o.a.s.s.SolrDispatchFilter / __| ___| |_ _   Starting in cloud mode on port null
   [junit4]   2> 987686 INFO  (closeThreadPool-697-thread-2) [    ] o.a.s.s.SolrDispatchFilter \__ \/ _ \ | '_|  Install dir: null
   [junit4]   2> 987686 INFO  (closeThreadPool-697-thread-2) [    ] o.a.s.s.SolrDispatchFilter |___/\___/_|_|    Start time: 2019-02-08T21:01:56.553Z
   [junit4]   2> 987688 INFO  (zkConnectionManagerCallback-701-thread-1) [    ] o.a.s.c.c.ConnectionManager zkClient has connected
   [junit4]   2> 987738 INFO  (closeThreadPool-697-thread-2) [    ] o.a.s.s.SolrDispatchFilter Loading solr.xml from SolrHome (not found in ZooKeeper)
   [junit4]   2> 987738 INFO  (closeThreadPool-697-thread-2) [    ] o.a.s.c.SolrXmlConfig Loading container configuration from /home/jenkins/jenkins-slave/workspace/Lucene-Solr-NightlyTests-7.x/checkout/solr/build/solr-core/test/J2/temp/solr.cloud.hdfs.HdfsUnloadDistributedZkTest_E637C0C68C28D8FD-001/shard-2-001/solr.xml
   [junit4]   2> 987905 INFO  (closeThreadPool-697-thread-2) [    ] o.a.s.c.SolrXmlConfig Configuration parameter autoReplicaFailoverWorkLoopDelay is ignored
   [junit4]   2> 987905 INFO  (closeThreadPool-697-thread-2) [    ] o.a.s.c.SolrXmlConfig Configuration parameter autoReplicaFailoverBadNodeExpiration is ignored
   [junit4]   2> 987906 INFO  (closeThreadPool-697-thread-2) [    ] o.a.s.c.SolrXmlConfig MBean server found: com.sun.jmx.mbeanserver.JmxMBeanServer@4567f35d, but no JMX reporters were configured - adding default JMX reporter.
   [junit4]   2> 987948 INFO  (closeThreadPool-697-thread-1) [    ] o.a.s.h.c.HttpShardHandlerFactory Host whitelist initialized: WhitelistHostChecker [whitelistHosts=null, whitelistHostCheckingEnabled=false]
   [junit4]   2> 988021 INFO  (closeThreadPool-697-thread-1) [    ] o.a.s.c.ZkContainer Zookeeper client=127.0.0.1:39315/solr
   [junit4]   2> 988402 INFO  (zkConnectionManagerCallback-705-thread-1) [    ] o.a.s.c.c.ConnectionManager zkClient has connected
   [junit4]   2> 988605 INFO  (zkConnectionManagerCallback-707-thread-1) [    ] o.a.s.c.c.ConnectionManager zkClient has connected
   [junit4]   2> 988616 INFO  (closeThreadPool-697-thread-1) [n:127.0.0.1:44669_u    ] o.a.s.c.c.ZkStateReader Updated live nodes from ZooKeeper... (0) -> (1)
   [junit4]   2> 988776 INFO  (closeThreadPool-697-thread-1) [n:127.0.0.1:44669_u    ] o.a.s.c.ZkController Publish node=127.0.0.1:44669_u as DOWN
   [junit4]   2> 988777 INFO  (closeThreadPool-697-thread-1) [n:127.0.0.1:44669_u    ] o.a.s.c.TransientSolrCoreCacheDefault Allocating transient cache for 4 transient cores
   [junit4]   2> 988777 INFO  (closeThreadPool-697-thread-1) [n:127.0.0.1:44669_u    ] o.a.s.c.ZkController Register node as live in ZooKeeper:/live_nodes/127.0.0.1:44669_u
   [junit4]   2> 988791 INFO  (zkCallback-684-thread-1) [    ] o.a.s.c.c.ZkStateReader Updated live nodes from ZooKeeper... (1) -> (2)
   [junit4]   2> 988793 INFO  (zkCallback-677-thread-3) [    ] o.a.s.c.c.ZkStateReader Updated live nodes from ZooKeeper... (1) -> (2)
   [junit4]   2> 988903 INFO  (zkCallback-695-thread-1) [    ] o.a.s.c.c.ZkStateReader Updated live nodes from ZooKeeper... (1) -> (2)
   [junit4]   2> 988988 INFO  (zkCallback-706-thread-1) [    ] o.a.s.c.c.ZkStateReader Updated live nodes from ZooKeeper... (1) -> (2)
   [junit4]   2> 989046 INFO  (zkConnectionManagerCallback-714-thread-1) [    ] o.a.s.c.c.ConnectionManager zkClient has connected
   [junit4]   2> 989059 INFO  (closeThreadPool-697-thread-1) [n:127.0.0.1:44669_u    ] o.a.s.c.c.ZkStateReader Updated live nodes from ZooKeeper... (0) -> (2)
   [junit4]   2> 989060 INFO  (closeThreadPool-697-thread-1) [n:127.0.0.1:44669_u    ] o.a.s.c.s.i.ZkClientClusterStateProvider Cluster at 127.0.0.1:39315/solr ready
   [junit4]   2> 989075 INFO  (closeThreadPool-697-thread-1) [n:127.0.0.1:44669_u    ] o.a.s.h.a.MetricsHistoryHandler No .system collection, keeping metrics history in memory.
   [junit4]   2> 989259 INFO  (closeThreadPool-697-thread-1) [n:127.0.0.1:44669_u    ] o.a.s.m.r.SolrJmxReporter JMX monitoring for 'solr.node' (registry 'solr.node') enabled at server: com.sun.jmx.mbeanserver.JmxMBeanServer@4567f35d
   [junit4]   2> 989441 INFO  (closeThreadPool-697-thread-1) [n:127.0.0.1:44669_u    ] o.a.s.m.r.SolrJmxReporter JMX monitoring for 'solr.jvm' (registry 'solr.jvm') enabled at server: com.sun.jmx.mbeanserver.JmxMBeanServer@4567f35d
   [junit4]   2> 989441 INFO  (closeThreadPool-697-thread-1) [n:127.0.0.1:44669_u    ] o.a.s.m.r.SolrJmxReporter JMX monitoring for 'solr.jetty' (registry 'solr.jetty') enabled at server: com.sun.jmx.mbeanserver.JmxMBeanServer@4567f35d
   [junit4]   2> 989443 INFO  (closeThreadPool-697-thread-1) [n:127.0.0.1:44669_u    ] o.a.s.c.CorePropertiesLocator Found 0 core definitions underneath /home/jenkins/jenkins-slave/workspace/Lucene-Solr-NightlyTests-7.x/checkout/solr/build/solr-core/test/J2/temp/solr.cloud.hdfs.HdfsUnloadDistributedZkTest_E637C0C68C28D8FD-001/shard-1-001/cores
   [junit4]   2> 989861 INFO  (closeThreadPool-697-thread-2) [    ] o.a.s.h.c.HttpShardHandlerFactory Host whitelist initialized: WhitelistHostChecker [whitelistHosts=null, whitelistHostCheckingEnabled=false]
   [junit4]   2> 990127 INFO  (closeThreadPool-697-thread-2) [    ] o.a.s.c.ZkContainer Zookeeper client=127.0.0.1:39315/solr
   [junit4]   2> 990237 INFO  (zkConnectionManagerCallback-719-thread-1) [    ] o.a.s.c.c.ConnectionManager zkClient has connected
   [junit4]   2> 990377 INFO  (TEST-HdfsUnloadDistributedZkTest.test-seed#[E637C0C68C28D8FD]) [    ] o.a.s.c.AbstractFullDistribZkTestBase create jetty 3 in directory /home/jenkins/jenkins-slave/workspace/Lucene-Solr-NightlyTests-7.x/checkout/solr/build/solr-core/test/J2/temp/solr.cloud.hdfs.HdfsUnloadDistributedZkTest_E637C0C68C28D8FD-001/shard-3-001 of type NRT
   [junit4]   2> 990377 WARN  (closeThreadPool-697-thread-1) [    ] o.e.j.s.AbstractConnector Ignoring deprecated socket close linger time
   [junit4]   2> 990378 INFO  (closeThreadPool-697-thread-1) [    ] o.a.s.c.s.e.JettySolrRunner Start Jetty (original configured port=0)
   [junit4]   2> 990378 INFO  (closeThreadPool-697-thread-1) [    ] o.a.s.c.s.e.JettySolrRunner Trying to start Jetty on port 0 try number 1 ...
   [junit4]   2> 990378 INFO  (closeThreadPool-697-thread-1) [    ] o.e.j.s.Server jetty-9.4.14.v20181114; built: 2018-11-14T21:20:31.478Z; git: c4550056e785fb5665914545889f21dc136ad9e6; jvm 1.8.0_191-b12
   [junit4]   2> 990387 INFO  (zkConnectionManagerCallback-721-thread-1) [    ] o.a.s.c.c.ConnectionManager zkClient has connected
   [junit4]   2> 990423 INFO  (closeThreadPool-697-thread-2) [n:127.0.0.1:39846_u    ] o.a.s.c.c.ZkStateReader Updated live nodes from ZooKeeper... (0) -> (2)
   [junit4]   2> 990454 INFO  (closeThreadPool-697-thread-2) [n:127.0.0.1:39846_u    ] o.a.s.c.ZkController Publish node=127.0.0.1:39846_u as DOWN
   [junit4]   2> 990454 INFO  (closeThreadPool-697-thread-2) [n:127.0.0.1:39846_u    ] o.a.s.c.TransientSolrCoreCacheDefault Allocating transient cache for 4 transient cores
   [junit4]   2> 990454 INFO  (closeThreadPool-697-thread-2) [n:127.0.0.1:39846_u    ] o.a.s.c.ZkController Register node as live in ZooKeeper:/live_nodes/127.0.0.1:39846_u
   [junit4]   2> 990474 INFO  (zkCallback-677-thread-3) [    ] o.a.s.c.c.ZkStateReader Updated live nodes from ZooKeeper... (2) -> (3)
   [junit4]   2> 990474 INFO  (zkCallback-684-thread-1) [    ] o.a.s.c.c.ZkStateReader Updated live nodes from ZooKeeper... (2) -> (3)
   [junit4]   2> 990474 INFO  (zkCallback-706-thread-1) [    ] o.a.s.c.c.ZkStateReader Updated live nodes from ZooKeeper... (2) -> (3)
   [junit4]   2> 990520 INFO  (closeThreadPool-697-thread-1) [    ] o.e.j.s.session DefaultSessionIdManager workerName=node0
   [junit4]   2> 990520 INFO  (closeThreadPool-697-thread-1) [    ] o.e.j.s.session No SessionScavenger set, using defaults
   [junit4]   2> 990520 INFO  (closeThreadPool-697-thread-1) [    ] o.e.j.s.session node0 Scavenging every 600000ms
   [junit4]   2> 990537 INFO  (closeThreadPool-697-thread-1) [    ] o.e.j.s.h.ContextHandler Started o.e.j.s.ServletContextHandler@73ccfedb{/u,null,AVAILABLE}
   [junit4]   2> 990538 INFO  (closeThreadPool-697-thread-1) [    ] o.e.j.s.AbstractConnector Started ServerConnector@c143e6c{HTTP/1.1,[http/1.1]}{127.0.0.1:37286}
   [junit4]   2> 990538 INFO  (closeThreadPool-697-thread-1) [    ] o.e.j.s.Server Started @990595ms
   [junit4]   2> 990538 INFO  (closeThreadPool-697-thread-1) [    ] o.a.s.c.s.e.JettySolrRunner Jetty properties: {solr.data.dir=hdfs://lucene2-us-west.apache.org:36517/hdfs__lucene2-us-west.apache.org_36517__home_jenkins_jenkins-slave_workspace_Lucene-Solr-NightlyTests-7.x_checkout_solr_build_solr-core_test_J2_temp_solr.cloud.hdfs.HdfsUnloadDistributedZkTest_E637C0C68C28D8FD-001_tempDir-002_jetty3, replicaType=NRT, solrconfig=solrconfig.xml, hostContext=/u, hostPort=37286, coreRootDirectory=/home/jenkins/jenkins-slave/workspace/Lucene-Solr-NightlyTests-7.x/checkout/solr/build/solr-core/test/J2/temp/solr.cloud.hdfs.HdfsUnloadDistributedZkTest_E637C0C68C28D8FD-001/shard-3-001/cores}
   [junit4]   2> 990538 ERROR (closeThreadPool-697-thread-1) [    ] o.a.s.u.StartupLoggingUtils Missing Java Option solr.log.dir. Logging may be missing or incomplete.
   [junit4]   2> 990538 INFO  (closeThreadPool-697-thread-1) [    ] o.a.s.s.SolrDispatchFilter Using logger factory org.apache.logging.slf4j.Log4jLoggerFactory
   [junit4]   2> 990538 INFO  (closeThreadPool-697-thread-1) [    ] o.a.s.s.SolrDispatchFilter  ___      _       Welcome to Apache Solr? version 7.8.0
   [junit4]   2> 990538 INFO  (closeThreadPool-697-thread-1) [    ] o.a.s.s.SolrDispatchFilter / __| ___| |_ _   Starting in cloud mode on port null
   [junit4]   2> 990538 INFO  (closeThreadPool-697-thread-1) [    ] o.a.s.s.SolrDispatchFilter \__ \/ _ \ | '_|  Install dir: null
   [junit4]   2> 990538 INFO  (closeThreadPool-697-thread-1) [    ] o.a.s.s.SolrDispatchFilter |___/\___/_|_|    Start time: 2019-02-08T21:01:59.405Z
   [junit4]   2> 990556 INFO  (zkConnectionManagerCallback-725-thread-1) [    ] o.a.s.c.c.ConnectionManager zkClient has connected
   [junit4]   2> 990569 INFO  (closeThreadPool-697-thread-1) [    ] o.a.s.s.SolrDispatchFilter Loading solr.xml from SolrHome (not found in ZooKeeper)
   [junit4]   2> 990569 INFO  (closeThreadPool-697-thread-1) [    ] o.a.s.c.SolrXmlConfig Loading container configuration from /home/jenkins/jenkins-slave/workspace/Lucene-Solr-NightlyTests-7.x/checkout/solr/build/solr-core/test/J2/temp/solr.cloud.hdfs.HdfsUnloadDistributedZkTest_E637C0C68C28D8FD-001/shard-3-001/solr.xml
   [junit4]   2> 990573 INFO  (closeThreadPool-697-thread-1) [    ] o.a.s.c.SolrXmlConfig Configuration parameter autoReplicaFailoverWorkLoopDelay is ignored
   [junit4]   2> 990573 INFO  (closeThreadPool-697-thread-1) [    ] o.a.s.c.SolrXmlConfig Configuration parameter autoReplicaFailoverBadNodeExpiration is ignored
   [junit4]   2> 990638 INFO  (zkCallback-695-thread-1) [    ] o.a.s.c.c.ZkStateReader Updated live nodes from ZooKeeper... (2) -> (3)
   [junit4]   2> 990643 INFO  (closeThreadPool-697-thread-1) [    ] o.a.s.c.SolrXmlConfig MBean server found: com.sun.jmx.mbeanserver.JmxMBeanServer@4567f35d, but no JMX reporters were configured - adding default JMX reporter.
   [junit4]   2> 990711 INFO  (zkCallback-713-thread-1) [    ] o.a.s.c.c.ZkStateReader Updated live nodes from ZooKeeper... (2) -> (3)
   [junit4]   2> 990716 INFO  (zkCallback-720-thread-1) [    ] o.a.s.c.c.ZkStateReader Updated live nodes from ZooKeeper... (2) -> (3)
   [junit4]   2> 990821 INFO  (zkConnectionManagerCallback-730-thread-1) [    ] o.a.s.c.c.ConnectionManager zkClient has connected
   [junit4]   2> 990822 INFO  (closeThreadPool-697-thread-2) [n:127.0.0.1:39846_u    ] o.a.s.c.c.ZkStateReader Updated live nodes from ZooKeeper... (0) -> (3)
   [junit4]   2> 990823 INFO  (closeThreadPool-697-thread-2) [n:127.0.0.1:39846_u    ] o.a.s.c.s.i.ZkClientClusterStateProvider Cluster at 127.0.0.1:39315/solr ready
   [junit4]   2> 990893 INFO  (closeThreadPool-697-thread-2) [n:127.0.0.1:39846_u    ] o.a.s.h.a.MetricsHistoryHandler No .system collection, keeping metrics history in memory.
   [junit4]   2> 991005 INFO  (closeThreadPool-697-thread-2) [n:127.0.0.1:39846_u    ] o.a.s.m.r.SolrJmxReporter JMX monitoring for 'solr.node' (registry 'solr.node') enabled at server: com.sun.jmx.mbeanserver.JmxMBeanServer@4567f35d
   [junit4]   2> 991113 INFO  (closeThreadPool-697-thread-2) [n:127.0.0.1:39846_u    ] o.a.s.m.r.SolrJmxReporter JMX monitoring for 'solr.jvm' (registry 'solr.jvm') enabled at server: com.sun.jmx.mbeanserver.JmxMBeanServer@4567f35d
   [junit4]   2> 991113 INFO  (closeThreadPool-697-thread-2) [n:127.0.0.1:39846_u    ] o.a.s.m.r.SolrJmxReporter JMX monitoring for 'solr.jetty' (registry 'solr.jetty') enabled at server: com.sun.jmx.mbeanserver.JmxMBeanServer@4567f35d
   [junit4]   2> 991114 INFO  (closeThreadPool-697-thread-2) [n:127.0.0.1:39846_u    ] o.a.s.c.CorePropertiesLocator Found 0 core definitions underneath /home/jenkins/jenkins-slave/workspace/Lucene-Solr-NightlyTests-7.x/checkout/solr/build/solr-core/test/J2/temp/solr.cloud.hdfs.HdfsUnloadDistributedZkTest_E637C0C68C28D8FD-001/shard-2-001/cores
   [junit4]   2> 992613 INFO  (closeThreadPool-697-thread-1) [    ] o.a.s.h.c.HttpShardHandlerFactory Host whitelist initialized: WhitelistHostChecker [whitelistHosts=null, whitelistHostCheckingEnabled=false]
   [junit4]   2> 992722 INFO  (closeThreadPool-697-thread-1) [    ] o.a.s.c.ZkContainer Zookeeper client=127.0.0.1:39315/solr
   [junit4]   2> 992742 INFO  (zkConnectionManagerCallback-735-thread-1) [    ] o.a.s.c.c.ConnectionManager zkClient has connected
   [junit4]   2> 992825 INFO  (TEST-HdfsUnloadDistributedZkTest.test-seed#[E637C0C68C28D8FD]) [    ] o.a.s.c.AbstractFullDistribZkTestBase create jetty 4 in directory /home/jenkins/jenkins-slave/workspace/Lucene-Solr-NightlyTests-7.x/checkout/solr/build/solr-core/test/J2/temp/solr.cloud.hdfs.HdfsUnloadDistributedZkTest_E637C0C68C28D8FD-001/shard-4-001 of type NRT
   [junit4]   2> 992825 WARN  (closeThreadPool-697-thread-2) [    ] o.e.j.s.AbstractConnector Ignoring deprecated socket close linger time
   [junit4]   2> 992826 INFO  (closeThreadPool-697-thread-2) [    ] o.a.s.c.s.e.JettySolrRunner Start Jetty (original configured port=0)
   [junit4]   2> 992826 INFO  (closeThreadPool-697-thread-2) [    ] o.a.s.c.s.e.JettySolrRunner Trying to start Jetty on port 0 try number 1 ...
   [junit4]   2> 992826 INFO  (closeThreadPool-697-thread-2) [    ] o.e.j.s.Server jetty-9.4.14.v20181114; built: 2018-11-14T21:20:31.478Z; git: c4550056e785fb5665914545889f21dc136ad9e6; jvm 1.8.0_191-b12
   [junit4]   2> 992846 INFO  (closeThreadPool-697-thread-2) [    ] o.e.j.s.session DefaultSessionIdManager workerName=node0
   [junit4]   2> 992846 INFO  (closeThreadPool-697-thread-2) [    ] o.e.j.s.session No SessionScavenger set, using defaults
   [junit4]   2> 992846 INFO  (closeThreadPool-697-thread-2) [    ] o.e.j.s.session node0 Scavenging every 600000ms
   [junit4]   2> 992859 INFO  (closeThreadPool-697-thread-2) [    ] o.e.j.s.h.ContextHandler Started o.e.j.s.ServletContextHandler@6886bb7e{/u,null,AVAILABLE}
   [junit4]   2> 992860 INFO  (closeThreadPool-697-thread-2) [    ] o.e.j.s.AbstractConnector Started ServerConnector@1b31a388{HTTP/1.1,[http/1.1]}{127.0.0.1:45328}
   [junit4]   2> 992860 INFO  (closeThreadPool-697-thread-2) [    ] o.e.j.s.Server Started @992917ms
   [junit4]   2> 992860 INFO  (closeThreadPool-697-thread-2) [    ] o.a.s.c.s.e.JettySolrRunner Jetty properties: {solr.data.dir=hdfs://lucene2-us-west.apache.org:36517/hdfs__lucene2-us-west.apache.org_36517__home_jenkins_jenkins-slave_workspace_Lucene-Solr-NightlyTests-7.x_checkout_solr_build_solr-core_test_J2_temp_solr.cloud.hdfs.HdfsUnloadDistributedZkTest_E637C0C68C28D8FD-001_tempDir-002_jetty4, replicaType=NRT, solrconfig=solrconfig.xml, hostContext=/u, hostPort=45328, coreRootDirectory=/home/jenkins/jenkins-slave/workspace/Lucene-Solr-NightlyTests-7.x/checkout/solr/build/solr-core/test/J2/temp/solr.cloud.hdfs.HdfsUnloadDistributedZkTest_E637C0C68C28D8FD-001/shard-4-001/cores}
   [junit4]   2> 992860 ERROR (closeThreadPool-697-thread-2) [    ] o.a.s.u.StartupLoggingUtils Missing Java Option solr.log.dir. Logging may be missing or incomplete.
   [junit4]   2> 992860 INFO  (closeThreadPool-697-thread-2) [    ] o.a.s.s.SolrDispatchFilter Using logger factory org.apache.logging.slf4j.Log4jLoggerFactory
   [junit4]   2> 992860 INFO  (closeThreadPool-697-thread-2) [    ] o.a.s.s.SolrDispatchFilter  ___      _       Welcome to Apache Solr? version 7.8.0
   [junit4]   2> 992860 INFO  (closeThreadPool-697-thread-2) [    ] o.a.s.s.SolrDispatchFilter / __| ___| |_ _   Starting in cloud mode on port null
   [junit4]   2> 992860 INFO  (closeThreadPool-697-thread-2) [    ] o.a.s.s.SolrDispatchFilter \__ \/ _ \ | '_|  Install dir: null
   [junit4]   2> 992861 INFO  (closeThreadPool-697-thread-2) [    ] o.a.s.s.SolrDispatchFilter |___/\___/_|_|    Start time: 2019-02-08T21:02:01.728Z
   [junit4]   2> 992879 INFO  (zkConnectionManagerCallback-737-thread-1) [    ] o.a.s.c.c.ConnectionManager zkClient has connected
   [junit4]   2> 992879 INFO  (zkConnectionManagerCallback-739-thread-1) [    ] o.a.s.c.c.ConnectionManager zkClient has connected
   [junit4]   2> 992880 INFO  (closeThreadPool-697-thread-2) [    ] o.a.s.s.SolrDispatchFilter Loading solr.xml from SolrHome (not found in ZooKeeper)
   [junit4]   2> 992880 INFO  (closeThreadPool-697-thread-2) [    ] o.a.s.c.SolrXmlConfig Loading container configuration from /home/jenkins/jenkins-slave/workspace/Lucene-Solr-NightlyTests-7.x/checkout/solr/build/solr-core/test/J2/temp/solr.cloud.hdfs.HdfsUnloadDistributedZkTest_E637C0C68C28D8FD-001/shard-4-001/solr.xml
   [junit4]   2> 992896 INFO  (closeThreadPool-697-thread-2) [    ] o.a.s.c.SolrXmlConfig Configuration parameter autoReplicaFailoverWorkLoopDelay is ignored
   [junit4]   2> 992896 INFO  (closeThreadPool-697-thread-2) [    ] o.a.s.c.SolrXmlConfig Configuration parameter autoReplicaFailoverBadNodeExpiration is ignored
   [junit4]   2> 992898 INFO  (closeThreadPool-697-thread-2) [    ] o.a.s.c.SolrXmlConfig MBean server found: com.sun.jmx.mbeanserver.JmxMBeanServer@4567f35d, but no JMX reporters were configured - adding default JMX reporter.
   [junit4]   2> 992935 INFO  (closeThreadPool-697-thread-1) [    ] o.a.s.c.c.ZkStateReader Updated live nodes from ZooKeeper... (0) -> (3)
   [junit4]   2> 992955 INFO  (closeThreadPool-697-thread-1) [    ] o.a.s.c.ZkController Publish node=127.0.0.1:37286_u as DOWN
   [junit4]   2> 992968 INFO  (closeThreadPool-697-thread-1) [    ] o.a.s.c.TransientSolrCoreCacheDefault Allocating transient cache for 4 transient cores
   [junit4]   2> 992969 INFO  (closeThreadPool-697-thread-1) [    ] o.a.s.c.ZkController Register node as live in ZooKeeper:/live_nodes/127.0.0.1:37286_u
   [junit4]   2> 992970 INFO  (zkCallback-677-thread-3) [    ] o.a.s.c.c.ZkStateReader Updated live nodes from ZooKeeper... (3) -> (4)
   [junit4]   2> 992977 INFO  (zkCallback-695-thread-1) [    ] o.a.s.c.c.ZkStateReader Updated live nodes from ZooKeeper... (3) -> (4)
   [junit4]   2> 992977 INFO  (zkCallback-684-thread-1) [    ] o.a.s.c.c.ZkStateReader Updated live nodes from ZooKeeper... (3) -> (4)
   [junit4]   2> 992977 INFO  (zkCallback-720-thread-1) [    ] o.a.s.c.c.ZkStateReader Updated live nodes from ZooKeeper... (3) -> (4)
   [junit4]   2> 993013 INFO  (zkCallback-729-thread-1) [    ] o.a.s.c.c.ZkStateReader Updated live nodes from ZooKeeper... (3) -> (4)
   [junit4]   2> 993017 INFO  (zkCallback-706-thread-1) [    ] o.a.s.c.c.ZkStateReader Updated live nodes from ZooKeeper... (3) -> (4)
   [junit4]   2> 993033 INFO  (zkCallback-713-thread-1) [    ] o.a.s.c.c.ZkStateReader Updated live nodes from ZooKeeper... (3) -> (4)
   [junit4]   2> 993070 INFO  (zkCallback-736-thread-1) [    ] o.a.s.c.c.ZkStateReader Updated live nodes from ZooKeeper... (3) -> (4)
   [junit4]   2> 993078 INFO  (zkConnectionManagerCallback-746-thread-1) [    ] o.a.s.c.c.ConnectionManager zkClient has connected
   [junit4]   2> 993086 INFO  (closeThreadPool-697-thread-1) [    ] o.a.s.c.c.ZkStateReader Updated live nodes from ZooKeeper... (0) -> (4)
   [junit4]   2> 993087 INFO  (closeThreadPool-697-thread-1) [    ] o.a.s.c.s.i.ZkClientClusterStateProvider Cluster at 127.0.0.1:39315/solr ready
   [junit4]   2> 993106 INFO  (closeThreadPool-697-thread-1) [    ] o.a.s.h.a.MetricsHistoryHandler No .system collection, keeping metrics history in memory.
   [junit4]   2> 993181 INFO  (closeThreadPool-697-thread-1) [    ] o.a.s.m.r.SolrJmxReporter JMX monitoring for 'solr.node' (registry 'solr.node') enabled at server: com.sun.jmx.mbeanserver.JmxMBeanServer@4567f35d
   [junit4]   2> 993232 INFO  (closeThreadPool-697-thread-1) [    ] o.a.s.m.r.SolrJmxReporter JMX monitoring for 'solr.jvm' (registry 'solr.jvm') enabled at server: com.sun.jmx.mbeanserver.JmxMBeanServer@4567f35d
   [junit4]   2> 993232 INFO  (closeThreadPool-697-thread-1) [    ] o.a.s.m.r.SolrJmxReporter JMX monitoring for 'solr.jetty' (registry 'solr.jetty') enabled at server: com.sun.jmx.mbeanserver.JmxMBeanServer@4567f35d
   [junit4]   2> 993233 INFO  (closeThreadPool-697-thread-1) [    ] o.a.s.c.CorePropertiesLocator Found 0 core definitions underneath /home/jenkins/jenkins-slave/workspace/Lucene-Solr-NightlyTests-7.x/checkout/solr/build/solr-core/test/J2/temp/solr.cloud.hdfs.HdfsUnloadDistributedZkTest_E637C0C68C28D8FD-001/shard-3-001/cores
   [junit4]   2> 994310 INFO  (closeThreadPool-697-thread-2) [    ] o.a.s.h.c.HttpShardHandlerFactory Host whitelist initialized: WhitelistHostChecker [whitelistHosts=null, whitelistHostCheckingEnabled=false]
   [junit4]   2> 994332 INFO  (closeThreadPool-697-thread-2) [    ] o.a.s.c.ZkContainer Zookeeper client=127.0.0.1:39315/solr
   [junit4]   2> 994333 INFO  (zkConnectionManagerCallback-751-thread-1) [    ] o.a.s.c.c.ConnectionManager zkClient has connected
   [junit4]   2> 994349 INFO  (zkConnectionManagerCallback-753-thread-1) [    ] o.a.s.c.c.ConnectionManager zkClient has connected
   [junit4]   2> 994369 INFO  (closeThreadPool-697-thread-2) [    ] o.a.s.c.c.ZkStateReader Updated live nodes from ZooKeeper... (0) -> (4)
   [junit4]   2> 994408 INFO  (closeThreadPool-697-thread-2) [    ] o.a.s.c.ZkController Publish node=127.0.0.1:45328_u as DOWN
   [junit4]   2> 994409 INFO  (closeThreadPool-697-thread-2) [    ] o.a.s.c.TransientSolrCoreCacheDefault Allocating transient cache for 4 transient cores
   [junit4]   2> 994409 INFO  (closeThreadPool-697-thread-2) [    ] o.a.s.c.ZkController Register node as live in ZooKeeper:/live_nodes/127.0.0.1:45328_u
   [junit4]   2> 994413 INFO  (zkCallback-706-thread-1) [    ] o.a.s.c.c.ZkStateReader Updated live nodes from ZooKeeper... (4) -> (5)
   [junit4]   2> 994431 INFO  (zkCallback-752-thread-1) [    ] o.a.s.c.c.ZkStateReader Updated live nodes from ZooKeeper... (4) -> (5)
   [junit4]   2> 994443 INFO  (zkCallback-677-thread-3) [    ] o.a.s.c.c.ZkStateReader Updated live nodes from ZooKeeper... (4) -> (5)
   [junit4]   2> 994456 INFO  (zkCallback-695-thread-1) [    ] o.a.s.c.c.ZkStateReader Updated live nodes from ZooKeeper... (4) -> (5)
   [junit4]   2> 994456 INFO  (zkCallback-684-thread-1) [    ] o.a.s.c.c.ZkStateReader Updated live nodes from ZooKeeper... (4) -> (5)
   [junit4]   2> 994456 INFO  (zkCallback-713-thread-1) [    ] o.a.s.c.c.ZkStateReader Updated live nodes from ZooKeeper... (4) -> (5)
   [junit4]   2> 994456 INFO  (zkCallback-720-thread-1) [    ] o.a.s.c.c.ZkStateReader Updated live nodes from ZooKeeper... (4) -> (5)
   [junit4]   2> 994461 INFO  (zkCallback-729-thread-1) [    ] o.a.s.c.c.ZkStateReader Updated live nodes from ZooKeeper... (4) -> (5)
   [junit4]   2> 994468 INFO  (zkCallback-745-thread-1) [    ] o.a.s.c.c.ZkStateReader Updated live nodes from ZooKeeper... (4) -> (5)
   [junit4]   2> 994468 INFO  (zkCallback-736-thread-1) [    ] o.a.s.c.c.ZkStateReader Updated live nodes from ZooKeeper... (4) -> (5)
   [junit4]   2> 994820 INFO  (zkConnectionManagerCallback-760-thread-1) [    ] o.a.s.c.c.ConnectionManager zkClient has connected
   [junit4]   2> 994821 INFO  (closeThreadPool-697-thread-2) [    ] o.a.s.c.c.ZkStateReader Updated live nodes from ZooKeeper... (0) -> (5)
   [junit4]   2> 994823 INFO  (closeThreadPool-697-thread-2) [    ] o.a.s.c.s.i.ZkClientClusterStateProvider Cluster at 127.0.0.1:39315/solr ready
   [junit4]   2> 994823 INFO  (closeThreadPool-697-thread-2) [    ] o.a.s.h.a.MetricsHistoryHandler No .system collection, keeping metrics history in memory.
   [junit4]   2> 994913 INFO  (closeThreadPool-697-thread-2) [    ] o.a.s.m.r.SolrJmxReporter JMX monitoring for 'solr.node' (registry 'solr.node') enabled at server: com.sun.jmx.mbeanserver.JmxMBeanServer@4567f35d
   [junit4]   2> 994969 INFO  (closeThreadPool-697-thread-2) [    ] o.a.s.m.r.SolrJmxReporter JMX monitoring for 'solr.jvm' (registry 'solr.jvm') enabled at server: com.sun.jmx.mbeanserver.JmxMBeanServer@4567f35d
   [junit4]   2> 994969 INFO  (closeThreadPool-697-thread-2) [    ] o.a.s.m.r.SolrJmxReporter JMX monitoring for 'solr.jetty' (registry 'solr.jetty') enabled at server: com.sun.jmx.mbeanserver.JmxMBeanServer@4567f35d
   [junit4]   2> 995003 INFO  (closeThreadPool-697-thread-2) [    ] o.a.s.c.CorePropertiesLocator Found 0 core definitions underneath /home/jenkins/jenkins-slave/workspace/Lucene-Solr-NightlyTests-7.x/checkout/solr/build/solr-core/test/J2/temp/solr.cloud.hdfs.HdfsUnloadDistributedZkTest_E637C0C68C28D8FD-001/shard-4-001/cores
   [junit4]   2> 995720 INFO  (qtp2047360687-5266) [n:127.0.0.1:37286_u    ] o.a.s.h.a.CollectionsHandler Invoked Collection Action :addreplica with params node=127.0.0.1:44669_u&action=ADDREPLICA&collection=collection1&shard=shard2&type=NRT&wt=javabin&version=2 and sendToOCPQueue=true
   [junit4]   2> 995736 INFO  (qtp2047360687-5265) [n:127.0.0.1:37286_u    ] o.a.s.h.a.CollectionsHandler Invoked Collection Action :addreplica with params node=127.0.0.1:39846_u&action=ADDREPLICA&collection=collection1&shard=shard1&type=NRT&wt=javabin&version=2 and sendToOCPQueue=true
   [junit4]   2> 995740 INFO  (qtp2047360687-5267) [n:127.0.0.1:37286_u    ] o.a.s.h.a.CollectionsHandler Invoked Collection Action :addreplica with params node=127.0.0.1:37286_u&action=ADDREPLICA&collection=collection1&shard=shard2&type=NRT&wt=javabin&version=2 and sendToOCPQueue=true
   [junit4]   2> 995744 INFO  (qtp2047360687-5268) [n:127.0.0.1:37286_u    ] o.a.s.h.a.CollectionsHandler Invoked Collection Action :addreplica with params node=127.0.0.1:45328_u&action=ADDREPLICA&collection=collection1&shard=shard1&type=NRT&wt=javabin&version=2 and sendToOCPQueue=true
   [junit4]   2> 995867 INFO  (qtp2047360687-5269) [n:127.0.0.1:37286_u    ] o.a.s.s.HttpSolrCall [admin] webapp=null path=/admin/metrics params={prefix=CONTAINER.fs.usableSpace,CONTAINER.fs.totalSpace,CORE.coreName&wt=javabin&version=2&group=solr.node,solr.core} status=0 QTime=0
   [junit4]   2> 995886 INFO  (qtp2047360687-5346) [n:127.0.0.1:37286_u    ] o.a.s.s.HttpSolrCall [admin] webapp=null path=/admin/metrics params={prefix=CONTAINER.fs.usableSpace,CONTAINER.fs.totalSpace,CORE.coreName&wt=javabin&version=2&group=solr.node,solr.core} status=0 QTime=0
   [junit4]   2> 995887 INFO  (qtp2047360687-5269) [n:127.0.0.1:37286_u    ] o.a.s.s.HttpSolrCall [admin] webapp=null path=/admin/metrics params={prefix=CONTAINER.fs.usableSpace,CONTAINER.fs.totalSpace,CORE.coreName&wt=javabin&version=2&group=solr.node,solr.core} status=0 QTime=0
   [junit4]   2> 995888 INFO  (qtp2047360687-5346) [n:127.0.0.1:37286_u    ] o.a.s.s.HttpSolrCall [admin] webapp=null path=/admin/metrics params={prefix=CONTAINER.fs.usableSpace,CONTAINER.fs.totalSpace,CORE.coreName&wt=javabin&version=2&group=solr.node,solr.core} status=0 QTime=0
   [junit4]   2> 995889 INFO  (qtp2047360687-5269) [n:127.0.0.1:37286_u    ] o.a.s.s.HttpSolrCall [admin] webapp=null path=/admin/metrics params={prefix=CONTAINER.fs.usableSpace,CONTAINER.fs.totalSpace,CORE.coreName&wt=javabin&version=2&group=solr.node,solr.core} status=0 QTime=0
   [junit4]   2> 995940 INFO  (qtp1036077143-5223) [n:127.0.0.1:39846_u    ] o.a.s.s.HttpSolrCall [admin] webapp=null path=/admin/metrics params={prefix=CONTAINER.fs.usableSpace,CONTAINER.fs.totalSpace,CORE.coreName&wt=javabin&version=2&group=solr.node,solr.core} status=0 QTime=0
   [junit4]   2> 995941 INFO  (qtp1036077143-5224) [n:127.0.0.1:39846_u    ] o.a.s.s.HttpSolrCall [admin] webapp=null path=/admin/metrics params={prefix=CONTAINER.fs.usableSpace,CONTAINER.fs.totalSpace,CORE.coreName&wt=javabin&version=2&group=solr.node,solr.core} status=0 QTime=0
   [junit4]   2> 995941 INFO  (qtp1036077143-5225) [n:127.0.0.1:39846_u    ] o.a.s.s.HttpSolrCall [admin] webapp=null path=/admin/metrics params={prefix=CONTAINER.fs.usableSpace,CONTAINER.fs.totalSpace,CORE.coreName&wt=javabin&version=2&group=solr.node,solr.core} status=0 QTime=0
   [junit4]   2> 995947 INFO  (qtp1036077143-5226) [n:127.0.0.1:39846_u    ] o.a.s.s.HttpSolrCall [admin] webapp=null path=/admin/metrics params={prefix=CONTAINER.fs.usableSpace,CONTAINER.fs.totalSpace,CORE.coreName&wt=javabin&version=2&group=solr.node,solr.core} status=0 QTime=0
   [junit4]   2> 995948 INFO  (qtp1036077143-5222) [n:127.0.0.1:39846_u    ] o.a.s.s.HttpSolrCall [admin] webapp=null path=/admin/metrics params={prefix=CONTAINER.fs.usableSpace,CONTAINER.fs.totalSpace,CORE.coreName&wt=javabin&version=2&group=solr.node,solr.core} status=0 QTime=0
   [junit4]   2> 996286 INFO  (qtp1621775445-5139) [n:127.0.0.1:43412_u    ] o.a.s.s.HttpSolrCall [admin] webapp=null path=/admin/metrics params={wt=javabin&version=2&key=solr.core.control_collection.shard1.replica_n1:INDEX.sizeInBytes} status=0 QTime=310
   [junit4]   2> 996324 INFO  (qtp1621775445-5138) [n:127.0.0.1:43412_u    ] o.a.s.s.HttpSolrCall [admin] webapp=null path=/admin/metrics params={wt=javabin&version=2&key=solr.core.control_collection.shard1.replica_n1:INDEX.sizeInBytes} status=0 QTime=32
   [junit4]   2> 996327 INFO  (qtp1621775445-5140) [n:127.0.0.1:43412_u    ] o.a.s.s.HttpSolrCall [admin] webapp=null path=/admin/metrics params={wt=javabin&version=2&key=solr.core.control_collection.shard1.replica_n1:INDEX.sizeInBytes} status=0 QTime=2
   [junit4]   2> 996342 INFO  (qtp1621775445-5141) [n:127.0.0.1:43412_u    ] o.a.s.s.HttpSolrCall [admin] webapp=null path=/admin/metrics params={prefix=CONTAINER.fs.usableSpace,CONTAINER.fs.totalSpace,CORE.coreName&wt=javabin&version=2&group=solr.node,solr.core} status=0 QTime=1
   [junit4]   2> 996343 INFO  (qtp1621775445-5142) [n:127.0.0.1:43412_u    ] o.a.s.s.HttpSolrCall [admin] webapp=null path=/admin/metrics params={prefix=CONTAINER.fs.usableSpace,CONTAINER.fs.totalSpace,CORE.coreName&wt=javabin&version=2&group=solr.node,solr.core} status=0 QTime=0
   [junit4]   2> 996378 INFO  (qtp1621775445-5139) [n:127.0.0.1:43412_u    ] o.a.s.s.HttpSolrCall [admin] webapp=null path=/admin/metrics params={prefix=CONTAINER.fs.usableSpace,CONTAINER.fs.totalSpace,CORE.coreName&wt=javabin&version=2&group=solr.node,solr.core} status=0 QTime=34
   [junit4]   2> 996396 INFO  (qtp1621775445-5139) [n:127.0.0.1:43412_u    ] o.a.s.s.HttpSolrCall [admin] webapp=null path=/admin/metrics params={prefix=CONTAINER.fs.usableSpace,CONTAINER.fs.totalSpace,CORE.coreName&wt=javabin&version=2&group=solr.node,solr.core} status=0 QTime=18
   [junit4]   2> 996397 INFO  (qtp1621775445-5139) [n:127.0.0.1:43412_u    ] o.a.s.s.HttpSolrCall [admin] webapp=null path=/admin/metrics params={prefix=CONTAINER.fs.usableSpace,CONTAINER.fs.totalSpace,CORE.coreName&wt=javabin&version=2&group=solr.node,solr.core} status=0 QTime=0
   [junit4]   2> 996450 INFO  (qtp1753129329-5210) [n:127.0.0.1:44669_u    ] o.a.s.s.HttpSolrCall [admin] webapp=null path=/admin/metrics params={prefix=CONTAINER.fs.usableSpace,CONTAINER.fs.totalSpace,CORE.coreName&wt=javabin&version=2&group=solr.node,solr.core} status=0 QTime=0
   [junit4]   2> 996451 INFO  (qtp1753129329-5211) [n:127.0.0.1:44669_u    ] o.a.s.s.HttpSolrCall [admin] webapp=null path=/admin/metrics params={prefix=CONTAINER.fs.usableSpace,CONTAINER.fs.totalSpace,CORE.coreName&wt=javabin&version=2&group=solr.node,solr.core} status=0 QTime=0
   [junit4]   2> 996453 INFO  (qtp1753129329-5212) [n:127.0.0.1:44669_u    ] o.a.s.s.HttpSolrCall [admin] webapp=null path=/admin/metrics params={prefix=CONTAINER.fs.usableSpace,CONTAINER.fs.totalSpace,CORE.coreName&wt=javabin&version=2&group=solr.node,solr.core} status=0 QTime=0
   [junit4]   2> 996470 INFO  (qtp1753129329-5212) [n:127.0.0.1:44669_u    ] o.a.s.s.HttpSolrCall [admin] webapp=null path=/admin/metrics params={prefix=CONTAINER.fs.usableSpace,CONTAINER.fs.totalSpace,CORE.coreName&wt=javabin&version=2&group=solr.node,solr.core} status=0 QTime=0
   [junit4]   2> 996471 INFO  (qtp1753129329-5212) [n:127.0.0.1:44669_u    ] o.a.s.s.HttpSolrCall [admin] webapp=null path=/admin/metrics params={prefix=CONTAINER.fs.usableSpace,CONTAINER.fs.totalSpace,CORE.coreName&wt=javabin&version=2&group=solr.node,solr.core} status=0 QTime=0
   [junit4]   2> 996486 INFO  (qtp1786161598-5298) [n:127.0.0.1:45328_u    ] o.a.s.s.HttpSolrCall [admin] webapp=null path=/admin/metrics params={prefix=CONTAINER.fs.usableSpace,CONTAINER.fs.totalSpace,CORE.coreName&wt=javabin&version=2&group=solr.node,solr.core} status=0 QTime=0
   [junit4]   2> 996487 INFO  (qtp1786161598-5299) [n:127.0.0.1:45328_u    ] o.a.s.s.HttpSolrCall [admin] webapp=null path=/admin/metrics params={prefix=CONTAINER.fs.usableSpace,CONTAINER.fs.totalSpace,CORE.coreName&wt=javabin&version=2&group=solr.node,solr.core} status=0 QTime=0
   [junit4]   2> 996488 INFO  (qtp1786161598-5300) [n:127.0.0.1:45328_u    ] o.a.s.s.HttpSolrCall [admin] webapp=null path=/admin/metrics params={prefix=CONTAINER.fs.usableSpace,CONTAINER.fs.totalSpace,CORE.coreName&wt=javabin&version=2&group=solr.node,solr.core} status=0 QTime=0
   [junit4]   2> 996489 INFO  (qtp1786161598-5301) [n:127.0.0.1:45328_u    ] o.a.s.s.HttpSolrCall [admin] webapp=null path=/admin/metrics params={prefix=CONTAINER.fs.usableSpace,CONTAINER.fs.totalSpace,CORE.coreName&wt=javabin&version=2&group=solr.node,solr.core} status=0 QTime=0
   [junit4]   2> 996543 INFO  (qtp1786161598-5297) [n:127.0.0.1:45328_u    ] o.a.s.s.HttpSolrCall [admin] webapp=null path=/admin/metrics params={prefix=CONTAINER.fs.usableSpace,CONTAINER.fs.totalSpace,CORE.coreName&wt=javabin&version=2&group=solr.node,solr.core} status=0 QTime=0
   [junit4]   2> 996580 INFO  (OverseerThreadFactory-1757-thread-3-processing-n:127.0.0.1:43412_u) [n:127.0.0.1:43412_u c:collection1 s:shard2  ] o.a.s.c.a.c.AddReplicaCmd Node Identified 127.0.0.1:44669_u for creating new replica of shard shard2 for collection collection1
   [junit4]   2> 996632 INFO  (OverseerThreadFactory-1757-thread-4-processing-n:127.0.0.1:43412_u) [n:127.0.0.1:43412_u c:collection1 s:shard1  ] o.a.s.c.a.c.AddReplicaCmd Node Identified 127.0.0.1:39846_u for creating new replica of shard shard1 for collection collection1
   [junit4]   2> 996688 INFO  (OverseerThreadFactory-1757-thread-3-processing-n:127.0.0.1:43412_u) [n:127.0.0.1:43412_u c:collection1 s:shard2  ] o.a.s.c.a.c.AddReplicaCmd Returning CreateReplica command.
   [junit4]   2> 996725 INFO  (OverseerThreadFactory-1757-thread-4-processing-n:127.0.0.1:43412_u) [n:127.0.0.1:43412_u c:collection1 s:shard1  ] o.a.s.c.a.c.AddReplicaCmd Returning CreateReplica command.
   [junit4]   2> 996741 INFO  (qtp1753129329-5209) [n:127.0.0.1:44669_u    x:collection1_shard2_replica_n1] o.a.s.h.a.CoreAdminOperation core create command qt=/admin/cores&collection.configName=conf1&name=collection1_shard2_replica_n1&action=CREATE&collection=collection1&shard=shard2&wt=javabin&version=2&replicaType=NRT
   [junit4]   2> 996763 INFO  (qtp1036077143-5224) [n:127.0.0.1:39846_u    x:collection1_shard1_replica_n2] o.a.s.h.a.CoreAdminOperation core create command qt=/admin/cores&collection.configName=conf1&name=collection1_shard1_replica_n2&action=CREATE&collection=collection1&shard=shard1&wt=javabin&version=2&replicaType=NRT
   [junit4]   2> 998090 INFO  (qtp1036077143-5224) [n:127.0.0.1:39846_u c:collection1 s:shard1  x:collection1_shard1_replica_n2] o.a.s.c.SolrConfig Using Lucene MatchVersion: 7.8.0
   [junit4]   2> 998143 INFO  (qtp1753129329-5209) [n:127.0.0.1:44669_u c:collection1 s:shard2  x:collection1_shard2_replica_n1] o.a.s.c.SolrConfig Using Lucene MatchVersion: 7.8.0
   [junit4]   2> 998523 INFO  (qtp1753129329-5209) [n:127.0.0.1:44669_u c:collection1 s:shard2  x:collection1_shard2_replica_n1] o.a.s.s.IndexSchema [collection1_shard2_replica_n1] Schema name=test
   [junit4]   2> 998540 INFO  (qtp1036077143-5224) [n:127.0.0.1:39846_u c:collection1 s:shard1  x:collection1_shard1_replica_n2] o.a.s.s.IndexSchema [collection1_shard1_replica_n2] Schema name=test
   [junit4]   2> 999866 INFO  (qtp1753129329-5209) [n:127.0.0.1:44669_u c:collection1 s:shard2  x:collection1_shard2_repli

[...truncated too long message...]

source] Do not set property disallowed.ivy.jars.list as its length is 0.

-ivy-fail-disallowed-ivy-version:

ivy-fail:

ivy-configure:
[ivy:configure] :: loading settings :: file = /home/jenkins/jenkins-slave/workspace/Lucene-Solr-NightlyTests-7.x/checkout/lucene/top-level-ivy-settings.xml

resolve:

ivy-availability-check:
[loadresource] Do not set property disallowed.ivy.jars.list as its length is 0.

-ivy-fail-disallowed-ivy-version:

ivy-fail:

ivy-fail:

ivy-configure:
[ivy:configure] :: loading settings :: file = /home/jenkins/jenkins-slave/workspace/Lucene-Solr-NightlyTests-7.x/checkout/lucene/top-level-ivy-settings.xml

resolve:

ivy-availability-check:
[loadresource] Do not set property disallowed.ivy.jars.list as its length is 0.

-ivy-fail-disallowed-ivy-version:

ivy-fail:

ivy-configure:
[ivy:configure] :: loading settings :: file = /home/jenkins/jenkins-slave/workspace/Lucene-Solr-NightlyTests-7.x/checkout/lucene/top-level-ivy-settings.xml

resolve:

ivy-availability-check:
[loadresource] Do not set property disallowed.ivy.jars.list as its length is 0.

-ivy-fail-disallowed-ivy-version:

ivy-fail:

ivy-fail:

ivy-configure:
[ivy:configure] :: loading settings :: file = /home/jenkins/jenkins-slave/workspace/Lucene-Solr-NightlyTests-7.x/checkout/lucene/top-level-ivy-settings.xml

resolve:

ivy-availability-check:
[loadresource] Do not set property disallowed.ivy.jars.list as its length is 0.

-ivy-fail-disallowed-ivy-version:

ivy-fail:

ivy-fail:

ivy-configure:
[ivy:configure] :: loading settings :: file = /home/jenkins/jenkins-slave/workspace/Lucene-Solr-NightlyTests-7.x/checkout/lucene/top-level-ivy-settings.xml

resolve:

ivy-availability-check:
[loadresource] Do not set property disallowed.ivy.jars.list as its length is 0.

-ivy-fail-disallowed-ivy-version:

ivy-fail:

ivy-fail:

ivy-configure:
[ivy:configure] :: loading settings :: file = /home/jenkins/jenkins-slave/workspace/Lucene-Solr-NightlyTests-7.x/checkout/lucene/top-level-ivy-settings.xml

resolve:

ivy-availability-check:
[loadresource] Do not set property disallowed.ivy.jars.list as its length is 0.

-ivy-fail-disallowed-ivy-version:

ivy-fail:

ivy-fail:

ivy-configure:
[ivy:configure] :: loading settings :: file = /home/jenkins/jenkins-slave/workspace/Lucene-Solr-NightlyTests-7.x/checkout/lucene/top-level-ivy-settings.xml

resolve:

ivy-availability-check:
[loadresource] Do not set property disallowed.ivy.jars.list as its length is 0.

-ivy-fail-disallowed-ivy-version:

ivy-fail:

ivy-fail:

ivy-configure:
[ivy:configure] :: loading settings :: file = /home/jenkins/jenkins-slave/workspace/Lucene-Solr-NightlyTests-7.x/checkout/lucene/top-level-ivy-settings.xml

resolve:

ivy-availability-check:
[loadresource] Do not set property disallowed.ivy.jars.list as its length is 0.

-ivy-fail-disallowed-ivy-version:

ivy-fail:

ivy-fail:

ivy-configure:
[ivy:configure] :: loading settings :: file = /home/jenkins/jenkins-slave/workspace/Lucene-Solr-NightlyTests-7.x/checkout/lucene/top-level-ivy-settings.xml

resolve:

ivy-availability-check:
[loadresource] Do not set property disallowed.ivy.jars.list as its length is 0.

-ivy-fail-disallowed-ivy-version:

ivy-fail:

ivy-fail:

ivy-configure:
[ivy:configure] :: loading settings :: file = /home/jenkins/jenkins-slave/workspace/Lucene-Solr-NightlyTests-7.x/checkout/lucene/top-level-ivy-settings.xml

resolve:

ivy-availability-check:
[loadresource] Do not set property disallowed.ivy.jars.list as its length is 0.

-ivy-fail-disallowed-ivy-version:

ivy-fail:

ivy-fail:

ivy-configure:
[ivy:configure] :: loading settings :: file = /home/jenkins/jenkins-slave/workspace/Lucene-Solr-NightlyTests-7.x/checkout/lucene/top-level-ivy-settings.xml

resolve:

ivy-availability-check:
[loadresource] Do not set property disallowed.ivy.jars.list as its length is 0.

-ivy-fail-disallowed-ivy-version:

ivy-fail:

ivy-fail:

ivy-configure:
[ivy:configure] :: loading settings :: file = /home/jenkins/jenkins-slave/workspace/Lucene-Solr-NightlyTests-7.x/checkout/lucene/top-level-ivy-settings.xml

resolve:

ivy-availability-check:
[loadresource] Do not set property disallowed.ivy.jars.list as its length is 0.

-ivy-fail-disallowed-ivy-version:

ivy-fail:

ivy-fail:

ivy-configure:
[ivy:configure] :: loading settings :: file = /home/jenkins/jenkins-slave/workspace/Lucene-Solr-NightlyTests-7.x/checkout/lucene/top-level-ivy-settings.xml

resolve:

jar-checksums:
    [mkdir] Created dir: /home/jenkins/jenkins-slave/workspace/Lucene-Solr-NightlyTests-7.x/checkout/solr/null148260687
     [copy] Copying 242 files to /home/jenkins/jenkins-slave/workspace/Lucene-Solr-NightlyTests-7.x/checkout/solr/null148260687
   [delete] Deleting directory /home/jenkins/jenkins-slave/workspace/Lucene-Solr-NightlyTests-7.x/checkout/solr/null148260687

check-working-copy:
[ivy:cachepath] :: resolving dependencies :: org.eclipse.jgit#org.eclipse.jgit-caller;working
[ivy:cachepath] 	confs: [default]
[ivy:cachepath] 	found org.eclipse.jgit#org.eclipse.jgit;4.6.0.201612231935-r in public
[ivy:cachepath] 	found com.jcraft#jsch;0.1.53 in public
[ivy:cachepath] 	found com.googlecode.javaewah#JavaEWAH;1.1.6 in public
[ivy:cachepath] 	found org.apache.httpcomponents#httpclient;4.3.6 in public
[ivy:cachepath] 	found org.apache.httpcomponents#httpcore;4.3.3 in public
[ivy:cachepath] 	found commons-logging#commons-logging;1.1.3 in public
[ivy:cachepath] 	found commons-codec#commons-codec;1.6 in public
[ivy:cachepath] 	found org.slf4j#slf4j-api;1.7.2 in public
[ivy:cachepath] :: resolution report :: resolve 134ms :: artifacts dl 3ms
	---------------------------------------------------------------------
	|                  |            modules            ||   artifacts   |
	|       conf       | number| search|dwnlded|evicted|| number|dwnlded|
	---------------------------------------------------------------------
	|      default     |   8   |   0   |   0   |   0   ||   8   |   0   |
	---------------------------------------------------------------------
[wc-checker] Initializing working copy...
[wc-checker] SLF4J: Failed to load class "org.slf4j.impl.StaticLoggerBinder".
[wc-checker] SLF4J: Defaulting to no-operation (NOP) logger implementation
[wc-checker] SLF4J: See http://www.slf4j.org/codes.html#StaticLoggerBinder for further details.
[wc-checker] Checking working copy status...

-jenkins-base:

BUILD SUCCESSFUL
Total time: 466 minutes 7 seconds
Archiving artifacts
java.lang.InterruptedException: no matches found within 10000
	at hudson.FilePath$ValidateAntFileMask.hasMatch(FilePath.java:2847)
	at hudson.FilePath$ValidateAntFileMask.invoke(FilePath.java:2726)
	at hudson.FilePath$ValidateAntFileMask.invoke(FilePath.java:2707)
	at hudson.FilePath$FileCallableWrapper.call(FilePath.java:3086)
Also:   hudson.remoting.Channel$CallSiteStackTrace: Remote call to lucene2
		at hudson.remoting.Channel.attachCallSiteStackTrace(Channel.java:1741)
		at hudson.remoting.UserRequest$ExceptionResponse.retrieve(UserRequest.java:357)
		at hudson.remoting.Channel.call(Channel.java:955)
		at hudson.FilePath.act(FilePath.java:1072)
		at hudson.FilePath.act(FilePath.java:1061)
		at hudson.FilePath.validateAntFileMask(FilePath.java:2705)
		at hudson.tasks.ArtifactArchiver.perform(ArtifactArchiver.java:243)
		at hudson.tasks.BuildStepCompatibilityLayer.perform(BuildStepCompatibilityLayer.java:81)
		at hudson.tasks.BuildStepMonitor$1.perform(BuildStepMonitor.java:20)
		at hudson.model.AbstractBuild$AbstractBuildExecution.perform(AbstractBuild.java:744)
		at hudson.model.AbstractBuild$AbstractBuildExecution.performAllBuildSteps(AbstractBuild.java:690)
		at hudson.model.Build$BuildExecution.post2(Build.java:186)
		at hudson.model.AbstractBuild$AbstractBuildExecution.post(AbstractBuild.java:635)
		at hudson.model.Run.execute(Run.java:1835)
		at hudson.model.FreeStyleBuild.run(FreeStyleBuild.java:43)
		at hudson.model.ResourceController.execute(ResourceController.java:97)
		at hudson.model.Executor.run(Executor.java:429)
Caused: hudson.FilePath$TunneledInterruptedException
	at hudson.FilePath$FileCallableWrapper.call(FilePath.java:3088)
	at hudson.remoting.UserRequest.perform(UserRequest.java:212)
	at hudson.remoting.UserRequest.perform(UserRequest.java:54)
	at hudson.remoting.Request$2.run(Request.java:369)
	at hudson.remoting.InterceptingExecutorService$1.call(InterceptingExecutorService.java:72)
	at java.util.concurrent.FutureTask.run(FutureTask.java:266)
	at java.util.concurrent.ThreadPoolExecutor.runWorker(ThreadPoolExecutor.java:1142)
	at java.util.concurrent.ThreadPoolExecutor$Worker.run(ThreadPoolExecutor.java:617)
	at java.lang.Thread.run(Thread.java:748)
Caused: java.lang.InterruptedException: java.lang.InterruptedException: no matches found within 10000
	at hudson.FilePath.act(FilePath.java:1074)
	at hudson.FilePath.act(FilePath.java:1061)
	at hudson.FilePath.validateAntFileMask(FilePath.java:2705)
	at hudson.tasks.ArtifactArchiver.perform(ArtifactArchiver.java:243)
	at hudson.tasks.BuildStepCompatibilityLayer.perform(BuildStepCompatibilityLayer.java:81)
	at hudson.tasks.BuildStepMonitor$1.perform(BuildStepMonitor.java:20)
	at hudson.model.AbstractBuild$AbstractBuildExecution.perform(AbstractBuild.java:744)
	at hudson.model.AbstractBuild$AbstractBuildExecution.performAllBuildSteps(AbstractBuild.java:690)
	at hudson.model.Build$BuildExecution.post2(Build.java:186)
	at hudson.model.AbstractBuild$AbstractBuildExecution.post(AbstractBuild.java:635)
	at hudson.model.Run.execute(Run.java:1835)
	at hudson.model.FreeStyleBuild.run(FreeStyleBuild.java:43)
	at hudson.model.ResourceController.execute(ResourceController.java:97)
	at hudson.model.Executor.run(Executor.java:429)
No artifacts found that match the file pattern "**/*.events,heapdumps/**,**/hs_err_pid*". Configuration error?
Recording test results
Build step 'Publish JUnit test result report' changed build result to UNSTABLE
Email was triggered for: Unstable (Test Failures)
Sending email for trigger: Unstable (Test Failures)

Mime
View raw message