lucene-dev mailing list archives

Site index · List index
Message view « Date » · « Thread »
Top « Date » · « Thread »
From Apache Jenkins Server <jenk...@builds.apache.org>
Subject [JENKINS] Lucene-Solr-BadApples-Tests-master - Build # 277 - Unstable
Date Tue, 05 Feb 2019 15:15:20 GMT
Build: https://builds.apache.org/job/Lucene-Solr-BadApples-Tests-master/277/

4 tests failed.
FAILED:  org.apache.solr.cloud.autoscaling.AutoScalingHandlerTest.testReadApi

Error Message:
expected:<2> but was:<3>

Stack Trace:
java.lang.AssertionError: expected:<2> but was:<3>
	at __randomizedtesting.SeedInfo.seed([D30EE5D0FE466D69:84271E6525B48F72]:0)
	at org.junit.Assert.fail(Assert.java:88)
	at org.junit.Assert.failNotEquals(Assert.java:834)
	at org.junit.Assert.assertEquals(Assert.java:645)
	at org.junit.Assert.assertEquals(Assert.java:631)
	at org.apache.solr.cloud.autoscaling.AutoScalingHandlerTest.testReadApi(AutoScalingHandlerTest.java:822)
	at sun.reflect.NativeMethodAccessorImpl.invoke0(Native Method)
	at sun.reflect.NativeMethodAccessorImpl.invoke(NativeMethodAccessorImpl.java:62)
	at sun.reflect.DelegatingMethodAccessorImpl.invoke(DelegatingMethodAccessorImpl.java:43)
	at java.lang.reflect.Method.invoke(Method.java:498)
	at com.carrotsearch.randomizedtesting.RandomizedRunner.invoke(RandomizedRunner.java:1750)
	at com.carrotsearch.randomizedtesting.RandomizedRunner$8.evaluate(RandomizedRunner.java:938)
	at com.carrotsearch.randomizedtesting.RandomizedRunner$9.evaluate(RandomizedRunner.java:974)
	at com.carrotsearch.randomizedtesting.RandomizedRunner$10.evaluate(RandomizedRunner.java:988)
	at com.carrotsearch.randomizedtesting.rules.SystemPropertiesRestoreRule$1.evaluate(SystemPropertiesRestoreRule.java:57)
	at org.apache.lucene.util.TestRuleSetupTeardownChained$1.evaluate(TestRuleSetupTeardownChained.java:49)
	at org.apache.lucene.util.AbstractBeforeAfterRule$1.evaluate(AbstractBeforeAfterRule.java:45)
	at org.apache.lucene.util.TestRuleThreadAndTestName$1.evaluate(TestRuleThreadAndTestName.java:48)
	at org.apache.lucene.util.TestRuleIgnoreAfterMaxFailures$1.evaluate(TestRuleIgnoreAfterMaxFailures.java:64)
	at org.apache.lucene.util.TestRuleMarkFailure$1.evaluate(TestRuleMarkFailure.java:47)
	at com.carrotsearch.randomizedtesting.rules.StatementAdapter.evaluate(StatementAdapter.java:36)
	at com.carrotsearch.randomizedtesting.ThreadLeakControl$StatementRunner.run(ThreadLeakControl.java:368)
	at com.carrotsearch.randomizedtesting.ThreadLeakControl.forkTimeoutingTask(ThreadLeakControl.java:817)
	at com.carrotsearch.randomizedtesting.ThreadLeakControl$3.evaluate(ThreadLeakControl.java:468)
	at com.carrotsearch.randomizedtesting.RandomizedRunner.runSingleTest(RandomizedRunner.java:947)
	at com.carrotsearch.randomizedtesting.RandomizedRunner$5.evaluate(RandomizedRunner.java:832)
	at com.carrotsearch.randomizedtesting.RandomizedRunner$6.evaluate(RandomizedRunner.java:883)
	at com.carrotsearch.randomizedtesting.RandomizedRunner$7.evaluate(RandomizedRunner.java:894)
	at com.carrotsearch.randomizedtesting.rules.StatementAdapter.evaluate(StatementAdapter.java:36)
	at com.carrotsearch.randomizedtesting.rules.SystemPropertiesRestoreRule$1.evaluate(SystemPropertiesRestoreRule.java:57)
	at org.apache.lucene.util.AbstractBeforeAfterRule$1.evaluate(AbstractBeforeAfterRule.java:45)
	at com.carrotsearch.randomizedtesting.rules.StatementAdapter.evaluate(StatementAdapter.java:36)
	at org.apache.lucene.util.TestRuleStoreClassName$1.evaluate(TestRuleStoreClassName.java:41)
	at com.carrotsearch.randomizedtesting.rules.NoShadowingOrOverridesOnMethodsRule$1.evaluate(NoShadowingOrOverridesOnMethodsRule.java:40)
	at com.carrotsearch.randomizedtesting.rules.NoShadowingOrOverridesOnMethodsRule$1.evaluate(NoShadowingOrOverridesOnMethodsRule.java:40)
	at com.carrotsearch.randomizedtesting.rules.StatementAdapter.evaluate(StatementAdapter.java:36)
	at com.carrotsearch.randomizedtesting.rules.StatementAdapter.evaluate(StatementAdapter.java:36)
	at com.carrotsearch.randomizedtesting.rules.StatementAdapter.evaluate(StatementAdapter.java:36)
	at org.apache.lucene.util.TestRuleAssertionsRequired$1.evaluate(TestRuleAssertionsRequired.java:53)
	at org.apache.lucene.util.TestRuleMarkFailure$1.evaluate(TestRuleMarkFailure.java:47)
	at org.apache.lucene.util.TestRuleIgnoreAfterMaxFailures$1.evaluate(TestRuleIgnoreAfterMaxFailures.java:64)
	at org.apache.lucene.util.TestRuleIgnoreTestSuites$1.evaluate(TestRuleIgnoreTestSuites.java:54)
	at com.carrotsearch.randomizedtesting.rules.StatementAdapter.evaluate(StatementAdapter.java:36)
	at com.carrotsearch.randomizedtesting.ThreadLeakControl$StatementRunner.run(ThreadLeakControl.java:368)
	at java.lang.Thread.run(Thread.java:748)


FAILED:  org.apache.solr.cloud.autoscaling.sim.TestSimExtremeIndexing.testScaleUp

Error Message:
{numFound=975200000,start=0,docs=[]} expected:<1000000000> but was:<975200000>

Stack Trace:
java.lang.AssertionError: {numFound=975200000,start=0,docs=[]} expected:<1000000000> but was:<975200000>
	at __randomizedtesting.SeedInfo.seed([D30EE5D0FE466D69:F250A372F268B3C8]:0)
	at org.junit.Assert.fail(Assert.java:88)
	at org.junit.Assert.failNotEquals(Assert.java:834)
	at org.junit.Assert.assertEquals(Assert.java:645)
	at org.apache.solr.cloud.autoscaling.sim.TestSimExtremeIndexing.testScaleUp(TestSimExtremeIndexing.java:135)
	at sun.reflect.NativeMethodAccessorImpl.invoke0(Native Method)
	at sun.reflect.NativeMethodAccessorImpl.invoke(NativeMethodAccessorImpl.java:62)
	at sun.reflect.DelegatingMethodAccessorImpl.invoke(DelegatingMethodAccessorImpl.java:43)
	at java.lang.reflect.Method.invoke(Method.java:498)
	at com.carrotsearch.randomizedtesting.RandomizedRunner.invoke(RandomizedRunner.java:1750)
	at com.carrotsearch.randomizedtesting.RandomizedRunner$8.evaluate(RandomizedRunner.java:938)
	at com.carrotsearch.randomizedtesting.RandomizedRunner$9.evaluate(RandomizedRunner.java:974)
	at com.carrotsearch.randomizedtesting.RandomizedRunner$10.evaluate(RandomizedRunner.java:988)
	at com.carrotsearch.randomizedtesting.rules.SystemPropertiesRestoreRule$1.evaluate(SystemPropertiesRestoreRule.java:57)
	at org.apache.lucene.util.TestRuleSetupTeardownChained$1.evaluate(TestRuleSetupTeardownChained.java:49)
	at org.apache.lucene.util.AbstractBeforeAfterRule$1.evaluate(AbstractBeforeAfterRule.java:45)
	at org.apache.lucene.util.TestRuleThreadAndTestName$1.evaluate(TestRuleThreadAndTestName.java:48)
	at org.apache.lucene.util.TestRuleIgnoreAfterMaxFailures$1.evaluate(TestRuleIgnoreAfterMaxFailures.java:64)
	at org.apache.lucene.util.TestRuleMarkFailure$1.evaluate(TestRuleMarkFailure.java:47)
	at com.carrotsearch.randomizedtesting.rules.StatementAdapter.evaluate(StatementAdapter.java:36)
	at com.carrotsearch.randomizedtesting.ThreadLeakControl$StatementRunner.run(ThreadLeakControl.java:368)
	at com.carrotsearch.randomizedtesting.ThreadLeakControl.forkTimeoutingTask(ThreadLeakControl.java:817)
	at com.carrotsearch.randomizedtesting.ThreadLeakControl$3.evaluate(ThreadLeakControl.java:468)
	at com.carrotsearch.randomizedtesting.RandomizedRunner.runSingleTest(RandomizedRunner.java:947)
	at com.carrotsearch.randomizedtesting.RandomizedRunner$5.evaluate(RandomizedRunner.java:832)
	at com.carrotsearch.randomizedtesting.RandomizedRunner$6.evaluate(RandomizedRunner.java:883)
	at com.carrotsearch.randomizedtesting.RandomizedRunner$7.evaluate(RandomizedRunner.java:894)
	at com.carrotsearch.randomizedtesting.rules.StatementAdapter.evaluate(StatementAdapter.java:36)
	at com.carrotsearch.randomizedtesting.rules.SystemPropertiesRestoreRule$1.evaluate(SystemPropertiesRestoreRule.java:57)
	at org.apache.lucene.util.AbstractBeforeAfterRule$1.evaluate(AbstractBeforeAfterRule.java:45)
	at com.carrotsearch.randomizedtesting.rules.StatementAdapter.evaluate(StatementAdapter.java:36)
	at org.apache.lucene.util.TestRuleStoreClassName$1.evaluate(TestRuleStoreClassName.java:41)
	at com.carrotsearch.randomizedtesting.rules.NoShadowingOrOverridesOnMethodsRule$1.evaluate(NoShadowingOrOverridesOnMethodsRule.java:40)
	at com.carrotsearch.randomizedtesting.rules.NoShadowingOrOverridesOnMethodsRule$1.evaluate(NoShadowingOrOverridesOnMethodsRule.java:40)
	at com.carrotsearch.randomizedtesting.rules.StatementAdapter.evaluate(StatementAdapter.java:36)
	at com.carrotsearch.randomizedtesting.rules.StatementAdapter.evaluate(StatementAdapter.java:36)
	at com.carrotsearch.randomizedtesting.rules.StatementAdapter.evaluate(StatementAdapter.java:36)
	at org.apache.lucene.util.TestRuleAssertionsRequired$1.evaluate(TestRuleAssertionsRequired.java:53)
	at org.apache.lucene.util.TestRuleMarkFailure$1.evaluate(TestRuleMarkFailure.java:47)
	at org.apache.lucene.util.TestRuleIgnoreAfterMaxFailures$1.evaluate(TestRuleIgnoreAfterMaxFailures.java:64)
	at org.apache.lucene.util.TestRuleIgnoreTestSuites$1.evaluate(TestRuleIgnoreTestSuites.java:54)
	at com.carrotsearch.randomizedtesting.rules.StatementAdapter.evaluate(StatementAdapter.java:36)
	at com.carrotsearch.randomizedtesting.ThreadLeakControl$StatementRunner.run(ThreadLeakControl.java:368)
	at java.lang.Thread.run(Thread.java:748)


FAILED:  org.apache.solr.handler.component.TestDistributedStatsComponentCardinality.test

Error Message:
.responseHeader.status:200!=0

Stack Trace:
junit.framework.AssertionFailedError: .responseHeader.status:200!=0
	at __randomizedtesting.SeedInfo.seed([D30EE5D0FE466D69:5B5ADA0A50BA0091]:0)
	at junit.framework.Assert.fail(Assert.java:57)
	at org.apache.solr.BaseDistributedSearchTestCase.compareSolrResponses(BaseDistributedSearchTestCase.java:999)
	at org.apache.solr.BaseDistributedSearchTestCase.compareResponses(BaseDistributedSearchTestCase.java:1026)
	at org.apache.solr.BaseDistributedSearchTestCase.query(BaseDistributedSearchTestCase.java:680)
	at org.apache.solr.BaseDistributedSearchTestCase.query(BaseDistributedSearchTestCase.java:643)
	at org.apache.solr.handler.component.TestDistributedStatsComponentCardinality.test(TestDistributedStatsComponentCardinality.java:191)
	at sun.reflect.NativeMethodAccessorImpl.invoke0(Native Method)
	at sun.reflect.NativeMethodAccessorImpl.invoke(NativeMethodAccessorImpl.java:62)
	at sun.reflect.DelegatingMethodAccessorImpl.invoke(DelegatingMethodAccessorImpl.java:43)
	at java.lang.reflect.Method.invoke(Method.java:498)
	at com.carrotsearch.randomizedtesting.RandomizedRunner.invoke(RandomizedRunner.java:1750)
	at com.carrotsearch.randomizedtesting.RandomizedRunner$8.evaluate(RandomizedRunner.java:938)
	at com.carrotsearch.randomizedtesting.RandomizedRunner$9.evaluate(RandomizedRunner.java:974)
	at com.carrotsearch.randomizedtesting.RandomizedRunner$10.evaluate(RandomizedRunner.java:988)
	at org.apache.solr.BaseDistributedSearchTestCase$ShardsRepeatRule$ShardsFixedStatement.callStatement(BaseDistributedSearchTestCase.java:1082)
	at org.apache.solr.BaseDistributedSearchTestCase$ShardsRepeatRule$ShardsStatement.evaluate(BaseDistributedSearchTestCase.java:1054)
	at com.carrotsearch.randomizedtesting.rules.SystemPropertiesRestoreRule$1.evaluate(SystemPropertiesRestoreRule.java:57)
	at org.apache.lucene.util.TestRuleSetupTeardownChained$1.evaluate(TestRuleSetupTeardownChained.java:49)
	at org.apache.lucene.util.AbstractBeforeAfterRule$1.evaluate(AbstractBeforeAfterRule.java:45)
	at org.apache.lucene.util.TestRuleThreadAndTestName$1.evaluate(TestRuleThreadAndTestName.java:48)
	at org.apache.lucene.util.TestRuleIgnoreAfterMaxFailures$1.evaluate(TestRuleIgnoreAfterMaxFailures.java:64)
	at org.apache.lucene.util.TestRuleMarkFailure$1.evaluate(TestRuleMarkFailure.java:47)
	at com.carrotsearch.randomizedtesting.rules.StatementAdapter.evaluate(StatementAdapter.java:36)
	at com.carrotsearch.randomizedtesting.ThreadLeakControl$StatementRunner.run(ThreadLeakControl.java:368)
	at com.carrotsearch.randomizedtesting.ThreadLeakControl.forkTimeoutingTask(ThreadLeakControl.java:817)
	at com.carrotsearch.randomizedtesting.ThreadLeakControl$3.evaluate(ThreadLeakControl.java:468)
	at com.carrotsearch.randomizedtesting.RandomizedRunner.runSingleTest(RandomizedRunner.java:947)
	at com.carrotsearch.randomizedtesting.RandomizedRunner$5.evaluate(RandomizedRunner.java:832)
	at com.carrotsearch.randomizedtesting.RandomizedRunner$6.evaluate(RandomizedRunner.java:883)
	at com.carrotsearch.randomizedtesting.RandomizedRunner$7.evaluate(RandomizedRunner.java:894)
	at com.carrotsearch.randomizedtesting.rules.StatementAdapter.evaluate(StatementAdapter.java:36)
	at com.carrotsearch.randomizedtesting.rules.SystemPropertiesRestoreRule$1.evaluate(SystemPropertiesRestoreRule.java:57)
	at org.apache.lucene.util.AbstractBeforeAfterRule$1.evaluate(AbstractBeforeAfterRule.java:45)
	at com.carrotsearch.randomizedtesting.rules.StatementAdapter.evaluate(StatementAdapter.java:36)
	at org.apache.lucene.util.TestRuleStoreClassName$1.evaluate(TestRuleStoreClassName.java:41)
	at com.carrotsearch.randomizedtesting.rules.NoShadowingOrOverridesOnMethodsRule$1.evaluate(NoShadowingOrOverridesOnMethodsRule.java:40)
	at com.carrotsearch.randomizedtesting.rules.NoShadowingOrOverridesOnMethodsRule$1.evaluate(NoShadowingOrOverridesOnMethodsRule.java:40)
	at com.carrotsearch.randomizedtesting.rules.StatementAdapter.evaluate(StatementAdapter.java:36)
	at com.carrotsearch.randomizedtesting.rules.StatementAdapter.evaluate(StatementAdapter.java:36)
	at com.carrotsearch.randomizedtesting.rules.StatementAdapter.evaluate(StatementAdapter.java:36)
	at org.apache.lucene.util.TestRuleAssertionsRequired$1.evaluate(TestRuleAssertionsRequired.java:53)
	at org.apache.lucene.util.TestRuleMarkFailure$1.evaluate(TestRuleMarkFailure.java:47)
	at org.apache.lucene.util.TestRuleIgnoreAfterMaxFailures$1.evaluate(TestRuleIgnoreAfterMaxFailures.java:64)
	at org.apache.lucene.util.TestRuleIgnoreTestSuites$1.evaluate(TestRuleIgnoreTestSuites.java:54)
	at com.carrotsearch.randomizedtesting.rules.StatementAdapter.evaluate(StatementAdapter.java:36)
	at com.carrotsearch.randomizedtesting.ThreadLeakControl$StatementRunner.run(ThreadLeakControl.java:368)
	at java.lang.Thread.run(Thread.java:748)


FAILED:  org.apache.solr.security.BasicAuthIntegrationTest.testBasicAuth

Error Message:
Expected metric minimums for prefix SECURITY./authentication.: {failMissingCredentials=2, authenticated=19, passThrough=9, failWrongCredentials=1, requests=31, errors=0}, but got: {failMissingCredentials=2, authenticated=17, passThrough=10, totalTime=101389966, failWrongCredentials=1, requestTimes=550, requests=30, errors=0}

Stack Trace:
java.lang.AssertionError: Expected metric minimums for prefix SECURITY./authentication.: {failMissingCredentials=2, authenticated=19, passThrough=9, failWrongCredentials=1, requests=31, errors=0}, but got: {failMissingCredentials=2, authenticated=17, passThrough=10, totalTime=101389966, failWrongCredentials=1, requestTimes=550, requests=30, errors=0}
	at __randomizedtesting.SeedInfo.seed([D30EE5D0FE466D69:6F6093C25A15EE13]:0)
	at org.junit.Assert.fail(Assert.java:88)
	at org.junit.Assert.assertTrue(Assert.java:41)
	at org.apache.solr.cloud.SolrCloudAuthTestCase.assertAuthMetricsMinimums(SolrCloudAuthTestCase.java:125)
	at org.apache.solr.cloud.SolrCloudAuthTestCase.assertAuthMetricsMinimums(SolrCloudAuthTestCase.java:81)
	at org.apache.solr.security.BasicAuthIntegrationTest.testBasicAuth(BasicAuthIntegrationTest.java:306)
	at sun.reflect.NativeMethodAccessorImpl.invoke0(Native Method)
	at sun.reflect.NativeMethodAccessorImpl.invoke(NativeMethodAccessorImpl.java:62)
	at sun.reflect.DelegatingMethodAccessorImpl.invoke(DelegatingMethodAccessorImpl.java:43)
	at java.lang.reflect.Method.invoke(Method.java:498)
	at com.carrotsearch.randomizedtesting.RandomizedRunner.invoke(RandomizedRunner.java:1750)
	at com.carrotsearch.randomizedtesting.RandomizedRunner$8.evaluate(RandomizedRunner.java:938)
	at com.carrotsearch.randomizedtesting.RandomizedRunner$9.evaluate(RandomizedRunner.java:974)
	at com.carrotsearch.randomizedtesting.RandomizedRunner$10.evaluate(RandomizedRunner.java:988)
	at com.carrotsearch.randomizedtesting.rules.SystemPropertiesRestoreRule$1.evaluate(SystemPropertiesRestoreRule.java:57)
	at org.apache.lucene.util.TestRuleSetupTeardownChained$1.evaluate(TestRuleSetupTeardownChained.java:49)
	at org.apache.lucene.util.AbstractBeforeAfterRule$1.evaluate(AbstractBeforeAfterRule.java:45)
	at org.apache.lucene.util.TestRuleThreadAndTestName$1.evaluate(TestRuleThreadAndTestName.java:48)
	at org.apache.lucene.util.TestRuleIgnoreAfterMaxFailures$1.evaluate(TestRuleIgnoreAfterMaxFailures.java:64)
	at org.apache.lucene.util.TestRuleMarkFailure$1.evaluate(TestRuleMarkFailure.java:47)
	at com.carrotsearch.randomizedtesting.rules.StatementAdapter.evaluate(StatementAdapter.java:36)
	at com.carrotsearch.randomizedtesting.ThreadLeakControl$StatementRunner.run(ThreadLeakControl.java:368)
	at com.carrotsearch.randomizedtesting.ThreadLeakControl.forkTimeoutingTask(ThreadLeakControl.java:817)
	at com.carrotsearch.randomizedtesting.ThreadLeakControl$3.evaluate(ThreadLeakControl.java:468)
	at com.carrotsearch.randomizedtesting.RandomizedRunner.runSingleTest(RandomizedRunner.java:947)
	at com.carrotsearch.randomizedtesting.RandomizedRunner$5.evaluate(RandomizedRunner.java:832)
	at com.carrotsearch.randomizedtesting.RandomizedRunner$6.evaluate(RandomizedRunner.java:883)
	at com.carrotsearch.randomizedtesting.RandomizedRunner$7.evaluate(RandomizedRunner.java:894)
	at com.carrotsearch.randomizedtesting.rules.StatementAdapter.evaluate(StatementAdapter.java:36)
	at com.carrotsearch.randomizedtesting.rules.SystemPropertiesRestoreRule$1.evaluate(SystemPropertiesRestoreRule.java:57)
	at org.apache.lucene.util.AbstractBeforeAfterRule$1.evaluate(AbstractBeforeAfterRule.java:45)
	at com.carrotsearch.randomizedtesting.rules.StatementAdapter.evaluate(StatementAdapter.java:36)
	at org.apache.lucene.util.TestRuleStoreClassName$1.evaluate(TestRuleStoreClassName.java:41)
	at com.carrotsearch.randomizedtesting.rules.NoShadowingOrOverridesOnMethodsRule$1.evaluate(NoShadowingOrOverridesOnMethodsRule.java:40)
	at com.carrotsearch.randomizedtesting.rules.NoShadowingOrOverridesOnMethodsRule$1.evaluate(NoShadowingOrOverridesOnMethodsRule.java:40)
	at com.carrotsearch.randomizedtesting.rules.StatementAdapter.evaluate(StatementAdapter.java:36)
	at com.carrotsearch.randomizedtesting.rules.StatementAdapter.evaluate(StatementAdapter.java:36)
	at com.carrotsearch.randomizedtesting.rules.StatementAdapter.evaluate(StatementAdapter.java:36)
	at org.apache.lucene.util.TestRuleAssertionsRequired$1.evaluate(TestRuleAssertionsRequired.java:53)
	at org.apache.lucene.util.TestRuleMarkFailure$1.evaluate(TestRuleMarkFailure.java:47)
	at org.apache.lucene.util.TestRuleIgnoreAfterMaxFailures$1.evaluate(TestRuleIgnoreAfterMaxFailures.java:64)
	at org.apache.lucene.util.TestRuleIgnoreTestSuites$1.evaluate(TestRuleIgnoreTestSuites.java:54)
	at com.carrotsearch.randomizedtesting.rules.StatementAdapter.evaluate(StatementAdapter.java:36)
	at com.carrotsearch.randomizedtesting.ThreadLeakControl$StatementRunner.run(ThreadLeakControl.java:368)
	at java.lang.Thread.run(Thread.java:748)




Build Log:
[...truncated 13321 lines...]
   [junit4] Suite: org.apache.solr.cloud.autoscaling.sim.TestSimExtremeIndexing
   [junit4]   2> 1442977 INFO  (SUITE-TestSimExtremeIndexing-seed#[D30EE5D0FE466D69]-worker) [    ] o.a.s.SolrTestCaseJ4 SecureRandom sanity checks: test.solr.allowed.securerandom=null & java.security.egd=file:/dev/./urandom
   [junit4]   2> Creating dataDir: /home/jenkins/jenkins-slave/workspace/Lucene-Solr-BadApples-Tests-master/solr/build/solr-core/test/J2/temp/solr.cloud.autoscaling.sim.TestSimExtremeIndexing_D30EE5D0FE466D69-001/init-core-data-001
   [junit4]   2> 1442980 INFO  (SUITE-TestSimExtremeIndexing-seed#[D30EE5D0FE466D69]-worker) [    ] o.a.s.SolrTestCaseJ4 Using PointFields (NUMERIC_POINTS_SYSPROP=true) w/NUMERIC_DOCVALUES_SYSPROP=true
   [junit4]   2> 1443013 INFO  (SUITE-TestSimExtremeIndexing-seed#[D30EE5D0FE466D69]-worker) [    ] o.a.s.SolrTestCaseJ4 Randomized ssl (true) and clientAuth (true) via: @org.apache.solr.util.RandomizeSSL(reason=, value=NaN, ssl=NaN, clientAuth=NaN)
   [junit4]   2> 1443030 INFO  (TEST-TestSimExtremeIndexing.testScaleUp-seed#[D30EE5D0FE466D69]) [    ] o.a.s.SolrTestCaseJ4 ###Starting testScaleUp
   [junit4]   2> 1443271 DEBUG (TEST-TestSimExtremeIndexing.testScaleUp-seed#[D30EE5D0FE466D69]) [    ] o.a.s.c.a.s.SimClusterStateProvider --- new Overseer leader: 127.0.0.1:10000_solr
   [junit4]   2> 1443285 DEBUG (Simulated OverseerAutoScalingTriggerThread) [    ] o.a.s.c.a.OverseerTriggerThread Adding .auto_add_replicas and .scheduled_maintenance triggers
   [junit4]   2> 1443285 DEBUG (Simulated OverseerAutoScalingTriggerThread) [    ] o.a.s.c.a.OverseerTriggerThread Refreshing /autoscaling.json with znode version 1
   [junit4]   2> 1443285 DEBUG (Simulated OverseerAutoScalingTriggerThread) [    ] o.a.s.c.a.OverseerTriggerThread Current znodeVersion 1, lastZnodeVersion 0
   [junit4]   2> 1443285 DEBUG (Simulated OverseerAutoScalingTriggerThread) [    ] o.a.s.c.a.OverseerTriggerThread Processed trigger updates upto znodeVersion 1
   [junit4]   2> 1443313 DEBUG (TEST-TestSimExtremeIndexing.testScaleUp-seed#[D30EE5D0FE466D69]) [    ] o.a.s.c.a.s.SimClusterStateProvider ** creating new collection states, currentVersion=0
   [junit4]   2> 1443321 DEBUG (TEST-TestSimExtremeIndexing.testScaleUp-seed#[D30EE5D0FE466D69]) [    ] o.a.s.c.a.s.SimClusterStateProvider ** saved cluster state version 0
   [junit4]   2> 1443321 INFO  (TEST-TestSimExtremeIndexing.testScaleUp-seed#[D30EE5D0FE466D69]) [    ] o.a.s.h.a.MetricsHistoryHandler No .system collection, keeping metrics history in memory.
   [junit4]   2> 1443334 DEBUG (Simulated OverseerAutoScalingTriggerThread) [    ] o.a.s.c.a.OverseerTriggerThread -- cleaning old nodeLost / nodeAdded markers
   [junit4]   2> 1443334 DEBUG (Simulated OverseerAutoScalingTriggerThread) [    ] o.a.s.c.a.OverseerTriggerThread Current znodeVersion 1, lastZnodeVersion 1
   [junit4]   2> 1443898 DEBUG (simCloudManagerPool-2710-thread-1) [    ] o.a.s.c.a.s.SimClusterStateProvider -- simCreateCollection testScaleUp_collection, currentVersion=1
   [junit4]   2> 1443899 DEBUG (simCloudManagerPool-2710-thread-1) [    ] o.a.s.c.a.s.SimClusterStateProvider ** creating new collection states, currentVersion=1
   [junit4]   2> 1443899 DEBUG (simCloudManagerPool-2710-thread-1) [    ] o.a.s.c.a.s.SimClusterStateProvider ** saved cluster state version 1
   [junit4]   2> 1443969 DEBUG (simCloudManagerPool-2710-thread-1) [    ] o.a.s.c.a.s.SimClusterStateProvider ** creating new collection states, currentVersion=2
   [junit4]   2> 1443991 DEBUG (simCloudManagerPool-2710-thread-1) [    ] o.a.s.c.a.s.SimClusterStateProvider ** saved cluster state version 2
   [junit4]   2> 1445487 DEBUG (simCloudManagerPool-2710-thread-2) [    ] o.a.s.c.a.s.SimClusterStateProvider ** creating new collection states, currentVersion=3
   [junit4]   2> 1445550 DEBUG (simCloudManagerPool-2710-thread-2) [    ] o.a.s.c.a.s.SimClusterStateProvider ** saved cluster state version 3
   [junit4]   2> 1445671 DEBUG (simCloudManagerPool-2710-thread-6) [    ] o.a.s.c.a.s.SimClusterStateProvider -- elected new leader for testScaleUp_collection / shard1 (currentVersion=4): {"core_node1":{
   [junit4]   2>     "core":"testScaleUp_collection_shard1_replica_n1",
   [junit4]   2>     "shard":"shard1",
   [junit4]   2>     "collection":"testScaleUp_collection",
   [junit4]   2>     "node_name":"127.0.0.1:10072_solr",
   [junit4]   2>     "type":"NRT",
   [junit4]   2>     "leader":"true",
   [junit4]   2>     "SEARCHER.searcher.maxDoc":0,
   [junit4]   2>     "SEARCHER.searcher.deletedDocs":0,
   [junit4]   2>     "INDEX.sizeInBytes":10240,
   [junit4]   2>     "state":"active",
   [junit4]   2>     "INDEX.sizeInGB":9.5367431640625E-6,
   [junit4]   2>     "SEARCHER.searcher.numDocs":0}}
   [junit4]   2> 1445723 DEBUG (simCloudManagerPool-2710-thread-3) [    ] o.a.s.c.a.s.SimClusterStateProvider ** creating new collection states, currentVersion=4
   [junit4]   2> 1445724 DEBUG (simCloudManagerPool-2710-thread-3) [    ] o.a.s.c.a.s.SimClusterStateProvider ** saved cluster state version 4
   [junit4]   2> 1445739 DEBUG (MetricsHistoryHandler-2714-thread-1) [    ] o.a.s.c.a.s.SimClusterStateProvider ** creating new collection states, currentVersion=5
   [junit4]   2> 1445740 DEBUG (MetricsHistoryHandler-2714-thread-1) [    ] o.a.s.c.a.s.SimClusterStateProvider ** saved cluster state version 5
   [junit4]   2> 1445760 DEBUG (simCloudManagerPool-2710-thread-4) [    ] o.a.s.c.a.s.SimClusterStateProvider ** creating new collection states, currentVersion=6
   [junit4]   2> 1445760 DEBUG (simCloudManagerPool-2710-thread-4) [    ] o.a.s.c.a.s.SimClusterStateProvider ** saved cluster state version 6
   [junit4]   2> 1445776 DEBUG (simCloudManagerPool-2710-thread-1) [    ] o.a.s.c.a.s.SimClusterStateProvider -- finished createCollection testScaleUp_collection, currentVersion=7
   [junit4]   2> 1445843 DEBUG (simCloudManagerPool-2710-thread-7) [    ] o.a.s.c.a.s.SimClusterStateProvider -- elected new leader for testScaleUp_collection / shard2 (currentVersion=7): {"core_node3":{
   [junit4]   2>     "core":"testScaleUp_collection_shard2_replica_n3",
   [junit4]   2>     "shard":"shard2",
   [junit4]   2>     "collection":"testScaleUp_collection",
   [junit4]   2>     "node_name":"127.0.0.1:10059_solr",
   [junit4]   2>     "type":"NRT",
   [junit4]   2>     "leader":"true",
   [junit4]   2>     "SEARCHER.searcher.maxDoc":0,
   [junit4]   2>     "SEARCHER.searcher.deletedDocs":0,
   [junit4]   2>     "INDEX.sizeInBytes":10240,
   [junit4]   2>     "state":"active",
   [junit4]   2>     "INDEX.sizeInGB":9.5367431640625E-6,
   [junit4]   2>     "SEARCHER.searcher.numDocs":0}}
   [junit4]   2> 1445869 DEBUG (simCloudManagerPool-2710-thread-5) [    ] o.a.s.c.a.s.SimClusterStateProvider ** creating new collection states, currentVersion=7
   [junit4]   2> 1445869 DEBUG (simCloudManagerPool-2710-thread-5) [    ] o.a.s.c.a.s.SimClusterStateProvider ** saved cluster state version 7
   [junit4]   2> 1445877 DEBUG (TEST-TestSimExtremeIndexing.testScaleUp-seed#[D30EE5D0FE466D69]) [    ] o.a.s.c.a.s.SimClusterStateProvider ** creating new collection states, currentVersion=8
   [junit4]   2> 1445890 DEBUG (TEST-TestSimExtremeIndexing.testScaleUp-seed#[D30EE5D0FE466D69]) [    ] o.a.s.c.a.s.SimClusterStateProvider ** saved cluster state version 8
   [junit4]   2> 1446085 DEBUG (simCloudManagerPool-2710-thread-8) [    ] o.a.s.c.a.AutoScalingHandler Verified autoscaling configuration
   [junit4]   2> 1446085 DEBUG (simCloudManagerPool-2710-thread-8) [    ] o.a.s.c.a.OverseerTriggerThread Refreshing /autoscaling.json with znode version 2
   [junit4]   2> 1446089 DEBUG (Simulated OverseerAutoScalingTriggerThread) [    ] o.a.s.c.a.OverseerTriggerThread Processed trigger updates upto znodeVersion 2
   [junit4]   2> 1446089 DEBUG (Simulated OverseerAutoScalingTriggerThread) [    ] o.a.s.c.a.OverseerTriggerThread -- cleaning old nodeLost / nodeAdded markers
   [junit4]   2> 1446089 DEBUG (Simulated OverseerAutoScalingTriggerThread) [    ] o.a.s.c.a.OverseerTriggerThread Current znodeVersion 2, lastZnodeVersion 2
   [junit4]   2> 1446339 INFO  (TEST-TestSimExtremeIndexing.testScaleUp-seed#[D30EE5D0FE466D69]) [    ] o.a.s.c.a.s.TestSimExtremeIndexing #### Total docs so far: 200,000
   [junit4]   2> 1446538 INFO  (TEST-TestSimExtremeIndexing.testScaleUp-seed#[D30EE5D0FE466D69]) [    ] o.a.s.c.a.s.TestSimExtremeIndexing #### Total docs so far: 400,000
   [junit4]   2> 1446595 INFO  (TEST-TestSimExtremeIndexing.testScaleUp-seed#[D30EE5D0FE466D69]) [    ] o.a.s.c.a.s.TestSimExtremeIndexing #### Total docs so far: 600,000
   [junit4]   2> 1446633 INFO  (TEST-TestSimExtremeIndexing.testScaleUp-seed#[D30EE5D0FE466D69]) [    ] o.a.s.c.a.s.TestSimExtremeIndexing #### Total docs so far: 800,000
   [junit4]   2> 1446669 INFO  (TEST-TestSimExtremeIndexing.testScaleUp-seed#[D30EE5D0FE466D69]) [    ] o.a.s.c.a.s.TestSimExtremeIndexing #### Total docs so far: 1,000,000
   [junit4]   2> 1446719 INFO  (TEST-TestSimExtremeIndexing.testScaleUp-seed#[D30EE5D0FE466D69]) [    ] o.a.s.c.a.s.TestSimExtremeIndexing #### Total docs so far: 1,200,000
   [junit4]   2> 1446755 INFO  (TEST-TestSimExtremeIndexing.testScaleUp-seed#[D30EE5D0FE466D69]) [    ] o.a.s.c.a.s.TestSimExtremeIndexing #### Total docs so far: 1,400,000
   [junit4]   2> 1446800 INFO  (TEST-TestSimExtremeIndexing.testScaleUp-seed#[D30EE5D0FE466D69]) [    ] o.a.s.c.a.s.TestSimExtremeIndexing #### Total docs so far: 1,600,000
   [junit4]   2> 1446851 INFO  (TEST-TestSimExtremeIndexing.testScaleUp-seed#[D30EE5D0FE466D69]) [    ] o.a.s.c.a.s.TestSimExtremeIndexing #### Total docs so far: 1,800,000
   [junit4]   2> 1446865 INFO  (TEST-TestSimExtremeIndexing.testScaleUp-seed#[D30EE5D0FE466D69]) [    ] o.a.s.c.a.s.TestSimExtremeIndexing #### Total docs so far: 2,000,000
   [junit4]   2> 1446884 INFO  (TEST-TestSimExtremeIndexing.testScaleUp-seed#[D30EE5D0FE466D69]) [    ] o.a.s.c.a.s.TestSimExtremeIndexing #### Total docs so far: 2,200,000
   [junit4]   2> 1446925 INFO  (TEST-TestSimExtremeIndexing.testScaleUp-seed#[D30EE5D0FE466D69]) [    ] o.a.s.c.a.s.TestSimExtremeIndexing #### Total docs so far: 2,400,000
   [junit4]   2> 1446959 INFO  (TEST-TestSimExtremeIndexing.testScaleUp-seed#[D30EE5D0FE466D69]) [    ] o.a.s.c.a.s.TestSimExtremeIndexing #### Total docs so far: 2,600,000
   [junit4]   2> 1446998 INFO  (TEST-TestSimExtremeIndexing.testScaleUp-seed#[D30EE5D0FE466D69]) [    ] o.a.s.c.a.s.TestSimExtremeIndexing #### Total docs so far: 2,800,000
   [junit4]   2> 1447032 INFO  (TEST-TestSimExtremeIndexing.testScaleUp-seed#[D30EE5D0FE466D69]) [    ] o.a.s.c.a.s.TestSimExtremeIndexing #### Total docs so far: 3,000,000
   [junit4]   2> 1447071 INFO  (TEST-TestSimExtremeIndexing.testScaleUp-seed#[D30EE5D0FE466D69]) [    ] o.a.s.c.a.s.TestSimExtremeIndexing #### Total docs so far: 3,200,000
   [junit4]   2> 1447126 INFO  (TEST-TestSimExtremeIndexing.testScaleUp-seed#[D30EE5D0FE466D69]) [    ] o.a.s.c.a.s.TestSimExtremeIndexing #### Total docs so far: 3,400,000
   [junit4]   2> 1447145 INFO  (TEST-TestSimExtremeIndexing.testScaleUp-seed#[D30EE5D0FE466D69]) [    ] o.a.s.c.a.s.TestSimExtremeIndexing #### Total docs so far: 3,600,000
   [junit4]   2> 1447145 INFO  (TEST-TestSimExtremeIndexing.testScaleUp-seed#[D30EE5D0FE466D69]) [    ] o.a.s.c.a.s.TestSimExtremeIndexing #### Total docs so far: 3,800,000
   [junit4]   2> 1447158 INFO  (TEST-TestSimExtremeIndexing.testScaleUp-seed#[D30EE5D0FE466D69]) [    ] o.a.s.c.a.s.TestSimExtremeIndexing #### Total docs so far: 4,000,000
   [junit4]   2> 1447198 INFO  (TEST-TestSimExtremeIndexing.testScaleUp-seed#[D30EE5D0FE466D69]) [    ] o.a.s.c.a.s.TestSimExtremeIndexing #### Total docs so far: 4,200,000
   [junit4]   2> 1447199 INFO  (TEST-TestSimExtremeIndexing.testScaleUp-seed#[D30EE5D0FE466D69]) [    ] o.a.s.c.a.s.TestSimExtremeIndexing #### Total docs so far: 4,400,000
   [junit4]   2> 1447200 INFO  (TEST-TestSimExtremeIndexing.testScaleUp-seed#[D30EE5D0FE466D69]) [    ] o.a.s.c.a.s.TestSimExtremeIndexing #### Total docs so far: 4,600,000
   [junit4]   2> 1447215 INFO  (TEST-TestSimExtremeIndexing.testScaleUp-seed#[D30EE5D0FE466D69]) [    ] o.a.s.c.a.s.TestSimExtremeIndexing #### Total docs so far: 4,800,000
   [junit4]   2> 1447251 INFO  (TEST-TestSimExtremeIndexing.testScaleUp-seed#[D30EE5D0FE466D69]) [    ] o.a.s.c.a.s.TestSimExtremeIndexing #### Total docs so far: 5,000,000
   [junit4]   2> 1447273 INFO  (TEST-TestSimExtremeIndexing.testScaleUp-seed#[D30EE5D0FE466D69]) [    ] o.a.s.c.a.s.TestSimExtremeIndexing #### Total docs so far: 5,200,000
   [junit4]   2> 1447288 INFO  (TEST-TestSimExtremeIndexing.testScaleUp-seed#[D30EE5D0FE466D69]) [    ] o.a.s.c.a.s.TestSimExtremeIndexing #### Total docs so far: 5,400,000
   [junit4]   2> 1447289 INFO  (TEST-TestSimExtremeIndexing.testScaleUp-seed#[D30EE5D0FE466D69]) [    ] o.a.s.c.a.s.TestSimExtremeIndexing #### Total docs so far: 5,600,000
   [junit4]   2> 1447308 INFO  (TEST-TestSimExtremeIndexing.testScaleUp-seed#[D30EE5D0FE466D69]) [    ] o.a.s.c.a.s.TestSimExtremeIndexing #### Total docs so far: 5,800,000
   [junit4]   2> 1447324 INFO  (TEST-TestSimExtremeIndexing.testScaleUp-seed#[D30EE5D0FE466D69]) [    ] o.a.s.c.a.s.TestSimExtremeIndexing #### Total docs so far: 6,000,000
   [junit4]   2> 1447340 INFO  (TEST-TestSimExtremeIndexing.testScaleUp-seed#[D30EE5D0FE466D69]) [    ] o.a.s.c.a.s.TestSimExtremeIndexing #### Total docs so far: 6,200,000
   [junit4]   2> 1447360 INFO  (TEST-TestSimExtremeIndexing.testScaleUp-seed#[D30EE5D0FE466D69]) [    ] o.a.s.c.a.s.TestSimExtremeIndexing #### Total docs so far: 6,400,000
   [junit4]   2> 1447381 INFO  (TEST-TestSimExtremeIndexing.testScaleUp-seed#[D30EE5D0FE466D69]) [    ] o.a.s.c.a.s.TestSimExtremeIndexing #### Total docs so far: 6,600,000
   [junit4]   2> 1447397 INFO  (TEST-TestSimExtremeIndexing.testScaleUp-seed#[D30EE5D0FE466D69]) [    ] o.a.s.c.a.s.TestSimExtremeIndexing #### Total docs so far: 6,800,000
   [junit4]   2> 1447413 INFO  (TEST-TestSimExtremeIndexing.testScaleUp-seed#[D30EE5D0FE466D69]) [    ] o.a.s.c.a.s.TestSimExtremeIndexing #### Total docs so far: 7,000,000
   [junit4]   2> 1447429 INFO  (TEST-TestSimExtremeIndexing.testScaleUp-seed#[D30EE5D0FE466D69]) [    ] o.a.s.c.a.s.TestSimExtremeIndexing #### Total docs so far: 7,200,000
   [junit4]   2> 1447430 INFO  (TEST-TestSimExtremeIndexing.testScaleUp-seed#[D30EE5D0FE466D69]) [    ] o.a.s.c.a.s.TestSimExtremeIndexing #### Total docs so far: 7,400,000
   [junit4]   2> 1447430 INFO  (TEST-TestSimExtremeIndexing.testScaleUp-seed#[D30EE5D0FE466D69]) [    ] o.a.s.c.a.s.TestSimExtremeIndexing #### Total docs so far: 7,600,000
   [junit4]   2> 1447446 INFO  (TEST-TestSimExtremeIndexing.testScaleUp-seed#[D30EE5D0FE466D69]) [    ] o.a.s.c.a.s.TestSimExtremeIndexing #### Total docs so far: 7,800,000
   [junit4]   2> 1447450 INFO  (TEST-TestSimExtremeIndexing.testScaleUp-seed#[D30EE5D0FE466D69]) [    ] o.a.s.c.a.s.TestSimExtremeIndexing #### Total docs so far: 8,000,000
   [junit4]   2> 1447470 INFO  (TEST-TestSimExtremeIndexing.testScaleUp-seed#[D30EE5D0FE466D69]) [    ] o.a.s.c.a.s.TestSimExtremeIndexing #### Total docs so far: 8,200,000
   [junit4]   2> 1447490 INFO  (TEST-TestSimExtremeIndexing.testScaleUp-seed#[D30EE5D0FE466D69]) [    ] o.a.s.c.a.s.TestSimExtremeIndexing #### Total docs so far: 8,400,000
   [junit4]   2> 1447502 INFO  (TEST-TestSimExtremeIndexing.testScaleUp-seed#[D30EE5D0FE466D69]) [    ] o.a.s.c.a.s.TestSimExtremeIndexing #### Total docs so far: 8,600,000
   [junit4]   2> 1447542 INFO  (TEST-TestSimExtremeIndexing.testScaleUp-seed#[D30EE5D0FE466D69]) [    ] o.a.s.c.a.s.TestSimExtremeIndexing #### Total docs so far: 8,800,000
   [junit4]   2> 1447576 INFO  (TEST-TestSimExtremeIndexing.testScaleUp-seed#[D30EE5D0FE466D69]) [    ] o.a.s.c.a.s.TestSimExtremeIndexing #### Total docs so far: 9,000,000
   [junit4]   2> 1447578 INFO  (TEST-TestSimExtremeIndexing.testScaleUp-seed#[D30EE5D0FE466D69]) [    ] o.a.s.c.a.s.TestSimExtremeIndexing #### Total docs so far: 9,200,000
   [junit4]   2> 1447595 INFO  (TEST-TestSimExtremeIndexing.testScaleUp-seed#[D30EE5D0FE466D69]) [    ] o.a.s.c.a.s.TestSimExtremeIndexing #### Total docs so far: 9,400,000
   [junit4]   2> 1447596 INFO  (TEST-TestSimExtremeIndexing.testScaleUp-seed#[D30EE5D0FE466D69]) [    ] o.a.s.c.a.s.TestSimExtremeIndexing #### Total docs so far: 9,600,000
   [junit4]   2> 1447596 INFO  (TEST-TestSimExtremeIndexing.testScaleUp-seed#[D30EE5D0FE466D69]) [    ] o.a.s.c.a.s.TestSimExtremeIndexing #### Total docs so far: 9,800,000
   [junit4]   2> 1447597 INFO  (TEST-TestSimExtremeIndexing.testScaleUp-seed#[D30EE5D0FE466D69]) [    ] o.a.s.c.a.s.TestSimExtremeIndexing #### Total docs so far: 10,000,000
   [junit4]   2> 1447597 INFO  (TEST-TestSimExtremeIndexing.testScaleUp-seed#[D30EE5D0FE466D69]) [    ] o.a.s.c.a.s.TestSimExtremeIndexing #### Total docs so far: 10,200,000
   [junit4]   2> 1447598 INFO  (TEST-TestSimExtremeIndexing.testScaleUp-seed#[D30EE5D0FE466D69]) [    ] o.a.s.c.a.s.TestSimExtremeIndexing #### Total docs so far: 10,400,000
   [junit4]   2> 1447598 INFO  (TEST-TestSimExtremeIndexing.testScaleUp-seed#[D30EE5D0FE466D69]) [    ] o.a.s.c.a.s.TestSimExtremeIndexing #### Total docs so far: 10,600,000
   [junit4]   2> 1447599 INFO  (TEST-TestSimExtremeIndexing.testScaleUp-seed#[D30EE5D0FE466D69]) [    ] o.a.s.c.a.s.TestSimExtremeIndexing #### Total docs so far: 10,800,000
   [junit4]   2> 1447611 INFO  (TEST-TestSimExtremeIndexing.testScaleUp-seed#[D30EE5D0FE466D69]) [    ] o.a.s.c.a.s.TestSimExtremeIndexing #### Total docs so far: 11,000,000
   [junit4]   2> 1447612 INFO  (TEST-TestSimExtremeIndexing.testScaleUp-seed#[D30EE5D0FE466D69]) [    ] o.a.s.c.a.s.TestSimExtremeIndexing #### Total docs so far: 11,200,000
   [junit4]   2> 1447612 INFO  (TEST-TestSimExtremeIndexing.testScaleUp-seed#[D30EE5D0FE466D69]) [    ] o.a.s.c.a.s.TestSimExtremeIndexing #### Total docs so far: 11,400,000
   [junit4]   2> 1447628 INFO  (TEST-TestSimExtremeIndexing.testScaleUp-seed#[D30EE5D0FE466D69]) [    ] o.a.s.c.a.s.TestSimExtremeIndexing #### Total docs so far: 11,600,000
   [junit4]   2> 1447651 INFO  (TEST-TestSimExtremeIndexing.testScaleUp-seed#[D30EE5D0FE466D69]) [    ] o.a.s.c.a.s.TestSimExtremeIndexing #### Total docs so far: 11,800,000
   [junit4]   2> 1447701 INFO  (TEST-TestSimExtremeIndexing.testScaleUp-seed#[D30EE5D0FE466D69]) [    ] o.a.s.c.a.s.TestSimExtremeIndexing #### Total docs so far: 12,000,000
   [junit4]   2> 1447737 INFO  (TEST-TestSimExtremeIndexing.testScaleUp-seed#[D30EE5D0FE466D69]) [    ] o.a.s.c.a.s.TestSimExtremeIndexing #### Total docs so far: 12,200,000
   [junit4]   2> 1447758 INFO  (TEST-TestSimExtremeIndexing.testScaleUp-seed#[D30EE5D0FE466D69]) [    ] o.a.s.c.a.s.TestSimExtremeIndexing #### Total docs so far: 12,400,000
   [junit4]   2> 1447758 INFO  (TEST-TestSimExtremeIndexing.testScaleUp-seed#[D30EE5D0FE466D69]) [    ] o.a.s.c.a.s.TestSimExtremeIndexing #### Total docs so far: 12,600,000
   [junit4]   2> 1447759 INFO  (TEST-TestSimExtremeIndexing.testScaleUp-seed#[D30EE5D0FE466D69]) [    ] o.a.s.c.a.s.TestSimExtremeIndexing #### Total docs so far: 12,800,000
   [junit4]   2> 1447774 INFO  (TEST-TestSimExtremeIndexing.testScaleUp-seed#[D30EE5D0FE466D69]) [    ] o.a.s.c.a.s.TestSimExtremeIndexing #### Total docs so far: 13,000,000
   [junit4]   2> 1447798 INFO  (TEST-TestSimExtremeIndexing.testScaleUp-seed#[D30EE5D0FE466D69]) [    ] o.a.s.c.a.s.TestSimExtremeIndexing #### Total docs so far: 13,200,000
   [junit4]   2> 1447818 INFO  (TEST-TestSimExtremeIndexing.testScaleUp-seed#[D30EE5D0FE466D69]) [    ] o.a.s.c.a.s.TestSimExtremeIndexing #### Total docs so far: 13,400,000
   [junit4]   2> 1447830 INFO  (TEST-TestSimExtremeIndexing.testScaleUp-seed#[D30EE5D0FE466D69]) [    ] o.a.s.c.a.s.TestSimExtremeIndexing #### Total docs so far: 13,600,000
   [junit4]   2> 1447831 INFO  (TEST-TestSimExtremeIndexing.testScaleUp-seed#[D30EE5D0FE466D69]) [    ] o.a.s.c.a.s.TestSimExtremeIndexing #### Total docs so far: 13,800,000
   [junit4]   2> 1447847 INFO  (TEST-TestSimExtremeIndexing.testScaleUp-seed#[D30EE5D0FE466D69]) [    ] o.a.s.c.a.s.TestSimExtremeIndexing #### Total docs so far: 14,000,000
   [junit4]   2> 1447847 INFO  (TEST-TestSimExtremeIndexing.testScaleUp-seed#[D30EE5D0FE466D69]) [    ] o.a.s.c.a.s.TestSimExtremeIndexing #### Total docs so far: 14,200,000
   [junit4]   2> 1447847 INFO  (TEST-TestSimExtremeIndexing.testScaleUp-seed#[D30EE5D0FE466D69]) [    ] o.a.s.c.a.s.TestSimExtremeIndexing #### Total docs so far: 14,400,000
   [junit4]   2> 1447867 INFO  (TEST-TestSimExtremeIndexing.testScaleUp-seed#[D30EE5D0FE466D69]) [    ] o.a.s.c.a.s.TestSimExtremeIndexing #### Total docs so far: 14,600,000
   [junit4]   2> 1447867 INFO  (TEST-TestSimExtremeIndexing.testScaleUp-seed#[D30EE5D0FE466D69]) [    ] o.a.s.c.a.s.TestSimExtremeIndexing #### Total docs so far: 14,800,000
   [junit4]   2> 1447868 INFO  (TEST-TestSimExtremeIndexing.testScaleUp-seed#[D30EE5D0FE466D69]) [    ] o.a.s.c.a.s.TestSimExtremeIndexing #### Total docs so far: 15,000,000
   [junit4]   2> 1447868 INFO  (TEST-TestSimExtremeIndexing.testScaleUp-seed#[D30EE5D0FE466D69]) [    ] o.a.s.c.a.s.TestSimExtremeIndexing #### Total docs so far: 15,200,000
   [junit4]   2> 1447883 INFO  (TEST-TestSimExtremeIndexing.testScaleUp-seed#[D30EE5D0FE466D69]) [    ] o.a.s.c.a.s.TestSimExtremeIndexing #### Total docs so far: 15,400,000
   [junit4]   2> 1447909 INFO  (TEST-TestSimExtremeIndexing.testScaleUp-seed#[D30EE5D0FE466D69]) [    ] o.a.s.c.a.s.TestSimExtremeIndexing #### Total docs so far: 15,600,000
   [junit4]   2> 1447928 INFO  (TEST-TestSimExtremeIndexing.testScaleUp-seed#[D30EE5D0FE466D69]) [    ] o.a.s.c.a.s.TestSimExtremeIndexing #### Total docs so far: 15,800,000
   [junit4]   2> 1447940 INFO  (TEST-TestSimExtremeIndexing.testScaleUp-seed#[D30EE5D0FE466D69]) [    ] o.a.s.c.a.s.TestSimExtremeIndexing #### Total docs so far: 16,000,000
   [junit4]   2> 1447940 INFO  (TEST-TestSimExtremeIndexing.testScaleUp-seed#[D30EE5D0FE466D69]) [    ] o.a.s.c.a.s.TestSimExtremeIndexing #### Total docs so far: 16,200,000
   [junit4]   2> 1447956 INFO  (TEST-TestSimExtremeIndexing.testScaleUp-seed#[D30EE5D0FE466D69]) [    ] o.a.s.c.a.s.TestSimExtremeIndexing #### Total docs so far: 16,400,000
   [junit4]   2> 1447976 INFO  (TEST-TestSimExtremeIndexing.testScaleUp-seed#[D30EE5D0FE466D69]) [    ] o.a.s.c.a.s.TestSimExtremeIndexing #### Total docs so far: 16,600,000
   [junit4]   2> 1448029 INFO  (TEST-TestSimExtremeIndexing.testScaleUp-seed#[D30EE5D0FE466D69]) [    ] o.a.s.c.a.s.TestSimExtremeIndexing #### Total docs so far: 16,800,000
   [junit4]   2> 1448066 INFO  (TEST-TestSimExtremeIndexing.testScaleUp-seed#[D30EE5D0FE466D69]) [    ] o.a.s.c.a.s.TestSimExtremeIndexing #### Total docs so far: 17,000,000
   [junit4]   2> 1448074 INFO  (TEST-TestSimExtremeIndexing.testScaleUp-seed#[D30EE5D0FE466D69]) [    ] o.a.s.c.a.s.TestSimExtremeIndexing #### Total docs so far: 17,200,000
   [junit4]   2> 1448090 INFO  (TEST-TestSimExtremeIndexing.testScaleUp-seed#[D30EE5D0FE466D69]) [    ] o.a.s.c.a.s.TestSimExtremeIndexing #### Total docs so far: 17,400,000
   [junit4]   2> 1448150 INFO  (TEST-TestSimExtremeIndexing.testScaleUp-seed#[D30EE5D0FE466D69]) [    ] o.a.s.c.a.s.TestSimExtremeIndexing #### Total docs so far: 17,600,000
   [junit4]   2> 1448151 INFO  (TEST-TestSimExtremeIndexing.testScaleUp-seed#[D30EE5D0FE466D69]) [    ] o.a.s.c.a.s.TestSimExtremeIndexing #### Total docs so far: 17,800,000
   [junit4]   2> 1448187 INFO  (TEST-TestSimExtremeIndexing.testScaleUp-seed#[D30EE5D0FE466D69]) [    ] o.a.s.c.a.s.TestSimExtremeIndexing #### Total docs so far: 18,000,000
   [junit4]   2> 1448210 INFO  (TEST-TestSimExtremeIndexing.testScaleUp-seed#[D30EE5D0FE466D69]) [    ] o.a.s.c.a.s.TestSimExtremeIndexing #### Total docs so far: 18,200,000
   [junit4]   2> 1448210 INFO  (TEST-TestSimExtremeIndexing.testScaleUp-seed#[D30EE5D0FE466D69]) [    ] o.a.s.c.a.s.TestSimExtremeIndexing #### Total docs so far: 18,400,000
   [junit4]   2> 1448236 INFO  (TEST-TestSimExtremeIndexing.testScaleUp-seed#[D30EE5D0FE466D69]) [    ] o.a.s.c.a.s.TestSimExtremeIndexing #### Total docs so far: 18,600,000
   [junit4]   2> 1448236 INFO  (TEST-TestSimExtremeIndexing.testScaleUp-seed#[D30EE5D0FE466D69]) [    ] o.a.s.c.a.s.TestSimExtremeIndexing #### Total docs so far: 18,800,000
   [junit4]   2> 1448256 INFO  (TEST-TestSimExtremeIndexing.testScaleUp-seed#[D30EE5D0FE466D69]) [    ] o.a.s.c.a.s.TestSimExtremeIndexing #### Total docs so far: 19,000,000
   [junit4]   2> 1448260 INFO  (TEST-TestSimExtremeIndexing.testScaleUp-seed#[D30EE5D0FE466D69]) [    ] o.a.s.c.a.s.TestSimExtremeIndexing #### Total docs so far: 19,200,000
   [junit4]   2> 1448299 INFO  (TEST-TestSimExtremeIndexing.testScaleUp-seed#[D30EE5D0FE466D69]) [    ] o.a.s.c.a.s.TestSimExtremeIndexing #### Total docs so far: 19,400,000
   [junit4]   2> 1448348 INFO  (TEST-TestSimExtremeIndexing.testScaleUp-seed#[D30EE5D0FE466D69]) [    ] o.a.s.c.a.s.TestSimExtremeIndexing #### Total docs so far: 19,600,000
   [junit4]   2> 1448365 INFO  (TEST-TestSimExtremeIndexing.testScaleUp-seed#[D30EE5D0FE466D69]) [    ] o.a.s.c.a.s.TestSimExtremeIndexing #### Total docs so far: 19,800,000
   [junit4]   2> 1448366 INFO  (TEST-TestSimExtremeIndexing.testScaleUp-seed#[D30EE5D0FE466D69]) [    ] o.a.s.c.a.s.TestSimExtremeIndexing #### Total docs so far: 20,000,000
   [junit4]   2> 1448366 INFO  (TEST-TestSimExtremeIndexing.testScaleUp-seed#[D30EE5D0FE466D69]) [    ] o.a.s.c.a.s.TestSimExtremeIndexing #### Total docs so far: 20,200,000
   [junit4]   2> 1448382 INFO  (TEST-TestSimExtremeIndexing.testScaleUp-seed#[D30EE5D0FE466D69]) [    ] o.a.s.c.a.s.TestSimExtremeIndexing #### Total docs so far: 20,400,000
   [junit4]   2> 1448401 INFO  (TEST-TestSimExtremeIndexing.testScaleUp-seed#[D30EE5D0FE466D69]) [    ] o.a.s.c.a.s.TestSimExtremeIndexing #### Total docs so far: 20,600,000
   [junit4]   2> 1448405 INFO  (TEST-TestSimExtremeIndexing.testScaleUp-seed#[D30EE5D0FE466D69]) [    ] o.a.s.c.a.s.TestSimExtremeIndexing #### Total docs so far: 20,800,000
   [junit4]   2> 1448455 INFO  (TEST-TestSimExtremeIndexing.testScaleUp-seed#[D30EE5D0FE466D69]) [    ] o.a.s.c.a.s.TestSimExtremeIndexing #### Total docs so far: 21,000,000
   [junit4]   2> 1448491 INFO  (TEST-TestSimExtremeIndexing.testScaleUp-seed#[D30EE5D0FE466D69]) [    ] o.a.s.c.a.s.TestSimExtremeIndexing #### Total docs so far: 21,200,000
   [junit4]   2> 1448549 INFO  (TEST-TestSimExtremeIndexing.testScaleUp-seed#[D30EE5D0FE466D69]) [    ] o.a.s.c.a.s.TestSimExtremeIndexing #### Total docs so far: 21,400,000
   [junit4]   2> 1448560 INFO  (TEST-TestSimExtremeIndexing.testScaleUp-seed#[D30EE5D0FE466D69]) [    ] o.a.s.c.a.s.TestSimExtremeIndexing #### Total docs so far: 21,600,000
   [junit4]   2> 1448560 INFO  (TEST-TestSimExtremeIndexing.testScaleUp-seed#[D30EE5D0FE466D69]) [    ] o.a.s.c.a.s.TestSimExtremeIndexing #### Total docs so far: 21,800,000
   [junit4]   2> 1448576 INFO  (TEST-TestSimExtremeIndexing.testScaleUp-seed#[D30EE5D0FE466D69]) [    ] o.a.s.c.a.s.TestSimExtremeIndexing #### Total docs so far: 22,000,000
   [junit4]   2> 1448577 INFO  (TEST-TestSimExtremeIndexing.testScaleUp-seed#[D30EE5D0FE466D69]) [    ] o.a.s.c.a.s.TestSimExtremeIndexing #### Total docs so far: 22,200,000
   [junit4]   2> 1448577 INFO  (TEST-TestSimExtremeIndexing.testScaleUp-seed#[D30EE5D0FE466D69]) [    ] o.a.s.c.a.s.TestSimExtremeIndexing #### Total docs so far: 22,400,000
   [junit4]   2> 1448597 INFO  (TEST-TestSimExtremeIndexing.testScaleUp-seed#[D30EE5D0FE466D69]) [    ] o.a.s.c.a.s.TestSimExtremeIndexing #### Total docs so far: 22,600,000
   [junit4]   2> 1448597 INFO  (TEST-TestSimExtremeIndexing.testScaleUp-seed#[D30EE5D0FE466D69]) [    ] o.a.s.c.a.s.TestSimExtremeIndexing #### Total docs so far: 22,800,000
   [junit4]   2> 1448598 INFO  (TEST-TestSimExtremeIndexing.testScaleUp-seed#[D30EE5D0FE466D69]) [    ] o.a.s.c.a.s.TestSimExtremeIndexing #### Total docs so far: 23,000,000
   [junit4]   2> 1448598 INFO  (TEST-TestSimExtremeIndexing.testScaleUp-seed#[D30EE5D0FE466D69]) [    ] o.a.s.c.a.s.TestSimExtremeIndexing #### Total docs so far: 23,200,000
   [junit4]   2> 1448613 INFO  (TEST-TestSimExtremeIndexing.testScaleUp-seed#[D30EE5D0FE466D69]) [    ] o.a.s.c.a.s.TestSimExtremeIndexing #### Total docs so far: 23,400,000
   [junit4]   2> 1448614 INFO  (TEST-TestSimExtremeIndexing.testScaleUp-seed#[D30EE5D0FE466D69]) [    ] o.a.s.c.a.s.TestSimExtremeIndexing #### Total docs so far: 23,600,000
   [junit4]   2> 1448621 INFO  (TEST-TestSimExtremeIndexing.testScaleUp-seed#[D30EE5D0FE466D69]) [    ] o.a.s.c.a.s.TestSimExtremeIndexing #### Total docs so far: 23,800,000
   [junit4]   2> 1448657 INFO  (TEST-TestSimExtremeIndexing.testScaleUp-seed#[D30EE5D0FE466D69]) [    ] o.a.s.c.a.s.TestSimExtremeIndexing #### Total docs so far: 24,000,000
   [junit4]   2> 1448657 INFO  (TEST-TestSimExtremeIndexing.testScaleUp-seed#[D30EE5D0FE466D69]) [    ] o.a.s.c.a.s.TestSimExtremeIndexing #### Total docs so far: 24,200,000
   [junit4]   2> 1448658 INFO  (TEST-TestSimExtremeIndexing.testScaleUp-seed#[D30EE5D0FE466D69]) [    ] o.a.s.c.a.s.TestSimExtremeIndexing #### Total docs so far: 24,400,000
   [junit4]   2> 1448658 INFO  (TEST-TestSimExtremeIndexing.testScaleUp-seed#[D30EE5D0FE466D69]) [    ] o.a.s.c.a.s.TestSimExtremeIndexing #### Total docs so far: 24,600,000
   [junit4]   2> 1448673 INFO  (TEST-TestSimExtremeIndexing.testScaleUp-seed#[D30EE5D0FE466D69]) [    ] o.a.s.c.a.s.TestSimExtremeIndexing #### Total docs so far: 24,800,000
   [junit4]   2> 1448674 INFO  (TEST-TestSimExtremeIndexing.testScaleUp-seed#[D30EE5D0FE466D69]) [    ] o.a.s.c.a.s.TestSimExtremeIndexing #### Total docs so far: 25,000,000
   [junit4]   2> 1448674 INFO  (TEST-TestSimExtremeIndexing.testScaleUp-seed#[D30EE5D0FE466D69]) [    ] o.a.s.c.a.s.TestSimExtremeIndexing #### Total docs so far: 25,200,000
   [junit4]   2> 1448694 INFO  (TEST-TestSimExtremeIndexing.testScaleUp-seed#[D30EE5D0FE466D69]) [    ] o.a.s.c.a.s.TestSimExtremeIndexing #### Total docs so far: 25,400,000
   [junit4]   2> 1448731 INFO  (TEST-TestSimExtremeIndexing.testScaleUp-seed#[D30EE5D0FE466D69]) [    ] o.a.s.c.a.s.TestSimExtremeIndexing #### Total docs so far: 25,600,000
   [junit4]   2> 1448746 INFO  (TEST-TestSimExtremeIndexing.testScaleUp-seed#[D30EE5D0FE466D69]) [    ] o.a.s.c.a.s.TestSimExtremeIndexing #### Total docs so far: 25,800,000
   [junit4]   2> 1448767 INFO  (TEST-TestSimExtremeIndexing.testScaleUp-seed#[D30EE5D0FE466D69]) [    ] o.a.s.c.a.s.TestSimExtremeIndexing #### Total docs so far: 26,000,000
   [junit4]   2> 1448779 INFO  (TEST-TestSimExtremeIndexing.testScaleUp-seed#[D30EE5D0FE466D69]) [    ] o.a.s.c.a.s.TestSimExtremeIndexing #### Total docs so far: 26,200,000
   [junit4]   2> 1448779 INFO  (TEST-TestSimExtremeIndexing.testScaleUp-seed#[D30EE5D0FE466D69]) [    ] o.a.s.c.a.s.TestSimExtremeIndexing #### Total docs so far: 26,400,000
   [junit4]   2> 1448795 INFO  (TEST-TestSimExtremeIndexing.testScaleUp-seed#[D30EE5D0FE466D69]) [    ] o.a.s.c.a.s.TestSimExtremeIndexing #### Total docs so far: 26,600,000
   [junit4]   2> 1448795 INFO  (TEST-TestSimExtremeIndexing.testScaleUp-seed#[D30EE5D0FE466D69]) [    ] o.a.s.c.a.s.TestSimExtremeIndexing #### Total docs so far: 26,800,000
   [junit4]   2> 1448795 INFO  (TEST-TestSimExtremeIndexing.testScaleUp-seed#[D30EE5D0FE466D69]) [    ] o.a.s.c.a.s.TestSimExtremeIndexing #### Total docs so far: 27,000,000
   [junit4]   2> 1448815 INFO  (TEST-TestSimExtremeIndexing.testScaleUp-seed#[D30EE5D0FE466D69]) [    ] o.a.s.c.a.s.TestSimExtremeIndexing #### Total docs so far: 27,200,000
   [junit4]   2> 1448819 INFO  (TEST-TestSimExtremeIndexing.testScaleUp-seed#[D30EE5D0FE466D69]) [    ] o.a.s.c.a.s.TestSimExtremeIndexing #### Total docs so far: 27,400,000
   [junit4]   2> 1448839 INFO  (TEST-TestSimExtremeIndexing.testScaleUp-seed#[D30EE5D0FE466D69]) [    ] o.a.s.c.a.s.TestSimExtremeIndexing #### Total docs so far: 27,600,000
   [junit4]   2> 1448858 INFO  (TEST-TestSimExtremeIndexing.testScaleUp-seed#[D30EE5D0FE466D69]) [    ] o.a.s.c.a.s.TestSimExtremeIndexing #### Total docs so far: 27,800,000
   [junit4]   2> 1448859 INFO  (TEST-TestSimExtremeIndexing.testScaleUp-seed#[D30EE5D0FE466D69]) [    ] o.a.s.c.a.s.TestSimExtremeIndexing #### Total docs so far: 28,000,000
   [junit4]   2> 1448879 INFO  (TEST-TestSimExtremeIndexing.testScaleUp-seed#[D30EE5D0FE466D69]) [    ] o.a.s.c.a.s.TestSimExtremeIndexing #### Total docs so far: 28,200,000
   [junit4]   2> 1448896 INFO  (TEST-TestSimExtremeIndexing.testScaleUp-seed#[D30EE5D0FE466D69]) [    ] o.a.s.c.a.s.TestSimExtremeIndexing #### Total docs so far: 28,400,000
   [junit4]   2> 1448904 INFO  (TEST-TestSimExtremeIndexing.testScaleUp-seed#[D30EE5D0FE466D69]) [    ] o.a.s.c.a.s.TestSimExtremeIndexing #### Total docs so far: 28,600,000
   [junit4]   2> 1448924 INFO  (TEST-TestSimExtremeIndexing.testScaleUp-seed#[D30EE5D0FE466D69]) [    ] o.a.s.c.a.s.TestSimExtremeIndexing #### Total docs so far: 28,800,000
   [junit4]   2> 1448933 INFO  (TEST-TestSimExtremeIndexing.testScaleUp-seed#[D30EE5D0FE466D69]) [    ] o.a.s.c.a.s.TestSimExtremeIndexing #### Total docs so far: 29,000,000
   [junit4]   2> 1448933 INFO  (TEST-TestSimExtremeIndexing.testScaleUp-seed#[D30EE5D0FE466D69]) [    ] o.a.s.c.a.s.TestSimExtremeIndexing #### Total docs so far: 29,200,000
   [junit4]   2> 1448949 INFO  (TEST-TestSimExtremeIndexing.testScaleUp-seed#[D30EE5D0FE466D69]) [    ] o.a.s.c.a.s.TestSimExtremeIndexing #### Total docs so far: 29,400,000
   [junit4]   2> 1448949 INFO  (TEST-TestSimExtremeIndexing.testScaleUp-seed#[D30EE5D0FE466D69]) [    ] o.a.s.c.a.s.TestSimExtremeIndexing #### Total docs so far: 29,600,000
   [junit4]   2> 1448950 INFO  (TEST-TestSimExtremeIndexing.testScaleUp-seed#[D30EE5D0FE466D69]) [    ] o.a.s.c.a.s.TestSimExtremeIndexing #### Total docs so far: 29,800,000
   [junit4]   2> 1448965 INFO  (TEST-TestSimExtremeIndexing.testScaleUp-seed#[D30EE5D0FE466D69]) [    ] o.a.s.c.a.s.TestSimExtremeIndexing #### Total docs so far: 30,000,000
   [junit4]   2> 1448965 INFO  (TEST-TestSimExtremeIndexing.testScaleUp-seed#[D30EE5D0FE466D69]) [    ] o.a.s.c.a.s.TestSimExtremeIndexing #### Total docs so far: 30,200,000
   [junit4]   2> 1448966 INFO  (TEST-TestSimExtremeIndexing.testScaleUp-seed#[D30EE5D0FE466D69]) [    ] o.a.s.c.a.s.TestSimExtremeIndexing #### Total docs so far: 30,400,000
   [junit4]   2> 1448985 INFO  (TEST-TestSimExtremeIndexing.testScaleUp-seed#[D30EE5D0FE466D69]) [    ] o.a.s.c.a.s.TestSimExtremeIndexing #### Total docs so far: 30,600,000
   [junit4]   2> 1448987 INFO  (TEST-TestSimExtremeIndexing.testScaleUp-seed#[D30EE5D0FE466D69]) [    ] o.a.s.c.a.s.TestSimExtremeIndexing #### Total docs so far: 30,800,000
   [junit4]   2> 1448988 INFO  (TEST-TestSimExtremeIndexing.testScaleUp-seed#[D30EE5D0FE466D69]) [    ] o.a.s.c.a.s.TestSimExtremeIndexing #### Total docs so far: 31,000,000
   [junit4]   2> 1449002 INFO  (TEST-TestSimExtremeIndexing.testScaleUp-seed#[D30EE5D0FE466D69]) [    ] o.a.s.c.a.s.TestSimExtremeIndexing #### Total docs so far: 31,200,000
   [junit4]   2> 1449002 INFO  (TEST-TestSimExtremeIndexing.testScaleUp-seed#[D30EE5D0FE466D69]) [    ] o.a.s.c.a.s.TestSimExtremeIndexing #### Total docs so far: 31,400,000
   [junit4]   2> 1449003 INFO  (TEST-TestSimExtremeIndexing.testScaleUp-seed#[D30EE5D0FE466D69]) [    ] o.a.s.c.a.s.TestSimExtremeIndexing #### Total docs so far: 31,600,000
   [junit4]   2> 1449004 INFO  (TEST-TestSimExtremeIndexing.testScaleUp-seed#[D30EE5D0FE466D69]) [    ] o.a.s.c.a.s.TestSimExtremeIndexing #### Total docs so far: 31,800,000
   [junit4]   2> 1449005 INFO  (TEST-TestSimExtremeIndexing.testScaleUp-seed#[D30EE5D0FE466D69]) [    ] o.a.s.c.a.s.TestSimExtremeIndexing #### Total docs so far: 32,000,000
   [junit4]   2> 1449005 INFO  (TEST-TestSimExtremeIndexing.testScaleUp-seed#[D30EE5D0FE466D69]) [    ] o.a.s.c.a.s.TestSimExtremeIndexing #### Total docs so far: 32,200,000
   [junit4]   2> 1449022 INFO  (TEST-TestSimExtremeIndexing.testScaleUp-seed#[D30EE5D0FE466D69]) [    ] o.a.s.c.a.s.TestSimExtremeIndexing #### Total docs so far: 32,400,000
   [junit4]   2> 1449058 INFO  (TEST-TestSimExtremeIndexing.testScaleUp-seed#[D30EE5D0FE466D69]) [    ] o.a.s.c.a.s.TestSimExtremeIndexing #### Total docs so far: 32,600,000
   [junit4]   2> 1449070 INFO  (TEST-TestSimExtremeIndexing.testScaleUp-seed#[D30EE5D0FE466D69]) [    ] o.a.s.c.a.s.TestSimExtremeIndexing #### Total docs so far: 32,800,000
   [junit4]   2> 1449074 INFO  (TEST-TestSimExtremeIndexing.testScaleUp-seed#[D30EE5D0FE466D69]) [    ] o.a.s.c.a.s.TestSimExtremeIndexing #### Total docs so far: 33,000,000
   [junit4]   2> 1449095 INFO  (TEST-TestSimExtremeIndexing.testScaleUp-seed#[D30EE5D0FE466D69]) [    ] o.a.s.c.a.s.TestSimExtremeIndexing #### Total docs so far: 33,200,000
   [junit4]   2> 1449095 INFO  (TEST-TestSimExtremeIndexing.testScaleUp-seed#[D30EE5D0FE466D69]) [    ] o.a.s.c.a.s.TestSimExtremeIndexing #### Total docs so far: 33,400,000
   [junit4]   2> 1449095 INFO  (TEST-TestSimExtremeIndexing.testScaleUp-seed#[D30EE5D0FE466D69]) [    ] o.a.s.c.a.s.TestSimExtremeIndexing #### Total docs so far: 33,600,000
   [junit4]   2> 1449111 INFO  (TEST-TestSimExtremeIndexing.testScaleUp-seed#[D30EE5D0FE466D69]) [    ] o.a.s.c.a.s.TestSimExtremeIndexing #### Total docs so far: 33,800,000
   [junit4]   2> 1449143 INFO  (TEST-TestSimExtremeIndexing.testScaleUp-seed#[D30EE5D0FE466D69]) [    ] o.a.s.c.a.s.TestSimExtremeIndexing #### Total docs so far: 34,000,000
   [junit4]   2> 1449159 INFO  (TEST-TestSimExtremeIndexing.testScaleUp-seed#[D30EE5D0FE466D69]) [    ] o.a.s.c.a.s.TestSimExtremeIndexing #### Total docs so far: 34,200,000
   [junit4]   2> 1449195 INFO  (TEST-TestSimExtremeIndexing.testScaleUp-seed#[D30EE5D0FE466D69]) [    ] o.a.s.c.a.s.TestSimExtremeIndexing #### Total docs so far: 34,400,000
   [junit4]   2> 1449232 INFO  (TEST-TestSimExtremeIndexing.testScaleUp-seed#[D30EE5D0FE466D69]) [    ] o.a.s.c.a.s.TestSimExtremeIndexing #### Total docs so far: 34,600,000
   [junit4]   2> 1449268 INFO  (TEST-TestSimExtremeIndexing.testScaleUp-seed#[D30EE5D0FE466D69]) [    ] o.a.s.c.a.s.TestSimExtremeIndexing #### Total docs so far: 34,800,000
   [junit4]   2> 1449293 INFO  (TEST-TestSimExtremeIndexing.testScaleUp-seed#[D30EE5D0FE466D69]) [    ] o.a.s.c.a.s.TestSimExtremeIndexing #### Total docs so far: 35,000,000
   [junit4]   2> 1449316 INFO  (TEST-TestSimExtremeIndexing.testScaleUp-seed#[D30EE5D0FE466D69]) [    ] o.a.s.c.a.s.TestSimExtremeIndexing #### Total docs so far: 35,200,000
   [junit4]   2> 1449350 INFO  (TEST-TestSimExtremeIndexing.testScaleUp-seed#[D30EE5D0FE466D69]) [    ] o.a.s.c.a.s.TestSimExtremeIndexing #### Total docs so far: 35,400,000
   [junit4]   2> 1449366 INFO  (TEST-TestSimExtremeIndexing.testScaleUp-seed#[D30EE5D0FE466D69]) [    ] o.a.s.c.a.s.TestSimExtremeIndexing #### Total docs so far: 35,600,000
   [junit4]   2> 1449366 INFO  (TEST-TestSimExtremeIndexing.testScaleUp-seed#[D30EE5D0FE466D69]) [    ] o.a.s.c.a.s.TestSimExtremeIndexing #### Total docs so far: 35,800,000
   [junit4]   2> 1449386 INFO  (TEST-TestSimExtremeIndexing.testScaleUp-seed#[D30EE5D0FE466D69]) [    ] o.a.s.c.a.s.TestSimExtremeIndexing #### Total docs so far: 36,000,000
   [junit4]   2> 1449387 INFO  (TEST-TestSimExtremeIndexing.testScaleUp-seed#[D30EE5D0FE466D69]) [    ] o.a.s.c.a.s.TestSimExtremeIndexing #### Total docs so far: 36,200,000
   [junit4]   2> 1449387 INFO  (TEST-TestSimExtremeIndexing.testScaleUp-seed#[D30EE5D0FE466D69]) [    ] o.a.s.c.a.s.TestSimExtremeIndexing #### Total docs so far: 36,400,000
   [junit4]   2> 1449387 INFO  (TEST-TestSimExtremeIndexing.testScaleUp-seed#[D30EE5D0FE466D69]) [    ] o.a.s.c.a.s.TestSimExtremeIndexing #### Total docs so far: 36,600,000
   [junit4]   2> 1449403 INFO  (TEST-TestSimExtremeIndexing.testScaleUp-seed#[D30EE5D0FE466D69]) [    ] o.a.s.c.a.s.TestSimExtremeIndexing #### Total docs so far: 36,800,000
   [junit4]   2> 1449423 INFO  (TEST-TestSimExtremeIndexing.testScaleUp-seed#[D30EE5D0FE466D69]) [    ] o.a.s.c.a.s.TestSimExtremeIndexing #### Total docs so far: 37,000,000
   [junit4]   2> 1449423 INFO  (TEST-TestSimExtremeIndexing.testScaleUp-seed#[D30EE5D0FE466D69]) [    ] o.a.s.c.a.s.TestSimExtremeIndexing #### Total docs so far: 37,200,000
   [junit4]   2> 1449424 INFO  (TEST-TestSimExtremeIndexing.testScaleUp-seed#[D30EE5D0FE466D69]) [    ] o.a.s.c.a.s.TestSimExtremeIndexing #### Total docs so far: 37,400,000
   [junit4]   2> 1449439 INFO  (TEST-TestSimExtremeIndexing.testScaleUp-seed#[D30EE5D0FE466D69]) [    ] o.a.s.c.a.s.TestSimExtremeIndexing #### Total docs so far: 37,600,000
   [junit4]   2> 1449439 INFO  (TEST-TestSimExtremeIndexing.testScaleUp-seed#[D30EE5D0FE466D69]) [    ] o.a.s.c.a.s.TestSimExtremeIndexing #### Total docs so far: 37,800,000
   [junit4]   2> 1449440 INFO  (TEST-TestSimExtremeIndexing.testScaleUp-seed#[D30EE5D0FE466D69]) [    ] o.a.s.c.a.s.TestSimExtremeIndexing #### Total docs so far: 38,000,000
   [junit4]   2> 1449459 INFO  (TEST-TestSimExtremeIndexing.testScaleUp-seed#[D30EE5D0FE466D69]) [    ] o.a.s.c.a.s.TestSimExtremeIndexing #### Total docs so far: 38,200,000
   [junit4]   2> 1449477 INFO  (TEST-TestSimExtremeIndexing.testScaleUp-seed#[D30EE5D0FE466D69]) [    ] o.a.s.c.a.s.TestSimExtremeIndexing #### Total docs so far: 38,400,000
   [junit4]   2> 1449477 INFO  (TEST-TestSimExtremeIndexing.testScaleUp-seed#[D30EE5D0FE466D69]) [    ] o.a.s.c.a.s.TestSimExtremeIndexing #### Total docs so far: 38,600,000
   [junit4]   2> 1449478 INFO  (TEST-TestSimExtremeIndexing.testScaleUp-seed#[D30EE5D0FE466D69]) [    ] o.a.s.c.a.s.TestSimExtremeIndexing #### Total docs so far: 38,800,000
   [junit4]   2> 1449478 INFO  (TEST-TestSimExtremeIndexing.testScaleUp-seed#[D30EE5D0FE466D69]) [    ] o.a.s.c.a.s.TestSimExtremeIndexing #### Total docs so far: 39,000,000
   [junit4]   2> 1449478 INFO  (TEST-TestSimExtremeIndexing.testScaleUp-seed#[D30EE5D0FE466D69]) [    ] o.a.s.c.a.s.TestSimExtremeIndexing #### Total docs so far: 39,200,000
   [junit4]   2> 1449478 INFO  (TEST-TestSimExtremeIndexing.testScaleUp-seed#[D30EE5D0FE466D69]) [    ] o.a.s.c.a.s.TestSimExtremeIndexing #### Total docs so far: 39,400,000
   [junit4]   2> 1449478 INFO  (TEST-TestSimExtremeIndexing.testScaleUp-seed#[D30EE5D0FE466D69]) [    ] o.a.s.c.a.s.TestSimExtremeIndexing #### Total docs so far: 39,600,000
   [junit4]   2> 1449479 INFO  (TEST-TestSimExtremeIndexing.testScaleUp-seed#[D30EE5D0FE466D69]) [    ] o.a.s.c.a.s.TestSimExtremeIndexing #### Total docs so far: 39,800,000
   [junit4]   2> 1449479 INFO  (TEST-TestSimExtremeIndexing.testScaleUp-seed#[D30EE5D0FE466D69]) [    ] o.a.s.c.a.s.TestSimExtremeIndexing #### Total docs so far: 40,000,000
   [junit4]   2> 1449512 INFO  (TEST-TestSimExtremeIndexing.testScaleUp-seed#[D30EE5D0FE466D69]) [    ] o.a.s.c.a.s.TestSimExtremeIndexing #### Total docs so far: 40,200,000
   [junit4]   2> 1449512 INFO  (TEST-TestSimExtremeIndexing.testScaleUp-seed#[D30EE5D0FE466D69]) [    ] o.a.s.c.a.s.TestSimExtremeIndexing #### Total docs so far: 40,400,000
   [junit4]   2> 1449512 INFO  (TEST-TestSimExtremeIndexing.testScaleUp-seed#[D30EE5D0FE466D69]) [    ] o.a.s.c.a.s.TestSimExtremeIndexing #### Total docs so far: 40,600,000
   [junit4]   2> 1449512 INFO  (TEST-TestSimExtremeIndexing.testScaleUp-seed#[D30EE5D0FE466D69]) [    ] o.a.s.c.a.s.TestSimExtremeIndexing #### Total docs so far: 40,800,000
   [junit4]   2> 1449515 INFO  (TEST-TestSimExtremeIndexing.testScaleUp-seed#[D30EE5D0FE466D69]) [    ] o.a.s.c.a.s.TestSimExtremeIndexing #### Total docs so far: 41,000,000
   [junit4]   2> 1449580 INFO  (TEST-TestSimExtremeIndexing.testScaleUp-seed#[D30EE5D0FE466D69]) [    ] o.a.s.c.a.s.TestSimExtremeIndexing #### Total docs so far: 41,200,000
   [junit4]   2> 1449580 INFO  (TEST-TestSimExtremeIndexing.testScaleUp-seed#[D30EE5D0FE466D69]) [    ] o.a.s.c.a.s.TestSimExtremeIndexing #### Total docs so far: 41,400,000
   [junit4]   2> 1449613 INFO  (TEST-TestSimExtremeIndexing.testScaleUp-seed#[D30EE5D0FE466D69]) [    ] o.a.s.c.a.s.TestSimExtremeIndexing #### Total docs so far: 41,600,000
   [junit4]   2> 1449613 INFO  (TEST-TestSimExtremeIndexing.testScaleUp-seed#[D30EE5D0FE466D69]) [    ] o.a.s.c.a.s.TestSimExtremeIndexing #### Total docs so far: 41,800,000
   [junit4]   2> 1449614 INFO  (TEST-TestSimExtremeIndexing.testScaleUp-seed#[D30EE5D0FE466D69]) [    ] o.a.s.c.a.s.TestSimExtremeIndexing #### Total docs so far: 42,000,000
   [junit4]   2> 1449614 INFO  (TEST-TestSimExtremeIndexing.testScaleUp-seed#[D30EE5D0FE466D69]) [    ] o.a.s.c.a.s.TestSimExtremeIndexing #### Total docs so far: 42,200,000
   [junit4]   2> 1449614 INFO  (TEST-TestSimExtremeIndexing.testScaleUp-seed#[D30EE5D0FE466D69]) [    ] o.a.s.c.a.s.TestSimExtremeIndexing #### Total docs so far: 42,400,000
   [junit4]   2> 1449615 INFO  (TEST-TestSimExtremeIndexing.testScaleUp-seed#[D30EE5D0FE466D69]) [    ] o.a.s.c.a.s.TestSimExtremeIndexing #### Total docs so far: 42,600,000
   [junit4]   2> 1449615 INFO  (TEST-TestSimExtremeIndexing.testScaleUp-seed#[D30EE5D0FE466D69]) [    ] o.a.s.c.a.s.TestSimExtremeIndexing #### Total docs so far: 42,800,000
   [junit4]   2> 1449616 INFO  (TEST-TestSimExtremeIndexing.testScaleUp-seed#[D30EE5D0FE466D69]) [    ] o.a.s.c.a.s.TestSimExtremeIndexing #### Total docs so far: 43,000,000
   [junit4]   2> 1449616 INFO  (TEST-TestSimExtremeIndexing.testScaleUp-seed#[D30EE5D0FE466D69]) [    ] o.a.s.c.a.s.TestSimExtremeIndexing #### Total docs so far: 43,200,000
   [junit4]   2> 1449617 INFO  (TEST-TestSimExtremeIndexing.testScaleUp-seed#[D30EE5D0FE466D69]) [    ] o.a.s.c.a.s.TestSimExtremeIndexing #### Total docs so far: 43,400,000
   [junit4]   2> 1449617 INFO  (TEST-TestSimExtremeIndexing.testScaleUp-seed#[D30EE5D0FE466D69]) [    ] o.a.s.c.a.s.TestSimExtremeIndexing #### Total docs so far: 43,600,000
   [junit4]   2> 1449649 INFO  (TEST-TestSimExtremeIndexing.testScaleUp-seed#[D30EE5D0FE466D69]) [    ] o.a.s.c.a.s.TestSimExtremeIndexing #### Total docs so far: 43,800,000
   [junit4]   2> 1449650 INFO  (TEST-TestSimExtremeIndexing.testScaleUp-seed#[D30EE5D0FE466D69]) [    ] o.a.s.c.a.s.TestSimExtremeIndexing #### Total docs so far: 44,000,000
   [junit4]   2> 1449650 INFO  (TEST-TestSimExtremeIndexing.testScaleUp-seed#[D30EE5D0FE466D69]) [    ] o.a.s.c.a.s.TestSimExtremeIndexing #### Total docs so far: 44,200,000
   [junit4]   2> 1449650 INFO  (TEST-TestSimExtremeIndexing.testScaleUp-seed#[D30EE5D0FE466D69]) [    ] o.a.s.c.a.s.TestSimExtremeIndexing #### Total docs so far: 44,400,000
   [junit4]   2> 1449651 INFO  (TEST-TestSimExtremeIndexing.testScaleUp-seed#[D30EE5D0FE466D69]) [    ] o.a.s.c.a.s.TestSimExtremeIndexing #### Total docs so far: 44,600,000
   [junit4]   2> 1449651 INFO  (TEST-TestSimExtremeIndexing.testScaleUp-seed#[D30EE5D0FE466D69]) [    ] o.a.s.c.a.s.TestSimExtremeIndexing #### Total docs so far: 44,800,000
   [junit4]   2> 1449651 INFO  (TEST-TestSimExtremeIndexing.testScaleUp-seed#[D30EE5D0FE466D69]) [    ] o.a.s.c.a.s.TestSimExtremeIndexing #### Total docs so far: 45,000,000
   [junit4]   2> 1449651 INFO  (TEST-TestSimExtremeIndexing.testScaleUp-seed#[D30EE5D0FE466D69]) [    ] o.a.s.c.a.s.TestSimExtremeIndexing #### Total docs so far: 45,200,000
   [junit4]   2> 1449651 INFO  (TEST-TestSimExtremeIndexing.testScaleUp-seed#[D30EE5D0FE466D69]) [    ] o.a.s.c.a.s.TestSimExtremeIndexing #### Total docs so far: 45,400,000
   [junit4]   2> 1449652 INFO  (TEST-TestSimExtremeIndexing.testScaleUp-seed#[D30EE5D0FE466D69]) [    ] o.a.s.c.a.s.TestSimExtremeIndexing #### Total docs so far: 45,600,000
   [junit4]   2> 1449652 INFO  (TEST-TestSimExtremeIndexing.testScaleUp-seed#[D30EE5D0FE466D69]) [    ] o.a.s.c.a.s.TestSimExtremeIndexing #### Total docs so far: 45,800,000
   [junit4]   2> 1449652 INFO  (TEST-TestSimExtremeIndexing.testScaleUp-seed#[D30EE5D0FE466D69]) [    ] o.a.s.c.a.s.TestSimExtremeIndexing #### Total docs so far: 46,000,000
   [junit4]   2> 1449652 INFO  (TEST-TestSimExtremeIndexing.testScaleUp-seed#[D30EE5D0FE466D69]) [    ] o.a.s.c.a.s.TestSimExtremeIndexing #### Total docs so far: 46,200,000
   [junit4]   2> 1449653 INFO  (TEST-TestSimExtremeIndexing.testScaleUp-seed#[D30EE5D0FE466D69]) [    ] o.a.s.c.a.s.TestSimExtremeIndexing #### Total docs so far: 46,400,000
   [junit4]   2> 1449653 INFO  (TEST-TestSimExtremeIndexing.testScaleUp-seed#[D30EE5D0FE466D69]) [    ] o.a.s.c.a.s.TestSimExtremeIndexing #### Total docs so far: 46,600,000
   [junit4]   2> 1449653 INFO  (TEST-TestSimExtremeIndexing.testScaleUp-seed#[D30EE5D0FE466D69]) [    ] o.a.s.c.a.s.TestSimExtremeIndexing #### Total docs so far: 46,800,000
   [junit4]   2> 1449653 INFO  (TEST-TestSimExtremeIndexing.testScaleUp-seed#[D30EE5D0FE466D69]) [    ] o.a.s.c.a.s.TestSimExtremeIndexing #### Total docs so far: 47,000,000
   [junit4]   2> 1449661 DEBUG (ScheduledTrigger-2711-thread-4) [    ] o.a.s.c.a.ScheduledTriggers ++++++++ Cooldown inactive - processing event: {
   [junit4]   2>   "id":"70a892d17c83abTefl00p9l3373chrnbf2rmwkgs",
   [junit4]   2>   "source":"scaleUpTrigger",
   [junit4]   2>   "eventTime":31710545924883371,
   [junit4]   2>   "eventType":"INDEXSIZE",
   [junit4]   2>   "properties":{
   [junit4]   2>     "aboveSize":{
   [junit4]   2>       "testScaleUp_collection_shard1_replica_n1":"docs=20600000, bytes=10300010240",
   [junit4]   2>       "testScaleUp_collection_shard2_replica_n3":"docs=20600000, bytes=10300010240"},
   [junit4]   2>     "belowSize":{},
   [junit4]   2>     "requestedOps":[
   [junit4]   2>       {
   [junit4]   2>         "action":"SPLITSHARD",
   [junit4]   2>         "hints":{
   [junit4]   2>           "COLL_SHARD":[{
   [junit4]   2>               "first":"testScaleUp_collection",
   [junit4]   2>               "second":"shard1"}],
   [junit4]   2>           "PARAMS":{"splitMethod":"link"}}},
   [junit4]   2>       {
   [junit4]   2>         "action":"SPLITSHARD",
   [junit4]   2>         "hints":{
   [junit4]   2>           "COLL_SHARD":[{
   [junit4]   2>               "first":"testScaleUp_collection",
   [junit4]   2>               "second":"shard2"}],
   [junit4]   2>           "PARAMS":{"splitMethod":"link"}}}]}}
   [junit4]   2> 1449707 INFO  (TEST-TestSimExtremeIndexing.testScaleUp-seed#[D30EE5D0FE466D69]) [    ] o.a.s.c.a.s.TestSimExtremeIndexing #### Total docs so far: 47,200,000
   [junit4]   2> 1449710 DEBUG (ScheduledTrigger-2711-thread-4) [    ] o.a.s.c.a.ScheduledTriggers Pausing all triggers: [.auto_add_replicas, scaleUpTrigger, .scheduled_maintenance]
   [junit4]   2> 1449711 DEBUG (ScheduledTrigger-2711-thread-4) [    ] o.a.s.c.a.SystemLogListener Collection .system missing, skip sending event {
   [junit4]   2>   "id":"70a892d17c83abTefl00p9l3373chrnbf2rmwkgs",
   [junit4]   2>   "source":"scaleUpTrigger",
   [junit4]   2>   "eventTime":31710545924883371,
   [junit4]   2>   "eventType":"INDEXSIZE",
   [junit4]   2>   "properties":{
   [junit4]   2>     "aboveSize":{
   [junit4]   2>       "testScaleUp_collection_shard1_replica_n1":"docs=20600000, bytes=10300010240",
   [junit4]   2>       "testScaleUp_collection_shard2_replica_n3":"docs=20600000, bytes=10300010240"},
   [junit4]   2>     "belowSize":{},
   [junit4]   2>     "_enqueue_time_":31710565351142471,
   [junit4]   2>     "requestedOps":[
   [junit4]   2>       {
   [junit4]   2>         "action":"SPLITSHARD",
   [junit4]   2>         "hints":{
   [junit4]   2>           "COLL_SHARD":[{
   [junit4]   2>               "first":"testScaleUp_collection",
   [junit4]   2>               "second":"shard1"}],
   [junit4]   2>           "PARAMS":{"splitMethod":"link"}}},
   [junit4]   2>       {
   [junit4]   2>         "action":"SPLITSHARD",
   [junit4]   2>         "hints":{
   [junit4]   2>           "COLL_SHARD":[{
   [junit4]   2>               "first":"testScaleUp_collection",
   [junit4]   2>               "second":"shard2"}],
   [junit4]   2>           "PARAMS":{"splitMethod":"link"}}}]}}
   [junit4]   2> 1449752 INFO  (TEST-TestSimExtremeIndexing.testScaleUp-seed#[D30EE5D0FE466D69]) [    ] o.a.s.c.a.s.TestSimExtremeIndexing #### Total docs so far: 47,400,000
   [junit4]   2> 1449752 INFO  (TEST-TestSimExtremeIndexing.testScaleUp-seed#[D30EE5D0FE466D69]) [    ] o.a.s.c.a.s.TestSimExtremeIndexing #### Total docs so far: 47,600,000
   [junit4]   2> 1449752 INFO  (TEST-TestSimExtremeIndexing.testScaleUp-seed#[D30EE5D0FE466D69]) [    ] o.a.s.c.a.s.TestSimExtremeIndexing #### Total docs so far: 47,800,000
   [junit4]   2> 1449752 INFO  (TEST-TestSimExtremeIndexing.testScaleUp-seed#[D30EE5D0FE466D69]) [    ] o.a.s.c.a.s.TestSimExtremeIndexing #### Total docs so far: 48,000,000
   [junit4]   2> 1449753 INFO  (TEST-TestSimExtremeIndexing.testScaleUp-seed#[D30EE5D0FE466D69]) [    ] o.a.s.c.a.s.TestSimExtremeIndexing #### Total docs so far: 48,200,000
   [junit4]   2> 1449753 INFO  (TEST-TestSimExtremeIndexing.testScaleUp-seed#[D30EE5D0FE466D69]) [    ] o.a.s.c.a.s.TestSimExtremeIndexing #### Total docs so far: 48,400,000
   [junit4]   2> 1449753 INFO  (TEST-TestSimExtremeIndexing.testScaleUp-seed#[D30EE5D0FE466D69]) [    ] o.a.s.c.a.s.TestSimExtremeIndexing #### Total docs so far: 48,600,000
   [junit4]   2> 1449753 INFO  (TEST-TestSimExtremeIndexing.testScaleUp-seed#[D30EE5D0FE466D69]) [    ] o.a.s.c.a.s.TestSimExtremeIndexing #### Total docs so far: 48,800,000
   [junit4]   2> 1449754 INFO  (TEST-TestSimExtremeIndexing.testScaleUp-seed#[D30EE5D0FE466D69]) [    ] o.a.s.c.a.s.TestSimExtremeIndexing #### Total docs so far: 49,000,000
   [junit4]   2> 1449754 INFO  (TEST-TestSimExtremeIndexing.testScaleUp-seed#[D30EE5D0FE466D69]) [    ] o.a.s.c.a.s.TestSimExtremeIndexing #### Total docs so far: 49,200,000
   [junit4]   2> 1449754 INFO  (TEST-TestSimExtremeIndexing.testScaleUp-seed#[D30EE5D0FE466D69]) [    ] o.a.s.c.a.s.TestSimExtremeIndexing #### Total docs so far: 49,400,000
   [junit4]   2> 1449767 DEBUG (AutoscalingActionExecutor-2712-thread-1) [    ] o.a.s.c.a.ScheduledTriggers -- processing actions for {
   [junit4]   2>   "id":"70a892d17c83abTefl00p9l3373chrnbf2rmwkgs",
   [junit4]   2>   "source":"scaleUpTrigger",
   [junit4]   2>   "eventTime":31710545924883371,
   [junit4]   2>   "eventType":"INDEXSIZE",
   [junit4]   2>   "properties":{
   [junit4]   2>     "aboveSize":{
   [junit4]   2>       "testScaleUp_collection_shard1_replica_n1":"docs=20600000, bytes=10300010240",
   [junit4]   2>       "testScaleUp_collection_shard2_replica_n3":"docs=20600000, bytes=10300010240"},
   [junit4]   2>     "belowSize":{},
   [junit4]   2>     "_enqueue_time_":31710565351142471,
   [junit4]   2>     "requestedOps":[
   [junit4]   2>       {
   [junit4]   2>         "action":"SPLITSHARD",
   [junit4]   2>         "hints":{
   [junit4]   2>           "COLL_SHARD":[{
   [junit4]   2>               "first":"testScaleUp_collection",
   [junit4]   2>               "second":"shard1"}],
   [junit4]   2>           "PARAMS":{"splitMethod":"link"}}},
   [junit4]   2>       {
   [junit4]   2>         "action":"SPLITSHARD",
   [junit4]   2>         "hints":{
   [junit4]   2>           "COLL_SHARD":[{
   [junit4]   2>               "first":"testScaleUp_collection",
   [junit4]   2>               "second":"shard2"}],
   [junit4]   2>           "PARAMS":{"splitMethod":"link"}}}]}}
   [junit4]   2> 1449770 DEBUG (AutoscalingActionExecutor-2712-thread-1) [    ] o.a.s.c.a.ExecutePlanAction -- processing event: {
   [junit4]   2>   "id":"70a892d17c83abTefl00p9l3373chrnbf2rmwkgs",
   [junit4]   2>   "source":"scaleUpTrigger",
   [junit4]   2>   "eventTime":31710545924883371,
   [junit4]   2>   "eventType":"INDEXSIZE",
   [junit4]   2>   "properties":{
   [junit4]   2>     "__start__":2,
   [junit4]   2>     "aboveSize":{
   [junit4]   2>       "testScaleUp_collection_shard1_replica_n1":"docs=20600000, bytes=10300010240",
   [junit4]   2>       "testScaleUp_collection_shard2_replica_n3":"docs=20600000, bytes=10300010240"},
   [junit4]   2>     "belowSize":{},
   [junit4]   2>     "_enqueue_time_":31710565351142471,
   [junit4]   2>     "requestedOps":[
   [junit4]   2>       {
   [junit4]   2>         "action":"SPLITSHARD",
   [junit4]   2>         "hints":{
   [junit4]   2>           "COLL_SHARD":[{
   [junit4]   2>               "first":"testScaleUp_collection",
   [junit4]   2>               "second":"shard1"}],
   [junit4]   2>           "PARAMS":{"splitMethod":"link"}}},
   [junit4]   2>       {
   [junit4]   2>         "action":"SPLITSHARD",
   [junit4]   2>         "hints":{
   [junit4]   2>           "COLL_SHARD":[{
   [junit4]   2>               "first":"testScaleUp_collection",
   [junit4]   2>               "second":"shard2"}],
   [junit4]   2>           "PARAMS":{"splitMethod":"link"}}}]}} with context properties: {operations=[{
   [junit4]   2>   "class":"org.apache.solr.client.solrj.request.CollectionAdminRequest$SplitShard",
   [junit4]   2>   "method":"GET",
   [junit4]   2>   "params.action":"SPLITSHARD",
   [junit4]   2>   "params.collection":"testScaleUp_collection",
   [junit4]   2>   "params.shard":"shard1",
   [junit4]   2>   "params.splitMethod":"link"}, {
   [junit4]   2>   "class":"org.apache.solr.client.solrj.request.CollectionAdminRequest$SplitShard",
   [junit4]   2>   "method":"GET",
   [junit4]   2>   "params.action":"SPLITSHARD",
   [junit4]   2>   "params.collection":"testScaleUp_collection",
   [junit4]   2>   "params.shard":"shard2",
   [junit4]   2>   "params.splitMethod":"link"}], AFTER_ACTION=[compute_plan], BEFORE_ACTION=[compute_plan, execute_plan]}
   [junit4]   2> 1449770 DEBUG (AutoscalingActionExecutor-2712-thread-1) [    ] o.a.s.c.a.ExecutePlanAction Executing operation: action=SPLITSHARD&collection=testScaleUp_collection&shard=shard1&splitMethod=link
   [junit4]   2> 1449787 INFO  (TEST-TestSimExtremeIndexing.testScaleUp-seed#[D30EE5D0FE466D69]) [    ] o.a.s.c.a.s.TestSimExtremeIndexing #### Total docs so far: 49,600,000
   [junit4]   2> 1449788 INFO  (TEST-TestSimExtremeIndexing.testScaleUp-seed#[D30EE5D0FE466D69]) [    ] o.a.s.c.a.s.TestSimExtremeIndexing #### Total docs so far: 49,800,000
   [junit4]   2> 1449788 INFO  (TEST-TestSimExtremeIndexing.testScaleUp-seed#[D30EE5D0FE466D69]) [    ] o.a.s.c.a.s.TestSimExtremeIndexing #### Total docs so far: 50,000,000
   [junit4]   2> 1449788 INFO  (TEST-TestSimExtremeIndexing.testScaleUp-seed#[D30EE5D0FE466D69]) [    ] o.a.s.c.a.s.TestSimExtremeIndexing #### Total docs so far: 50,200,000
   [junit4]   2> 1449788 INFO  (TEST-TestSimExtremeIndexing.testScaleUp-seed#[D30EE5D0FE466D69]) [    ] o.a.s.c.a.s.TestSimExtremeIndexing #### Total docs so far: 50,400,000
   [junit4]   2> 1449790 INFO  (TEST-TestSimExtremeIndexing.testScaleUp-seed#[D30EE5D0FE466D69]) [    ] o.a.s.c.a.s.TestSimExtremeIndexing #### Total docs so far: 50,600,000
   [junit4]   2> 1449824 INFO  (TEST-TestSimExtremeIndexing.testScaleUp-seed#[D30EE5D0FE466D69]) [    ] o.a.s.c.a.s.TestSimExtremeIndexing #### Total docs so far: 50,800,000
   [junit4]   2> 1449840 INFO  (simCloudManagerPool-2710-thread-57) [    ] o.a.s.c.a.c.SplitShardCmd numSubShards set at: 2
   [junit4]   2> 1449860 INFO  (TEST-TestSimExtremeIndexing.testScaleUp-seed#[D30EE5D0FE466D69]) [    ] o.a.s.c.a.s.TestSimExtremeIndexing #### Total docs so far: 51,000,000
   [junit4]   2> 1449862 INFO  (TEST-TestSimExtremeIndexing.testScaleUp-seed#[D30EE5D0FE466D69]) [    ] o.a.s.c.a.s.TestSimExtremeIndexing #### Total docs so far: 51,200,000
   [junit4]   2> 1449863 INFO  (TEST-TestSimExtremeIndexing.testScaleUp-seed#[D30EE5D0FE466D69]) [    ] o.a.s.c.a.s.TestSimExtremeIndexing #### Total docs so far: 51,400,000
   [junit4]   2> 1449896 INFO  (TEST-TestSimExtremeIndexing.testScaleUp-seed#[D30EE5D0FE466D69]) [    ] o.a.s.c.a.s.TestSimExtremeIndexing #### Total docs so far: 51,600,000
   [junit4]   2> 1449917 INFO  (TEST-TestSimExtremeIndexing.testScaleUp-seed#[D30EE5D0FE466D69]) [    ] o.a.s.c.a.s.TestSimExtremeIndexing #### Total docs so far: 51,800,000
   [junit4]   2> 1449933 INFO  (TEST-TestSimExtremeIndexing.testScaleUp-seed#[D30EE5D0FE466D69]) [    ] o.a.s.c.a.s.TestSimExtremeIndexing #### Total docs so far: 52,000,000
   [junit4]   2> 1449969 INFO  (TEST-TestSimExtremeIndexing.testScaleUp-seed#[D30EE5D0FE466D69]) [    ] o.a.s.c.a.s.TestSimExtremeIndexing #### Total docs so far: 52,200,000
   [junit4]   2> 1449970 INFO  (TEST-TestSimExtremeIndexing.testScaleUp-seed#[D30EE5D0FE466D69]) [    ] o.a.s.c.a.s.TestSimExtremeIndexing #### Total docs so far: 52,400,000
   [junit4]   2> 1449970 INFO  (TEST-TestSimExtremeIndexing.testScaleUp-seed#[D30EE5D0FE466D69]) [    ] o.a.s.c.a.s.TestSimExtremeIndexing #### Total docs so far: 52,600,000
   [junit4]   2> 1449970 INFO  (TEST-TestSimExtremeIndexing.testScaleUp-seed#[D30EE5D0FE466D69]) [    ] o.a.s.c.a.s.TestSimExtremeIndexing #### Total docs so far: 52,800,000
   [junit4]   2> 1449971 INFO  (TEST-TestSimExtremeIndexing.testScaleUp-seed#[D30EE5D0FE466D69]) [    ] o.a.s.c.a.s.TestSimExtremeIndexing #### Total docs so far: 53,000,000
   [junit4]   2> 1449971 INFO  (TEST-TestSimExtremeIndexing.testScaleUp-seed#[D30EE5D0FE466D69]) [    ] o.a.s.c.a.s.TestSimExtremeIndexing #### Total docs so far: 53,200,000
   [junit4]   2> 1449971 INFO  (TEST-TestSimExtremeIndexing.testScaleUp-seed#[D30EE5D0FE466D69]) [    ] o.a.s.c.a.s.TestSimExtremeIndexing #### Total docs so far: 53,400,000
   [junit4]   2> 1449971 INFO  (TEST-TestSimExtremeIndexing.testScaleUp-seed#[D30EE5D0FE466D69]) [    ] o.a.s.c.a.s.TestSimExtremeIndexing #### Total docs so far: 53,600,000
   [junit4]   2> 1449990 INFO  (TEST-TestSimExtremeIndexing.testScaleUp-seed#[D30EE5D0FE466D69]) [    ] o.a.s.c.a.s.TestSimExtremeIndexing #### Total docs so far: 53,800,000
   [junit4]   2> 1449990 INFO  (TEST-TestSimExtremeIndexing.testScaleUp-seed#[D30EE5D0FE466D69]) [    ] o.a.s.c.a.s.TestSimExtremeIndexing #### Total docs so far: 54,000,000
   [junit4]   2> 1449990 INFO  (TEST-TestSimExtremeIndexing.testScaleUp-seed#[D30EE5D0FE466D69]) [    ] o.a.s.c.a.s.TestSimExtremeIndexing #### Total docs so far: 54,200,000
   [junit4]   2> 1449990 INFO  (TEST-TestSimExtremeIndexing.testScaleUp-seed#[D30EE5D0FE466D69]) [    ] o.a.s.c.a.s.TestSimExtremeIndexing #### Total docs so far: 54,400,000
   [junit4]   2> 1449991 INFO  (TEST-TestSimExtremeIndexing.testScaleUp-seed#[D30EE5D0FE466D69]) [    ] o.a.s.c.a.s.TestSimExtremeIndexing #### Total docs so far: 54,600,000
   [junit4]   2> 1449991 INFO  (TEST-TestSimExtremeIndexing.testScaleUp-seed#[D30EE5D0FE466D69]) [    ] o.a.s.c.a.s.TestSimExtremeIndexing #### Total docs so far: 54,800,000
   [junit4]   2> 1449991 INFO  (TEST-TestSimExtremeIndexing.testScaleUp-seed#[D30EE5D0FE466D69]) [    ] o.a.s.c.a.s.TestSimExtremeIndexing #### Total docs so far: 55,000,000
   [junit4]   2> 1449991 INFO  (TEST-TestSimExtremeIndexing.testScaleUp-seed#[D30EE5D0FE466D69]) [    ] o.a.s.c.a.s.TestSimExtremeIndexing #### Total docs so far: 55,200,000
   [junit4]   2> 1450006 INFO  (TEST-TestSimExtremeIndexing.testScaleUp-seed#[D30EE5D0FE466D69]) [    ] o.a.s.c.a.s.TestSimExtremeIndexing #### Total docs so far: 55,400,000
   [junit4]   2> 1450026 INFO  (TEST-TestSimExtremeIndexing.testScaleUp-seed#[D30EE5D0FE466D69]) [    ] o.a.s.c.a.s.TestSimExtremeIndexing #### Total docs so far: 55,600,000
   [junit4]   2> 1450042 INFO  (TEST-TestSimExtremeIndexing.testScaleUp-seed#[D30EE5D0FE466D69]) [    ] o.a.s.c.a.s.TestSimExtremeIndexing #### Total docs so far: 55,800,000
   [junit4]   2> 1450063 INFO  (TEST-TestSimExtremeIndexing.testScaleUp-seed#[D30EE5D0FE466D69]) [    ] o.a.s.c.a.s.TestSimExtremeIndexing #### Total docs so far: 56,000,000
   [junit4]   2> 1450079 INFO  (TEST-TestSimExtremeIndexing.testScaleUp-seed#[D30EE5D0FE466D69]) [    ] o.a.s.c.a.s.TestSimExtremeIndexing #### Total docs so far: 56,200,000
   [junit4]   2> 1450079 INFO  (TEST-TestSimExtremeIndexing.testScaleUp-seed#[D30EE5D0FE466D69]) [    ] o.a.s.c.a.s.TestSimExtremeIndexing #### Total docs so far: 56,400,000
   [junit4]   2> 1450079 INFO  (TEST-TestSimExtremeIndexing.testScaleUp-seed#[D30EE5D0FE466D69]) [    ] o.a.s.c.a.s.TestSimExtremeIndexing #### Total docs so far: 56,600,000
   [junit4]   2> 1450080 INFO  (TEST-TestSimExtremeIndexing.testScaleUp-seed#[D30EE5D0FE466D69]) [    ] o.a.s.c.a.s.TestSimExtremeIndexing #### Total docs so far: 56,800,000
   [junit4]   2> 1450099 INFO  (TEST-TestSimExtremeIndexing.testScaleUp-seed#[D30EE5D0FE466D69]) [    ] o.a.s.c.a.s.TestSimExtremeIndexing #### Total docs so far: 57,000,000
   [junit4]   2> 1450115 INFO  (TEST-TestSimExtremeIndexing.testScaleUp-seed#[D30EE5D0FE466D69]) [    ] o.a.s.c.a.s.TestSimExtremeIndexing #### Total docs so far: 57,200,000
   [junit4]   2> 1450135 INFO  (TEST-TestSimExtremeIndexing.testScaleUp-seed#[D30EE5D0FE466D69]) [    ] o.a.s.c.a.s.TestSimExtremeIndexing #### Total docs so far: 57,400,000
   [junit4]   2> 1450150 INFO  (TEST-TestSimExtremeIndexing.testScaleUp-seed#[D30EE5D0FE466D69]) [    ] o.a.s.c.a.s.TestSimExtremeIndexing #### Total docs so far: 57,600,000
   [junit4]   2> 1450168 INFO  (TEST-TestSimExtremeIndexing.testScaleUp-seed#[D30EE5D0FE466D69]) [    ] o.a.s.c.a.s.TestSimExtremeIndexing #### Total docs so far: 57,800,000
   [junit4]   2> 1450184 INFO  (TEST-TestSimExtremeIndexing.testScaleUp-seed#[D30EE5D0FE466D69]) [    ] o.a.s.c.a.s.TestSimExtremeIndexing #### Total docs so far: 58,000,000
   [junit4]   2> 1450221 INFO  (TEST-TestSimExtremeIndexing.testScaleUp-seed#[D30EE5D0FE466D69]) [    ] o.a.s.c.a.s.TestSimExtremeIndexing #### Total docs so far: 58,200,000
   [junit4]   2> 1450241 INFO  (TEST-TestSimExtremeIndexing.testScaleUp-seed#[D30EE5D0FE466D69]) [    ] o.a.s.c.a.s.TestSimExtremeIndexing #### Total docs so far: 58,400,000
   [junit4]   2> 1450257 INFO  (TEST-TestSimExtremeIndexing.testScaleUp-seed#[D30EE5D0FE466D69]) [    ] o.a.s.c.a.s.TestSimExtremeIndexing #### Total docs so far: 58,600,000
   [junit4]   2> 1450277 INFO  (TEST-TestSimExtremeIndexing.testScaleUp-seed#[D30EE5D0FE466D69]) [    ] o.a.s.c.a.s.TestSimExtremeIndexing #### Total docs so far: 58,800,000
   [junit4]   2> 1450294 INFO  (TEST-TestSimExtremeIndexing.testScaleUp-seed#[D30EE5D0FE466D69]) [    ] o.a.s.c.a.s.TestSimExtremeIndexing #### Total docs so far: 59,000,000
   [junit4]   2> 1450294 INFO  (TEST-TestSimExtremeIndexing.testScaleUp-seed#[D30EE5D0FE466D69]) [    ] o.a.s.c.a.s.TestSimExtremeIndexing #### Total docs so far: 59,200,000
   [junit4]   2> 1450479 INFO  (TEST-TestSimExtremeIndexing.testScaleUp-seed#[D30EE5D0FE466D69]) [    ] o.a.s.c.a.s.TestSimExtremeIndexing #### Total docs so far: 59,400,000
   [junit4]   2> 1450553 DEBUG (simCloudManagerPool-2710-thread-57) [    ] o.a.s.c.a.s.SimClusterStateProvider ** creating new collection states, currentVersion=9
   [junit4]   2> 1450553 DEBUG (simCloudManagerPool-2710-thread-57) [    ] o.a.s.c.a.s.SimClusterStateProvider ** saved cluster state version 9
   [junit4]   2> 1450554 DEBUG (simCloudManagerPool-2710-thread-57) [    ] o.a.s.c.a.s.SimClusterStateProvider ** no leader in testScaleUp_collection / shard1_0:{
   [junit4]   2>   "parent":"shard1",
   [junit4]   2>   "stateTimestamp":"1549373241611414000",
   [junit4]   2>   "range":"80000000-bfffffff",
   [junit4]   2>   "state":"construction",
   [junit4]   2>   "replicas":{
   [junit4]   2>     "core_node10":{
   [junit4]   2>       "core":"testScaleUp_collection_shard1_0_replica_n9",
   [junit4]   2>       "SEARCHER.searcher.maxDoc":12350000,
   [junit4]   2>       "SEARCHER.searcher.deletedDocs":0,
   [junit4]   2>       "INDEX.sizeInBytes":6175020480,
   [junit4]   2>       "node_name":"127.0.0.1:10034_solr",
   [junit4]   2>       "base_url":"http://127.0.0.1:10034/solr",
   [junit4]   2>       "state":"active",
   [junit4]   2>       "type":"NRT",
   [junit4]   2>       "INDEX.sizeInGB":5.750935971736908,
   [junit4]   2>       "SEARCHER.searcher.numDocs":12350000},
   [junit4]   2>     "core_node8":{
   [junit4]   2>       "core":"testScaleUp_collection_shard1_0_replica_n7",
   [junit4]   2>       "SEARCHER.searcher.maxDoc":12350000,
   [junit4]   2>       "SEARCHER.searcher.deletedDocs":0,
   [junit4]   2>       "INDEX.sizeInBytes":6175020480,
   [junit4]   2>       "node_name":"127.0.0.1:10109_solr",
   [junit4]   2>       "base_url":"http://127.0.0.1:10109/solr",
   [junit4]   2>       "state":"active",
   [junit4]   2>       "type":"NRT",
   [junit4]   2>       "INDEX.sizeInGB":5.750935971736908,
   [junit4]   2>       "SEARCHER.searcher.numDocs":12350000}}}
   [junit4]   2> 1450555 DEBUG (simCloudManagerPool-2710-thread-57) [    ] o.a.s.c.a.s.SimClusterStateProvider ** no leader in testScaleUp_collection / shard1_0:{
   [junit4]   2>   "parent":"shard1",
   [junit4]   2>   "stateTimestamp":"1549373241611414000",
   [junit4]   2>   "range":"80000000-bfffffff",
   [junit4]   2>   "state":"construction",
   [junit4]   2>   "replicas":{
   [junit4]   2>     "core_node10":{
   [junit4]   2>       "core":"testScaleUp_collection_shard1_0_replica_n9",
   [junit4]   2>       "SEARCHER.searcher.maxDoc":12350000,
   [junit4]   2>       "SEARCHER.searcher.deletedDocs":0,
   [junit4]   2>       "INDEX.sizeInBytes":6175020480,
   [junit4]   2>       "node_name":"127.0.0.1:10034_solr",
   [junit4]   2>       "base_url":"http://127.0.0.1:10034/solr",
   [junit4]   2>       "state":"active",
   [junit4]   2>       "type":"NRT",
   [junit4]   2>       "INDEX.sizeInGB":5.750935971736908,
   [junit4]   2>       "SEARCHER.searcher.numDocs":12350000},
   [junit4]   2>     "core_node8":{
   [junit4]   2>       "core":"testScaleUp_collection_shard1_0_replica_n7",
   [junit4]   2>       "SEARCHER.searcher.maxDoc":12350000,
   [junit4]   2>       "SEARCHER.searcher.deletedDocs":0,
   [junit4]   2>       "INDEX.sizeInBytes":6175020480,
   [junit4]   2>       "node_name":"127.0.0.1:10109_solr",
   [junit4]   2>       "base_url":"http://127.0.0.1:10109/solr",
   [junit4]   2>       "state":"active",
   [junit4]   2>       "type":"NRT",
   [junit4]   2>       "INDEX.sizeInGB":5.750935971736908,
   [junit4]   2>       "SEARCHER.searcher.numDocs":12350000}}}
   [junit4]   2> 1450557 DEBUG (simCloudManagerPool-2710-thread-57) [    ] o.a.s.c.a.s.SimClusterStateProvider ** no leader in testScaleUp_collection / shard1_0:{
   [junit4]   2>   "parent":"shard1",
   [junit4]   2>   "stateTimestamp":"1549373241611414000",
   [junit4]   2>   "range":"80000000-bfffffff",
   [junit4]   2>   "state":"construction",
   [junit4]   2>   "replicas":{
   [junit4]   2>     "core_node10":{
   [junit4]   2>       "core":"testScaleUp_collection_shard1_0_replica_n9",
   [junit4]   2>       "SEARCHER.searcher.maxDoc":12350000,
   [junit4]   2>       "SEARCHER.searcher.deletedDocs":0,
   [junit4]   2>       "INDEX.sizeInBytes":6175020480,
   [junit4]   2>       "node_name":"127.0.0.1:10034_solr",
   [junit4]   2>       "base_url":"http://127.0.0.1:10034/solr",
   [junit4]   2>       "state":"active",
   [junit4]   2>       "type":"NRT",
   [junit4]   2>       "INDEX.sizeInGB":5.750935971736908,
   [junit4]   2>       "SEARCHER.s

[...truncated too long message...]

ml

resolve:

ivy-availability-check:
[loadresource] Do not set property disallowed.ivy.jars.list as its length is 0.

-ivy-fail-disallowed-ivy-version:

ivy-fail:

ivy-configure:
[ivy:configure] :: loading settings :: file = /home/jenkins/jenkins-slave/workspace/Lucene-Solr-BadApples-Tests-master/lucene/top-level-ivy-settings.xml

resolve:

ivy-availability-check:
[loadresource] Do not set property disallowed.ivy.jars.list as its length is 0.

-ivy-fail-disallowed-ivy-version:

ivy-fail:

ivy-fail:

ivy-configure:
[ivy:configure] :: loading settings :: file = /home/jenkins/jenkins-slave/workspace/Lucene-Solr-BadApples-Tests-master/lucene/top-level-ivy-settings.xml

resolve:

ivy-availability-check:
[loadresource] Do not set property disallowed.ivy.jars.list as its length is 0.

-ivy-fail-disallowed-ivy-version:

ivy-fail:

ivy-configure:
[ivy:configure] :: loading settings :: file = /home/jenkins/jenkins-slave/workspace/Lucene-Solr-BadApples-Tests-master/lucene/top-level-ivy-settings.xml

resolve:

ivy-availability-check:
[loadresource] Do not set property disallowed.ivy.jars.list as its length is 0.

-ivy-fail-disallowed-ivy-version:

ivy-fail:

ivy-fail:

ivy-configure:
[ivy:configure] :: loading settings :: file = /home/jenkins/jenkins-slave/workspace/Lucene-Solr-BadApples-Tests-master/lucene/top-level-ivy-settings.xml

resolve:

ivy-availability-check:
[loadresource] Do not set property disallowed.ivy.jars.list as its length is 0.

-ivy-fail-disallowed-ivy-version:

ivy-fail:

ivy-fail:

ivy-configure:
[ivy:configure] :: loading settings :: file = /home/jenkins/jenkins-slave/workspace/Lucene-Solr-BadApples-Tests-master/lucene/top-level-ivy-settings.xml

resolve:

ivy-availability-check:
[loadresource] Do not set property disallowed.ivy.jars.list as its length is 0.

-ivy-fail-disallowed-ivy-version:

ivy-fail:

ivy-fail:

ivy-configure:
[ivy:configure] :: loading settings :: file = /home/jenkins/jenkins-slave/workspace/Lucene-Solr-BadApples-Tests-master/lucene/top-level-ivy-settings.xml

resolve:

ivy-availability-check:
[loadresource] Do not set property disallowed.ivy.jars.list as its length is 0.

-ivy-fail-disallowed-ivy-version:

ivy-fail:

ivy-fail:

ivy-configure:
[ivy:configure] :: loading settings :: file = /home/jenkins/jenkins-slave/workspace/Lucene-Solr-BadApples-Tests-master/lucene/top-level-ivy-settings.xml

resolve:

ivy-availability-check:
[loadresource] Do not set property disallowed.ivy.jars.list as its length is 0.

-ivy-fail-disallowed-ivy-version:

ivy-fail:

ivy-fail:

ivy-configure:
[ivy:configure] :: loading settings :: file = /home/jenkins/jenkins-slave/workspace/Lucene-Solr-BadApples-Tests-master/lucene/top-level-ivy-settings.xml

resolve:

ivy-availability-check:
[loadresource] Do not set property disallowed.ivy.jars.list as its length is 0.

-ivy-fail-disallowed-ivy-version:

ivy-fail:

ivy-fail:

ivy-configure:
[ivy:configure] :: loading settings :: file = /home/jenkins/jenkins-slave/workspace/Lucene-Solr-BadApples-Tests-master/lucene/top-level-ivy-settings.xml

resolve:

ivy-availability-check:
[loadresource] Do not set property disallowed.ivy.jars.list as its length is 0.

-ivy-fail-disallowed-ivy-version:

ivy-fail:

ivy-fail:

ivy-configure:
[ivy:configure] :: loading settings :: file = /home/jenkins/jenkins-slave/workspace/Lucene-Solr-BadApples-Tests-master/lucene/top-level-ivy-settings.xml

resolve:

ivy-availability-check:
[loadresource] Do not set property disallowed.ivy.jars.list as its length is 0.

-ivy-fail-disallowed-ivy-version:

ivy-fail:

ivy-fail:

ivy-configure:
[ivy:configure] :: loading settings :: file = /home/jenkins/jenkins-slave/workspace/Lucene-Solr-BadApples-Tests-master/lucene/top-level-ivy-settings.xml

resolve:

ivy-availability-check:
[loadresource] Do not set property disallowed.ivy.jars.list as its length is 0.

-ivy-fail-disallowed-ivy-version:

ivy-fail:

ivy-fail:

ivy-configure:
[ivy:configure] :: loading settings :: file = /home/jenkins/jenkins-slave/workspace/Lucene-Solr-BadApples-Tests-master/lucene/top-level-ivy-settings.xml

resolve:

ivy-availability-check:
[loadresource] Do not set property disallowed.ivy.jars.list as its length is 0.

-ivy-fail-disallowed-ivy-version:

ivy-fail:

ivy-fail:

ivy-configure:
[ivy:configure] :: loading settings :: file = /home/jenkins/jenkins-slave/workspace/Lucene-Solr-BadApples-Tests-master/lucene/top-level-ivy-settings.xml

resolve:

jar-checksums:
    [mkdir] Created dir: /home/jenkins/jenkins-slave/workspace/Lucene-Solr-BadApples-Tests-master/solr/null1948883328
     [copy] Copying 237 files to /home/jenkins/jenkins-slave/workspace/Lucene-Solr-BadApples-Tests-master/solr/null1948883328
   [delete] Deleting directory /home/jenkins/jenkins-slave/workspace/Lucene-Solr-BadApples-Tests-master/solr/null1948883328

check-working-copy:
[ivy:cachepath] :: resolving dependencies :: org.eclipse.jgit#org.eclipse.jgit-caller;working
[ivy:cachepath] 	confs: [default]
[ivy:cachepath] 	found org.eclipse.jgit#org.eclipse.jgit;4.6.0.201612231935-r in public
[ivy:cachepath] 	found com.jcraft#jsch;0.1.53 in public
[ivy:cachepath] 	found com.googlecode.javaewah#JavaEWAH;1.1.6 in public
[ivy:cachepath] 	found org.apache.httpcomponents#httpclient;4.3.6 in public
[ivy:cachepath] 	found org.apache.httpcomponents#httpcore;4.3.3 in public
[ivy:cachepath] 	found commons-logging#commons-logging;1.1.3 in public
[ivy:cachepath] 	found commons-codec#commons-codec;1.6 in public
[ivy:cachepath] 	found org.slf4j#slf4j-api;1.7.2 in public
[ivy:cachepath] :: resolution report :: resolve 24ms :: artifacts dl 1ms
	---------------------------------------------------------------------
	|                  |            modules            ||   artifacts   |
	|       conf       | number| search|dwnlded|evicted|| number|dwnlded|
	---------------------------------------------------------------------
	|      default     |   8   |   0   |   0   |   0   ||   8   |   0   |
	---------------------------------------------------------------------
[wc-checker] Initializing working copy...
[wc-checker] SLF4J: Failed to load class "org.slf4j.impl.StaticLoggerBinder".
[wc-checker] SLF4J: Defaulting to no-operation (NOP) logger implementation
[wc-checker] SLF4J: See http://www.slf4j.org/codes.html#StaticLoggerBinder for further details.
[wc-checker] Checking working copy status...

-jenkins-base:

BUILD SUCCESSFUL
Total time: 234 minutes 36 seconds
Archiving artifacts
java.lang.InterruptedException: no matches found within 10000
	at hudson.FilePath$ValidateAntFileMask.hasMatch(FilePath.java:2847)
	at hudson.FilePath$ValidateAntFileMask.invoke(FilePath.java:2726)
	at hudson.FilePath$ValidateAntFileMask.invoke(FilePath.java:2707)
	at hudson.FilePath$FileCallableWrapper.call(FilePath.java:3086)
Also:   hudson.remoting.Channel$CallSiteStackTrace: Remote call to lucene2
		at hudson.remoting.Channel.attachCallSiteStackTrace(Channel.java:1741)
		at hudson.remoting.UserRequest$ExceptionResponse.retrieve(UserRequest.java:357)
		at hudson.remoting.Channel.call(Channel.java:955)
		at hudson.FilePath.act(FilePath.java:1072)
		at hudson.FilePath.act(FilePath.java:1061)
		at hudson.FilePath.validateAntFileMask(FilePath.java:2705)
		at hudson.tasks.ArtifactArchiver.perform(ArtifactArchiver.java:243)
		at hudson.tasks.BuildStepCompatibilityLayer.perform(BuildStepCompatibilityLayer.java:81)
		at hudson.tasks.BuildStepMonitor$1.perform(BuildStepMonitor.java:20)
		at hudson.model.AbstractBuild$AbstractBuildExecution.perform(AbstractBuild.java:744)
		at hudson.model.AbstractBuild$AbstractBuildExecution.performAllBuildSteps(AbstractBuild.java:690)
		at hudson.model.Build$BuildExecution.post2(Build.java:186)
		at hudson.model.AbstractBuild$AbstractBuildExecution.post(AbstractBuild.java:635)
		at hudson.model.Run.execute(Run.java:1835)
		at hudson.model.FreeStyleBuild.run(FreeStyleBuild.java:43)
		at hudson.model.ResourceController.execute(ResourceController.java:97)
		at hudson.model.Executor.run(Executor.java:429)
Caused: hudson.FilePath$TunneledInterruptedException
	at hudson.FilePath$FileCallableWrapper.call(FilePath.java:3088)
	at hudson.remoting.UserRequest.perform(UserRequest.java:212)
	at hudson.remoting.UserRequest.perform(UserRequest.java:54)
	at hudson.remoting.Request$2.run(Request.java:369)
	at hudson.remoting.InterceptingExecutorService$1.call(InterceptingExecutorService.java:72)
	at java.util.concurrent.FutureTask.run(FutureTask.java:266)
	at java.util.concurrent.ThreadPoolExecutor.runWorker(ThreadPoolExecutor.java:1142)
	at java.util.concurrent.ThreadPoolExecutor$Worker.run(ThreadPoolExecutor.java:617)
	at java.lang.Thread.run(Thread.java:748)
Caused: java.lang.InterruptedException: java.lang.InterruptedException: no matches found within 10000
	at hudson.FilePath.act(FilePath.java:1074)
	at hudson.FilePath.act(FilePath.java:1061)
	at hudson.FilePath.validateAntFileMask(FilePath.java:2705)
	at hudson.tasks.ArtifactArchiver.perform(ArtifactArchiver.java:243)
	at hudson.tasks.BuildStepCompatibilityLayer.perform(BuildStepCompatibilityLayer.java:81)
	at hudson.tasks.BuildStepMonitor$1.perform(BuildStepMonitor.java:20)
	at hudson.model.AbstractBuild$AbstractBuildExecution.perform(AbstractBuild.java:744)
	at hudson.model.AbstractBuild$AbstractBuildExecution.performAllBuildSteps(AbstractBuild.java:690)
	at hudson.model.Build$BuildExecution.post2(Build.java:186)
	at hudson.model.AbstractBuild$AbstractBuildExecution.post(AbstractBuild.java:635)
	at hudson.model.Run.execute(Run.java:1835)
	at hudson.model.FreeStyleBuild.run(FreeStyleBuild.java:43)
	at hudson.model.ResourceController.execute(ResourceController.java:97)
	at hudson.model.Executor.run(Executor.java:429)
No artifacts found that match the file pattern "**/*.events,heapdumps/**,**/hs_err_pid*". Configuration error?
Recording test results
Build step 'Publish JUnit test result report' changed build result to UNSTABLE
Email was triggered for: Unstable (Test Failures)
Sending email for trigger: Unstable (Test Failures)

Mime
View raw message