lucene-dev mailing list archives

Site index · List index
Message view « Date » · « Thread »
Top « Date » · « Thread »
From Policeman Jenkins Server <jenk...@thetaphi.de>
Subject [JENKINS] Lucene-Solr-master-Solaris (64bit/jdk1.8.0) - Build # 2298 - Unstable!
Date Wed, 20 Feb 2019 22:55:57 GMT
Build: https://jenkins.thetaphi.de/job/Lucene-Solr-master-Solaris/2298/
Java: 64bit/jdk1.8.0 -XX:-UseCompressedOops -XX:+UseSerialGC

6 tests failed.
FAILED:  org.apache.solr.cloud.ChaosMonkeySafeLeaderWithPullReplicasTest.test

Error Message:
Timed out waiting for replica core_node11 (1550703184524) to replicate from leader core_node3 (0)

Stack Trace:
java.lang.AssertionError: Timed out waiting for replica core_node11 (1550703184524) to replicate from leader core_node3 (0)
	at __randomizedtesting.SeedInfo.seed([2C3A040E393CC4CE:A46E3BD497C0A936]:0)
	at org.junit.Assert.fail(Assert.java:88)
	at org.apache.solr.cloud.AbstractFullDistribZkTestBase.waitForReplicationFromReplicas(AbstractFullDistribZkTestBase.java:2271)
	at org.apache.solr.cloud.ChaosMonkeySafeLeaderWithPullReplicasTest.test(ChaosMonkeySafeLeaderWithPullReplicasTest.java:212)
	at sun.reflect.NativeMethodAccessorImpl.invoke0(Native Method)
	at sun.reflect.NativeMethodAccessorImpl.invoke(NativeMethodAccessorImpl.java:62)
	at sun.reflect.DelegatingMethodAccessorImpl.invoke(DelegatingMethodAccessorImpl.java:43)
	at java.lang.reflect.Method.invoke(Method.java:498)
	at com.carrotsearch.randomizedtesting.RandomizedRunner.invoke(RandomizedRunner.java:1750)
	at com.carrotsearch.randomizedtesting.RandomizedRunner$8.evaluate(RandomizedRunner.java:938)
	at com.carrotsearch.randomizedtesting.RandomizedRunner$9.evaluate(RandomizedRunner.java:974)
	at com.carrotsearch.randomizedtesting.RandomizedRunner$10.evaluate(RandomizedRunner.java:988)
	at org.apache.solr.BaseDistributedSearchTestCase$ShardsRepeatRule$ShardsFixedStatement.callStatement(BaseDistributedSearchTestCase.java:1082)
	at org.apache.solr.BaseDistributedSearchTestCase$ShardsRepeatRule$ShardsStatement.evaluate(BaseDistributedSearchTestCase.java:1054)
	at com.carrotsearch.randomizedtesting.rules.SystemPropertiesRestoreRule$1.evaluate(SystemPropertiesRestoreRule.java:57)
	at org.apache.lucene.util.TestRuleSetupTeardownChained$1.evaluate(TestRuleSetupTeardownChained.java:49)
	at org.apache.lucene.util.AbstractBeforeAfterRule$1.evaluate(AbstractBeforeAfterRule.java:45)
	at org.apache.lucene.util.TestRuleThreadAndTestName$1.evaluate(TestRuleThreadAndTestName.java:48)
	at org.apache.lucene.util.TestRuleIgnoreAfterMaxFailures$1.evaluate(TestRuleIgnoreAfterMaxFailures.java:64)
	at org.apache.lucene.util.TestRuleMarkFailure$1.evaluate(TestRuleMarkFailure.java:47)
	at com.carrotsearch.randomizedtesting.rules.StatementAdapter.evaluate(StatementAdapter.java:36)
	at com.carrotsearch.randomizedtesting.ThreadLeakControl$StatementRunner.run(ThreadLeakControl.java:368)
	at com.carrotsearch.randomizedtesting.ThreadLeakControl.forkTimeoutingTask(ThreadLeakControl.java:817)
	at com.carrotsearch.randomizedtesting.ThreadLeakControl$3.evaluate(ThreadLeakControl.java:468)
	at com.carrotsearch.randomizedtesting.RandomizedRunner.runSingleTest(RandomizedRunner.java:947)
	at com.carrotsearch.randomizedtesting.RandomizedRunner$5.evaluate(RandomizedRunner.java:832)
	at com.carrotsearch.randomizedtesting.RandomizedRunner$6.evaluate(RandomizedRunner.java:883)
	at com.carrotsearch.randomizedtesting.RandomizedRunner$7.evaluate(RandomizedRunner.java:894)
	at com.carrotsearch.randomizedtesting.rules.StatementAdapter.evaluate(StatementAdapter.java:36)
	at com.carrotsearch.randomizedtesting.rules.SystemPropertiesRestoreRule$1.evaluate(SystemPropertiesRestoreRule.java:57)
	at org.apache.lucene.util.AbstractBeforeAfterRule$1.evaluate(AbstractBeforeAfterRule.java:45)
	at com.carrotsearch.randomizedtesting.rules.StatementAdapter.evaluate(StatementAdapter.java:36)
	at org.apache.lucene.util.TestRuleStoreClassName$1.evaluate(TestRuleStoreClassName.java:41)
	at com.carrotsearch.randomizedtesting.rules.NoShadowingOrOverridesOnMethodsRule$1.evaluate(NoShadowingOrOverridesOnMethodsRule.java:40)
	at com.carrotsearch.randomizedtesting.rules.NoShadowingOrOverridesOnMethodsRule$1.evaluate(NoShadowingOrOverridesOnMethodsRule.java:40)
	at com.carrotsearch.randomizedtesting.rules.StatementAdapter.evaluate(StatementAdapter.java:36)
	at com.carrotsearch.randomizedtesting.rules.StatementAdapter.evaluate(StatementAdapter.java:36)
	at com.carrotsearch.randomizedtesting.rules.StatementAdapter.evaluate(StatementAdapter.java:36)
	at org.apache.lucene.util.TestRuleAssertionsRequired$1.evaluate(TestRuleAssertionsRequired.java:53)
	at org.apache.lucene.util.TestRuleMarkFailure$1.evaluate(TestRuleMarkFailure.java:47)
	at org.apache.lucene.util.TestRuleIgnoreAfterMaxFailures$1.evaluate(TestRuleIgnoreAfterMaxFailures.java:64)
	at org.apache.lucene.util.TestRuleIgnoreTestSuites$1.evaluate(TestRuleIgnoreTestSuites.java:54)
	at com.carrotsearch.randomizedtesting.rules.StatementAdapter.evaluate(StatementAdapter.java:36)
	at com.carrotsearch.randomizedtesting.ThreadLeakControl$StatementRunner.run(ThreadLeakControl.java:368)
	at java.lang.Thread.run(Thread.java:748)


FAILED:  org.apache.solr.cloud.ChaosMonkeySafeLeaderWithPullReplicasTest.test

Error Message:
Timed out waiting for replica core_node12 (1550703220716) to replicate from leader core_node3 (0)

Stack Trace:
java.lang.AssertionError: Timed out waiting for replica core_node12 (1550703220716) to replicate from leader core_node3 (0)
	at __randomizedtesting.SeedInfo.seed([2C3A040E393CC4CE:A46E3BD497C0A936]:0)
	at org.junit.Assert.fail(Assert.java:88)
	at org.apache.solr.cloud.AbstractFullDistribZkTestBase.waitForReplicationFromReplicas(AbstractFullDistribZkTestBase.java:2271)
	at org.apache.solr.cloud.ChaosMonkeySafeLeaderWithPullReplicasTest.test(ChaosMonkeySafeLeaderWithPullReplicasTest.java:212)
	at sun.reflect.NativeMethodAccessorImpl.invoke0(Native Method)
	at sun.reflect.NativeMethodAccessorImpl.invoke(NativeMethodAccessorImpl.java:62)
	at sun.reflect.DelegatingMethodAccessorImpl.invoke(DelegatingMethodAccessorImpl.java:43)
	at java.lang.reflect.Method.invoke(Method.java:498)
	at com.carrotsearch.randomizedtesting.RandomizedRunner.invoke(RandomizedRunner.java:1750)
	at com.carrotsearch.randomizedtesting.RandomizedRunner$8.evaluate(RandomizedRunner.java:938)
	at com.carrotsearch.randomizedtesting.RandomizedRunner$9.evaluate(RandomizedRunner.java:974)
	at com.carrotsearch.randomizedtesting.RandomizedRunner$10.evaluate(RandomizedRunner.java:988)
	at org.apache.solr.BaseDistributedSearchTestCase$ShardsRepeatRule$ShardsFixedStatement.callStatement(BaseDistributedSearchTestCase.java:1082)
	at org.apache.solr.BaseDistributedSearchTestCase$ShardsRepeatRule$ShardsStatement.evaluate(BaseDistributedSearchTestCase.java:1054)
	at com.carrotsearch.randomizedtesting.rules.SystemPropertiesRestoreRule$1.evaluate(SystemPropertiesRestoreRule.java:57)
	at org.apache.lucene.util.TestRuleSetupTeardownChained$1.evaluate(TestRuleSetupTeardownChained.java:49)
	at org.apache.lucene.util.AbstractBeforeAfterRule$1.evaluate(AbstractBeforeAfterRule.java:45)
	at org.apache.lucene.util.TestRuleThreadAndTestName$1.evaluate(TestRuleThreadAndTestName.java:48)
	at org.apache.lucene.util.TestRuleIgnoreAfterMaxFailures$1.evaluate(TestRuleIgnoreAfterMaxFailures.java:64)
	at org.apache.lucene.util.TestRuleMarkFailure$1.evaluate(TestRuleMarkFailure.java:47)
	at com.carrotsearch.randomizedtesting.rules.StatementAdapter.evaluate(StatementAdapter.java:36)
	at com.carrotsearch.randomizedtesting.ThreadLeakControl$StatementRunner.run(ThreadLeakControl.java:368)
	at com.carrotsearch.randomizedtesting.ThreadLeakControl.forkTimeoutingTask(ThreadLeakControl.java:817)
	at com.carrotsearch.randomizedtesting.ThreadLeakControl$3.evaluate(ThreadLeakControl.java:468)
	at com.carrotsearch.randomizedtesting.RandomizedRunner.runSingleTest(RandomizedRunner.java:947)
	at com.carrotsearch.randomizedtesting.RandomizedRunner$5.evaluate(RandomizedRunner.java:832)
	at com.carrotsearch.randomizedtesting.RandomizedRunner$6.evaluate(RandomizedRunner.java:883)
	at com.carrotsearch.randomizedtesting.RandomizedRunner$7.evaluate(RandomizedRunner.java:894)
	at com.carrotsearch.randomizedtesting.rules.StatementAdapter.evaluate(StatementAdapter.java:36)
	at com.carrotsearch.randomizedtesting.rules.SystemPropertiesRestoreRule$1.evaluate(SystemPropertiesRestoreRule.java:57)
	at org.apache.lucene.util.AbstractBeforeAfterRule$1.evaluate(AbstractBeforeAfterRule.java:45)
	at com.carrotsearch.randomizedtesting.rules.StatementAdapter.evaluate(StatementAdapter.java:36)
	at org.apache.lucene.util.TestRuleStoreClassName$1.evaluate(TestRuleStoreClassName.java:41)
	at com.carrotsearch.randomizedtesting.rules.NoShadowingOrOverridesOnMethodsRule$1.evaluate(NoShadowingOrOverridesOnMethodsRule.java:40)
	at com.carrotsearch.randomizedtesting.rules.NoShadowingOrOverridesOnMethodsRule$1.evaluate(NoShadowingOrOverridesOnMethodsRule.java:40)
	at com.carrotsearch.randomizedtesting.rules.StatementAdapter.evaluate(StatementAdapter.java:36)
	at com.carrotsearch.randomizedtesting.rules.StatementAdapter.evaluate(StatementAdapter.java:36)
	at com.carrotsearch.randomizedtesting.rules.StatementAdapter.evaluate(StatementAdapter.java:36)
	at org.apache.lucene.util.TestRuleAssertionsRequired$1.evaluate(TestRuleAssertionsRequired.java:53)
	at org.apache.lucene.util.TestRuleMarkFailure$1.evaluate(TestRuleMarkFailure.java:47)
	at org.apache.lucene.util.TestRuleIgnoreAfterMaxFailures$1.evaluate(TestRuleIgnoreAfterMaxFailures.java:64)
	at org.apache.lucene.util.TestRuleIgnoreTestSuites$1.evaluate(TestRuleIgnoreTestSuites.java:54)
	at com.carrotsearch.randomizedtesting.rules.StatementAdapter.evaluate(StatementAdapter.java:36)
	at com.carrotsearch.randomizedtesting.ThreadLeakControl$StatementRunner.run(ThreadLeakControl.java:368)
	at java.lang.Thread.run(Thread.java:748)


FAILED:  org.apache.solr.cloud.ChaosMonkeySafeLeaderWithPullReplicasTest.test

Error Message:
Timed out waiting for replica core_node12 (1550703263899) to replicate from leader core_node3 (0)

Stack Trace:
java.lang.AssertionError: Timed out waiting for replica core_node12 (1550703263899) to replicate from leader core_node3 (0)
	at __randomizedtesting.SeedInfo.seed([2C3A040E393CC4CE:A46E3BD497C0A936]:0)
	at org.junit.Assert.fail(Assert.java:88)
	at org.apache.solr.cloud.AbstractFullDistribZkTestBase.waitForReplicationFromReplicas(AbstractFullDistribZkTestBase.java:2271)
	at org.apache.solr.cloud.ChaosMonkeySafeLeaderWithPullReplicasTest.test(ChaosMonkeySafeLeaderWithPullReplicasTest.java:212)
	at sun.reflect.NativeMethodAccessorImpl.invoke0(Native Method)
	at sun.reflect.NativeMethodAccessorImpl.invoke(NativeMethodAccessorImpl.java:62)
	at sun.reflect.DelegatingMethodAccessorImpl.invoke(DelegatingMethodAccessorImpl.java:43)
	at java.lang.reflect.Method.invoke(Method.java:498)
	at com.carrotsearch.randomizedtesting.RandomizedRunner.invoke(RandomizedRunner.java:1750)
	at com.carrotsearch.randomizedtesting.RandomizedRunner$8.evaluate(RandomizedRunner.java:938)
	at com.carrotsearch.randomizedtesting.RandomizedRunner$9.evaluate(RandomizedRunner.java:974)
	at com.carrotsearch.randomizedtesting.RandomizedRunner$10.evaluate(RandomizedRunner.java:988)
	at org.apache.solr.BaseDistributedSearchTestCase$ShardsRepeatRule$ShardsFixedStatement.callStatement(BaseDistributedSearchTestCase.java:1082)
	at org.apache.solr.BaseDistributedSearchTestCase$ShardsRepeatRule$ShardsStatement.evaluate(BaseDistributedSearchTestCase.java:1054)
	at com.carrotsearch.randomizedtesting.rules.SystemPropertiesRestoreRule$1.evaluate(SystemPropertiesRestoreRule.java:57)
	at org.apache.lucene.util.TestRuleSetupTeardownChained$1.evaluate(TestRuleSetupTeardownChained.java:49)
	at org.apache.lucene.util.AbstractBeforeAfterRule$1.evaluate(AbstractBeforeAfterRule.java:45)
	at org.apache.lucene.util.TestRuleThreadAndTestName$1.evaluate(TestRuleThreadAndTestName.java:48)
	at org.apache.lucene.util.TestRuleIgnoreAfterMaxFailures$1.evaluate(TestRuleIgnoreAfterMaxFailures.java:64)
	at org.apache.lucene.util.TestRuleMarkFailure$1.evaluate(TestRuleMarkFailure.java:47)
	at com.carrotsearch.randomizedtesting.rules.StatementAdapter.evaluate(StatementAdapter.java:36)
	at com.carrotsearch.randomizedtesting.ThreadLeakControl$StatementRunner.run(ThreadLeakControl.java:368)
	at com.carrotsearch.randomizedtesting.ThreadLeakControl.forkTimeoutingTask(ThreadLeakControl.java:817)
	at com.carrotsearch.randomizedtesting.ThreadLeakControl$3.evaluate(ThreadLeakControl.java:468)
	at com.carrotsearch.randomizedtesting.RandomizedRunner.runSingleTest(RandomizedRunner.java:947)
	at com.carrotsearch.randomizedtesting.RandomizedRunner$5.evaluate(RandomizedRunner.java:832)
	at com.carrotsearch.randomizedtesting.RandomizedRunner$6.evaluate(RandomizedRunner.java:883)
	at com.carrotsearch.randomizedtesting.RandomizedRunner$7.evaluate(RandomizedRunner.java:894)
	at com.carrotsearch.randomizedtesting.rules.StatementAdapter.evaluate(StatementAdapter.java:36)
	at com.carrotsearch.randomizedtesting.rules.SystemPropertiesRestoreRule$1.evaluate(SystemPropertiesRestoreRule.java:57)
	at org.apache.lucene.util.AbstractBeforeAfterRule$1.evaluate(AbstractBeforeAfterRule.java:45)
	at com.carrotsearch.randomizedtesting.rules.StatementAdapter.evaluate(StatementAdapter.java:36)
	at org.apache.lucene.util.TestRuleStoreClassName$1.evaluate(TestRuleStoreClassName.java:41)
	at com.carrotsearch.randomizedtesting.rules.NoShadowingOrOverridesOnMethodsRule$1.evaluate(NoShadowingOrOverridesOnMethodsRule.java:40)
	at com.carrotsearch.randomizedtesting.rules.NoShadowingOrOverridesOnMethodsRule$1.evaluate(NoShadowingOrOverridesOnMethodsRule.java:40)
	at com.carrotsearch.randomizedtesting.rules.StatementAdapter.evaluate(StatementAdapter.java:36)
	at com.carrotsearch.randomizedtesting.rules.StatementAdapter.evaluate(StatementAdapter.java:36)
	at com.carrotsearch.randomizedtesting.rules.StatementAdapter.evaluate(StatementAdapter.java:36)
	at org.apache.lucene.util.TestRuleAssertionsRequired$1.evaluate(TestRuleAssertionsRequired.java:53)
	at org.apache.lucene.util.TestRuleMarkFailure$1.evaluate(TestRuleMarkFailure.java:47)
	at org.apache.lucene.util.TestRuleIgnoreAfterMaxFailures$1.evaluate(TestRuleIgnoreAfterMaxFailures.java:64)
	at org.apache.lucene.util.TestRuleIgnoreTestSuites$1.evaluate(TestRuleIgnoreTestSuites.java:54)
	at com.carrotsearch.randomizedtesting.rules.StatementAdapter.evaluate(StatementAdapter.java:36)
	at com.carrotsearch.randomizedtesting.ThreadLeakControl$StatementRunner.run(ThreadLeakControl.java:368)
	at java.lang.Thread.run(Thread.java:748)


FAILED:  org.apache.solr.cloud.ChaosMonkeySafeLeaderWithPullReplicasTest.test

Error Message:
Timed out waiting for replica core_node12 (1550703297165) to replicate from leader core_node3 (0)

Stack Trace:
java.lang.AssertionError: Timed out waiting for replica core_node12 (1550703297165) to replicate from leader core_node3 (0)
	at __randomizedtesting.SeedInfo.seed([2C3A040E393CC4CE:A46E3BD497C0A936]:0)
	at org.junit.Assert.fail(Assert.java:88)
	at org.apache.solr.cloud.AbstractFullDistribZkTestBase.waitForReplicationFromReplicas(AbstractFullDistribZkTestBase.java:2271)
	at org.apache.solr.cloud.ChaosMonkeySafeLeaderWithPullReplicasTest.test(ChaosMonkeySafeLeaderWithPullReplicasTest.java:212)
	at sun.reflect.NativeMethodAccessorImpl.invoke0(Native Method)
	at sun.reflect.NativeMethodAccessorImpl.invoke(NativeMethodAccessorImpl.java:62)
	at sun.reflect.DelegatingMethodAccessorImpl.invoke(DelegatingMethodAccessorImpl.java:43)
	at java.lang.reflect.Method.invoke(Method.java:498)
	at com.carrotsearch.randomizedtesting.RandomizedRunner.invoke(RandomizedRunner.java:1750)
	at com.carrotsearch.randomizedtesting.RandomizedRunner$8.evaluate(RandomizedRunner.java:938)
	at com.carrotsearch.randomizedtesting.RandomizedRunner$9.evaluate(RandomizedRunner.java:974)
	at com.carrotsearch.randomizedtesting.RandomizedRunner$10.evaluate(RandomizedRunner.java:988)
	at org.apache.solr.BaseDistributedSearchTestCase$ShardsRepeatRule$ShardsFixedStatement.callStatement(BaseDistributedSearchTestCase.java:1082)
	at org.apache.solr.BaseDistributedSearchTestCase$ShardsRepeatRule$ShardsStatement.evaluate(BaseDistributedSearchTestCase.java:1054)
	at com.carrotsearch.randomizedtesting.rules.SystemPropertiesRestoreRule$1.evaluate(SystemPropertiesRestoreRule.java:57)
	at org.apache.lucene.util.TestRuleSetupTeardownChained$1.evaluate(TestRuleSetupTeardownChained.java:49)
	at org.apache.lucene.util.AbstractBeforeAfterRule$1.evaluate(AbstractBeforeAfterRule.java:45)
	at org.apache.lucene.util.TestRuleThreadAndTestName$1.evaluate(TestRuleThreadAndTestName.java:48)
	at org.apache.lucene.util.TestRuleIgnoreAfterMaxFailures$1.evaluate(TestRuleIgnoreAfterMaxFailures.java:64)
	at org.apache.lucene.util.TestRuleMarkFailure$1.evaluate(TestRuleMarkFailure.java:47)
	at com.carrotsearch.randomizedtesting.rules.StatementAdapter.evaluate(StatementAdapter.java:36)
	at com.carrotsearch.randomizedtesting.ThreadLeakControl$StatementRunner.run(ThreadLeakControl.java:368)
	at com.carrotsearch.randomizedtesting.ThreadLeakControl.forkTimeoutingTask(ThreadLeakControl.java:817)
	at com.carrotsearch.randomizedtesting.ThreadLeakControl$3.evaluate(ThreadLeakControl.java:468)
	at com.carrotsearch.randomizedtesting.RandomizedRunner.runSingleTest(RandomizedRunner.java:947)
	at com.carrotsearch.randomizedtesting.RandomizedRunner$5.evaluate(RandomizedRunner.java:832)
	at com.carrotsearch.randomizedtesting.RandomizedRunner$6.evaluate(RandomizedRunner.java:883)
	at com.carrotsearch.randomizedtesting.RandomizedRunner$7.evaluate(RandomizedRunner.java:894)
	at com.carrotsearch.randomizedtesting.rules.StatementAdapter.evaluate(StatementAdapter.java:36)
	at com.carrotsearch.randomizedtesting.rules.SystemPropertiesRestoreRule$1.evaluate(SystemPropertiesRestoreRule.java:57)
	at org.apache.lucene.util.AbstractBeforeAfterRule$1.evaluate(AbstractBeforeAfterRule.java:45)
	at com.carrotsearch.randomizedtesting.rules.StatementAdapter.evaluate(StatementAdapter.java:36)
	at org.apache.lucene.util.TestRuleStoreClassName$1.evaluate(TestRuleStoreClassName.java:41)
	at com.carrotsearch.randomizedtesting.rules.NoShadowingOrOverridesOnMethodsRule$1.evaluate(NoShadowingOrOverridesOnMethodsRule.java:40)
	at com.carrotsearch.randomizedtesting.rules.NoShadowingOrOverridesOnMethodsRule$1.evaluate(NoShadowingOrOverridesOnMethodsRule.java:40)
	at com.carrotsearch.randomizedtesting.rules.StatementAdapter.evaluate(StatementAdapter.java:36)
	at com.carrotsearch.randomizedtesting.rules.StatementAdapter.evaluate(StatementAdapter.java:36)
	at com.carrotsearch.randomizedtesting.rules.StatementAdapter.evaluate(StatementAdapter.java:36)
	at org.apache.lucene.util.TestRuleAssertionsRequired$1.evaluate(TestRuleAssertionsRequired.java:53)
	at org.apache.lucene.util.TestRuleMarkFailure$1.evaluate(TestRuleMarkFailure.java:47)
	at org.apache.lucene.util.TestRuleIgnoreAfterMaxFailures$1.evaluate(TestRuleIgnoreAfterMaxFailures.java:64)
	at org.apache.lucene.util.TestRuleIgnoreTestSuites$1.evaluate(TestRuleIgnoreTestSuites.java:54)
	at com.carrotsearch.randomizedtesting.rules.StatementAdapter.evaluate(StatementAdapter.java:36)
	at com.carrotsearch.randomizedtesting.ThreadLeakControl$StatementRunner.run(ThreadLeakControl.java:368)
	at java.lang.Thread.run(Thread.java:748)


FAILED:  org.apache.solr.cloud.ChaosMonkeySafeLeaderWithPullReplicasTest.test

Error Message:
Timed out waiting for replica core_node11 (1550697951089) to replicate from leader core_node3 (0)

Stack Trace:
java.lang.AssertionError: Timed out waiting for replica core_node11 (1550697951089) to replicate from leader core_node3 (0)
	at __randomizedtesting.SeedInfo.seed([2C3A040E393CC4CE:A46E3BD497C0A936]:0)
	at org.junit.Assert.fail(Assert.java:88)
	at org.apache.solr.cloud.AbstractFullDistribZkTestBase.waitForReplicationFromReplicas(AbstractFullDistribZkTestBase.java:2271)
	at org.apache.solr.cloud.ChaosMonkeySafeLeaderWithPullReplicasTest.test(ChaosMonkeySafeLeaderWithPullReplicasTest.java:212)
	at sun.reflect.NativeMethodAccessorImpl.invoke0(Native Method)
	at sun.reflect.NativeMethodAccessorImpl.invoke(NativeMethodAccessorImpl.java:62)
	at sun.reflect.DelegatingMethodAccessorImpl.invoke(DelegatingMethodAccessorImpl.java:43)
	at java.lang.reflect.Method.invoke(Method.java:498)
	at com.carrotsearch.randomizedtesting.RandomizedRunner.invoke(RandomizedRunner.java:1750)
	at com.carrotsearch.randomizedtesting.RandomizedRunner$8.evaluate(RandomizedRunner.java:938)
	at com.carrotsearch.randomizedtesting.RandomizedRunner$9.evaluate(RandomizedRunner.java:974)
	at com.carrotsearch.randomizedtesting.RandomizedRunner$10.evaluate(RandomizedRunner.java:988)
	at org.apache.solr.BaseDistributedSearchTestCase$ShardsRepeatRule$ShardsFixedStatement.callStatement(BaseDistributedSearchTestCase.java:1082)
	at org.apache.solr.BaseDistributedSearchTestCase$ShardsRepeatRule$ShardsStatement.evaluate(BaseDistributedSearchTestCase.java:1054)
	at com.carrotsearch.randomizedtesting.rules.SystemPropertiesRestoreRule$1.evaluate(SystemPropertiesRestoreRule.java:57)
	at org.apache.lucene.util.TestRuleSetupTeardownChained$1.evaluate(TestRuleSetupTeardownChained.java:49)
	at org.apache.lucene.util.AbstractBeforeAfterRule$1.evaluate(AbstractBeforeAfterRule.java:45)
	at org.apache.lucene.util.TestRuleThreadAndTestName$1.evaluate(TestRuleThreadAndTestName.java:48)
	at org.apache.lucene.util.TestRuleIgnoreAfterMaxFailures$1.evaluate(TestRuleIgnoreAfterMaxFailures.java:64)
	at org.apache.lucene.util.TestRuleMarkFailure$1.evaluate(TestRuleMarkFailure.java:47)
	at com.carrotsearch.randomizedtesting.rules.StatementAdapter.evaluate(StatementAdapter.java:36)
	at com.carrotsearch.randomizedtesting.ThreadLeakControl$StatementRunner.run(ThreadLeakControl.java:368)
	at com.carrotsearch.randomizedtesting.ThreadLeakControl.forkTimeoutingTask(ThreadLeakControl.java:817)
	at com.carrotsearch.randomizedtesting.ThreadLeakControl$3.evaluate(ThreadLeakControl.java:468)
	at com.carrotsearch.randomizedtesting.RandomizedRunner.runSingleTest(RandomizedRunner.java:947)
	at com.carrotsearch.randomizedtesting.RandomizedRunner$5.evaluate(RandomizedRunner.java:832)
	at com.carrotsearch.randomizedtesting.RandomizedRunner$6.evaluate(RandomizedRunner.java:883)
	at com.carrotsearch.randomizedtesting.RandomizedRunner$7.evaluate(RandomizedRunner.java:894)
	at com.carrotsearch.randomizedtesting.rules.StatementAdapter.evaluate(StatementAdapter.java:36)
	at com.carrotsearch.randomizedtesting.rules.SystemPropertiesRestoreRule$1.evaluate(SystemPropertiesRestoreRule.java:57)
	at org.apache.lucene.util.AbstractBeforeAfterRule$1.evaluate(AbstractBeforeAfterRule.java:45)
	at com.carrotsearch.randomizedtesting.rules.StatementAdapter.evaluate(StatementAdapter.java:36)
	at org.apache.lucene.util.TestRuleStoreClassName$1.evaluate(TestRuleStoreClassName.java:41)
	at com.carrotsearch.randomizedtesting.rules.NoShadowingOrOverridesOnMethodsRule$1.evaluate(NoShadowingOrOverridesOnMethodsRule.java:40)
	at com.carrotsearch.randomizedtesting.rules.NoShadowingOrOverridesOnMethodsRule$1.evaluate(NoShadowingOrOverridesOnMethodsRule.java:40)
	at com.carrotsearch.randomizedtesting.rules.StatementAdapter.evaluate(StatementAdapter.java:36)
	at com.carrotsearch.randomizedtesting.rules.StatementAdapter.evaluate(StatementAdapter.java:36)
	at com.carrotsearch.randomizedtesting.rules.StatementAdapter.evaluate(StatementAdapter.java:36)
	at org.apache.lucene.util.TestRuleAssertionsRequired$1.evaluate(TestRuleAssertionsRequired.java:53)
	at org.apache.lucene.util.TestRuleMarkFailure$1.evaluate(TestRuleMarkFailure.java:47)
	at org.apache.lucene.util.TestRuleIgnoreAfterMaxFailures$1.evaluate(TestRuleIgnoreAfterMaxFailures.java:64)
	at org.apache.lucene.util.TestRuleIgnoreTestSuites$1.evaluate(TestRuleIgnoreTestSuites.java:54)
	at com.carrotsearch.randomizedtesting.rules.StatementAdapter.evaluate(StatementAdapter.java:36)
	at com.carrotsearch.randomizedtesting.ThreadLeakControl$StatementRunner.run(ThreadLeakControl.java:368)
	at java.lang.Thread.run(Thread.java:748)


FAILED:  org.apache.solr.cloud.HealthCheckHandlerTest.testHealthCheckV2Api

Error Message:
Error from server at https://127.0.0.1:36321/solr: Host Unavailable: Not in live nodes as per zk

Stack Trace:
org.apache.solr.client.solrj.impl.HttpSolrClient$RemoteExecutionException: Error from server at https://127.0.0.1:36321/solr: Host Unavailable: Not in live nodes as per zk
	at __randomizedtesting.SeedInfo.seed([2C3A040E393CC4CE:6FF7AD1A8883BD80]:0)
	at org.apache.solr.client.solrj.impl.HttpSolrClient$RemoteExecutionException.create(HttpSolrClient.java:836)
	at org.apache.solr.client.solrj.impl.HttpSolrClient.executeMethod(HttpSolrClient.java:627)
	at org.apache.solr.client.solrj.impl.HttpSolrClient.request(HttpSolrClient.java:256)
	at org.apache.solr.client.solrj.impl.HttpSolrClient.request(HttpSolrClient.java:245)
	at org.apache.solr.client.solrj.impl.LBSolrClient.doRequest(LBSolrClient.java:368)
	at org.apache.solr.client.solrj.impl.LBSolrClient.request(LBSolrClient.java:296)
	at org.apache.solr.client.solrj.impl.LBHttpSolrClient.request(LBHttpSolrClient.java:213)
	at org.apache.solr.client.solrj.impl.CloudSolrClient.sendRequest(CloudSolrClient.java:1110)
	at org.apache.solr.client.solrj.impl.CloudSolrClient.requestWithRetryOnStaleState(CloudSolrClient.java:884)
	at org.apache.solr.client.solrj.impl.CloudSolrClient.request(CloudSolrClient.java:817)
	at org.apache.solr.client.solrj.SolrRequest.process(SolrRequest.java:207)
	at org.apache.solr.client.solrj.SolrRequest.process(SolrRequest.java:224)
	at org.apache.solr.cloud.HealthCheckHandlerTest.testHealthCheckV2Api(HealthCheckHandlerTest.java:152)
	at sun.reflect.NativeMethodAccessorImpl.invoke0(Native Method)
	at sun.reflect.NativeMethodAccessorImpl.invoke(NativeMethodAccessorImpl.java:62)
	at sun.reflect.DelegatingMethodAccessorImpl.invoke(DelegatingMethodAccessorImpl.java:43)
	at java.lang.reflect.Method.invoke(Method.java:498)
	at com.carrotsearch.randomizedtesting.RandomizedRunner.invoke(RandomizedRunner.java:1750)
	at com.carrotsearch.randomizedtesting.RandomizedRunner$8.evaluate(RandomizedRunner.java:938)
	at com.carrotsearch.randomizedtesting.RandomizedRunner$9.evaluate(RandomizedRunner.java:974)
	at com.carrotsearch.randomizedtesting.RandomizedRunner$10.evaluate(RandomizedRunner.java:988)
	at com.carrotsearch.randomizedtesting.rules.SystemPropertiesRestoreRule$1.evaluate(SystemPropertiesRestoreRule.java:57)
	at org.apache.lucene.util.TestRuleSetupTeardownChained$1.evaluate(TestRuleSetupTeardownChained.java:49)
	at org.apache.lucene.util.AbstractBeforeAfterRule$1.evaluate(AbstractBeforeAfterRule.java:45)
	at org.apache.lucene.util.TestRuleThreadAndTestName$1.evaluate(TestRuleThreadAndTestName.java:48)
	at org.apache.lucene.util.TestRuleIgnoreAfterMaxFailures$1.evaluate(TestRuleIgnoreAfterMaxFailures.java:64)
	at org.apache.lucene.util.TestRuleMarkFailure$1.evaluate(TestRuleMarkFailure.java:47)
	at com.carrotsearch.randomizedtesting.rules.StatementAdapter.evaluate(StatementAdapter.java:36)
	at com.carrotsearch.randomizedtesting.ThreadLeakControl$StatementRunner.run(ThreadLeakControl.java:368)
	at com.carrotsearch.randomizedtesting.ThreadLeakControl.forkTimeoutingTask(ThreadLeakControl.java:817)
	at com.carrotsearch.randomizedtesting.ThreadLeakControl$3.evaluate(ThreadLeakControl.java:468)
	at com.carrotsearch.randomizedtesting.RandomizedRunner.runSingleTest(RandomizedRunner.java:947)
	at com.carrotsearch.randomizedtesting.RandomizedRunner$5.evaluate(RandomizedRunner.java:832)
	at com.carrotsearch.randomizedtesting.RandomizedRunner$6.evaluate(RandomizedRunner.java:883)
	at com.carrotsearch.randomizedtesting.RandomizedRunner$7.evaluate(RandomizedRunner.java:894)
	at com.carrotsearch.randomizedtesting.rules.StatementAdapter.evaluate(StatementAdapter.java:36)
	at com.carrotsearch.randomizedtesting.rules.SystemPropertiesRestoreRule$1.evaluate(SystemPropertiesRestoreRule.java:57)
	at org.apache.lucene.util.AbstractBeforeAfterRule$1.evaluate(AbstractBeforeAfterRule.java:45)
	at com.carrotsearch.randomizedtesting.rules.StatementAdapter.evaluate(StatementAdapter.java:36)
	at org.apache.lucene.util.TestRuleStoreClassName$1.evaluate(TestRuleStoreClassName.java:41)
	at com.carrotsearch.randomizedtesting.rules.NoShadowingOrOverridesOnMethodsRule$1.evaluate(NoShadowingOrOverridesOnMethodsRule.java:40)
	at com.carrotsearch.randomizedtesting.rules.NoShadowingOrOverridesOnMethodsRule$1.evaluate(NoShadowingOrOverridesOnMethodsRule.java:40)
	at com.carrotsearch.randomizedtesting.rules.StatementAdapter.evaluate(StatementAdapter.java:36)
	at com.carrotsearch.randomizedtesting.rules.StatementAdapter.evaluate(StatementAdapter.java:36)
	at com.carrotsearch.randomizedtesting.rules.StatementAdapter.evaluate(StatementAdapter.java:36)
	at org.apache.lucene.util.TestRuleAssertionsRequired$1.evaluate(TestRuleAssertionsRequired.java:53)
	at org.apache.lucene.util.TestRuleMarkFailure$1.evaluate(TestRuleMarkFailure.java:47)
	at org.apache.lucene.util.TestRuleIgnoreAfterMaxFailures$1.evaluate(TestRuleIgnoreAfterMaxFailures.java:64)
	at org.apache.lucene.util.TestRuleIgnoreTestSuites$1.evaluate(TestRuleIgnoreTestSuites.java:54)
	at com.carrotsearch.randomizedtesting.rules.StatementAdapter.evaluate(StatementAdapter.java:36)
	at com.carrotsearch.randomizedtesting.ThreadLeakControl$StatementRunner.run(ThreadLeakControl.java:368)
	at java.lang.Thread.run(Thread.java:748)




Build Log:
[...truncated 12984 lines...]
   [junit4] Suite: org.apache.solr.cloud.HealthCheckHandlerTest
   [junit4]   2> 733153 INFO  (SUITE-HealthCheckHandlerTest-seed#[2C3A040E393CC4CE]-worker) [    ] o.a.s.SolrTestCaseJ4 SecureRandom sanity checks: test.solr.allowed.securerandom=null & java.security.egd=file:/dev/./urandom
   [junit4]   2> Creating dataDir: /export/home/jenkins/workspace/Lucene-Solr-master-Solaris/solr/build/solr-core/test/J0/temp/solr.cloud.HealthCheckHandlerTest_2C3A040E393CC4CE-001/init-core-data-001
   [junit4]   2> 733153 WARN  (SUITE-HealthCheckHandlerTest-seed#[2C3A040E393CC4CE]-worker) [    ] o.a.s.SolrTestCaseJ4 startTrackingSearchers: numOpens=3 numCloses=3
   [junit4]   2> 733153 INFO  (SUITE-HealthCheckHandlerTest-seed#[2C3A040E393CC4CE]-worker) [    ] o.a.s.SolrTestCaseJ4 Using PointFields (NUMERIC_POINTS_SYSPROP=true) w/NUMERIC_DOCVALUES_SYSPROP=true
   [junit4]   2> 733155 INFO  (SUITE-HealthCheckHandlerTest-seed#[2C3A040E393CC4CE]-worker) [    ] o.a.s.SolrTestCaseJ4 Randomized ssl (true) and clientAuth (true) via: @org.apache.solr.util.RandomizeSSL(reason=, value=NaN, ssl=NaN, clientAuth=NaN)
   [junit4]   2> 733156 INFO  (SUITE-HealthCheckHandlerTest-seed#[2C3A040E393CC4CE]-worker) [    ] o.a.s.c.MiniSolrCloudCluster Starting cluster of 1 servers in /export/home/jenkins/workspace/Lucene-Solr-master-Solaris/solr/build/solr-core/test/J0/temp/solr.cloud.HealthCheckHandlerTest_2C3A040E393CC4CE-001/tempDir-001
   [junit4]   2> 733157 INFO  (SUITE-HealthCheckHandlerTest-seed#[2C3A040E393CC4CE]-worker) [    ] o.a.s.c.ZkTestServer STARTING ZK TEST SERVER
   [junit4]   2> 733157 INFO  (ZkTestServer Run Thread) [    ] o.a.s.c.ZkTestServer client port:0.0.0.0/0.0.0.0:0
   [junit4]   2> 733157 INFO  (ZkTestServer Run Thread) [    ] o.a.s.c.ZkTestServer Starting server
   [junit4]   2> 733258 INFO  (SUITE-HealthCheckHandlerTest-seed#[2C3A040E393CC4CE]-worker) [    ] o.a.s.c.ZkTestServer start zk server on port:46518
   [junit4]   2> 733258 INFO  (SUITE-HealthCheckHandlerTest-seed#[2C3A040E393CC4CE]-worker) [    ] o.a.s.c.ZkTestServer parse host and port list: 127.0.0.1:46518
   [junit4]   2> 733258 INFO  (SUITE-HealthCheckHandlerTest-seed#[2C3A040E393CC4CE]-worker) [    ] o.a.s.c.ZkTestServer connecting to 127.0.0.1 46518
   [junit4]   2> 733274 INFO  (zkConnectionManagerCallback-3438-thread-1) [    ] o.a.s.c.c.ConnectionManager zkClient has connected
   [junit4]   2> 733281 INFO  (zkConnectionManagerCallback-3440-thread-1) [    ] o.a.s.c.c.ConnectionManager zkClient has connected
   [junit4]   2> 733284 INFO  (zkConnectionManagerCallback-3442-thread-1) [    ] o.a.s.c.c.ConnectionManager zkClient has connected
   [junit4]   2> 733287 WARN  (jetty-launcher-3443-thread-1) [    ] o.e.j.s.AbstractConnector Ignoring deprecated socket close linger time
   [junit4]   2> 733287 INFO  (jetty-launcher-3443-thread-1) [    ] o.a.s.c.s.e.JettySolrRunner Start Jetty (original configured port=0)
   [junit4]   2> 733287 INFO  (jetty-launcher-3443-thread-1) [    ] o.a.s.c.s.e.JettySolrRunner Trying to start Jetty on port 0 try number 1 ...
   [junit4]   2> 733287 INFO  (jetty-launcher-3443-thread-1) [    ] o.e.j.s.Server jetty-9.4.14.v20181114; built: 2018-11-14T21:20:31.478Z; git: c4550056e785fb5665914545889f21dc136ad9e6; jvm 1.8.0_191-b12
   [junit4]   2> 733288 INFO  (jetty-launcher-3443-thread-1) [    ] o.e.j.s.session DefaultSessionIdManager workerName=node0
   [junit4]   2> 733288 INFO  (jetty-launcher-3443-thread-1) [    ] o.e.j.s.session No SessionScavenger set, using defaults
   [junit4]   2> 733288 INFO  (jetty-launcher-3443-thread-1) [    ] o.e.j.s.session node0 Scavenging every 600000ms
   [junit4]   2> 733290 INFO  (jetty-launcher-3443-thread-1) [    ] o.e.j.s.h.ContextHandler Started o.e.j.s.ServletContextHandler@24a453d7{/solr,null,AVAILABLE}
   [junit4]   2> 733290 WARN  (jetty-launcher-3443-thread-1) [    ] o.e.j.u.s.S.config No Client EndPointIdentificationAlgorithm configured for SslContextFactory@6bf3980b[provider=null,keyStore=null,trustStore=null]
   [junit4]   2> 733303 INFO  (jetty-launcher-3443-thread-1) [    ] o.e.j.s.AbstractConnector Started ServerConnector@175be17c{SSL,[ssl, http/1.1]}{127.0.0.1:36321}
   [junit4]   2> 733303 INFO  (jetty-launcher-3443-thread-1) [    ] o.e.j.s.Server Started @733989ms
   [junit4]   2> 733303 INFO  (jetty-launcher-3443-thread-1) [    ] o.a.s.c.s.e.JettySolrRunner Jetty properties: {hostContext=/solr, hostPort=36321}
   [junit4]   2> 733303 ERROR (jetty-launcher-3443-thread-1) [    ] o.a.s.u.StartupLoggingUtils Missing Java Option solr.log.dir. Logging may be missing or incomplete.
   [junit4]   2> 733303 INFO  (jetty-launcher-3443-thread-1) [    ] o.a.s.s.SolrDispatchFilter Using logger factory org.apache.logging.slf4j.Log4jLoggerFactory
   [junit4]   2> 733304 INFO  (jetty-launcher-3443-thread-1) [    ] o.a.s.s.SolrDispatchFilter  ___      _       Welcome to Apache Solr™ version 9.0.0
   [junit4]   2> 733304 INFO  (jetty-launcher-3443-thread-1) [    ] o.a.s.s.SolrDispatchFilter / __| ___| |_ _   Starting in cloud mode on port null
   [junit4]   2> 733304 INFO  (jetty-launcher-3443-thread-1) [    ] o.a.s.s.SolrDispatchFilter \__ \/ _ \ | '_|  Install dir: null
   [junit4]   2> 733304 INFO  (jetty-launcher-3443-thread-1) [    ] o.a.s.s.SolrDispatchFilter |___/\___/_|_|    Start time: 2019-02-20T21:24:05.341Z
   [junit4]   2> 733313 INFO  (zkConnectionManagerCallback-3445-thread-1) [    ] o.a.s.c.c.ConnectionManager zkClient has connected
   [junit4]   2> 733314 INFO  (jetty-launcher-3443-thread-1) [    ] o.a.s.s.SolrDispatchFilter solr.xml found in ZooKeeper. Loading...
   [junit4]   2> 733623 INFO  (jetty-launcher-3443-thread-1) [    ] o.a.s.h.c.HttpShardHandlerFactory Host whitelist initialized: WhitelistHostChecker [whitelistHosts=null, whitelistHostCheckingEnabled=true]
   [junit4]   2> 733623 WARN  (jetty-launcher-3443-thread-1) [    ] o.a.s.c.s.i.Http2SolrClient Create Http2SolrClient with HTTP/1.1 transport since Java 8 or lower versions does not support SSL + HTTP/2
   [junit4]   2> 733665 WARN  (jetty-launcher-3443-thread-1) [    ] o.e.j.u.s.S.config No Client EndPointIdentificationAlgorithm configured for SslContextFactory@5a66a878[provider=null,keyStore=null,trustStore=null]
   [junit4]   2> 733668 WARN  (jetty-launcher-3443-thread-1) [    ] o.a.s.c.s.i.Http2SolrClient Create Http2SolrClient with HTTP/1.1 transport since Java 8 or lower versions does not support SSL + HTTP/2
   [junit4]   2> 733669 WARN  (jetty-launcher-3443-thread-1) [    ] o.e.j.u.s.S.config No Client EndPointIdentificationAlgorithm configured for SslContextFactory@14700ae5[provider=null,keyStore=null,trustStore=null]
   [junit4]   2> 733670 INFO  (jetty-launcher-3443-thread-1) [    ] o.a.s.c.ZkContainer Zookeeper client=127.0.0.1:46518/solr
   [junit4]   2> 733690 INFO  (zkConnectionManagerCallback-3451-thread-1) [    ] o.a.s.c.c.ConnectionManager zkClient has connected
   [junit4]   2> 733694 INFO  (zkConnectionManagerCallback-3453-thread-1) [    ] o.a.s.c.c.ConnectionManager zkClient has connected
   [junit4]   2> 733941 INFO  (jetty-launcher-3443-thread-1) [n:127.0.0.1:36321_solr    ] o.a.s.c.OverseerElectionContext I am going to be the leader 127.0.0.1:36321_solr
   [junit4]   2> 733942 INFO  (jetty-launcher-3443-thread-1) [n:127.0.0.1:36321_solr    ] o.a.s.c.Overseer Overseer (id=72119711879069701-127.0.0.1:36321_solr-n_0000000000) starting
   [junit4]   2> 733948 INFO  (zkConnectionManagerCallback-3460-thread-1) [    ] o.a.s.c.c.ConnectionManager zkClient has connected
   [junit4]   2> 733950 INFO  (jetty-launcher-3443-thread-1) [n:127.0.0.1:36321_solr    ] o.a.s.c.s.i.ZkClientClusterStateProvider Cluster at 127.0.0.1:46518/solr ready
   [junit4]   2> 733957 INFO  (OverseerStateUpdate-72119711879069701-127.0.0.1:36321_solr-n_0000000000) [n:127.0.0.1:36321_solr    ] o.a.s.c.Overseer Starting to work on the main queue : 127.0.0.1:36321_solr
   [junit4]   2> 733958 INFO  (jetty-launcher-3443-thread-1) [n:127.0.0.1:36321_solr    ] o.a.s.c.ZkController Register node as live in ZooKeeper:/live_nodes/127.0.0.1:36321_solr
   [junit4]   2> 733976 INFO  (jetty-launcher-3443-thread-1) [n:127.0.0.1:36321_solr    ] o.a.s.h.a.MetricsHistoryHandler No .system collection, keeping metrics history in memory.
   [junit4]   2> 733996 INFO  (jetty-launcher-3443-thread-1) [n:127.0.0.1:36321_solr    ] o.a.s.m.r.SolrJmxReporter JMX monitoring for 'solr_36321.solr.node' (registry 'solr.node') enabled at server: com.sun.jmx.mbeanserver.JmxMBeanServer@18f019ca
   [junit4]   2> 734001 INFO  (jetty-launcher-3443-thread-1) [n:127.0.0.1:36321_solr    ] o.a.s.m.r.SolrJmxReporter JMX monitoring for 'solr_36321.solr.jvm' (registry 'solr.jvm') enabled at server: com.sun.jmx.mbeanserver.JmxMBeanServer@18f019ca
   [junit4]   2> 734001 INFO  (jetty-launcher-3443-thread-1) [n:127.0.0.1:36321_solr    ] o.a.s.m.r.SolrJmxReporter JMX monitoring for 'solr_36321.solr.jetty' (registry 'solr.jetty') enabled at server: com.sun.jmx.mbeanserver.JmxMBeanServer@18f019ca
   [junit4]   2> 734002 INFO  (jetty-launcher-3443-thread-1) [n:127.0.0.1:36321_solr    ] o.a.s.c.CorePropertiesLocator Found 0 core definitions underneath /export/home/jenkins/workspace/Lucene-Solr-master-Solaris/solr/build/solr-core/test/J0/temp/solr.cloud.HealthCheckHandlerTest_2C3A040E393CC4CE-001/tempDir-001/node1/.
   [junit4]   2> 734004 INFO  (zkCallback-3459-thread-1) [    ] o.a.s.c.c.ZkStateReader Updated live nodes from ZooKeeper... (0) -> (1)
   [junit4]   2> 734023 INFO  (zkConnectionManagerCallback-3466-thread-1) [    ] o.a.s.c.c.ConnectionManager zkClient has connected
   [junit4]   2> 734024 INFO  (SUITE-HealthCheckHandlerTest-seed#[2C3A040E393CC4CE]-worker) [    ] o.a.s.c.c.ZkStateReader Updated live nodes from ZooKeeper... (0) -> (1)
   [junit4]   2> 734025 INFO  (SUITE-HealthCheckHandlerTest-seed#[2C3A040E393CC4CE]-worker) [    ] o.a.s.c.s.i.ZkClientClusterStateProvider Cluster at 127.0.0.1:46518/solr ready
   [junit4]   2> 734065 INFO  (TEST-HealthCheckHandlerTest.testHealthCheckV2Api-seed#[2C3A040E393CC4CE]) [    ] o.a.s.SolrTestCaseJ4 ###Starting testHealthCheckV2Api
   [junit4]   2> 734139 INFO  (qtp2129664964-10571) [n:127.0.0.1:36321_solr    ] o.a.s.s.HttpSolrCall [admin] webapp=null path=/node/health params={wt=javabin&version=2} status=503 QTime=0
   [junit4]   2> 734140 INFO  (TEST-HealthCheckHandlerTest.testHealthCheckV2Api-seed#[2C3A040E393CC4CE]) [    ] o.a.s.SolrTestCaseJ4 ###Ending testHealthCheckV2Api
   [junit4]   2> NOTE: reproduce with: ant test  -Dtestcase=HealthCheckHandlerTest -Dtests.method=testHealthCheckV2Api -Dtests.seed=2C3A040E393CC4CE -Dtests.slow=true -Dtests.locale=fr -Dtests.timezone=Asia/Barnaul -Dtests.asserts=true -Dtests.file.encoding=UTF-8
   [junit4] ERROR   0.18s J0 | HealthCheckHandlerTest.testHealthCheckV2Api <<<
   [junit4]    > Throwable #1: org.apache.solr.client.solrj.impl.HttpSolrClient$RemoteExecutionException: Error from server at https://127.0.0.1:36321/solr: Host Unavailable: Not in live nodes as per zk
   [junit4]    > 	at __randomizedtesting.SeedInfo.seed([2C3A040E393CC4CE:6FF7AD1A8883BD80]:0)
   [junit4]    > 	at org.apache.solr.client.solrj.impl.HttpSolrClient$RemoteExecutionException.create(HttpSolrClient.java:836)
   [junit4]    > 	at org.apache.solr.client.solrj.impl.HttpSolrClient.executeMethod(HttpSolrClient.java:627)
   [junit4]    > 	at org.apache.solr.client.solrj.impl.HttpSolrClient.request(HttpSolrClient.java:256)
   [junit4]    > 	at org.apache.solr.client.solrj.impl.HttpSolrClient.request(HttpSolrClient.java:245)
   [junit4]    > 	at org.apache.solr.client.solrj.impl.LBSolrClient.doRequest(LBSolrClient.java:368)
   [junit4]    > 	at org.apache.solr.client.solrj.impl.LBSolrClient.request(LBSolrClient.java:296)
   [junit4]    > 	at org.apache.solr.client.solrj.impl.LBHttpSolrClient.request(LBHttpSolrClient.java:213)
   [junit4]    > 	at org.apache.solr.client.solrj.impl.CloudSolrClient.sendRequest(CloudSolrClient.java:1110)
   [junit4]    > 	at org.apache.solr.client.solrj.impl.CloudSolrClient.requestWithRetryOnStaleState(CloudSolrClient.java:884)
   [junit4]    > 	at org.apache.solr.client.solrj.impl.CloudSolrClient.request(CloudSolrClient.java:817)
   [junit4]    > 	at org.apache.solr.client.solrj.SolrRequest.process(SolrRequest.java:207)
   [junit4]    > 	at org.apache.solr.client.solrj.SolrRequest.process(SolrRequest.java:224)
   [junit4]    > 	at org.apache.solr.cloud.HealthCheckHandlerTest.testHealthCheckV2Api(HealthCheckHandlerTest.java:152)
   [junit4]    > 	at java.lang.Thread.run(Thread.java:748)
   [junit4]   2> 734208 INFO  (zkCallback-3452-thread-1) [    ] o.a.s.c.c.ZkStateReader Updated live nodes from ZooKeeper... (0) -> (1)
   [junit4]   2> 734217 INFO  (TEST-HealthCheckHandlerTest.testHealthCheckHandler-seed#[2C3A040E393CC4CE]) [    ] o.a.s.SolrTestCaseJ4 ###Starting testHealthCheckHandler
   [junit4]   2> 734217 INFO  (qtp2129664964-10573) [n:127.0.0.1:36321_solr    ] o.a.s.s.HttpSolrCall [admin] webapp=null path=/admin/info/health params={wt=javabin&version=2} status=0 QTime=0
   [junit4]   2> 734222 INFO  (qtp2129664964-10568) [n:127.0.0.1:36321_solr    ] o.a.s.s.HttpSolrCall [admin] webapp=null path=/admin/info/health params={wt=javabin&version=2} status=0 QTime=0
   [junit4]   2> 734235 INFO  (qtp2129664964-10573) [n:127.0.0.1:36321_solr    ] o.a.s.h.a.CollectionsHandler Invoked Collection Action :create with params collection.configName=_default&name=test&nrtReplicas=1&action=CREATE&numShards=1&property.solr.directoryFactory=solr.StandardDirectoryFactory&wt=javabin&version=2 and sendToOCPQueue=true
   [junit4]   2> 734244 INFO  (OverseerThreadFactory-2991-thread-1-processing-n:127.0.0.1:36321_solr) [n:127.0.0.1:36321_solr    ] o.a.s.c.a.c.CreateCollectionCmd Create collection test
   [junit4]   2> 734403 DEBUG (OverseerStateUpdate-72119711879069701-127.0.0.1:36321_solr-n_0000000000) [n:127.0.0.1:36321_solr    ] o.a.s.c.Overseer processMessage: queueSize: 1, message = {
   [junit4]   2>   "name":"test",
   [junit4]   2>   "fromApi":"true",
   [junit4]   2>   "collection.configName":"_default",
   [junit4]   2>   "numShards":"1",
   [junit4]   2>   "nrtReplicas":"1",
   [junit4]   2>   "stateFormat":"2",
   [junit4]   2>   "replicationFactor":"1",
   [junit4]   2>   "property.solr.directoryFactory":"solr.StandardDirectoryFactory",
   [junit4]   2>   "operation":"create"} current state version: 0
   [junit4]   2> 734489 DEBUG (OverseerStateUpdate-72119711879069701-127.0.0.1:36321_solr-n_0000000000) [n:127.0.0.1:36321_solr    ] o.a.s.c.Overseer processMessage: queueSize: 1, message = {
   [junit4]   2>   "operation":"ADDREPLICA",
   [junit4]   2>   "collection":"test",
   [junit4]   2>   "shard":"shard1",
   [junit4]   2>   "core":"test_shard1_replica_n1",
   [junit4]   2>   "state":"down",
   [junit4]   2>   "base_url":"https://127.0.0.1:36321/solr",
   [junit4]   2>   "type":"NRT",
   [junit4]   2>   "waitForFinalState":"false"} current state version: 0
   [junit4]   2> 734490 INFO  (OverseerStateUpdate-72119711879069701-127.0.0.1:36321_solr-n_0000000000) [n:127.0.0.1:36321_solr    ] o.a.s.c.o.SliceMutator createReplica() {
   [junit4]   2>   "operation":"ADDREPLICA",
   [junit4]   2>   "collection":"test",
   [junit4]   2>   "shard":"shard1",
   [junit4]   2>   "core":"test_shard1_replica_n1",
   [junit4]   2>   "state":"down",
   [junit4]   2>   "base_url":"https://127.0.0.1:36321/solr",
   [junit4]   2>   "type":"NRT",
   [junit4]   2>   "waitForFinalState":"false"} 
   [junit4]   2> 734703 INFO  (qtp2129664964-10571) [n:127.0.0.1:36321_solr    x:test_shard1_replica_n1] o.a.s.h.a.CoreAdminOperation core create command qt=/admin/cores&collection.configName=_default&newCollection=true&collection=test&version=2&replicaType=NRT&coreNodeName=core_node2&name=test_shard1_replica_n1&action=CREATE&numShards=1&shard=shard1&property.solr.directoryFactory=solr.StandardDirectoryFactory&wt=javabin
   [junit4]   2> 734703 INFO  (qtp2129664964-10571) [n:127.0.0.1:36321_solr    x:test_shard1_replica_n1] o.a.s.c.TransientSolrCoreCacheDefault Allocating transient cache for 2147483647 transient cores
   [junit4]   2> 734709 DEBUG (OverseerStateUpdate-72119711879069701-127.0.0.1:36321_solr-n_0000000000) [n:127.0.0.1:36321_solr    ] o.a.s.c.Overseer processMessage: queueSize: 1, message = {
   [junit4]   2>   "core":"test_shard1_replica_n1",
   [junit4]   2>   "core_node_name":"core_node2",
   [junit4]   2>   "roles":null,
   [junit4]   2>   "base_url":"https://127.0.0.1:36321/solr",
   [junit4]   2>   "node_name":"127.0.0.1:36321_solr",
   [junit4]   2>   "numShards":"1",
   [junit4]   2>   "state":"down",
   [junit4]   2>   "shard":"shard1",
   [junit4]   2>   "collection":"test",
   [junit4]   2>   "type":"NRT",
   [junit4]   2>   "force_set_state":"false",
   [junit4]   2>   "operation":"state"} current state version: 0
   [junit4]   2> 735722 INFO  (qtp2129664964-10571) [n:127.0.0.1:36321_solr c:test s:shard1 r:core_node2 x:test_shard1_replica_n1] o.a.s.c.RequestParams conf resource params.json loaded . version : 0 
   [junit4]   2> 735722 INFO  (qtp2129664964-10571) [n:127.0.0.1:36321_solr c:test s:shard1 r:core_node2 x:test_shard1_replica_n1] o.a.s.c.RequestParams request params refreshed to version 0
   [junit4]   2> 735724 WARN  (qtp2129664964-10571) [n:127.0.0.1:36321_solr c:test s:shard1 r:core_node2 x:test_shard1_replica_n1] o.a.s.c.SolrConfig Couldn't add files from /export/home/jenkins/workspace/Lucene-Solr-master-Solaris/solr/build/solr-core/test/J0/temp/solr.cloud.HealthCheckHandlerTest_2C3A040E393CC4CE-001/tempDir-001/node1/test_shard1_replica_n1/../../../../contrib/extraction/lib filtered by .*\.jar to classpath: /export/home/jenkins/workspace/Lucene-Solr-master-Solaris/solr/build/solr-core/test/J0/temp/solr.cloud.HealthCheckHandlerTest_2C3A040E393CC4CE-001/tempDir-001/node1/test_shard1_replica_n1/../../../../contrib/extraction/lib
   [junit4]   2> 735724 WARN  (qtp2129664964-10571) [n:127.0.0.1:36321_solr c:test s:shard1 r:core_node2 x:test_shard1_replica_n1] o.a.s.c.SolrConfig Couldn't add files from /export/home/jenkins/workspace/Lucene-Solr-master-Solaris/solr/build/solr-core/test/J0/temp/solr.cloud.HealthCheckHandlerTest_2C3A040E393CC4CE-001/tempDir-001/node1/test_shard1_replica_n1/../../../../dist filtered by solr-cell-\d.*\.jar to classpath: /export/home/jenkins/workspace/Lucene-Solr-master-Solaris/solr/build/solr-core/test/J0/temp/solr.cloud.HealthCheckHandlerTest_2C3A040E393CC4CE-001/tempDir-001/node1/test_shard1_replica_n1/../../../../dist
   [junit4]   2> 735724 WARN  (qtp2129664964-10571) [n:127.0.0.1:36321_solr c:test s:shard1 r:core_node2 x:test_shard1_replica_n1] o.a.s.c.SolrConfig Couldn't add files from /export/home/jenkins/workspace/Lucene-Solr-master-Solaris/solr/build/solr-core/test/J0/temp/solr.cloud.HealthCheckHandlerTest_2C3A040E393CC4CE-001/tempDir-001/node1/test_shard1_replica_n1/../../../../contrib/clustering/lib filtered by .*\.jar to classpath: /export/home/jenkins/workspace/Lucene-Solr-master-Solaris/solr/build/solr-core/test/J0/temp/solr.cloud.HealthCheckHandlerTest_2C3A040E393CC4CE-001/tempDir-001/node1/test_shard1_replica_n1/../../../../contrib/clustering/lib
   [junit4]   2> 735724 WARN  (qtp2129664964-10571) [n:127.0.0.1:36321_solr c:test s:shard1 r:core_node2 x:test_shard1_replica_n1] o.a.s.c.SolrConfig Couldn't add files from /export/home/jenkins/workspace/Lucene-Solr-master-Solaris/solr/build/solr-core/test/J0/temp/solr.cloud.HealthCheckHandlerTest_2C3A040E393CC4CE-001/tempDir-001/node1/test_shard1_replica_n1/../../../../dist filtered by solr-clustering-\d.*\.jar to classpath: /export/home/jenkins/workspace/Lucene-Solr-master-Solaris/solr/build/solr-core/test/J0/temp/solr.cloud.HealthCheckHandlerTest_2C3A040E393CC4CE-001/tempDir-001/node1/test_shard1_replica_n1/../../../../dist
   [junit4]   2> 735724 WARN  (qtp2129664964-10571) [n:127.0.0.1:36321_solr c:test s:shard1 r:core_node2 x:test_shard1_replica_n1] o.a.s.c.SolrConfig Couldn't add files from /export/home/jenkins/workspace/Lucene-Solr-master-Solaris/solr/build/solr-core/test/J0/temp/solr.cloud.HealthCheckHandlerTest_2C3A040E393CC4CE-001/tempDir-001/node1/test_shard1_replica_n1/../../../../contrib/langid/lib filtered by .*\.jar to classpath: /export/home/jenkins/workspace/Lucene-Solr-master-Solaris/solr/build/solr-core/test/J0/temp/solr.cloud.HealthCheckHandlerTest_2C3A040E393CC4CE-001/tempDir-001/node1/test_shard1_replica_n1/../../../../contrib/langid/lib
   [junit4]   2> 735724 WARN  (qtp2129664964-10571) [n:127.0.0.1:36321_solr c:test s:shard1 r:core_node2 x:test_shard1_replica_n1] o.a.s.c.SolrConfig Couldn't add files from /export/home/jenkins/workspace/Lucene-Solr-master-Solaris/solr/build/solr-core/test/J0/temp/solr.cloud.HealthCheckHandlerTest_2C3A040E393CC4CE-001/tempDir-001/node1/test_shard1_replica_n1/../../../../dist filtered by solr-langid-\d.*\.jar to classpath: /export/home/jenkins/workspace/Lucene-Solr-master-Solaris/solr/build/solr-core/test/J0/temp/solr.cloud.HealthCheckHandlerTest_2C3A040E393CC4CE-001/tempDir-001/node1/test_shard1_replica_n1/../../../../dist
   [junit4]   2> 735724 WARN  (qtp2129664964-10571) [n:127.0.0.1:36321_solr c:test s:shard1 r:core_node2 x:test_shard1_replica_n1] o.a.s.c.SolrConfig Couldn't add files from /export/home/jenkins/workspace/Lucene-Solr-master-Solaris/solr/build/solr-core/test/J0/temp/solr.cloud.HealthCheckHandlerTest_2C3A040E393CC4CE-001/tempDir-001/node1/test_shard1_replica_n1/../../../../contrib/velocity/lib filtered by .*\.jar to classpath: /export/home/jenkins/workspace/Lucene-Solr-master-Solaris/solr/build/solr-core/test/J0/temp/solr.cloud.HealthCheckHandlerTest_2C3A040E393CC4CE-001/tempDir-001/node1/test_shard1_replica_n1/../../../../contrib/velocity/lib
   [junit4]   2> 735724 WARN  (qtp2129664964-10571) [n:127.0.0.1:36321_solr c:test s:shard1 r:core_node2 x:test_shard1_replica_n1] o.a.s.c.SolrConfig Couldn't add files from /export/home/jenkins/workspace/Lucene-Solr-master-Solaris/solr/build/solr-core/test/J0/temp/solr.cloud.HealthCheckHandlerTest_2C3A040E393CC4CE-001/tempDir-001/node1/test_shard1_replica_n1/../../../../dist filtered by solr-velocity-\d.*\.jar to classpath: /export/home/jenkins/workspace/Lucene-Solr-master-Solaris/solr/build/solr-core/test/J0/temp/solr.cloud.HealthCheckHandlerTest_2C3A040E393CC4CE-001/tempDir-001/node1/test_shard1_replica_n1/../../../../dist
   [junit4]   2> 735725 WARN  (qtp2129664964-10571) [n:127.0.0.1:36321_solr c:test s:shard1 r:core_node2 x:test_shard1_replica_n1] o.a.s.c.SolrConfig Couldn't add files from /export/home/jenkins/workspace/Lucene-Solr-master-Solaris/solr/build/solr-core/test/J0/temp/solr.cloud.HealthCheckHandlerTest_2C3A040E393CC4CE-001/tempDir-001/node1/test_shard1_replica_n1/../../../../dist filtered by solr-ltr-\d.*\.jar to classpath: /export/home/jenkins/workspace/Lucene-Solr-master-Solaris/solr/build/solr-core/test/J0/temp/solr.cloud.HealthCheckHandlerTest_2C3A040E393CC4CE-001/tempDir-001/node1/test_shard1_replica_n1/../../../../dist
   [junit4]   2> 735733 INFO  (qtp2129664964-10571) [n:127.0.0.1:36321_solr c:test s:shard1 r:core_node2 x:test_shard1_replica_n1] o.a.s.c.SolrConfig Using Lucene MatchVersion: 9.0.0
   [junit4]   2> 735757 INFO  (qtp2129664964-10571) [n:127.0.0.1:36321_solr c:test s:shard1 r:core_node2 x:test_shard1_replica_n1] o.a.s.s.IndexSchema [test_shard1_replica_n1] Schema name=default-config
   [junit4]   2> 735924 INFO  (qtp2129664964-10571) [n:127.0.0.1:36321_solr c:test s:shard1 r:core_node2 x:test_shard1_replica_n1] o.a.s.s.IndexSchema Loaded schema default-config/1.6 with uniqueid field id
   [junit4]   2> 735966 INFO  (qtp2129664964-10571) [n:127.0.0.1:36321_solr c:test s:shard1 r:core_node2 x:test_shard1_replica_n1] o.a.s.c.CoreContainer Creating SolrCore 'test_shard1_replica_n1' using configuration from collection test, trusted=true
   [junit4]   2> 735971 INFO  (qtp2129664964-10571) [n:127.0.0.1:36321_solr c:test s:shard1 r:core_node2 x:test_shard1_replica_n1] o.a.s.m.r.SolrJmxReporter JMX monitoring for 'solr_36321.solr.core.test.shard1.replica_n1' (registry 'solr.core.test.shard1.replica_n1') enabled at server: com.sun.jmx.mbeanserver.JmxMBeanServer@18f019ca
   [junit4]   2> 735971 INFO  (qtp2129664964-10571) [n:127.0.0.1:36321_solr c:test s:shard1 r:core_node2 x:test_shard1_replica_n1] o.a.s.c.SolrCore [[test_shard1_replica_n1] ] Opening new SolrCore at [/export/home/jenkins/workspace/Lucene-Solr-master-Solaris/solr/build/solr-core/test/J0/temp/solr.cloud.HealthCheckHandlerTest_2C3A040E393CC4CE-001/tempDir-001/node1/test_shard1_replica_n1], dataDir=[/export/home/jenkins/workspace/Lucene-Solr-master-Solaris/solr/build/solr-core/test/J0/temp/solr.cloud.HealthCheckHandlerTest_2C3A040E393CC4CE-001/tempDir-001/node1/./test_shard1_replica_n1/data/]
   [junit4]   2> 735977 INFO  (qtp2129664964-10571) [n:127.0.0.1:36321_solr c:test s:shard1 r:core_node2 x:test_shard1_replica_n1] o.a.s.r.XSLTResponseWriter xsltCacheLifetimeSeconds=5
   [junit4]   2> 736056 INFO  (qtp2129664964-10571) [n:127.0.0.1:36321_solr c:test s:shard1 r:core_node2 x:test_shard1_replica_n1] o.a.s.u.UpdateHandler Using UpdateLog implementation: org.apache.solr.update.UpdateLog
   [junit4]   2> 736056 INFO  (qtp2129664964-10571) [n:127.0.0.1:36321_solr c:test s:shard1 r:core_node2 x:test_shard1_replica_n1] o.a.s.u.UpdateLog Initializing UpdateLog: dataDir= defaultSyncLevel=FLUSH numRecordsToKeep=100 maxNumLogsToKeep=10 numVersionBuckets=65536
   [junit4]   2> 736059 INFO  (qtp2129664964-10571) [n:127.0.0.1:36321_solr c:test s:shard1 r:core_node2 x:test_shard1_replica_n1] o.a.s.u.CommitTracker Hard AutoCommit: if uncommitted for 15000ms; 
   [junit4]   2> 736059 INFO  (qtp2129664964-10571) [n:127.0.0.1:36321_solr c:test s:shard1 r:core_node2 x:test_shard1_replica_n1] o.a.s.u.CommitTracker Soft AutoCommit: disabled
   [junit4]   2> 736061 INFO  (qtp2129664964-10571) [n:127.0.0.1:36321_solr c:test s:shard1 r:core_node2 x:test_shard1_replica_n1] o.a.s.s.SolrIndexSearcher Opening [Searcher@3b32848a[test_shard1_replica_n1] main]
   [junit4]   2> 736062 INFO  (qtp2129664964-10571) [n:127.0.0.1:36321_solr c:test s:shard1 r:core_node2 x:test_shard1_replica_n1] o.a.s.r.ManagedResourceStorage Configured ZooKeeperStorageIO with znodeBase: /configs/_default
   [junit4]   2> 736063 INFO  (qtp2129664964-10571) [n:127.0.0.1:36321_solr c:test s:shard1 r:core_node2 x:test_shard1_replica_n1] o.a.s.r.ManagedResourceStorage Loaded null at path _rest_managed.json using ZooKeeperStorageIO:path=/configs/_default
   [junit4]   2> 736063 INFO  (qtp2129664964-10571) [n:127.0.0.1:36321_solr c:test s:shard1 r:core_node2 x:test_shard1_replica_n1] o.a.s.s.ZkIndexSchemaReader Creating ZooKeeper watch for the managed schema at /configs/_default/managed-schema
   [junit4]   2> 736064 INFO  (qtp2129664964-10571) [n:127.0.0.1:36321_solr c:test s:shard1 r:core_node2 x:test_shard1_replica_n1] o.a.s.s.ZkIndexSchemaReader Current schema version 0 is already the latest
   [junit4]   2> 736064 INFO  (qtp2129664964-10571) [n:127.0.0.1:36321_solr c:test s:shard1 r:core_node2 x:test_shard1_replica_n1] o.a.s.h.c.SpellCheckComponent Initializing spell checkers
   [junit4]   2> 736064 INFO  (qtp2129664964-10571) [n:127.0.0.1:36321_solr c:test s:shard1 r:core_node2 x:test_shard1_replica_n1] o.a.s.s.DirectSolrSpellChecker init: {name=default,field=_text_,classname=solr.DirectSolrSpellChecker,distanceMeasure=internal,accuracy=0.5,maxEdits=2,minPrefix=1,maxInspections=5,minQueryLength=4,maxQueryFrequency=0.01}
   [junit4]   2> 736065 INFO  (qtp2129664964-10571) [n:127.0.0.1:36321_solr c:test s:shard1 r:core_node2 x:test_shard1_replica_n1] o.a.s.h.ReplicationHandler Commits will be reserved for 10000ms.
   [junit4]   2> 736066 INFO  (qtp2129664964-10571) [n:127.0.0.1:36321_solr c:test s:shard1 r:core_node2 x:test_shard1_replica_n1] o.a.s.u.UpdateLog Could not find max version in index or recent updates, using new clock 1626024546772451328
   [junit4]   2> 736072 INFO  (qtp2129664964-10571) [n:127.0.0.1:36321_solr c:test s:shard1 r:core_node2 x:test_shard1_replica_n1] o.a.s.c.ZkShardTerms Successful update of terms at /collections/test/terms/shard1 to Terms{values={core_node2=0}, version=0}
   [junit4]   2> 736072 INFO  (qtp2129664964-10571) [n:127.0.0.1:36321_solr c:test s:shard1 r:core_node2 x:test_shard1_replica_n1] o.a.s.c.ShardLeaderElectionContextBase make sure parent is created /collections/test/leaders/shard1
   [junit4]   2> 736075 INFO  (searcherExecutor-2996-thread-1-processing-n:127.0.0.1:36321_solr x:test_shard1_replica_n1 c:test s:shard1 r:core_node2) [n:127.0.0.1:36321_solr c:test s:shard1 r:core_node2 x:test_shard1_replica_n1] o.a.s.c.QuerySenderListener QuerySenderListener sending requests to Searcher@3b32848a[test_shard1_replica_n1] main{ExitableDirectoryReader(UninvertingDirectoryReader())}
   [junit4]   2> 736075 INFO  (searcherExecutor-2996-thread-1-processing-n:127.0.0.1:36321_solr x:test_shard1_replica_n1 c:test s:shard1 r:core_node2) [n:127.0.0.1:36321_solr c:test s:shard1 r:core_node2 x:test_shard1_replica_n1] o.a.s.c.QuerySenderListener QuerySenderListener done.
   [junit4]   2> 736075 INFO  (searcherExecutor-2996-thread-1-processing-n:127.0.0.1:36321_solr x:test_shard1_replica_n1 c:test s:shard1 r:core_node2) [n:127.0.0.1:36321_solr c:test s:shard1 r:core_node2 x:test_shard1_replica_n1] o.a.s.h.c.SpellCheckComponent Loading spell index for spellchecker: default
   [junit4]   2> 736075 INFO  (searcherExecutor-2996-thread-1-processing-n:127.0.0.1:36321_solr x:test_shard1_replica_n1 c:test s:shard1 r:core_node2) [n:127.0.0.1:36321_solr c:test s:shard1 r:core_node2 x:test_shard1_replica_n1] o.a.s.c.SolrCore [test_shard1_replica_n1] Registered new searcher Searcher@3b32848a[test_shard1_replica_n1] main{ExitableDirectoryReader(UninvertingDirectoryReader())}
   [junit4]   2> 736078 INFO  (qtp2129664964-10571) [n:127.0.0.1:36321_solr c:test s:shard1 r:core_node2 x:test_shard1_replica_n1] o.a.s.c.ShardLeaderElectionContext Enough replicas found to continue.
   [junit4]   2> 736078 INFO  (qtp2129664964-10571) [n:127.0.0.1:36321_solr c:test s:shard1 r:core_node2 x:test_shard1_replica_n1] o.a.s.c.ShardLeaderElectionContext I may be the new leader - try and sync
   [junit4]   2> 736078 INFO  (qtp2129664964-10571) [n:127.0.0.1:36321_solr c:test s:shard1 r:core_node2 x:test_shard1_replica_n1] o.a.s.c.SyncStrategy Sync replicas to https://127.0.0.1:36321/solr/test_shard1_replica_n1/
   [junit4]   2> 736079 INFO  (qtp2129664964-10571) [n:127.0.0.1:36321_solr c:test s:shard1 r:core_node2 x:test_shard1_replica_n1] o.a.s.c.SyncStrategy Sync Success - now sync replicas to me
   [junit4]   2> 736079 INFO  (qtp2129664964-10571) [n:127.0.0.1:36321_solr c:test s:shard1 r:core_node2 x:test_shard1_replica_n1] o.a.s.c.SyncStrategy https://127.0.0.1:36321/solr/test_shard1_replica_n1/ has no replicas
   [junit4]   2> 736079 INFO  (qtp2129664964-10571) [n:127.0.0.1:36321_solr c:test s:shard1 r:core_node2 x:test_shard1_replica_n1] o.a.s.c.ShardLeaderElectionContextBase Creating leader registration node /collections/test/leaders/shard1/leader after winning as /collections/test/leader_elect/shard1/election/72119711879069701-core_node2-n_0000000000
   [junit4]   2> 736081 INFO  (qtp2129664964-10571) [n:127.0.0.1:36321_solr c:test s:shard1 r:core_node2 x:test_shard1_replica_n1] o.a.s.c.ShardLeaderElectionContext I am the new leader: https://127.0.0.1:36321/solr/test_shard1_replica_n1/ shard1
   [junit4]   2> 736083 DEBUG (OverseerStateUpdate-72119711879069701-127.0.0.1:36321_solr-n_0000000000) [n:127.0.0.1:36321_solr    ] o.a.s.c.Overseer processMessage: queueSize: 1, message = {
   [junit4]   2>   "operation":"leader",
   [junit4]   2>   "shard":"shard1",
   [junit4]   2>   "collection":"test",
   [junit4]   2>   "base_url":"https://127.0.0.1:36321/solr",
   [junit4]   2>   "core":"test_shard1_replica_n1",
   [junit4]   2>   "state":"active"} current state version: 0
   [junit4]   2> 736187 INFO  (zkCallback-3452-thread-2) [    ] o.a.s.c.c.ZkStateReader A cluster state change: [WatchedEvent state:SyncConnected type:NodeDataChanged path:/collections/test/state.json] for collection [test] has occurred - updating... (live nodes size: [1])
   [junit4]   2> 736188 INFO  (qtp2129664964-10571) [n:127.0.0.1:36321_solr c:test s:shard1 r:core_node2 x:test_shard1_replica_n1] o.a.s.c.ZkController I am the leader, no recovery necessary
   [junit4]   2> 736190 INFO  (qtp2129664964-10571) [n:127.0.0.1:36321_solr c:test s:shard1 r:core_node2 x:test_shard1_replica_n1] o.a.s.s.HttpSolrCall [admin] webapp=null path=/admin/cores params={qt=/admin/cores&collection.configName=_default&newCollection=true&collection=test&version=2&replicaType=NRT&coreNodeName=core_node2&name=test_shard1_replica_n1&action=CREATE&numShards=1&shard=shard1&property.solr.directoryFactory=solr.StandardDirectoryFactory&wt=javabin} status=0 QTime=1488
   [junit4]   2> 736191 DEBUG (OverseerStateUpdate-72119711879069701-127.0.0.1:36321_solr-n_0000000000) [n:127.0.0.1:36321_solr    ] o.a.s.c.Overseer processMessage: queueSize: 1, message = {
   [junit4]   2>   "core":"test_shard1_replica_n1",
   [junit4]   2>   "core_node_name":"core_node2",
   [junit4]   2>   "roles":null,
   [junit4]   2>   "base_url":"https://127.0.0.1:36321/solr",
   [junit4]   2>   "node_name":"127.0.0.1:36321_solr",
   [junit4]   2>   "numShards":"1",
   [junit4]   2>   "state":"active",
   [junit4]   2>   "shard":"shard1",
   [junit4]   2>   "collection":"test",
   [junit4]   2>   "type":"NRT",
   [junit4]   2>   "force_set_state":"false",
   [junit4]   2>   "operation":"state"} current state version: 0
   [junit4]   2> 736192 INFO  (zkCallback-3452-thread-1) [    ] o.a.s.c.c.ZkStateReader A cluster state change: [WatchedEvent state:SyncConnected type:NodeDataChanged path:/collections/test/state.json] for collection [test] has occurred - updating... (live nodes size: [1])
   [junit4]   2> 736201 INFO  (qtp2129664964-10573) [n:127.0.0.1:36321_solr    ] o.a.s.h.a.CollectionsHandler Wait for new collection to be active for at most 45 seconds. Check all shard replicas
   [junit4]   2> 736244 INFO  (OverseerCollectionConfigSetProcessor-72119711879069701-127.0.0.1:36321_solr-n_0000000000) [n:127.0.0.1:36321_solr    ] o.a.s.c.OverseerTaskQueue Response ZK path: /overseer/collection-queue-work/qnr-0000000000 doesn't exist.  Requestor may have disconnected from ZooKeeper
   [junit4]   2> 736312 INFO  (zkCallback-3452-thread-2) [    ] o.a.s.c.c.ZkStateReader A cluster state change: [WatchedEvent state:SyncConnected type:NodeDataChanged path:/collections/test/state.json] for collection [test] has occurred - updating... (live nodes size: [1])
   [junit4]   2> 736312 INFO  (zkCallback-3452-thread-3) [    ] o.a.s.c.c.ZkStateReader A cluster state change: [WatchedEvent state:SyncConnected type:NodeDataChanged path:/collections/test/state.json] for collection [test] has occurred - updating... (live nodes size: [1])
   [junit4]   2> 736312 INFO  (zkCallback-3452-thread-1) [    ] o.a.s.c.c.ZkStateReader A cluster state change: [WatchedEvent state:SyncConnected type:NodeDataChanged path:/collections/test/state.json] for collection [test] has occurred - updating... (live nodes size: [1])
   [junit4]   2> 736313 INFO  (qtp2129664964-10573) [n:127.0.0.1:36321_solr    ] o.a.s.s.HttpSolrCall [admin] webapp=null path=/admin/collections params={collection.configName=_default&name=test&nrtReplicas=1&action=CREATE&numShards=1&property.solr.directoryFactory=solr.StandardDirectoryFactory&wt=javabin&version=2} status=0 QTime=2078
   [junit4]   2> 736314 INFO  (qtp2129664964-10570) [n:127.0.0.1:36321_solr    ] o.a.s.s.HttpSolrCall [admin] webapp=null path=/admin/info/health params={wt=javabin&version=2} status=0 QTime=0
   [junit4]   2> 736317 INFO  (TEST-HealthCheckHandlerTest.testHealthCheckHandler-seed#[2C3A040E393CC4CE]) [    ] o.a.s.c.c.ZkStateReader Updated live nodes from ZooKeeper... (0) -> (1)
   [junit4]   2> 736319 INFO  (qtp2129664964-10575) [n:127.0.0.1:36321_solr    ] o.a.s.h.a.CollectionsHandler Invoked Collection Action :delete with params name=test&action=DELETE&wt=javabin&version=2 and sendToOCPQueue=true
   [junit4]   2> 736323 INFO  (OverseerThreadFactory-2991-thread-2-processing-n:127.0.0.1:36321_solr) [n:127.0.0.1:36321_solr    ] o.a.s.c.a.c.OverseerCollectionMessageHandler Executing Collection Cmd=action=UNLOAD&deleteInstanceDir=true&deleteDataDir=true&deleteMetricsHistory=true, asyncId=null
   [junit4]   2> 736324 INFO  (qtp2129664964-10571) [n:127.0.0.1:36321_solr    x:test_shard1_replica_n1] o.a.s.m.SolrMetricManager Closing metric reporters for registry=solr.core.test.shard1.replica_n1, tag=null
   [junit4]   2> 736324 INFO  (qtp2129664964-10571) [n:127.0.0.1:36321_solr    x:test_shard1_replica_n1] o.a.s.m.r.SolrJmxReporter Closing reporter [org.apache.solr.metrics.reporters.SolrJmxReporter@3361b4ff: rootName = solr_36321, domain = solr.core.test.shard1.replica_n1, service url = null, agent id = null] for registry solr.core.test.shard1.replica_n1 / com.codahale.metrics.MetricRegistry@1552a095
   [junit4]   2> 736354 INFO  (qtp2129664964-10571) [n:127.0.0.1:36321_solr    x:test_shard1_replica_n1] o.a.s.c.SolrCore [test_shard1_replica_n1]  CLOSING SolrCore org.apache.solr.core.SolrCore@3c86f48b
   [junit4]   2> 736354 INFO  (qtp2129664964-10571) [n:127.0.0.1:36321_solr    x:test_shard1_replica_n1] o.a.s.m.SolrMetricManager Closing metric reporters for registry=solr.core.test.shard1.replica_n1, tag=3c86f48b
   [junit4]   2> 736354 INFO  (qtp2129664964-10571) [n:127.0.0.1:36321_solr    x:test_shard1_replica_n1] o.a.s.m.SolrMetricManager Closing metric reporters for registry=solr.collection.test.shard1.leader, tag=3c86f48b
   [junit4]   2> 736357 INFO  (qtp2129664964-10571) [n:127.0.0.1:36321_solr    x:test_shard1_replica_n1] o.a.s.c.ZkShardTerms Successful update of terms at /collections/test/terms/shard1 to Terms{values={}, version=1}
   [junit4]   2> 736358 INFO  (qtp2129664964-10571) [n:127.0.0.1:36321_solr    x:test_shard1_replica_n1] o.a.s.s.HttpSolrCall [admin] webapp=null path=/admin/cores params={deleteInstanceDir=true&deleteMetricsHistory=true&core=test_shard1_replica_n1&qt=/admin/cores&deleteDataDir=true&action=UNLOAD&wt=javabin&version=2} status=0 QTime=34
   [junit4]   2> 736360 DEBUG (OverseerStateUpdate-72119711879069701-127.0.0.1:36321_solr-n_0000000000) [n:127.0.0.1:36321_solr    ] o.a.s.c.Overseer processMessage: queueSize: 2, message = {
   [junit4]   2>   "operation":"deletecore",
   [junit4]   2>   "core":"test_shard1_replica_n1",
   [junit4]   2>   "node_name":"127.0.0.1:36321_solr",
   [junit4]   2>   "collection":"test",
   [junit4]   2>   "base_url":"https://127.0.0.1:36321/solr",
   [junit4]   2>   "core_node_name":"core_node2"} current state version: 0
   [junit4]   2> 736360 DEBUG (OverseerStateUpdate-72119711879069701-127.0.0.1:36321_solr-n_0000000000) [n:127.0.0.1:36321_solr    ] o.a.s.c.Overseer processMessage: queueSize: 2, message = {
   [junit4]   2>   "operation":"delete",
   [junit4]   2>   "name":"test"} current state version: 0
   [junit4]   2> 736463 INFO  (zkCallback-3452-thread-3) [    ] o.a.s.c.c.ZkStateReader A cluster state change: [WatchedEvent state:SyncConnected type:NodeDeleted path:/collections/test/state.json] for collection [test] has occurred - updating... (live nodes size: [1])
   [junit4]   2> 736464 INFO  (zkCallback-3452-thread-4) [    ] o.a.s.c.c.ZkStateReader A cluster state change: [WatchedEvent state:SyncConnected type:NodeDeleted path:/collections/test/state.json] for collection [test] has occurred - updating... (live nodes size: [1])
   [junit4]   2> 736465 INFO  (zkCallback-3452-thread-1) [    ] o.a.s.c.c.ZkStateReader A cluster state change: [WatchedEvent state:SyncConnected type:NodeDeleted path:/collections/test/state.json] for collection [test] has occurred - updating... (live nodes size: [1])
   [junit4]   2> 736490 INFO  (qtp2129664964-10575) [n:127.0.0.1:36321_solr    ] o.a.s.s.HttpSolrCall [admin] webapp=null path=/admin/collections params={name=test&action=DELETE&wt=javabin&version=2} status=0 QTime=171
   [junit4]   2> 736513 INFO  (qtp2129664964-10573) [n:127.0.0.1:36321_solr    ] o.a.s.h.a.ConfigSetsHandler Invoked ConfigSet Action :list with params action=LIST&wt=javabin&version=2 
   [junit4]   2> 736515 INFO  (qtp2129664964-10573) [n:127.0.0.1:36321_solr    ] o.a.s.s.HttpSolrCall [admin] webapp=null path=/admin/configs params={action=LIST&wt=javabin&version=2} status=0 QTime=1
   [junit4]   2> 736519 INFO  (qtp2129664964-10570) [n:127.0.0.1:36321_solr    ] o.a.s.h.a.ConfigSetsHandler Invoked ConfigSet Action :delete with params name=conf&action=DELETE&wt=javabin&version=2 
   [junit4]   2> 736526 INFO  (OverseerCollectionConfigSetProcessor-72119711879069701-127.0.0.1:36321_solr-n_0000000000) [n:127.0.0.1:36321_solr    ] o.a.s.c.OverseerTaskQueue Response ZK path: /overseer/collection-queue-work/qnr-0000000002 doesn't exist.  Requestor may have disconnected from ZooKeeper
   [junit4]   2> 736528 INFO  (OverseerThreadFactory-2991-thread-3-processing-n:127.0.0.1:36321_solr) [n:127.0.0.1:36321_solr    ] o.a.s.c.OverseerConfigSetMessageHandler OverseerConfigSetMessageHandler.processMessage : delete , {
   [junit4]   2>   "name":"conf",
   [junit4]   2>   "operation":"configsets:delete"}
   [junit4]   2> 736529 INFO  (OverseerThreadFactory-2991-thread-3-processing-n:127.0.0.1:36321_solr) [n:127.0.0.1:36321_solr    ] o.a.s.c.OverseerConfigSetMessageHandler no existing ConfigSet properties found
   [junit4]   2> 736532 INFO  (qtp2129664964-10570) [n:127.0.0.1:36321_solr    ] o.a.s.s.HttpSolrCall [admin] webapp=null path=/admin/configs params={name=conf&action=DELETE&wt=javabin&version=2} status=0 QTime=13
   [junit4]   2> 736534 WARN  (TEST-HealthCheckHandlerTest.testHealthCheckHandler-seed#[2C3A040E393CC4CE]) [    ] o.e.j.s.AbstractConnector Ignoring deprecated socket close linger time
   [junit4]   2> 736534 INFO  (TEST-HealthCheckHandlerTest.testHealthCheckHandler-seed#[2C3A040E393CC4CE]) [    ] o.a.s.c.s.e.JettySolrRunner Start Jetty (original configured port=0)
   [junit4]   2> 736534 INFO  (TEST-HealthCheckHandlerTest.testHealthCheckHandler-seed#[2C3A040E393CC4CE]) [    ] o.a.s.c.s.e.JettySolrRunner Trying to start Jetty on port 0 try number 1 ...
   [junit4]   2> 736534 INFO  (TEST-HealthCheckHandlerTest.testHealthCheckHandler-seed#[2C3A040E393CC4CE]) [    ] o.e.j.s.Server jetty-9.4.14.v20181114; built: 2018-11-14T21:20:31.478Z; git: c4550056e785fb5665914545889f21dc136ad9e6; jvm 1.8.0_191-b12
   [junit4]   2> 736535 INFO  (TEST-HealthCheckHandlerTest.testHealthCheckHandler-seed#[2C3A040E393CC4CE]) [    ] o.e.j.s.session DefaultSessionIdManager workerName=node0
   [junit4]   2> 736535 INFO  (TEST-HealthCheckHandlerTest.testHealthCheckHandler-seed#[2C3A040E393CC4CE]) [    ] o.e.j.s.session No SessionScavenger set, using defaults
   [junit4]   2> 736535 INFO  (TEST-HealthCheckHandlerTest.testHealthCheckHandler-seed#[2C3A040E393CC4CE]) [    ] o.e.j.s.session node0 Scavenging every 660000ms
   [junit4]   2> 736536 INFO  (TEST-HealthCheckHandlerTest.testHealthCheckHandler-seed#[2C3A040E393CC4CE]) [    ] o.e.j.s.h.ContextHandler Started o.e.j.s.ServletContextHandler@2629cb6a{/solr,null,AVAILABLE}
   [junit4]   2> 736536 WARN  (TEST-HealthCheckHandlerTest.testHealthCheckHandler-seed#[2C3A040E393CC4CE]) [    ] o.e.j.u.s.S.config No Client EndPointIdentificationAlgorithm configured for SslContextFactory@5ec8bca5[provider=null,keyStore=null,trustStore=null]
   [junit4]   2> 736536 INFO  (TEST-HealthCheckHandlerTest.testHealthCheckHandler-seed#[2C3A040E393CC4CE]) [    ] o.e.j.s.AbstractConnector Started ServerConnector@6636450{SSL,[ssl, http/1.1]}{127.0.0.1:47737}
   [junit4]   2> 736536 INFO  (TEST-HealthCheckHandlerTest.testHealthCheckHandler-seed#[2C3A040E393CC4CE]) [    ] o.e.j.s.Server Started @737223ms
   [junit4]   2> 736536 INFO  (TEST-HealthCheckHandlerTest.testHealthCheckHandler-seed#[2C3A040E393CC4CE]) [    ] o.a.s.c.s.e.JettySolrRunner Jetty properties: {hostContext=/solr, hostPort=47737}
   [junit4]   2> 736537 ERROR (TEST-HealthCheckHandlerTest.testHealthCheckHandler-seed#[2C3A040E393CC4CE]) [    ] o.a.s.u.StartupLoggingUtils Missing Java Option solr.log.dir. Logging may be missing or incomplete.
   [junit4]   2> 736537 INFO  (TEST-HealthCheckHandlerTest.testHealthCheckHandler-seed#[2C3A040E393CC4CE]) [    ] o.a.s.s.SolrDispatchFilter Using logger factory org.apache.logging.slf4j.Log4jLoggerFactory
   [junit4]   2> 736537 INFO  (TEST-HealthCheckHandlerTest.testHealthCheckHandler-seed#[2C3A040E393CC4CE]) [    ] o.a.s.s.SolrDispatchFilter  ___      _       Welcome to Apache Solr™ version 9.0.0
   [junit4]   2> 736537 INFO  (TEST-HealthCheckHandlerTest.testHealthCheckHandler-seed#[2C3A040E393CC4CE]) [    ] o.a.s.s.SolrDispatchFilter / __| ___| |_ _   Starting in cloud mode on port null
   [junit4]   2> 736537 INFO  (TEST-HealthCheckHandlerTest.testHealthCheckHandler-seed#[2C3A040E393CC4CE]) [    ] o.a.s.s.SolrDispatchFilter \__ \/ _ \ | '_|  Install dir: null
   [junit4]   2> 736537 INFO  (TEST-HealthCheckHandlerTest.testHealthCheckHandler-seed#[2C3A040E393CC4CE]) [    ] o.a.s.s.SolrDispatchFilter |___/\___/_|_|    Start time: 2019-02-20T21:24:08.574Z
   [junit4]   2> 736540 INFO  (zkConnectionManagerCallback-3471-thread-1) [    ] o.a.s.c.c.ConnectionManager zkClient has connected
   [junit4]   2> 736541 INFO  (TEST-HealthCheckHandlerTest.testHealthCheckHandler-seed#[2C3A040E393CC4CE]) [    ] o.a.s.s.SolrDispatchFilter solr.xml found in ZooKeeper. Loading...
   [junit4]   2> 737705 INFO  (TEST-HealthCheckHandlerTest.testHealthCheckHandler-seed#[2C3A040E393CC4CE]) [    ] o.a.s.h.c.HttpShardHandlerFactory Host whitelist initialized: WhitelistHostChecker [whitelistHosts=null, whitelistHostCheckingEnabled=true]
   [junit4]   2> 737706 WARN  (TEST-HealthCheckHandlerTest.testHealthCheckHandler-seed#[2C3A040E393CC4CE]) [    ] o.a.s.c.s.i.Http2SolrClient Create Http2SolrClient with HTTP/1.1 transport since Java 8 or lower versions does not support SSL + HTTP/2
   [junit4]   2> 737706 WARN  (TEST-HealthCheckHandlerTest.testHealthCheckHandler-seed#[2C3A040E393CC4CE]) [    ] o.e.j.u.s.S.config No Client EndPointIdentificationAlgorithm configured for SslContextFactory@14d40f21[provider=null,keyStore=null,trustStore=null]
   [junit4]   2> 737712 WARN  (TEST-HealthCheckHandlerTest.testHealthCheckHandler-seed#[2C3A040E393CC4CE]) [    ] o.a.s.c.s.i.Http2SolrClient Create Http2SolrClient with HTTP/1.1 transport since Java 8 or lower versions does not support SSL + HTTP/2
   [junit4]   2> 737713 WARN  (TEST-HealthCheckHandlerTest.testHealthCheckHandler-seed#[2C3A040E393CC4CE]) [    ] o.e.j.u.s.S.config No Client EndPointIdentificationAlgorithm configured for SslContextFactory@22bbc7a6[provider=null,keyStore=null,trustStore=null]
   [junit4]   2> 737714 INFO  (TEST-HealthCheckHandlerTest.testHealthCheckHandler-seed#[2C3A040E393CC4CE]) [    ] o.a.s.c.ZkContainer Zookeeper client=127.0.0.1:46518/solr
   [junit4]   2> 737721 INFO  (zkConnectionManagerCallback-3477-thread-1) [    ] o.a.s.c.c.ConnectionManager zkClient has connected
   [junit4]   2> 737725 INFO  (zkConnectionManagerCallback-3479-thread-1) [    ] o.a.s.c.c.ConnectionManager zkClient has connected
   [junit4]   2> 737730 INFO  (TEST-HealthCheckHandlerTest.testHealthCheckHandler-seed#[2C3A040E393CC4CE]) [n:127.0.0.1:47737_solr    ] o.a.s.c.c.ZkStateReader Updated live nodes from ZooKeeper... (0) -> (1)
   [junit4]   2> 737735 INFO  (TEST-HealthCheckHandlerTest.testHealthCheckHandler-seed#[2C3A040E393CC4CE]) [n:127.0.0.1:47737_solr    ] o.a.s.c.ZkController Publish node=127.0.0.1:47737_solr as DOWN
   [junit4]   2> 737736 INFO  (TEST-HealthCheckHandlerTest.testHealthCheckHandler-seed#[2C3A040E393CC4CE]) [n:127.0.0.1:47737_solr    ] o.a.s.c.TransientSolrCoreCacheDefault Allocating transient cache for 2147483647 transient cores
   [junit4]   2> 737736 INFO  (TEST-HealthCheckHandlerTest.testHealthCheckHandler-seed#[2C3A040E393CC4CE]) [n:127.0.0.1:47737_solr    ] o.a.s.c.ZkController Register node as live in ZooKeeper:/live_nodes/127.0.0.1:47737_solr
   [junit4]   2> 737745 INFO  (zkCallback-3452-thread-3) [    ] o.a.s.c.c.ZkStateReader Updated live nodes from ZooKeeper... (1) -> (2)
   [junit4]   2> 737769 INFO  (zkCallback-3459-thread-1) [    ] o.a.s.c.c.ZkStateReader Updated live nodes from ZooKeeper... (1) -> (2)
   [junit4]   2> 737769 INFO  (zkCallback-3478-thread-1) [    ] o.a.s.c.c.ZkStateReader Updated live nodes from ZooKeeper... (1) -> (2)
   [junit4]   2> 737778 INFO  (zkCallback-3465-thread-1) [    ] o.a.s.c.c.ZkStateReader Updated live nodes from ZooKeeper... (1) -> (2)
   [junit4]   2> 737778 INFO  (zkCallback-3465-thread-2) [    ] o.a.s.c.c.ZkStateReader Updated live nodes from ZooKeeper... (1) -> (2)
   [junit4]   2> 737779 DEBUG (OverseerStateUpdate-72119711879069701-127.0.0.1:36321_solr-n_0000000000) [n:127.0.0.1:36321_solr    ] o.a.s.c.Overseer processMessage: queueSize: 1, message = {
   [junit4]   2>   "operation":"downnode",
   [junit4]   2>   "node_name":"127.0.0.1:47737_solr"} current state version: 0
   [junit4]   2> 737779 INFO  (zkConnectionManagerCallback-3486-thread-1) [    ] o.a.s.c.c.ConnectionManager zkClient has connected
   [junit4]   2> 737780 INFO  (TEST-HealthCheckHandlerTest.testHealthCheckHandler-seed#[2C3A040E393CC4CE]) [n:127.0.0.1:47737_solr    ] o.a.s.c.c.ZkStateReader Updated live nodes from ZooKeeper... (0) -> (2)
   [junit4]   2> 737781 INFO  (TEST-HealthCheckHandlerTest.testHealthCheckHandler-seed#[2C3A040E393CC4CE]) [n:127.0.0.1:47737_solr    ] o.a.s.c.s.i.ZkClientClusterStateProvider Cluster at 127.0.0.1:46518/solr ready
   [junit4]   2> 737781 INFO  (TEST-HealthCheckHandlerTest.testHealthCheckHandler-seed#[2C3A040E393CC4CE]) [n:127.0.0.1:47737_solr    ] o.a.s.h.a.MetricsHistoryHandler No .system collection, keeping metrics history in memory.
   [junit4]   2> 737803 INFO  (TEST-HealthCheckHandlerTest.testHealthCheckHandler-seed#[2C3A040E393CC4CE]) [n:127.0.0.1:47737_solr    ] o.a.s.m.r.SolrJmxReporter JMX monitoring for 'solr_47737.solr.node' (registry 'solr.node') enabled at server: com.sun.jmx.mbeanserver.JmxMBeanServer@18f019ca
   [junit4]   2> 737810 INFO  (TEST-HealthCheckHandlerTest.testHealthCheckHandler-seed#[2C3A040E393CC4CE]) [n:127.0.0.1:47737_solr    ] o.a.s.m.r.SolrJmxReporter JMX monitoring for 'solr_47737.solr.jvm' (registry 'solr.jvm') enabled at server: com.sun.jmx.mbeanserver.JmxMBeanServer@18f019ca
   [junit4]   2> 737811 INFO  (TEST-HealthCheckHandlerTest.testHealthCheckHandler-seed#[2C3A040E393CC4CE]) [n:127.0.0.1:47737_solr    ] o.a.s.m.r.SolrJmxReporter JMX monitoring for 'solr_47737.solr.jetty' (registry 'solr.jetty') enabled at server: com.sun.jmx.mbeanserver.JmxMBeanServer@18f019ca
   [junit4]   2> 737812 INFO  (TEST-HealthCheckHandlerTest.testHealthCheckHandler-seed#[2C3A040E393CC4CE]) [n:127.0.0.1:47737_solr    ] o.a.s.c.CorePropertiesLocator Found 0 core definitions underneath /export/home/jenkins/workspace/Lucene-Solr-master-Solaris/solr/build/solr-core/test/J0/temp/solr.cloud.HealthCheckHandlerTest_2C3A040E393CC4CE-001/tempDir-001/node2/.
   [junit4]   2> 737860 INFO  (qtp1674793338-10638) [n:127.0.0.1:47737_solr    ] o.a.s.s.HttpSolrCall [admin] webapp=null path=/admin/info/health params={wt=javabin&version=2} status=0 QTime=0
   [junit4]   2> 737864 INFO  (qtp1674793338-10641) [n:127.0.0.1:47737_solr    ] o.a.s.s.HttpSolrCall [admin] webapp=null path=/admin/info/health params={wt=javabin&version=2} status=503 QTime=0
   [junit4]   2> 737865 INFO  (zkCallback-3465-thread-1) [    ] o.a.s.c.c.ZkStateReader Updated live nodes from ZooKeeper... (2) -> (1)
   [junit4]   2> 737865 INFO  (zkCallback-3465-thread-2) [    ] o.a.s.c.c.ZkStateReader Updated live nodes from ZooKeeper... (2) -> (1)
   [junit4]   2> 737865 INFO  (zkCallback-3452-thread-3) [    ] o.a.s.c.c.ZkStateReader Updated live nodes from ZooKeeper... (2) -> (1)
   [junit4]   2> 737866 INFO  (zkCallback-3459-thread-1) [    ] o.a.s.c.c.ZkStateReader Updated live nodes from ZooKeeper... (2) -> (1)
   [junit4]   2> 737870 INFO  (TEST-HealthCheckHandlerTest.testHealthCheckHandler-seed#[2C3A040E393CC4CE]) [    ] o.a.s.c.CoreContainer Shutting down CoreContainer instance=1978047705
   [junit4]   2> 737870 INFO  (TEST-HealthCheckHandlerTest.testHealthCheckHandler-seed#[2C3A040E393CC4CE]) [    ] o.a.s.c.ZkController Remove node as live in ZooKeeper:/live_nodes/127.0.0.1:47737_solr
   [junit4]   2> 737870 INFO  (TEST-HealthCheckHandlerTest.testHealthCheckHandler-seed#[2C3A040E393CC4CE]) [    ] o.a.s.c.CoreContainer Publish this node as DOWN...
   [junit4]   2> 737870 INFO  (TEST-HealthCheckHandlerTest.testHealthCheckHandler-seed#[2C3A040E393CC4CE]) [    ] o.a.s.c.ZkController Publish node=127.0.0.1:47737_solr as DOWN
   [junit4]   2> 737870 WARN  (TEST-HealthCheckHandlerTest.testHealthCheckHandler-seed#[2C3A040E393CC4CE]) [    ] o.a.s.c.CoreContainer Error publishing nodes as down. Continuing to close CoreContainer
   [junit4]   2> org.apache.solr.common.SolrException: org.apache.zookeeper.KeeperException$SessionExpiredException: KeeperErrorCode = Session expired for /overseer/queue
   [junit4]   2> 	at org.apache.solr.cloud.ZkDistributedQueue.<init>(ZkDistributedQueue.java:129) ~[java/:?]
   [junit4]   2> 	at org.apache.solr.cloud.Overseer.getStateUpdateQueue(Overseer.java:690) ~[java/:?]
   [junit4]   2> 	at org.apache.solr.cloud.Overseer.getStateUpdateQueue(Overseer.java:678) ~[java/:?]
   [junit4]   2> 	at org.apache.solr.cloud.ZkController.publishNodeAsDown(ZkController.java:2599) ~[java/:?]
   [junit4]   2> 	at org.apache.solr.core.CoreContainer.shutdown(CoreContainer.java:859) [java/:?]
   [junit4]   2> 	at org.apache.solr.servlet.SolrDispatchFilter.close(SolrDispatchFilter.java:333) [java/:?]
   [junit4]   2> 	at org.apache.solr.client.solrj.embedded.JettySolrRunner.stop(JettySolrRunner.java:609) [java/:?]
   [junit4]   2> 	at org.apache.solr.cloud.HealthCheckHandlerTest.testHealthCheckHandler(HealthCheckHandlerTest.java:98) [test/:?]
   [junit4]   2> 	at sun.reflect.NativeMethodAccessorImpl.invoke0(Native Method) ~[?:1.8.0_191]
   [junit4]   2> 	at sun.reflect.NativeMethodAccessorImpl.invoke(NativeMethodAccessorImpl.java:62) ~[?:1.8.0_191]
   [junit4]   2> 	at sun.reflect.DelegatingMethodAccessorImpl.invoke(DelegatingMethodAccessorImpl.java:43) ~[?:1.8.0_191]
   [junit4]   2> 	at java.lang.reflect.Method.invoke(Method.java:498) ~[?:1.8.0_191]
   [junit4]   2> 	at com.carrotsearch.randomizedtesting.RandomizedRunner.invoke(RandomizedRunner.java:1750) [randomizedtesting-runner-2.7.2.jar:?]
   [junit4]   2> 	at com.carrotsearch.randomizedtesting.RandomizedRunner$8.evaluate(RandomizedRunner.java:938) [randomizedtesting-runner-2.7.2.jar:?]
   [junit4]   2> 	at com.carrotsearch.randomizedtesting.RandomizedRunner$9.evaluate(RandomizedRunner.java:974) [randomizedtesting-runner-2.7.2.jar:?]
   [junit4]   2> 	at com.carrotsearch.randomizedtesting.RandomizedRunner$10.evaluate(RandomizedRunner.java:988) [randomizedtesting-runner-2.7.2.jar:?]
   [junit4]   2> 	at com.carrotsearch.randomizedtesting.rules.SystemPropertiesRestoreRule$1.evaluate(SystemPropertiesRestoreRule.java:57) [randomizedtesting-runner-2.7.2.jar:?]
   [junit4]   2> 	at org.apache.lucene.util.TestRuleSetupTeardownChained$1.evaluate(TestRuleSetupTeardownChained.java:49) [java/:?]
   [junit4]   2> 	at org.apache.lucene.util.AbstractBeforeAfterRule$1.evaluate(AbstractBeforeAfterRule.java:45) [java/:?]
   [junit4]   2> 	at org.apache.lucene.util.TestRuleThreadAndTestName$1.evaluate(TestRuleThreadAndTestName.java:48) [java/:?]
   [junit4]   2> 	at org.apache.lucene.util.TestRuleIgnoreAfterMaxFailures$1.evaluate(TestRuleIgnoreAfterMaxFailures.java:64) [java/:?]
   [junit4]   2> 	at org.apache.lucene.util.TestRuleMarkFailure$1.evaluate(TestRuleMarkFailure.java:47) [java/:?]
   [junit4]   2> 	at com.carrotsearch.randomizedtesting.rules.StatementAdapter.evaluate(StatementAdapter.java:36) [randomizedtesting-runner-2.7.2.jar:?]
   [junit4]   2> 	at com.carrotsearch.randomizedtesting.ThreadLeakControl$StatementRunner.run(ThreadLeakControl.java:368) [randomizedtesting-runner-2.7.2.jar:?]
   [junit4]   2> 	at com.carrotsearch.randomizedtesting.ThreadLeakControl.forkTimeoutingTask(ThreadLeakControl.java:817) [randomizedtesting-runner-2.7.2.jar:?]
   [junit4]   2> 	at com.carrotsearch.randomizedtesting.ThreadLeakControl$3.evaluate(ThreadLeakControl.java:468) [randomizedtesting-runner-2.7.2.jar:?]
   [junit4]   2> 	at com.carrotsearch.randomizedtesting.RandomizedRunner.runSingleTest(RandomizedRunner.java:947) [randomizedtesting-runner-2.7.2.jar:?]
   [junit4]   2> 	at com.carrotsearch.randomizedtesting.RandomizedRunner$5.evaluate(RandomizedRunner.java:832) [randomizedtesting-runner-2.7.2.jar:?]
   [junit4]   2> 	at com.carrotsearch.randomizedtesting.RandomizedRunner$6.evaluate(RandomizedRunner.java:883) [randomizedtesting-runner-2.7.2.jar:?]
   [junit4]   2> 	at com.carrotsearch.randomizedtesting.RandomizedRunner$7.evaluate(RandomizedRunner.java:894) [randomizedtesting-runner-2.7.2.jar:?]
   [junit4]   2> 	at com.carrotsearch.randomizedtesting.rules.StatementAdapter.evaluate(StatementAdapter.java:36) [randomizedtesting-runner-2.7.2.jar:?]
   [junit4]   2> 	at com.carrotsearch.randomizedtesting.rules.SystemPropertiesRestoreRule$1.evaluate(SystemPropertiesRestoreRule.java:57) [randomizedtesting-runner-2.7.2.jar:?]
   [junit4]   2> 	at org.apache.lucene.util.AbstractBeforeAfterRule$1.evaluate(AbstractBeforeAfterRule.java:45) [java/:?]
   [junit4]   2> 	at com.carrotsearch.randomizedtesting.rules.StatementAdapter.evaluate(StatementAdapter.java:36) [randomizedtesting-runner-2.7.2.jar:?]
   [junit4]   2> 	at org.apache.lucene.util.TestRuleStoreClassName$1.evaluate(TestRuleStoreClassName.java:41) [java/:?]
   [junit4]   2> 	at com.carrotsearch.randomizedtesting.rules.NoShadowingOrOverridesOnMethodsRule$1.evaluate(NoShadowingOrOverridesOnMethodsRule.java:40) [randomizedtesting-runner-2.7.2.jar:?]
   [junit4]   2> 	at com.carrotsearch.randomizedtesting.rules.NoShadowingOrOverridesOnMethodsRule$1.evaluate(NoShadowingOrOverridesOnMethodsRule.java:40) [randomizedtesting-runner-2.7.2.jar:?]
   [junit4]   2> 	at com.carrotsearch.randomizedtesting.rules.StatementAdapter.evaluate(StatementAdapter.java:36) [randomizedtesting-runner-2.7.2.jar:?]
   [junit4]   2> 	at com.carrotsearch.randomizedtesting.rules.StatementAdapter.evaluate(StatementAdapter.java:36) [randomizedtesting-runner-2.7.2.jar:?]
   [junit4]   2> 	at com.carrotsearch.randomizedtesting.rules.StatementAdapter.evaluate(StatementAdapter.java:36) [randomizedtesting-runner-2.7.2.jar:?]
   [junit4]   2> 	at org.apache.lucene.util.TestRuleAssertionsRequired$1.evaluate(TestRuleAssertionsRequired.java:53) [java/:?]
   [junit4]   2> 	at org.apache.lucene.util.TestRuleMarkFailure$1.evaluate(TestRuleMarkFailure.java:47) [java/:?]
   [junit4]   2> 	at org.apache.lucene.util.TestRuleIgnoreAfterMaxFailures$1.evaluate(TestRuleIgnoreAfterMaxFailures.java:64) [java/:?]
   [junit4]   2> 	at org.apache.lucene.util.TestRuleIgnoreTestSuites$1.evaluate(TestRuleIgnoreTestSuites.java:54) [java/:?]
   [junit4]   2> 	at com.carrotsearch.randomizedtesting.rules.StatementAdapter.evaluate(StatementAdapter.java:36) [randomizedtesting-runner-2.7.2.jar:?]
   [junit4]   2> 	at com.carrotsearch.randomizedtesting.ThreadLeakControl$StatementRunner.run(ThreadLeakControl.java:368) [randomizedtesting-runner-2.7.2.jar:?]
   [junit4]   2> 	at java.lang.Thread.run(Thread.java:748) [?:1.8.0_191]
   [junit4]   2> Caused by: org.apache.zookeeper.KeeperException$SessionExpiredException: KeeperErrorCode = Session expired for /overseer/queue
   [junit4]   2> 	at org.apache.zookeeper.KeeperException.create(KeeperException.java:130) ~[zookeeper-3.4.13.jar:3.4.13-2d71af4dbe22557fda74f9a9b4309b15a7487f03]
   [junit4]   2> 	at org.apache.zookeeper.KeeperException.create(KeeperException.java:54) ~[zookeeper-3.4.13.jar:3.4.13-2d71af4dbe22557fda74f9a9b4309b15a7487f03]
   [junit4]   2> 	at org.apache.zookeeper.ZooKeeper.exists(ZooKeeper.java:1111) ~[zookeeper-3.4.13.jar:3.4.13-2d71af4dbe22557fda74f9a9b4309b15a7487f03]
   [junit4]   2> 	at org.apache.solr.common.cloud.SolrZkClient.lambda$exists$3(SolrZkClient.java:334) ~[java/:?]
   [junit4]   2> 	at org.apache.solr.common.cloud.ZkCmdExecutor.retryOperation(ZkCmdExecutor.java:71) ~[java/:?]
   [junit4]   2> 	at org.apache.solr.common.cloud.SolrZkClient.exists(SolrZkClient.java:334) ~[java/:?]
   [junit4]   2> 	at org.apache.solr.common.cloud.ZkCmdExecutor.ensureExists(ZkCmdExecutor.java:10

[...truncated too long message...]

1> Done close org.apache.solr.common.util.ExecutorUtil$MDCAwareThreadPoolExecutor@317efb80[Terminated, pool size = 1, active threads = 0, queued tasks = 0, completed tasks = 1]
   [junit4]   2> 233560 INFO  (closeThreadPool-543-thread-2) [    ] o.a.s.c.Overseer Overseer (id=72120064837419012-127.0.0.1:61608_p_vwj-n_0000000000) closing
   [junit4]   2> 233568 INFO  (closeThreadPool-526-thread-2) [    ] o.a.s.c.Overseer Overseer (id=72120064837419012-127.0.0.1:61608_p_vwj-n_0000000000) closing
   [junit4]   1> Done close org.apache.solr.common.util.ExecutorUtil$MDCAwareThreadPoolExecutor@58705735[Terminated, pool size = 0, active threads = 0, queued tasks = 0, completed tasks = 19]
   [junit4]   1> Done close org.apache.solr.common.util.ExecutorUtil$MDCAwareThreadPoolExecutor@48e6592e[Terminated, pool size = 0, active threads = 0, queued tasks = 0, completed tasks = 7]
   [junit4]   2> 233573 INFO  (closeThreadPool-526-thread-13) [    ] o.e.j.s.AbstractConnector Stopped ServerConnector@6b7c2568{HTTP/1.1,[http/1.1, h2c]}{127.0.0.1:0}
   [junit4]   2> 233573 INFO  (closeThreadPool-526-thread-9) [    ] o.e.j.s.AbstractConnector Stopped ServerConnector@3fbf09f6{HTTP/1.1,[http/1.1, h2c]}{127.0.0.1:0}
   [junit4]   2> 233574 INFO  (closeThreadPool-526-thread-9) [    ] o.e.j.s.h.ContextHandler Stopped o.e.j.s.ServletContextHandler@5c3367ef{/p_vwj,null,UNAVAILABLE}
   [junit4]   2> 233574 INFO  (closeThreadPool-526-thread-13) [    ] o.e.j.s.h.ContextHandler Stopped o.e.j.s.ServletContextHandler@7ab463fb{/p_vwj,null,UNAVAILABLE}
   [junit4]   2> 233574 INFO  (closeThreadPool-526-thread-9) [    ] o.e.j.s.session node0 Stopped scavenging
   [junit4]   2> 233574 INFO  (closeThreadPool-526-thread-13) [    ] o.e.j.s.session node0 Stopped scavenging
   [junit4]   2> 233575 WARN  (NIOServerCxn.Factory:0.0.0.0/0.0.0.0:0) [    ] o.a.z.s.NIOServerCnxn Unable to read additional data from client sessionid 0x10038d11dd00013, likely client has closed socket
   [junit4]   2> 233578 INFO  (closeThreadPool-526-thread-2) [    ] o.e.j.s.AbstractConnector Stopped ServerConnector@1cc520ee{HTTP/1.1,[http/1.1, h2c]}{127.0.0.1:0}
   [junit4]   2> 233578 INFO  (closeThreadPool-526-thread-2) [    ] o.e.j.s.h.ContextHandler Stopped o.e.j.s.ServletContextHandler@d027375{/p_vwj,null,UNAVAILABLE}
   [junit4]   2> 233578 INFO  (closeThreadPool-526-thread-2) [    ] o.e.j.s.session node0 Stopped scavenging
   [junit4]   2> 233581 INFO  (closeThreadPool-526-thread-12) [    ] o.e.j.s.AbstractConnector Stopped ServerConnector@67e9fc33{HTTP/1.1,[http/1.1, h2c]}{127.0.0.1:0}
   [junit4]   2> 233582 INFO  (closeThreadPool-526-thread-12) [    ] o.e.j.s.h.ContextHandler Stopped o.e.j.s.ServletContextHandler@248b679e{/p_vwj,null,UNAVAILABLE}
   [junit4]   2> 233582 INFO  (closeThreadPool-526-thread-12) [    ] o.e.j.s.session node0 Stopped scavenging
   [junit4]   2> 233583 INFO  (TEST-ChaosMonkeySafeLeaderWithPullReplicasTest.test-seed#[2C3A040E393CC4CE]) [    ] o.a.s.c.ZkTestServer Shutting down ZkTestServer.
   [junit4]   2> 233586 WARN  (ZkTestServer Run Thread) [    ] o.a.s.c.ZkTestServer Watch limit violations: 
   [junit4]   2> Maximum concurrent create/delete watches above limit:
   [junit4]   2> 
   [junit4]   2> 	28	/solr/collections/collection1/state.json
   [junit4]   2> 	16	/solr/aliases.json
   [junit4]   2> 	9	/solr/collections/collection1/terms/shard1
   [junit4]   2> 	9	/solr/collections/collection1/terms/shard2
   [junit4]   2> 	7	/solr/security.json
   [junit4]   2> 	7	/solr/configs/conf1
   [junit4]   2> 	3	/solr/collections/control_collection/terms/shard1
   [junit4]   2> 
   [junit4]   2> Maximum concurrent data watches above limit:
   [junit4]   2> 
   [junit4]   2> 	16	/solr/clusterprops.json
   [junit4]   2> 	16	/solr/clusterstate.json
   [junit4]   2> 	9	/solr/collections/control_collection/state.json
   [junit4]   2> 	2	/solr/overseer_elect/election/72120064837419029-127.0.0.1:56115_p_vwj-n_0000000002
   [junit4]   2> 	2	/solr/overseer_elect/election/72120064837419012-127.0.0.1:61608_p_vwj-n_0000000000
   [junit4]   2> 	2	/solr/overseer_elect/election/72120064837419023-127.0.0.1:55267_p_vwj-n_0000000001
   [junit4]   2> 
   [junit4]   2> Maximum concurrent children watches above limit:
   [junit4]   2> 
   [junit4]   2> 	16	/solr/live_nodes
   [junit4]   2> 	16	/solr/collections
   [junit4]   2> 
   [junit4]   2> 233593 INFO  (TEST-ChaosMonkeySafeLeaderWithPullReplicasTest.test-seed#[2C3A040E393CC4CE]) [    ] o.a.s.c.ZkTestServer parse host and port list: 127.0.0.1:40202
   [junit4]   2> 233593 INFO  (TEST-ChaosMonkeySafeLeaderWithPullReplicasTest.test-seed#[2C3A040E393CC4CE]) [    ] o.a.s.c.ZkTestServer connecting to 127.0.0.1 40202
   [junit4]   2> NOTE: reproduce with: ant test  -Dtestcase=ChaosMonkeySafeLeaderWithPullReplicasTest -Dtests.method=test -Dtests.seed=2C3A040E393CC4CE -Dtests.slow=true -Dtests.badapples=true -Dtests.locale=fr -Dtests.timezone=Asia/Barnaul -Dtests.asserts=true -Dtests.file.encoding=UTF-8
   [junit4] FAILURE 74.8s J0 | ChaosMonkeySafeLeaderWithPullReplicasTest.test <<<
   [junit4]    > Throwable #1: java.lang.AssertionError: Timed out waiting for replica core_node12 (1550703297165) to replicate from leader core_node3 (0)
   [junit4]    > 	at __randomizedtesting.SeedInfo.seed([2C3A040E393CC4CE:A46E3BD497C0A936]:0)
   [junit4]    > 	at org.apache.solr.cloud.AbstractFullDistribZkTestBase.waitForReplicationFromReplicas(AbstractFullDistribZkTestBase.java:2271)
   [junit4]    > 	at org.apache.solr.cloud.ChaosMonkeySafeLeaderWithPullReplicasTest.test(ChaosMonkeySafeLeaderWithPullReplicasTest.java:212)
   [junit4]    > 	at org.apache.solr.BaseDistributedSearchTestCase$ShardsRepeatRule$ShardsFixedStatement.callStatement(BaseDistributedSearchTestCase.java:1082)
   [junit4]    > 	at org.apache.solr.BaseDistributedSearchTestCase$ShardsRepeatRule$ShardsStatement.evaluate(BaseDistributedSearchTestCase.java:1054)
   [junit4]    > 	at java.lang.Thread.run(Thread.java:748)
   [junit4]   2> NOTE: leaving temporary files on disk at: /export/home/jenkins/workspace/Lucene-Solr-master-Solaris/solr/build/solr-core/test/J0/temp/solr.cloud.ChaosMonkeySafeLeaderWithPullReplicasTest_2C3A040E393CC4CE-002
   [junit4]   2> Feb 20, 2019 10:55:01 PM com.carrotsearch.randomizedtesting.ThreadLeakControl checkThreadLeaks
   [junit4]   2> WARNING: Will linger awaiting termination of 3 leaked thread(s).
   [junit4]   2> NOTE: test params are: codec=Asserting(Lucene80): {}, docValues:{}, maxPointsInLeafNode=197, maxMBSortInHeap=5.309293924348699, sim=Asserting(org.apache.lucene.search.similarities.AssertingSimilarity@1ab82425), locale=fr, timezone=Asia/Barnaul
   [junit4]   2> NOTE: SunOS 5.11 amd64/Oracle Corporation 1.8.0_191 (64-bit)/cpus=3,threads=1,free=140919136,total=474087424
   [junit4]   2> NOTE: All tests run in this JVM: [ChaosMonkeySafeLeaderWithPullReplicasTest, ChaosMonkeySafeLeaderWithPullReplicasTest, ChaosMonkeySafeLeaderWithPullReplicasTest]
   [junit4] Completed [10/10 (4!)] on J0 in 75.47s, 1 test, 1 failure <<< FAILURES!
   [junit4] 
   [junit4] 
   [junit4] Tests with failures [seed: 2C3A040E393CC4CE]:
   [junit4]   - org.apache.solr.cloud.ChaosMonkeySafeLeaderWithPullReplicasTest.test
   [junit4]   - org.apache.solr.cloud.ChaosMonkeySafeLeaderWithPullReplicasTest.test
   [junit4]   - org.apache.solr.cloud.ChaosMonkeySafeLeaderWithPullReplicasTest.test
   [junit4]   - org.apache.solr.cloud.ChaosMonkeySafeLeaderWithPullReplicasTest.test
   [junit4] 
   [junit4] 
   [junit4] JVM J0:     0.77 ..   234.93 =   234.16s
   [junit4] JVM J1:     0.73 ..   225.92 =   225.19s
   [junit4] Execution time total: 3 minutes 54 seconds
   [junit4] Tests summary: 10 suites, 25 tests, 4 failures

BUILD FAILED
/export/home/jenkins/workspace/Lucene-Solr-master-Solaris/lucene/common-build.xml:1572: The following error occurred while executing this line:
/export/home/jenkins/workspace/Lucene-Solr-master-Solaris/lucene/common-build.xml:1099: There were test failures: 10 suites, 25 tests, 4 failures [seed: 2C3A040E393CC4CE]

Total time: 3 minutes 57 seconds

[repro] Setting last failure code to 256

[repro] Failures:
[repro]   0/5 failed: org.apache.solr.cloud.HealthCheckHandlerTest
[repro]   4/5 failed: org.apache.solr.cloud.ChaosMonkeySafeLeaderWithPullReplicasTest
[repro] Exiting with code 256
+ mv lucene/build lucene/build.repro
+ mv solr/build solr/build.repro
+ mv lucene/build.orig lucene/build
+ mv solr/build.orig solr/build
Archiving artifacts
Setting ANT_1_8_2_HOME=/export/home/jenkins/tools/hudson.tasks.Ant_AntInstallation/ANT_1.8.2
[WARNINGS] Parsing warnings in console log with parser Java Compiler (javac)
Setting ANT_1_8_2_HOME=/export/home/jenkins/tools/hudson.tasks.Ant_AntInstallation/ANT_1.8.2
No credentials specified
Setting ANT_1_8_2_HOME=/export/home/jenkins/tools/hudson.tasks.Ant_AntInstallation/ANT_1.8.2
<Git Blamer> Using GitBlamer to create author and commit information for all warnings.
<Git Blamer> GIT_COMMIT=9251d457060be6d99370d205dd0f9bab3b84b517, workspace=/export/home/jenkins/workspace/Lucene-Solr-master-Solaris
[WARNINGS] Computing warning deltas based on reference build #2297
Recording test results
Setting ANT_1_8_2_HOME=/export/home/jenkins/tools/hudson.tasks.Ant_AntInstallation/ANT_1.8.2
Build step 'Publish JUnit test result report' changed build result to UNSTABLE
Email was triggered for: Unstable (Test Failures)
Sending email for trigger: Unstable (Test Failures)
Setting ANT_1_8_2_HOME=/export/home/jenkins/tools/hudson.tasks.Ant_AntInstallation/ANT_1.8.2
Setting ANT_1_8_2_HOME=/export/home/jenkins/tools/hudson.tasks.Ant_AntInstallation/ANT_1.8.2
Setting ANT_1_8_2_HOME=/export/home/jenkins/tools/hudson.tasks.Ant_AntInstallation/ANT_1.8.2
Setting ANT_1_8_2_HOME=/export/home/jenkins/tools/hudson.tasks.Ant_AntInstallation/ANT_1.8.2
Setting ANT_1_8_2_HOME=/export/home/jenkins/tools/hudson.tasks.Ant_AntInstallation/ANT_1.8.2
Setting ANT_1_8_2_HOME=/export/home/jenkins/tools/hudson.tasks.Ant_AntInstallation/ANT_1.8.2

Mime
View raw message