lucene-dev mailing list archives

Site index · List index
Message view « Date » · « Thread »
Top « Date » · « Thread »
From Apache Jenkins Server <jenk...@builds.apache.org>
Subject [JENKINS] Lucene-Solr-BadApples-NightlyTests-master - Build # 48 - Still unstable
Date Sat, 02 Feb 2019 16:02:17 GMT
Build: https://builds.apache.org/job/Lucene-Solr-BadApples-NightlyTests-master/48/

1 tests failed.
FAILED:  org.apache.solr.cloud.RestartWhileUpdatingTest.test

Error Message:
There are still nodes recoverying - waited for 320 seconds

Stack Trace:
java.lang.AssertionError: There are still nodes recoverying - waited for 320 seconds
	at __randomizedtesting.SeedInfo.seed([A8D95E0C3EC09BBD:208D61D6903CF645]:0)
	at org.junit.Assert.fail(Assert.java:88)
	at org.apache.solr.cloud.AbstractDistribZkTestBase.waitForRecoveriesToFinish(AbstractDistribZkTestBase.java:195)
	at org.apache.solr.cloud.AbstractFullDistribZkTestBase.waitForRecoveriesToFinish(AbstractFullDistribZkTestBase.java:1038)
	at org.apache.solr.cloud.AbstractFullDistribZkTestBase.waitForThingsToLevelOut(AbstractFullDistribZkTestBase.java:1595)
	at org.apache.solr.cloud.RestartWhileUpdatingTest.test(RestartWhileUpdatingTest.java:144)
	at sun.reflect.NativeMethodAccessorImpl.invoke0(Native Method)
	at sun.reflect.NativeMethodAccessorImpl.invoke(NativeMethodAccessorImpl.java:62)
	at sun.reflect.DelegatingMethodAccessorImpl.invoke(DelegatingMethodAccessorImpl.java:43)
	at java.lang.reflect.Method.invoke(Method.java:498)
	at com.carrotsearch.randomizedtesting.RandomizedRunner.invoke(RandomizedRunner.java:1750)
	at com.carrotsearch.randomizedtesting.RandomizedRunner$8.evaluate(RandomizedRunner.java:938)
	at com.carrotsearch.randomizedtesting.RandomizedRunner$9.evaluate(RandomizedRunner.java:974)
	at com.carrotsearch.randomizedtesting.RandomizedRunner$10.evaluate(RandomizedRunner.java:988)
	at org.apache.solr.BaseDistributedSearchTestCase$ShardsRepeatRule$ShardsFixedStatement.callStatement(BaseDistributedSearchTestCase.java:1082)
	at org.apache.solr.BaseDistributedSearchTestCase$ShardsRepeatRule$ShardsStatement.evaluate(BaseDistributedSearchTestCase.java:1054)
	at com.carrotsearch.randomizedtesting.rules.SystemPropertiesRestoreRule$1.evaluate(SystemPropertiesRestoreRule.java:57)
	at org.apache.lucene.util.TestRuleSetupTeardownChained$1.evaluate(TestRuleSetupTeardownChained.java:49)
	at org.apache.lucene.util.AbstractBeforeAfterRule$1.evaluate(AbstractBeforeAfterRule.java:45)
	at org.apache.lucene.util.TestRuleThreadAndTestName$1.evaluate(TestRuleThreadAndTestName.java:48)
	at org.apache.lucene.util.TestRuleIgnoreAfterMaxFailures$1.evaluate(TestRuleIgnoreAfterMaxFailures.java:64)
	at org.apache.lucene.util.TestRuleMarkFailure$1.evaluate(TestRuleMarkFailure.java:47)
	at com.carrotsearch.randomizedtesting.rules.StatementAdapter.evaluate(StatementAdapter.java:36)
	at com.carrotsearch.randomizedtesting.ThreadLeakControl$StatementRunner.run(ThreadLeakControl.java:368)
	at com.carrotsearch.randomizedtesting.ThreadLeakControl.forkTimeoutingTask(ThreadLeakControl.java:817)
	at com.carrotsearch.randomizedtesting.ThreadLeakControl$3.evaluate(ThreadLeakControl.java:468)
	at com.carrotsearch.randomizedtesting.RandomizedRunner.runSingleTest(RandomizedRunner.java:947)
	at com.carrotsearch.randomizedtesting.RandomizedRunner$5.evaluate(RandomizedRunner.java:832)
	at com.carrotsearch.randomizedtesting.RandomizedRunner$6.evaluate(RandomizedRunner.java:883)
	at com.carrotsearch.randomizedtesting.RandomizedRunner$7.evaluate(RandomizedRunner.java:894)
	at com.carrotsearch.randomizedtesting.rules.StatementAdapter.evaluate(StatementAdapter.java:36)
	at com.carrotsearch.randomizedtesting.rules.SystemPropertiesRestoreRule$1.evaluate(SystemPropertiesRestoreRule.java:57)
	at org.apache.lucene.util.AbstractBeforeAfterRule$1.evaluate(AbstractBeforeAfterRule.java:45)
	at com.carrotsearch.randomizedtesting.rules.StatementAdapter.evaluate(StatementAdapter.java:36)
	at org.apache.lucene.util.TestRuleStoreClassName$1.evaluate(TestRuleStoreClassName.java:41)
	at com.carrotsearch.randomizedtesting.rules.NoShadowingOrOverridesOnMethodsRule$1.evaluate(NoShadowingOrOverridesOnMethodsRule.java:40)
	at com.carrotsearch.randomizedtesting.rules.NoShadowingOrOverridesOnMethodsRule$1.evaluate(NoShadowingOrOverridesOnMethodsRule.java:40)
	at com.carrotsearch.randomizedtesting.rules.StatementAdapter.evaluate(StatementAdapter.java:36)
	at com.carrotsearch.randomizedtesting.rules.StatementAdapter.evaluate(StatementAdapter.java:36)
	at com.carrotsearch.randomizedtesting.rules.StatementAdapter.evaluate(StatementAdapter.java:36)
	at org.apache.lucene.util.TestRuleAssertionsRequired$1.evaluate(TestRuleAssertionsRequired.java:53)
	at org.apache.lucene.util.TestRuleMarkFailure$1.evaluate(TestRuleMarkFailure.java:47)
	at org.apache.lucene.util.TestRuleIgnoreAfterMaxFailures$1.evaluate(TestRuleIgnoreAfterMaxFailures.java:64)
	at org.apache.lucene.util.TestRuleIgnoreTestSuites$1.evaluate(TestRuleIgnoreTestSuites.java:54)
	at com.carrotsearch.randomizedtesting.rules.StatementAdapter.evaluate(StatementAdapter.java:36)
	at com.carrotsearch.randomizedtesting.ThreadLeakControl$StatementRunner.run(ThreadLeakControl.java:368)
	at java.lang.Thread.run(Thread.java:748)




Build Log:
[...truncated 14552 lines...]
   [junit4] Suite: org.apache.solr.cloud.RestartWhileUpdatingTest
   [junit4]   2> 2247456 INFO  (SUITE-RestartWhileUpdatingTest-seed#[A8D95E0C3EC09BBD]-worker) [    ] o.a.s.SolrTestCaseJ4 SecureRandom sanity checks: test.solr.allowed.securerandom=null & java.security.egd=file:/dev/./urandom
   [junit4]   2> Creating dataDir: /x1/jenkins/jenkins-slave/workspace/Lucene-Solr-BadApples-NightlyTests-master/checkout/solr/build/solr-core/test/J1/temp/solr.cloud.RestartWhileUpdatingTest_A8D95E0C3EC09BBD-001/init-core-data-001
   [junit4]   2> 2247457 WARN  (SUITE-RestartWhileUpdatingTest-seed#[A8D95E0C3EC09BBD]-worker) [    ] o.a.s.SolrTestCaseJ4 startTrackingSearchers: numOpens=1 numCloses=1
   [junit4]   2> 2247457 INFO  (SUITE-RestartWhileUpdatingTest-seed#[A8D95E0C3EC09BBD]-worker) [    ] o.a.s.SolrTestCaseJ4 Using TrieFields (NUMERIC_POINTS_SYSPROP=false) w/NUMERIC_DOCVALUES_SYSPROP=true
   [junit4]   2> 2247460 INFO  (SUITE-RestartWhileUpdatingTest-seed#[A8D95E0C3EC09BBD]-worker) [    ] o.a.s.SolrTestCaseJ4 Randomized ssl (true) and clientAuth (true) via: @org.apache.solr.util.RandomizeSSL(reason=, value=NaN, ssl=NaN, clientAuth=NaN)
   [junit4]   2> 2247461 INFO  (SUITE-RestartWhileUpdatingTest-seed#[A8D95E0C3EC09BBD]-worker) [    ] o.a.s.BaseDistributedSearchTestCase Setting hostContext system property: /
   [junit4]   2> 2247468 INFO  (TEST-RestartWhileUpdatingTest.test-seed#[A8D95E0C3EC09BBD]) [    ] o.a.s.c.ZkTestServer STARTING ZK TEST SERVER
   [junit4]   2> 2247468 INFO  (ZkTestServer Run Thread) [    ] o.a.s.c.ZkTestServer client port:0.0.0.0/0.0.0.0:0
   [junit4]   2> 2247468 INFO  (ZkTestServer Run Thread) [    ] o.a.s.c.ZkTestServer Starting server
   [junit4]   2> 2247568 INFO  (TEST-RestartWhileUpdatingTest.test-seed#[A8D95E0C3EC09BBD]) [    ] o.a.s.c.ZkTestServer start zk server on port:42204
   [junit4]   2> 2247568 INFO  (TEST-RestartWhileUpdatingTest.test-seed#[A8D95E0C3EC09BBD]) [    ] o.a.s.c.ZkTestServer parse host and port list: 127.0.0.1:42204
   [junit4]   2> 2247568 INFO  (TEST-RestartWhileUpdatingTest.test-seed#[A8D95E0C3EC09BBD]) [    ] o.a.s.c.ZkTestServer connecting to 127.0.0.1 42204
   [junit4]   2> 2247576 INFO  (zkConnectionManagerCallback-14834-thread-1) [    ] o.a.s.c.c.ConnectionManager zkClient has connected
   [junit4]   2> 2247586 INFO  (zkConnectionManagerCallback-14836-thread-1) [    ] o.a.s.c.c.ConnectionManager zkClient has connected
   [junit4]   2> 2247587 INFO  (TEST-RestartWhileUpdatingTest.test-seed#[A8D95E0C3EC09BBD]) [    ] o.a.s.c.ZkTestServer put /x1/jenkins/jenkins-slave/workspace/Lucene-Solr-BadApples-NightlyTests-master/checkout/solr/core/src/test-files/solr/collection1/conf/solrconfig-tlog.xml to /configs/conf1/solrconfig.xml
   [junit4]   2> 2247589 INFO  (TEST-RestartWhileUpdatingTest.test-seed#[A8D95E0C3EC09BBD]) [    ] o.a.s.c.ZkTestServer put /x1/jenkins/jenkins-slave/workspace/Lucene-Solr-BadApples-NightlyTests-master/checkout/solr/core/src/test-files/solr/collection1/conf/schema15.xml to /configs/conf1/schema.xml
   [junit4]   2> 2247590 INFO  (TEST-RestartWhileUpdatingTest.test-seed#[A8D95E0C3EC09BBD]) [    ] o.a.s.c.ZkTestServer put /x1/jenkins/jenkins-slave/workspace/Lucene-Solr-BadApples-NightlyTests-master/checkout/solr/core/src/test-files/solr/collection1/conf/solrconfig.snippet.randomindexconfig.xml to /configs/conf1/solrconfig.snippet.randomindexconfig.xml
   [junit4]   2> 2247591 INFO  (TEST-RestartWhileUpdatingTest.test-seed#[A8D95E0C3EC09BBD]) [    ] o.a.s.c.ZkTestServer put /x1/jenkins/jenkins-slave/workspace/Lucene-Solr-BadApples-NightlyTests-master/checkout/solr/core/src/test-files/solr/collection1/conf/stopwords.txt to /configs/conf1/stopwords.txt
   [junit4]   2> 2247593 INFO  (TEST-RestartWhileUpdatingTest.test-seed#[A8D95E0C3EC09BBD]) [    ] o.a.s.c.ZkTestServer put /x1/jenkins/jenkins-slave/workspace/Lucene-Solr-BadApples-NightlyTests-master/checkout/solr/core/src/test-files/solr/collection1/conf/protwords.txt to /configs/conf1/protwords.txt
   [junit4]   2> 2247594 INFO  (TEST-RestartWhileUpdatingTest.test-seed#[A8D95E0C3EC09BBD]) [    ] o.a.s.c.ZkTestServer put /x1/jenkins/jenkins-slave/workspace/Lucene-Solr-BadApples-NightlyTests-master/checkout/solr/core/src/test-files/solr/collection1/conf/currency.xml to /configs/conf1/currency.xml
   [junit4]   2> 2247595 INFO  (TEST-RestartWhileUpdatingTest.test-seed#[A8D95E0C3EC09BBD]) [    ] o.a.s.c.ZkTestServer put /x1/jenkins/jenkins-slave/workspace/Lucene-Solr-BadApples-NightlyTests-master/checkout/solr/core/src/test-files/solr/collection1/conf/enumsConfig.xml to /configs/conf1/enumsConfig.xml
   [junit4]   2> 2247596 INFO  (TEST-RestartWhileUpdatingTest.test-seed#[A8D95E0C3EC09BBD]) [    ] o.a.s.c.ZkTestServer put /x1/jenkins/jenkins-slave/workspace/Lucene-Solr-BadApples-NightlyTests-master/checkout/solr/core/src/test-files/solr/collection1/conf/open-exchange-rates.json to /configs/conf1/open-exchange-rates.json
   [junit4]   2> 2247598 INFO  (TEST-RestartWhileUpdatingTest.test-seed#[A8D95E0C3EC09BBD]) [    ] o.a.s.c.ZkTestServer put /x1/jenkins/jenkins-slave/workspace/Lucene-Solr-BadApples-NightlyTests-master/checkout/solr/core/src/test-files/solr/collection1/conf/mapping-ISOLatin1Accent.txt to /configs/conf1/mapping-ISOLatin1Accent.txt
   [junit4]   2> 2247599 INFO  (TEST-RestartWhileUpdatingTest.test-seed#[A8D95E0C3EC09BBD]) [    ] o.a.s.c.ZkTestServer put /x1/jenkins/jenkins-slave/workspace/Lucene-Solr-BadApples-NightlyTests-master/checkout/solr/core/src/test-files/solr/collection1/conf/old_synonyms.txt to /configs/conf1/old_synonyms.txt
   [junit4]   2> 2247600 INFO  (TEST-RestartWhileUpdatingTest.test-seed#[A8D95E0C3EC09BBD]) [    ] o.a.s.c.ZkTestServer put /x1/jenkins/jenkins-slave/workspace/Lucene-Solr-BadApples-NightlyTests-master/checkout/solr/core/src/test-files/solr/collection1/conf/synonyms.txt to /configs/conf1/synonyms.txt
   [junit4]   2> 2247603 INFO  (zkConnectionManagerCallback-14840-thread-1) [    ] o.a.s.c.c.ConnectionManager zkClient has connected
   [junit4]   2> 2247605 INFO  (TEST-RestartWhileUpdatingTest.test-seed#[A8D95E0C3EC09BBD]) [    ] o.a.s.c.AbstractFullDistribZkTestBase Will use NRT replicas unless explicitly asked otherwise
   [junit4]   2> 2247795 WARN  (TEST-RestartWhileUpdatingTest.test-seed#[A8D95E0C3EC09BBD]) [    ] o.e.j.s.AbstractConnector Ignoring deprecated socket close linger time
   [junit4]   2> 2247795 INFO  (TEST-RestartWhileUpdatingTest.test-seed#[A8D95E0C3EC09BBD]) [    ] o.a.s.c.s.e.JettySolrRunner Start Jetty (original configured port=0)
   [junit4]   2> 2247795 INFO  (TEST-RestartWhileUpdatingTest.test-seed#[A8D95E0C3EC09BBD]) [    ] o.a.s.c.s.e.JettySolrRunner Trying to start Jetty on port 0 try number 1 ...
   [junit4]   2> 2247795 INFO  (TEST-RestartWhileUpdatingTest.test-seed#[A8D95E0C3EC09BBD]) [    ] o.e.j.s.Server jetty-9.4.14.v20181114; built: 2018-11-14T21:20:31.478Z; git: c4550056e785fb5665914545889f21dc136ad9e6; jvm 1.8.0_191-b12
   [junit4]   2> 2247796 INFO  (TEST-RestartWhileUpdatingTest.test-seed#[A8D95E0C3EC09BBD]) [    ] o.e.j.s.session DefaultSessionIdManager workerName=node0
   [junit4]   2> 2247796 INFO  (TEST-RestartWhileUpdatingTest.test-seed#[A8D95E0C3EC09BBD]) [    ] o.e.j.s.session No SessionScavenger set, using defaults
   [junit4]   2> 2247796 INFO  (TEST-RestartWhileUpdatingTest.test-seed#[A8D95E0C3EC09BBD]) [    ] o.e.j.s.session node0 Scavenging every 600000ms
   [junit4]   2> 2247797 INFO  (TEST-RestartWhileUpdatingTest.test-seed#[A8D95E0C3EC09BBD]) [    ] o.e.j.s.h.ContextHandler Started o.e.j.s.ServletContextHandler@5774b67e{/,null,AVAILABLE}
   [junit4]   2> 2247797 WARN  (TEST-RestartWhileUpdatingTest.test-seed#[A8D95E0C3EC09BBD]) [    ] o.e.j.u.s.S.config No Client EndPointIdentificationAlgorithm configured for SslContextFactory@68fcb677[provider=null,keyStore=null,trustStore=null]
   [junit4]   2> 2247798 INFO  (TEST-RestartWhileUpdatingTest.test-seed#[A8D95E0C3EC09BBD]) [    ] o.e.j.s.AbstractConnector Started ServerConnector@147d61aa{SSL,[ssl, http/1.1]}{127.0.0.1:33939}
   [junit4]   2> 2247798 INFO  (TEST-RestartWhileUpdatingTest.test-seed#[A8D95E0C3EC09BBD]) [    ] o.e.j.s.Server Started @2247874ms
   [junit4]   2> 2247798 INFO  (TEST-RestartWhileUpdatingTest.test-seed#[A8D95E0C3EC09BBD]) [    ] o.a.s.c.s.e.JettySolrRunner Jetty properties: {solr.data.dir=/x1/jenkins/jenkins-slave/workspace/Lucene-Solr-BadApples-NightlyTests-master/checkout/solr/build/solr-core/test/J1/temp/solr.cloud.RestartWhileUpdatingTest_A8D95E0C3EC09BBD-001/tempDir-001/control/data, hostContext=/, hostPort=33939, coreRootDirectory=/x1/jenkins/jenkins-slave/workspace/Lucene-Solr-BadApples-NightlyTests-master/checkout/solr/build/solr-core/test/J1/../../../../../../../../../../../x1/jenkins/jenkins-slave/workspace/Lucene-Solr-BadApples-NightlyTests-master/checkout/solr/build/solr-core/test/J1/temp/solr.cloud.RestartWhileUpdatingTest_A8D95E0C3EC09BBD-001/control-001/cores}
   [junit4]   2> 2247798 ERROR (TEST-RestartWhileUpdatingTest.test-seed#[A8D95E0C3EC09BBD]) [    ] o.a.s.u.StartupLoggingUtils Missing Java Option solr.log.dir. Logging may be missing or incomplete.
   [junit4]   2> 2247798 INFO  (TEST-RestartWhileUpdatingTest.test-seed#[A8D95E0C3EC09BBD]) [    ] o.a.s.s.SolrDispatchFilter Using logger factory org.apache.logging.slf4j.Log4jLoggerFactory
   [junit4]   2> 2247799 INFO  (TEST-RestartWhileUpdatingTest.test-seed#[A8D95E0C3EC09BBD]) [    ] o.a.s.s.SolrDispatchFilter  ___      _       Welcome to Apache Solr? version 9.0.0
   [junit4]   2> 2247799 INFO  (TEST-RestartWhileUpdatingTest.test-seed#[A8D95E0C3EC09BBD]) [    ] o.a.s.s.SolrDispatchFilter / __| ___| |_ _   Starting in cloud mode on port null
   [junit4]   2> 2247799 INFO  (TEST-RestartWhileUpdatingTest.test-seed#[A8D95E0C3EC09BBD]) [    ] o.a.s.s.SolrDispatchFilter \__ \/ _ \ | '_|  Install dir: null
   [junit4]   2> 2247799 INFO  (TEST-RestartWhileUpdatingTest.test-seed#[A8D95E0C3EC09BBD]) [    ] o.a.s.s.SolrDispatchFilter |___/\___/_|_|    Start time: 2019-02-02T14:46:15.694Z
   [junit4]   2> 2247801 INFO  (zkConnectionManagerCallback-14842-thread-1) [    ] o.a.s.c.c.ConnectionManager zkClient has connected
   [junit4]   2> 2247802 INFO  (TEST-RestartWhileUpdatingTest.test-seed#[A8D95E0C3EC09BBD]) [    ] o.a.s.s.SolrDispatchFilter Loading solr.xml from SolrHome (not found in ZooKeeper)
   [junit4]   2> 2247802 INFO  (TEST-RestartWhileUpdatingTest.test-seed#[A8D95E0C3EC09BBD]) [    ] o.a.s.c.SolrXmlConfig Loading container configuration from /x1/jenkins/jenkins-slave/workspace/Lucene-Solr-BadApples-NightlyTests-master/checkout/solr/build/solr-core/test/J1/temp/solr.cloud.RestartWhileUpdatingTest_A8D95E0C3EC09BBD-001/control-001/solr.xml
   [junit4]   2> 2247807 INFO  (TEST-RestartWhileUpdatingTest.test-seed#[A8D95E0C3EC09BBD]) [    ] o.a.s.c.SolrXmlConfig Configuration parameter autoReplicaFailoverWorkLoopDelay is ignored
   [junit4]   2> 2247807 INFO  (TEST-RestartWhileUpdatingTest.test-seed#[A8D95E0C3EC09BBD]) [    ] o.a.s.c.SolrXmlConfig Configuration parameter autoReplicaFailoverBadNodeExpiration is ignored
   [junit4]   2> 2247809 INFO  (TEST-RestartWhileUpdatingTest.test-seed#[A8D95E0C3EC09BBD]) [    ] o.a.s.c.SolrXmlConfig MBean server found: com.sun.jmx.mbeanserver.JmxMBeanServer@2ea6e21c, but no JMX reporters were configured - adding default JMX reporter.
   [junit4]   2> 2247991 INFO  (TEST-RestartWhileUpdatingTest.test-seed#[A8D95E0C3EC09BBD]) [    ] o.a.s.h.c.HttpShardHandlerFactory Host whitelist initialized: WhitelistHostChecker [whitelistHosts=null, whitelistHostCheckingEnabled=false]
   [junit4]   2> 2247992 WARN  (TEST-RestartWhileUpdatingTest.test-seed#[A8D95E0C3EC09BBD]) [    ] o.a.s.c.s.i.Http2SolrClient Create Http2SolrClient with HTTP/1.1 transport since Java 8 or lower versions does not support SSL + HTTP/2
   [junit4]   2> 2247993 WARN  (TEST-RestartWhileUpdatingTest.test-seed#[A8D95E0C3EC09BBD]) [    ] o.e.j.u.s.S.config No Client EndPointIdentificationAlgorithm configured for SslContextFactory@17c33166[provider=null,keyStore=null,trustStore=null]
   [junit4]   2> 2247997 WARN  (TEST-RestartWhileUpdatingTest.test-seed#[A8D95E0C3EC09BBD]) [    ] o.a.s.c.s.i.Http2SolrClient Create Http2SolrClient with HTTP/1.1 transport since Java 8 or lower versions does not support SSL + HTTP/2
   [junit4]   2> 2247998 WARN  (TEST-RestartWhileUpdatingTest.test-seed#[A8D95E0C3EC09BBD]) [    ] o.e.j.u.s.S.config No Client EndPointIdentificationAlgorithm configured for SslContextFactory@7884357e[provider=null,keyStore=null,trustStore=null]
   [junit4]   2> 2247999 INFO  (TEST-RestartWhileUpdatingTest.test-seed#[A8D95E0C3EC09BBD]) [    ] o.a.s.c.ZkContainer Zookeeper client=127.0.0.1:42204/solr
   [junit4]   2> 2248000 INFO  (zkConnectionManagerCallback-14848-thread-1) [    ] o.a.s.c.c.ConnectionManager zkClient has connected
   [junit4]   2> 2248003 INFO  (zkConnectionManagerCallback-14850-thread-1) [    ] o.a.s.c.c.ConnectionManager zkClient has connected
   [junit4]   2> 2248100 INFO  (TEST-RestartWhileUpdatingTest.test-seed#[A8D95E0C3EC09BBD]) [n:127.0.0.1:33939_    ] o.a.s.c.OverseerElectionContext I am going to be the leader 127.0.0.1:33939_
   [junit4]   2> 2248101 INFO  (TEST-RestartWhileUpdatingTest.test-seed#[A8D95E0C3EC09BBD]) [n:127.0.0.1:33939_    ] o.a.s.c.Overseer Overseer (id=72729569852915717-127.0.0.1:33939_-n_0000000000) starting
   [junit4]   2> 2248110 INFO  (zkConnectionManagerCallback-14857-thread-1) [    ] o.a.s.c.c.ConnectionManager zkClient has connected
   [junit4]   2> 2248114 INFO  (TEST-RestartWhileUpdatingTest.test-seed#[A8D95E0C3EC09BBD]) [n:127.0.0.1:33939_    ] o.a.s.c.s.i.ZkClientClusterStateProvider Cluster at 127.0.0.1:42204/solr ready
   [junit4]   2> 2248125 INFO  (OverseerStateUpdate-72729569852915717-127.0.0.1:33939_-n_0000000000) [n:127.0.0.1:33939_    ] o.a.s.c.Overseer Starting to work on the main queue : 127.0.0.1:33939_
   [junit4]   2> 2248126 INFO  (TEST-RestartWhileUpdatingTest.test-seed#[A8D95E0C3EC09BBD]) [n:127.0.0.1:33939_    ] o.a.s.c.ZkController Register node as live in ZooKeeper:/live_nodes/127.0.0.1:33939_
   [junit4]   2> 2248127 INFO  (OverseerStateUpdate-72729569852915717-127.0.0.1:33939_-n_0000000000) [n:127.0.0.1:33939_    ] o.a.s.c.c.ZkStateReader Updated live nodes from ZooKeeper... (0) -> (1)
   [junit4]   2> 2248150 INFO  (zkCallback-14856-thread-1) [    ] o.a.s.c.c.ZkStateReader Updated live nodes from ZooKeeper... (0) -> (1)
   [junit4]   2> 2248171 INFO  (TEST-RestartWhileUpdatingTest.test-seed#[A8D95E0C3EC09BBD]) [n:127.0.0.1:33939_    ] o.a.s.h.a.MetricsHistoryHandler No .system collection, keeping metrics history in memory.
   [junit4]   2> 2248222 INFO  (TEST-RestartWhileUpdatingTest.test-seed#[A8D95E0C3EC09BBD]) [n:127.0.0.1:33939_    ] o.a.s.m.r.SolrJmxReporter JMX monitoring for 'solr.node' (registry 'solr.node') enabled at server: com.sun.jmx.mbeanserver.JmxMBeanServer@2ea6e21c
   [junit4]   2> 2248238 INFO  (TEST-RestartWhileUpdatingTest.test-seed#[A8D95E0C3EC09BBD]) [n:127.0.0.1:33939_    ] o.a.s.m.r.SolrJmxReporter JMX monitoring for 'solr.jvm' (registry 'solr.jvm') enabled at server: com.sun.jmx.mbeanserver.JmxMBeanServer@2ea6e21c
   [junit4]   2> 2248238 INFO  (TEST-RestartWhileUpdatingTest.test-seed#[A8D95E0C3EC09BBD]) [n:127.0.0.1:33939_    ] o.a.s.m.r.SolrJmxReporter JMX monitoring for 'solr.jetty' (registry 'solr.jetty') enabled at server: com.sun.jmx.mbeanserver.JmxMBeanServer@2ea6e21c
   [junit4]   2> 2248240 INFO  (TEST-RestartWhileUpdatingTest.test-seed#[A8D95E0C3EC09BBD]) [n:127.0.0.1:33939_    ] o.a.s.c.CorePropertiesLocator Found 0 core definitions underneath /x1/jenkins/jenkins-slave/workspace/Lucene-Solr-BadApples-NightlyTests-master/checkout/solr/build/solr-core/test/J1/../../../../../../../../../../../x1/jenkins/jenkins-slave/workspace/Lucene-Solr-BadApples-NightlyTests-master/checkout/solr/build/solr-core/test/J1/temp/solr.cloud.RestartWhileUpdatingTest_A8D95E0C3EC09BBD-001/control-001/cores
   [junit4]   2> 2248274 INFO  (zkConnectionManagerCallback-14863-thread-1) [    ] o.a.s.c.c.ConnectionManager zkClient has connected
   [junit4]   2> 2248275 INFO  (TEST-RestartWhileUpdatingTest.test-seed#[A8D95E0C3EC09BBD]) [    ] o.a.s.c.c.ZkStateReader Updated live nodes from ZooKeeper... (0) -> (1)
   [junit4]   2> 2248277 INFO  (TEST-RestartWhileUpdatingTest.test-seed#[A8D95E0C3EC09BBD]) [    ] o.a.s.c.s.i.ZkClientClusterStateProvider Cluster at 127.0.0.1:42204/solr ready
   [junit4]   2> 2248298 INFO  (qtp1780132406-47412) [n:127.0.0.1:33939_    ] o.a.s.h.a.CollectionsHandler Invoked Collection Action :create with params collection.configName=conf1&name=control_collection&nrtReplicas=1&action=CREATE&numShards=1&createNodeSet=127.0.0.1:33939_&wt=javabin&version=2 and sendToOCPQueue=true
   [junit4]   2> 2248303 INFO  (OverseerThreadFactory-6051-thread-1-processing-n:127.0.0.1:33939_) [n:127.0.0.1:33939_    ] o.a.s.c.a.c.CreateCollectionCmd Create collection control_collection
   [junit4]   2> 2248415 INFO  (qtp1780132406-47410) [n:127.0.0.1:33939_    ] o.a.s.s.HttpSolrCall [admin] webapp=null path=/admin/metrics params={prefix=CONTAINER.fs.usableSpace,CONTAINER.fs.totalSpace,CORE.coreName&wt=javabin&version=2&group=solr.node,solr.core} status=0 QTime=0
   [junit4]   2> 2248417 INFO  (qtp1780132406-47411) [n:127.0.0.1:33939_    ] o.a.s.s.HttpSolrCall [admin] webapp=null path=/admin/metrics params={prefix=CONTAINER.fs.usableSpace,CONTAINER.fs.totalSpace,CORE.coreName&wt=javabin&version=2&group=solr.node,solr.core} status=0 QTime=0
   [junit4]   2> 2248418 INFO  (qtp1780132406-47408) [n:127.0.0.1:33939_    ] o.a.s.s.HttpSolrCall [admin] webapp=null path=/admin/metrics params={prefix=CONTAINER.fs.usableSpace,CONTAINER.fs.totalSpace,CORE.coreName&wt=javabin&version=2&group=solr.node,solr.core} status=0 QTime=0
   [junit4]   2> 2248419 INFO  (qtp1780132406-47409) [n:127.0.0.1:33939_    ] o.a.s.s.HttpSolrCall [admin] webapp=null path=/admin/metrics params={prefix=CONTAINER.fs.usableSpace,CONTAINER.fs.totalSpace,CORE.coreName&wt=javabin&version=2&group=solr.node,solr.core} status=0 QTime=0
   [junit4]   2> 2248421 INFO  (qtp1780132406-47410) [n:127.0.0.1:33939_    ] o.a.s.s.HttpSolrCall [admin] webapp=null path=/admin/metrics params={prefix=CONTAINER.fs.usableSpace,CONTAINER.fs.totalSpace,CORE.coreName&wt=javabin&version=2&group=solr.node,solr.core} status=0 QTime=0
   [junit4]   2> 2248446 INFO  (qtp1780132406-47411) [n:127.0.0.1:33939_    x:control_collection_shard1_replica_n1] o.a.s.h.a.CoreAdminOperation core create command qt=/admin/cores&collection.configName=conf1&newCollection=true&name=control_collection_shard1_replica_n1&action=CREATE&numShards=1&collection=control_collection&shard=shard1&wt=javabin&version=2&replicaType=NRT
   [junit4]   2> 2248447 INFO  (qtp1780132406-47411) [n:127.0.0.1:33939_    x:control_collection_shard1_replica_n1] o.a.s.c.TransientSolrCoreCacheDefault Allocating transient cache for 4 transient cores
   [junit4]   2> 2249480 INFO  (qtp1780132406-47411) [n:127.0.0.1:33939_ c:control_collection s:shard1  x:control_collection_shard1_replica_n1] o.a.s.c.SolrConfig Using Lucene MatchVersion: 9.0.0
   [junit4]   2> 2249497 INFO  (qtp1780132406-47411) [n:127.0.0.1:33939_ c:control_collection s:shard1  x:control_collection_shard1_replica_n1] o.a.s.s.IndexSchema [control_collection_shard1_replica_n1] Schema name=test
   [junit4]   2> 2249618 INFO  (qtp1780132406-47411) [n:127.0.0.1:33939_ c:control_collection s:shard1  x:control_collection_shard1_replica_n1] o.a.s.s.IndexSchema Loaded schema test/1.6 with uniqueid field id
   [junit4]   2> 2249640 INFO  (qtp1780132406-47411) [n:127.0.0.1:33939_ c:control_collection s:shard1  x:control_collection_shard1_replica_n1] o.a.s.c.CoreContainer Creating SolrCore 'control_collection_shard1_replica_n1' using configuration from collection control_collection, trusted=true
   [junit4]   2> 2249641 INFO  (qtp1780132406-47411) [n:127.0.0.1:33939_ c:control_collection s:shard1  x:control_collection_shard1_replica_n1] o.a.s.m.r.SolrJmxReporter JMX monitoring for 'solr.core.control_collection.shard1.replica_n1' (registry 'solr.core.control_collection.shard1.replica_n1') enabled at server: com.sun.jmx.mbeanserver.JmxMBeanServer@2ea6e21c
   [junit4]   2> 2249641 INFO  (qtp1780132406-47411) [n:127.0.0.1:33939_ c:control_collection s:shard1  x:control_collection_shard1_replica_n1] o.a.s.c.SolrCore [[control_collection_shard1_replica_n1] ] Opening new SolrCore at [/x1/jenkins/jenkins-slave/workspace/Lucene-Solr-BadApples-NightlyTests-master/checkout/solr/build/solr-core/test/J1/temp/solr.cloud.RestartWhileUpdatingTest_A8D95E0C3EC09BBD-001/control-001/cores/control_collection_shard1_replica_n1], dataDir=[/x1/jenkins/jenkins-slave/workspace/Lucene-Solr-BadApples-NightlyTests-master/checkout/solr/build/solr-core/test/J1/../../../../../../../../../../../x1/jenkins/jenkins-slave/workspace/Lucene-Solr-BadApples-NightlyTests-master/checkout/solr/build/solr-core/test/J1/temp/solr.cloud.RestartWhileUpdatingTest_A8D95E0C3EC09BBD-001/control-001/cores/control_collection_shard1_replica_n1/data/]
   [junit4]   2> 2249646 INFO  (qtp1780132406-47411) [n:127.0.0.1:33939_ c:control_collection s:shard1  x:control_collection_shard1_replica_n1] o.a.s.u.RandomMergePolicy RandomMergePolicy wrapping class org.apache.lucene.index.LogDocMergePolicy: [LogDocMergePolicy: minMergeSize=1000, mergeFactor=22, maxMergeSize=9223372036854775807, maxMergeSizeForForcedMerge=9223372036854775807, calibrateSizeByDeletes=true, maxMergeDocs=2147483647, maxCFSSegmentSizeMB=0.583984375, noCFSRatio=0.6344138601555405]
   [junit4]   2> 2249659 WARN  (qtp1780132406-47411) [n:127.0.0.1:33939_ c:control_collection s:shard1  x:control_collection_shard1_replica_n1] o.a.s.c.RequestHandlers INVALID paramSet a in requestHandler {type = requestHandler,name = /dump,class = DumpRequestHandler,attributes = {initParams=a, name=/dump, class=DumpRequestHandler},args = {defaults={a=A,b=B}}}
   [junit4]   2> 2249855 INFO  (qtp1780132406-47411) [n:127.0.0.1:33939_ c:control_collection s:shard1  x:control_collection_shard1_replica_n1] o.a.s.u.UpdateHandler Using UpdateLog implementation: org.apache.solr.update.UpdateLog
   [junit4]   2> 2249855 INFO  (qtp1780132406-47411) [n:127.0.0.1:33939_ c:control_collection s:shard1  x:control_collection_shard1_replica_n1] o.a.s.u.UpdateLog Initializing UpdateLog: dataDir= defaultSyncLevel=FLUSH numRecordsToKeep=100 maxNumLogsToKeep=10 numVersionBuckets=65536
   [junit4]   2> 2249858 INFO  (qtp1780132406-47411) [n:127.0.0.1:33939_ c:control_collection s:shard1  x:control_collection_shard1_replica_n1] o.a.s.u.CommitTracker Hard AutoCommit: if uncommitted for 30000ms; 
   [junit4]   2> 2249858 INFO  (qtp1780132406-47411) [n:127.0.0.1:33939_ c:control_collection s:shard1  x:control_collection_shard1_replica_n1] o.a.s.u.CommitTracker Soft AutoCommit: if uncommitted for 3000ms; 
   [junit4]   2> 2249860 INFO  (qtp1780132406-47411) [n:127.0.0.1:33939_ c:control_collection s:shard1  x:control_collection_shard1_replica_n1] o.a.s.u.RandomMergePolicy RandomMergePolicy wrapping class org.apache.lucene.index.LogByteSizeMergePolicy: [LogByteSizeMergePolicy: minMergeSize=1677721, mergeFactor=37, maxMergeSize=2147483648, maxMergeSizeForForcedMerge=9223372036854775807, calibrateSizeByDeletes=false, maxMergeDocs=2147483647, maxCFSSegmentSizeMB=8.796093022207999E12, noCFSRatio=0.5275168808969725]
   [junit4]   2> 2249866 INFO  (qtp1780132406-47411) [n:127.0.0.1:33939_ c:control_collection s:shard1  x:control_collection_shard1_replica_n1] o.a.s.s.SolrIndexSearcher Opening [Searcher@37842ec3[control_collection_shard1_replica_n1] main]
   [junit4]   2> 2249874 INFO  (qtp1780132406-47411) [n:127.0.0.1:33939_ c:control_collection s:shard1  x:control_collection_shard1_replica_n1] o.a.s.r.ManagedResourceStorage Configured ZooKeeperStorageIO with znodeBase: /configs/conf1
   [junit4]   2> 2249874 INFO  (qtp1780132406-47411) [n:127.0.0.1:33939_ c:control_collection s:shard1  x:control_collection_shard1_replica_n1] o.a.s.r.ManagedResourceStorage Loaded null at path _rest_managed.json using ZooKeeperStorageIO:path=/configs/conf1
   [junit4]   2> 2249875 INFO  (qtp1780132406-47411) [n:127.0.0.1:33939_ c:control_collection s:shard1  x:control_collection_shard1_replica_n1] o.a.s.h.ReplicationHandler Commits will be reserved for 10000ms.
   [junit4]   2> 2249875 INFO  (qtp1780132406-47411) [n:127.0.0.1:33939_ c:control_collection s:shard1  x:control_collection_shard1_replica_n1] o.a.s.u.UpdateLog Could not find max version in index or recent updates, using new clock 1624368771518955520
   [junit4]   2> 2249879 INFO  (searcherExecutor-6056-thread-1-processing-n:127.0.0.1:33939_ x:control_collection_shard1_replica_n1 c:control_collection s:shard1) [n:127.0.0.1:33939_ c:control_collection s:shard1  x:control_collection_shard1_replica_n1] o.a.s.c.SolrCore [control_collection_shard1_replica_n1] Registered new searcher Searcher@37842ec3[control_collection_shard1_replica_n1] main{ExitableDirectoryReader(UninvertingDirectoryReader())}
   [junit4]   2> 2249893 INFO  (qtp1780132406-47411) [n:127.0.0.1:33939_ c:control_collection s:shard1  x:control_collection_shard1_replica_n1] o.a.s.c.ZkShardTerms Successful update of terms at /collections/control_collection/terms/shard1 to Terms{values={core_node2=0}, version=0}
   [junit4]   2> 2249893 INFO  (qtp1780132406-47411) [n:127.0.0.1:33939_ c:control_collection s:shard1  x:control_collection_shard1_replica_n1] o.a.s.c.ShardLeaderElectionContextBase make sure parent is created /collections/control_collection/leaders/shard1
   [junit4]   2> 2249899 INFO  (qtp1780132406-47411) [n:127.0.0.1:33939_ c:control_collection s:shard1  x:control_collection_shard1_replica_n1] o.a.s.c.ShardLeaderElectionContext Enough replicas found to continue.
   [junit4]   2> 2249899 INFO  (qtp1780132406-47411) [n:127.0.0.1:33939_ c:control_collection s:shard1  x:control_collection_shard1_replica_n1] o.a.s.c.ShardLeaderElectionContext I may be the new leader - try and sync
   [junit4]   2> 2249899 INFO  (qtp1780132406-47411) [n:127.0.0.1:33939_ c:control_collection s:shard1  x:control_collection_shard1_replica_n1] o.a.s.c.SyncStrategy Sync replicas to https://127.0.0.1:33939/control_collection_shard1_replica_n1/
   [junit4]   2> 2249900 INFO  (qtp1780132406-47411) [n:127.0.0.1:33939_ c:control_collection s:shard1  x:control_collection_shard1_replica_n1] o.a.s.c.SyncStrategy Sync Success - now sync replicas to me
   [junit4]   2> 2249900 INFO  (qtp1780132406-47411) [n:127.0.0.1:33939_ c:control_collection s:shard1  x:control_collection_shard1_replica_n1] o.a.s.c.SyncStrategy https://127.0.0.1:33939/control_collection_shard1_replica_n1/ has no replicas
   [junit4]   2> 2249900 INFO  (qtp1780132406-47411) [n:127.0.0.1:33939_ c:control_collection s:shard1  x:control_collection_shard1_replica_n1] o.a.s.c.ShardLeaderElectionContextBase Creating leader registration node /collections/control_collection/leaders/shard1/leader after winning as /collections/control_collection/leader_elect/shard1/election/72729569852915717-core_node2-n_0000000000
   [junit4]   2> 2249902 INFO  (qtp1780132406-47411) [n:127.0.0.1:33939_ c:control_collection s:shard1  x:control_collection_shard1_replica_n1] o.a.s.c.ShardLeaderElectionContext I am the new leader: https://127.0.0.1:33939/control_collection_shard1_replica_n1/ shard1
   [junit4]   2> 2250004 INFO  (zkCallback-14849-thread-1) [    ] o.a.s.c.c.ZkStateReader A cluster state change: [WatchedEvent state:SyncConnected type:NodeDataChanged path:/collections/control_collection/state.json] for collection [control_collection] has occurred - updating... (live nodes size: [1])
   [junit4]   2> 2250005 INFO  (qtp1780132406-47411) [n:127.0.0.1:33939_ c:control_collection s:shard1  x:control_collection_shard1_replica_n1] o.a.s.c.ZkController I am the leader, no recovery necessary
   [junit4]   2> 2250007 INFO  (qtp1780132406-47411) [n:127.0.0.1:33939_ c:control_collection s:shard1  x:control_collection_shard1_replica_n1] o.a.s.s.HttpSolrCall [admin] webapp=null path=/admin/cores params={qt=/admin/cores&collection.configName=conf1&newCollection=true&name=control_collection_shard1_replica_n1&action=CREATE&numShards=1&collection=control_collection&shard=shard1&wt=javabin&version=2&replicaType=NRT} status=0 QTime=1561
   [junit4]   2> 2250030 INFO  (zkCallback-14849-thread-2) [    ] o.a.s.c.c.ZkStateReader A cluster state change: [WatchedEvent state:SyncConnected type:NodeDataChanged path:/collections/control_collection/state.json] for collection [control_collection] has occurred - updating... (live nodes size: [1])
   [junit4]   2> 2250033 INFO  (qtp1780132406-47412) [n:127.0.0.1:33939_    ] o.a.s.h.a.CollectionsHandler Wait for new collection to be active for at most 45 seconds. Check all shard replicas
   [junit4]   2> 2250132 INFO  (zkCallback-14849-thread-2) [    ] o.a.s.c.c.ZkStateReader A cluster state change: [WatchedEvent state:SyncConnected type:NodeDataChanged path:/collections/control_collection/state.json] for collection [control_collection] has occurred - updating... (live nodes size: [1])
   [junit4]   2> 2250132 INFO  (zkCallback-14849-thread-1) [    ] o.a.s.c.c.ZkStateReader A cluster state change: [WatchedEvent state:SyncConnected type:NodeDataChanged path:/collections/control_collection/state.json] for collection [control_collection] has occurred - updating... (live nodes size: [1])
   [junit4]   2> 2250133 INFO  (zkCallback-14849-thread-3) [    ] o.a.s.c.c.ZkStateReader A cluster state change: [WatchedEvent state:SyncConnected type:NodeDataChanged path:/collections/control_collection/state.json] for collection [control_collection] has occurred - updating... (live nodes size: [1])
   [junit4]   2> 2250134 INFO  (qtp1780132406-47412) [n:127.0.0.1:33939_    ] o.a.s.s.HttpSolrCall [admin] webapp=null path=/admin/collections params={collection.configName=conf1&name=control_collection&nrtReplicas=1&action=CREATE&numShards=1&createNodeSet=127.0.0.1:33939_&wt=javabin&version=2} status=0 QTime=1836
   [junit4]   2> 2250143 INFO  (zkConnectionManagerCallback-14869-thread-1) [    ] o.a.s.c.c.ConnectionManager zkClient has connected
   [junit4]   2> 2250144 INFO  (TEST-RestartWhileUpdatingTest.test-seed#[A8D95E0C3EC09BBD]) [    ] o.a.s.c.c.ZkStateReader Updated live nodes from ZooKeeper... (0) -> (1)
   [junit4]   2> 2250146 INFO  (TEST-RestartWhileUpdatingTest.test-seed#[A8D95E0C3EC09BBD]) [    ] o.a.s.c.s.i.ZkClientClusterStateProvider Cluster at 127.0.0.1:42204/solr ready
   [junit4]   2> 2250146 INFO  (TEST-RestartWhileUpdatingTest.test-seed#[A8D95E0C3EC09BBD]) [    ] o.a.s.c.ChaosMonkey monkey: init - expire sessions:false cause connection loss:false
   [junit4]   2> 2250150 INFO  (qtp1780132406-47408) [n:127.0.0.1:33939_    ] o.a.s.h.a.CollectionsHandler Invoked Collection Action :create with params collection.configName=conf1&name=collection1&nrtReplicas=1&action=CREATE&numShards=1&createNodeSet=&stateFormat=2&wt=javabin&version=2 and sendToOCPQueue=true
   [junit4]   2> 2250153 INFO  (OverseerThreadFactory-6051-thread-2-processing-n:127.0.0.1:33939_) [n:127.0.0.1:33939_    ] o.a.s.c.a.c.CreateCollectionCmd Create collection collection1
   [junit4]   2> 2250154 INFO  (OverseerCollectionConfigSetProcessor-72729569852915717-127.0.0.1:33939_-n_0000000000) [n:127.0.0.1:33939_    ] o.a.s.c.OverseerTaskQueue Response ZK path: /overseer/collection-queue-work/qnr-0000000000 doesn't exist.  Requestor may have disconnected from ZooKeeper
   [junit4]   2> 2250359 WARN  (OverseerThreadFactory-6051-thread-2-processing-n:127.0.0.1:33939_) [n:127.0.0.1:33939_    ] o.a.s.c.a.c.CreateCollectionCmd It is unusual to create a collection (collection1) without cores.
   [junit4]   2> 2250363 INFO  (qtp1780132406-47408) [n:127.0.0.1:33939_    ] o.a.s.h.a.CollectionsHandler Wait for new collection to be active for at most 45 seconds. Check all shard replicas
   [junit4]   2> 2250364 INFO  (qtp1780132406-47408) [n:127.0.0.1:33939_    ] o.a.s.s.HttpSolrCall [admin] webapp=null path=/admin/collections params={collection.configName=conf1&name=collection1&nrtReplicas=1&action=CREATE&numShards=1&createNodeSet=&stateFormat=2&wt=javabin&version=2} status=0 QTime=213
   [junit4]   2> 2250365 INFO  (TEST-RestartWhileUpdatingTest.test-seed#[A8D95E0C3EC09BBD]) [    ] o.a.s.c.AbstractFullDistribZkTestBase Creating jetty instances pullReplicaCount=0 numOtherReplicas=3
   [junit4]   2> 2250548 INFO  (TEST-RestartWhileUpdatingTest.test-seed#[A8D95E0C3EC09BBD]) [    ] o.a.s.c.AbstractFullDistribZkTestBase create jetty 1 in directory /x1/jenkins/jenkins-slave/workspace/Lucene-Solr-BadApples-NightlyTests-master/checkout/solr/build/solr-core/test/J1/temp/solr.cloud.RestartWhileUpdatingTest_A8D95E0C3EC09BBD-001/shard-1-001 of type NRT
   [junit4]   2> 2250549 WARN  (closeThreadPool-14870-thread-1) [    ] o.e.j.s.AbstractConnector Ignoring deprecated socket close linger time
   [junit4]   2> 2250550 INFO  (closeThreadPool-14870-thread-1) [    ] o.a.s.c.s.e.JettySolrRunner Start Jetty (original configured port=0)
   [junit4]   2> 2250550 INFO  (closeThreadPool-14870-thread-1) [    ] o.a.s.c.s.e.JettySolrRunner Trying to start Jetty on port 0 try number 1 ...
   [junit4]   2> 2250550 INFO  (closeThreadPool-14870-thread-1) [    ] o.e.j.s.Server jetty-9.4.14.v20181114; built: 2018-11-14T21:20:31.478Z; git: c4550056e785fb5665914545889f21dc136ad9e6; jvm 1.8.0_191-b12
   [junit4]   2> 2250551 INFO  (closeThreadPool-14870-thread-1) [    ] o.e.j.s.session DefaultSessionIdManager workerName=node0
   [junit4]   2> 2250551 INFO  (closeThreadPool-14870-thread-1) [    ] o.e.j.s.session No SessionScavenger set, using defaults
   [junit4]   2> 2250551 INFO  (closeThreadPool-14870-thread-1) [    ] o.e.j.s.session node0 Scavenging every 660000ms
   [junit4]   2> 2250552 INFO  (closeThreadPool-14870-thread-1) [    ] o.e.j.s.h.ContextHandler Started o.e.j.s.ServletContextHandler@52a6d29a{/,null,AVAILABLE}
   [junit4]   2> 2250552 WARN  (closeThreadPool-14870-thread-1) [    ] o.e.j.u.s.S.config No Client EndPointIdentificationAlgorithm configured for SslContextFactory@72728ad[provider=null,keyStore=null,trustStore=null]
   [junit4]   2> 2250553 INFO  (closeThreadPool-14870-thread-1) [    ] o.e.j.s.AbstractConnector Started ServerConnector@2527854f{SSL,[ssl, http/1.1]}{127.0.0.1:35846}
   [junit4]   2> 2250553 INFO  (closeThreadPool-14870-thread-1) [    ] o.e.j.s.Server Started @2250629ms
   [junit4]   2> 2250553 INFO  (closeThreadPool-14870-thread-1) [    ] o.a.s.c.s.e.JettySolrRunner Jetty properties: {solr.data.dir=/x1/jenkins/jenkins-slave/workspace/Lucene-Solr-BadApples-NightlyTests-master/checkout/solr/build/solr-core/test/J1/temp/solr.cloud.RestartWhileUpdatingTest_A8D95E0C3EC09BBD-001/tempDir-001/jetty1, solrconfig=solrconfig.xml, hostContext=/, hostPort=35846, coreRootDirectory=/x1/jenkins/jenkins-slave/workspace/Lucene-Solr-BadApples-NightlyTests-master/checkout/solr/build/solr-core/test/J1/temp/solr.cloud.RestartWhileUpdatingTest_A8D95E0C3EC09BBD-001/shard-1-001/cores}
   [junit4]   2> 2250553 ERROR (closeThreadPool-14870-thread-1) [    ] o.a.s.u.StartupLoggingUtils Missing Java Option solr.log.dir. Logging may be missing or incomplete.
   [junit4]   2> 2250553 INFO  (closeThreadPool-14870-thread-1) [    ] o.a.s.s.SolrDispatchFilter Using logger factory org.apache.logging.slf4j.Log4jLoggerFactory
   [junit4]   2> 2250553 INFO  (closeThreadPool-14870-thread-1) [    ] o.a.s.s.SolrDispatchFilter  ___      _       Welcome to Apache Solr? version 9.0.0
   [junit4]   2> 2250553 INFO  (closeThreadPool-14870-thread-1) [    ] o.a.s.s.SolrDispatchFilter / __| ___| |_ _   Starting in cloud mode on port null
   [junit4]   2> 2250553 INFO  (closeThreadPool-14870-thread-1) [    ] o.a.s.s.SolrDispatchFilter \__ \/ _ \ | '_|  Install dir: null
   [junit4]   2> 2250553 INFO  (closeThreadPool-14870-thread-1) [    ] o.a.s.s.SolrDispatchFilter |___/\___/_|_|    Start time: 2019-02-02T14:46:18.448Z
   [junit4]   2> 2250555 INFO  (zkConnectionManagerCallback-14872-thread-1) [    ] o.a.s.c.c.ConnectionManager zkClient has connected
   [junit4]   2> 2250556 INFO  (closeThreadPool-14870-thread-1) [    ] o.a.s.s.SolrDispatchFilter Loading solr.xml from SolrHome (not found in ZooKeeper)
   [junit4]   2> 2250557 INFO  (closeThreadPool-14870-thread-1) [    ] o.a.s.c.SolrXmlConfig Loading container configuration from /x1/jenkins/jenkins-slave/workspace/Lucene-Solr-BadApples-NightlyTests-master/checkout/solr/build/solr-core/test/J1/temp/solr.cloud.RestartWhileUpdatingTest_A8D95E0C3EC09BBD-001/shard-1-001/solr.xml
   [junit4]   2> 2250562 INFO  (closeThreadPool-14870-thread-1) [    ] o.a.s.c.SolrXmlConfig Configuration parameter autoReplicaFailoverWorkLoopDelay is ignored
   [junit4]   2> 2250562 INFO  (closeThreadPool-14870-thread-1) [    ] o.a.s.c.SolrXmlConfig Configuration parameter autoReplicaFailoverBadNodeExpiration is ignored
   [junit4]   2> 2250564 INFO  (closeThreadPool-14870-thread-1) [    ] o.a.s.c.SolrXmlConfig MBean server found: com.sun.jmx.mbeanserver.JmxMBeanServer@2ea6e21c, but no JMX reporters were configured - adding default JMX reporter.
   [junit4]   2> 2250754 INFO  (TEST-RestartWhileUpdatingTest.test-seed#[A8D95E0C3EC09BBD]) [    ] o.a.s.c.AbstractFullDistribZkTestBase create jetty 2 in directory /x1/jenkins/jenkins-slave/workspace/Lucene-Solr-BadApples-NightlyTests-master/checkout/solr/build/solr-core/test/J1/temp/solr.cloud.RestartWhileUpdatingTest_A8D95E0C3EC09BBD-001/shard-2-001 of type NRT
   [junit4]   2> 2250758 WARN  (closeThreadPool-14870-thread-2) [    ] o.e.j.s.AbstractConnector Ignoring deprecated socket close linger time
   [junit4]   2> 2250759 INFO  (closeThreadPool-14870-thread-2) [    ] o.a.s.c.s.e.JettySolrRunner Start Jetty (original configured port=0)
   [junit4]   2> 2250759 INFO  (closeThreadPool-14870-thread-2) [    ] o.a.s.c.s.e.JettySolrRunner Trying to start Jetty on port 0 try number 1 ...
   [junit4]   2> 2250759 INFO  (closeThreadPool-14870-thread-2) [    ] o.e.j.s.Server jetty-9.4.14.v20181114; built: 2018-11-14T21:20:31.478Z; git: c4550056e785fb5665914545889f21dc136ad9e6; jvm 1.8.0_191-b12
   [junit4]   2> 2250760 INFO  (closeThreadPool-14870-thread-2) [    ] o.e.j.s.session DefaultSessionIdManager workerName=node0
   [junit4]   2> 2250760 INFO  (closeThreadPool-14870-thread-2) [    ] o.e.j.s.session No SessionScavenger set, using defaults
   [junit4]   2> 2250760 INFO  (closeThreadPool-14870-thread-2) [    ] o.e.j.s.session node0 Scavenging every 600000ms
   [junit4]   2> 2250760 INFO  (closeThreadPool-14870-thread-2) [    ] o.e.j.s.h.ContextHandler Started o.e.j.s.ServletContextHandler@4f1c1850{/,null,AVAILABLE}
   [junit4]   2> 2250761 WARN  (closeThreadPool-14870-thread-2) [    ] o.e.j.u.s.S.config No Client EndPointIdentificationAlgorithm configured for SslContextFactory@196ef1e3[provider=null,keyStore=null,trustStore=null]
   [junit4]   2> 2250761 INFO  (closeThreadPool-14870-thread-2) [    ] o.e.j.s.AbstractConnector Started ServerConnector@6252181e{SSL,[ssl, http/1.1]}{127.0.0.1:45995}
   [junit4]   2> 2250762 INFO  (closeThreadPool-14870-thread-2) [    ] o.e.j.s.Server Started @2250837ms
   [junit4]   2> 2250762 INFO  (closeThreadPool-14870-thread-2) [    ] o.a.s.c.s.e.JettySolrRunner Jetty properties: {solr.data.dir=/x1/jenkins/jenkins-slave/workspace/Lucene-Solr-BadApples-NightlyTests-master/checkout/solr/build/solr-core/test/J1/temp/solr.cloud.RestartWhileUpdatingTest_A8D95E0C3EC09BBD-001/tempDir-001/jetty2, solrconfig=solrconfig.xml, hostContext=/, hostPort=45995, coreRootDirectory=/x1/jenkins/jenkins-slave/workspace/Lucene-Solr-BadApples-NightlyTests-master/checkout/solr/build/solr-core/test/J1/temp/solr.cloud.RestartWhileUpdatingTest_A8D95E0C3EC09BBD-001/shard-2-001/cores}
   [junit4]   2> 2250762 ERROR (closeThreadPool-14870-thread-2) [    ] o.a.s.u.StartupLoggingUtils Missing Java Option solr.log.dir. Logging may be missing or incomplete.
   [junit4]   2> 2250762 INFO  (closeThreadPool-14870-thread-2) [    ] o.a.s.s.SolrDispatchFilter Using logger factory org.apache.logging.slf4j.Log4jLoggerFactory
   [junit4]   2> 2250762 INFO  (closeThreadPool-14870-thread-2) [    ] o.a.s.s.SolrDispatchFilter  ___      _       Welcome to Apache Solr? version 9.0.0
   [junit4]   2> 2250762 INFO  (closeThreadPool-14870-thread-2) [    ] o.a.s.s.SolrDispatchFilter / __| ___| |_ _   Starting in cloud mode on port null
   [junit4]   2> 2250762 INFO  (closeThreadPool-14870-thread-2) [    ] o.a.s.s.SolrDispatchFilter \__ \/ _ \ | '_|  Install dir: null
   [junit4]   2> 2250762 INFO  (closeThreadPool-14870-thread-2) [    ] o.a.s.s.SolrDispatchFilter |___/\___/_|_|    Start time: 2019-02-02T14:46:18.657Z
   [junit4]   2> 2250765 INFO  (zkConnectionManagerCallback-14874-thread-1) [    ] o.a.s.c.c.ConnectionManager zkClient has connected
   [junit4]   2> 2250766 INFO  (closeThreadPool-14870-thread-2) [    ] o.a.s.s.SolrDispatchFilter Loading solr.xml from SolrHome (not found in ZooKeeper)
   [junit4]   2> 2250766 INFO  (closeThreadPool-14870-thread-2) [    ] o.a.s.c.SolrXmlConfig Loading container configuration from /x1/jenkins/jenkins-slave/workspace/Lucene-Solr-BadApples-NightlyTests-master/checkout/solr/build/solr-core/test/J1/temp/solr.cloud.RestartWhileUpdatingTest_A8D95E0C3EC09BBD-001/shard-2-001/solr.xml
   [junit4]   2> 2250771 INFO  (closeThreadPool-14870-thread-2) [    ] o.a.s.c.SolrXmlConfig Configuration parameter autoReplicaFailoverWorkLoopDelay is ignored
   [junit4]   2> 2250771 INFO  (closeThreadPool-14870-thread-2) [    ] o.a.s.c.SolrXmlConfig Configuration parameter autoReplicaFailoverBadNodeExpiration is ignored
   [junit4]   2> 2250773 INFO  (closeThreadPool-14870-thread-2) [    ] o.a.s.c.SolrXmlConfig MBean server found: com.sun.jmx.mbeanserver.JmxMBeanServer@2ea6e21c, but no JMX reporters were configured - adding default JMX reporter.
   [junit4]   2> 2250880 INFO  (closeThreadPool-14870-thread-2) [    ] o.a.s.h.c.HttpShardHandlerFactory Host whitelist initialized: WhitelistHostChecker [whitelistHosts=null, whitelistHostCheckingEnabled=false]
   [junit4]   2> 2250881 WARN  (closeThreadPool-14870-thread-2) [    ] o.a.s.c.s.i.Http2SolrClient Create Http2SolrClient with HTTP/1.1 transport since Java 8 or lower versions does not support SSL + HTTP/2
   [junit4]   2> 2250886 WARN  (closeThreadPool-14870-thread-2) [    ] o.e.j.u.s.S.config No Client EndPointIdentificationAlgorithm configured for SslContextFactory@7d50f70e[provider=null,keyStore=null,trustStore=null]
   [junit4]   2> 2250890 WARN  (closeThreadPool-14870-thread-2) [    ] o.a.s.c.s.i.Http2SolrClient Create Http2SolrClient with HTTP/1.1 transport since Java 8 or lower versions does not support SSL + HTTP/2
   [junit4]   2> 2250890 WARN  (closeThreadPool-14870-thread-2) [    ] o.e.j.u.s.S.config No Client EndPointIdentificationAlgorithm configured for SslContextFactory@15f42009[provider=null,keyStore=null,trustStore=null]
   [junit4]   2> 2250892 INFO  (closeThreadPool-14870-thread-2) [    ] o.a.s.c.ZkContainer Zookeeper client=127.0.0.1:42204/solr
   [junit4]   2> 2250917 INFO  (zkConnectionManagerCallback-14880-thread-1) [    ] o.a.s.c.c.ConnectionManager zkClient has connected
   [junit4]   2> 2250920 INFO  (closeThreadPool-14870-thread-1) [    ] o.a.s.h.c.HttpShardHandlerFactory Host whitelist initialized: WhitelistHostChecker [whitelistHosts=null, whitelistHostCheckingEnabled=false]
   [junit4]   2> 2250921 WARN  (closeThreadPool-14870-thread-1) [    ] o.a.s.c.s.i.Http2SolrClient Create Http2SolrClient with HTTP/1.1 transport since Java 8 or lower versions does not support SSL + HTTP/2
   [junit4]   2> 2250923 WARN  (closeThreadPool-14870-thread-1) [    ] o.e.j.u.s.S.config No Client EndPointIdentificationAlgorithm configured for SslContextFactory@5ffd15a0[provider=null,keyStore=null,trustStore=null]
   [junit4]   2> 2250926 INFO  (zkConnectionManagerCallback-14882-thread-1) [    ] o.a.s.c.c.ConnectionManager zkClient has connected
   [junit4]   2> 2250926 WARN  (closeThreadPool-14870-thread-1) [    ] o.a.s.c.s.i.Http2SolrClient Create Http2SolrClient with HTTP/1.1 transport since Java 8 or lower versions does not support SSL + HTTP/2
   [junit4]   2> 2250929 WARN  (closeThreadPool-14870-thread-1) [    ] o.e.j.u.s.S.config No Client EndPointIdentificationAlgorithm configured for SslContextFactory@4c0bd1a3[provider=null,keyStore=null,trustStore=null]
   [junit4]   2> 2250930 INFO  (closeThreadPool-14870-thread-1) [    ] o.a.s.c.ZkContainer Zookeeper client=127.0.0.1:42204/solr
   [junit4]   2> 2250934 INFO  (zkConnectionManagerCallback-14890-thread-1) [    ] o.a.s.c.c.ConnectionManager zkClient has connected
   [junit4]   2> 2250939 INFO  (closeThreadPool-14870-thread-2) [n:127.0.0.1:45995_    ] o.a.s.c.c.ZkStateReader Updated live nodes from ZooKeeper... (0) -> (1)
   [junit4]   2> 2250941 WARN  (NIOServerCxn.Factory:0.0.0.0/0.0.0.0:0) [    ] o.a.z.s.NIOServerCnxn Unable to read additional data from client sessionid 0x10263288fc0000d, likely client has closed socket
   [junit4]   2> 2250942 INFO  (zkConnectionManagerCallback-14892-thread-1) [    ] o.a.s.c.c.ConnectionManager zkClient has connected
   [junit4]   2> 2250945 INFO  (closeThreadPool-14870-thread-2) [n:127.0.0.1:45995_    ] o.a.s.c.ZkController Publish node=127.0.0.1:45995_ as DOWN
   [junit4]   2> 2250947 INFO  (closeThreadPool-14870-thread-2) [n:127.0.0.1:45995_    ] o.a.s.c.TransientSolrCoreCacheDefault Allocating transient cache for 4 transient cores
   [junit4]   2> 2250947 INFO  (closeThreadPool-14870-thread-2) [n:127.0.0.1:45995_    ] o.a.s.c.ZkController Register node as live in ZooKeeper:/live_nodes/127.0.0.1:45995_
   [junit4]   2> 2250948 INFO  (zkCallback-14849-thread-4) [    ] o.a.s.c.c.ZkStateReader Updated live nodes from ZooKeeper... (1) -> (2)
   [junit4]   2> 2250952 INFO  (zkCallback-14856-thread-1) [    ] o.a.s.c.c.ZkStateReader Updated live nodes from ZooKeeper... (1) -> (2)
   [junit4]   2> 2250952 INFO  (zkCallback-14868-thread-1) [    ] o.a.s.c.c.ZkStateReader Updated live nodes from ZooKeeper... (1) -> (2)
   [junit4]   2> 2250954 INFO  (zkCallback-14881-thread-1) [    ] o.a.s.c.c.ZkStateReader Updated live nodes from ZooKeeper... (1) -> (2)
   [junit4]   2> 2250954 INFO  (closeThreadPool-14870-thread-1) [n:127.0.0.1:35846_    ] o.a.s.c.c.ZkStateReader Updated live nodes from ZooKeeper... (0) -> (2)
   [junit4]   2> 2250958 INFO  (closeThreadPool-14870-thread-1) [n:127.0.0.1:35846_    ] o.a.s.c.ZkController Publish node=127.0.0.1:35846_ as DOWN
   [junit4]   2> 2250959 INFO  (closeThreadPool-14870-thread-1) [n:127.0.0.1:35846_    ] o.a.s.c.TransientSolrCoreCacheDefault Allocating transient cache for 4 transient cores
   [junit4]   2> 2250959 INFO  (closeThreadPool-14870-thread-1) [n:127.0.0.1:35846_    ] o.a.s.c.ZkController Register node as live in ZooKeeper:/live_nodes/127.0.0.1:35846_
   [junit4]   2> 2250961 INFO  (zkCallback-14856-thread-1) [    ] o.a.s.c.c.ZkStateReader Updated live nodes from ZooKeeper... (2) -> (3)
   [junit4]   2> 2250961 INFO  (zkCallback-14849-thread-4) [    ] o.a.s.c.c.ZkStateReader Updated live nodes from ZooKeeper... (2) -> (3)
   [junit4]   2> 2250961 INFO  (zkCallback-14868-thread-1) [    ] o.a.s.c.c.ZkStateReader Updated live nodes from ZooKeeper... (2) -> (3)
   [junit4]   2> 2250962 INFO  (zkCallback-14891-thread-1) [    ] o.a.s.c.c.ZkStateReader Updated live nodes from ZooKeeper... (2) -> (3)
   [junit4]   2> 2250962 INFO  (zkCallback-14881-thread-1) [    ] o.a.s.c.c.ZkStateReader Updated live nodes from ZooKeeper... (2) -> (3)
   [junit4]   2> 2250989 INFO  (zkConnectionManagerCallback-14899-thread-1) [    ] o.a.s.c.c.ConnectionManager zkClient has connected
   [junit4]   2> 2250990 INFO  (zkConnectionManagerCallback-14904-thread-1) [    ] o.a.s.c.c.ConnectionManager zkClient has connected
   [junit4]   2> 2250991 INFO  (closeThreadPool-14870-thread-2) [n:127.0.0.1:45995_    ] o.a.s.c.c.ZkStateReader Updated live nodes from ZooKeeper... (0) -> (3)
   [junit4]   2> 2250991 INFO  (closeThreadPool-14870-thread-1) [n:127.0.0.1:35846_    ] o.a.s.c.c.ZkStateReader Updated live nodes from ZooKeeper... (0) -> (3)
   [junit4]   2> 2250992 INFO  (closeThreadPool-14870-thread-1) [n:127.0.0.1:35846_    ] o.a.s.c.s.i.ZkClientClusterStateProvider Cluster at 127.0.0.1:42204/solr ready
   [junit4]   2> 2250992 INFO  (closeThreadPool-14870-thread-2) [n:127.0.0.1:45995_    ] o.a.s.c.s.i.ZkClientClusterStateProvider Cluster at 127.0.0.1:42204/solr ready
   [junit4]   2> 2250993 INFO  (closeThreadPool-14870-thread-2) [n:127.0.0.1:45995_    ] o.a.s.h.a.MetricsHistoryHandler No .system collection, keeping metrics history in memory.
   [junit4]   2> 2250998 INFO  (closeThreadPool-14870-thread-1) [n:127.0.0.1:35846_    ] o.a.s.h.a.MetricsHistoryHandler No .system collection, keeping metrics history in memory.
   [junit4]   2> 2251005 WARN  (closeThreadPool-14870-thread-2) [n:127.0.0.1:45995_    ] o.a.s.m.r.j.JmxMetricsReporter Unable to register meter
   [junit4]   2> javax.management.InstanceNotFoundException: solr:dom1=node,category=QUERY,scope=/admin/metrics/history,name=timeouts
   [junit4]   2> 	at com.sun.jmx.interceptor.DefaultMBeanServerInterceptor.getMBean(DefaultMBeanServerInterceptor.java:1095) ~[?:1.8.0_191]
   [junit4]   2> 	at com.sun.jmx.interceptor.DefaultMBeanServerInterceptor.exclusiveUnregisterMBean(DefaultMBeanServerInterceptor.java:427) ~[?:1.8.0_191]
   [junit4]   2> 	at com.sun.jmx.interceptor.DefaultMBeanServerInterceptor.unregisterMBean(DefaultMBeanServerInterceptor.java:415) ~[?:1.8.0_191]
   [junit4]   2> 	at com.sun.jmx.mbeanserver.JmxMBeanServer.unregisterMBean(JmxMBeanServer.java:546) ~[?:1.8.0_191]
   [junit4]   2> 	at org.apache.solr.metrics.reporters.jmx.JmxMetricsReporter$JmxListener.registerMBean(JmxMetricsReporter.java:531) ~[java/:?]
   [junit4]   2> 	at org.apache.solr.metrics.reporters.jmx.JmxMetricsReporter$JmxListener.onMeterAdded(JmxMetricsReporter.java:648) ~[java/:?]
   [junit4]   2> 	at com.codahale.metrics.MetricRegistry.notifyListenerOfAddedMetric(MetricRegistry.java:460) ~[metrics-core-3.2.6.jar:3.2.6]
   [junit4]   2> 	at com.codahale.metrics.MetricRegistry.addListener(MetricRegistry.java:297) ~[metrics-core-3.2.6.jar:3.2.6]
   [junit4]   2> 	at org.apache.solr.metrics.reporters.jmx.JmxMetricsReporter.start(JmxMetricsReporter.java:729) ~[java/:?]
   [junit4]   2> 	at org.apache.solr.metrics.reporters.SolrJmxReporter.doInit(SolrJmxReporter.java:110) ~[java/:?]
   [junit4]   2> 	at org.apache.solr.metrics.SolrMetricReporter.init(SolrMetricReporter.java:70) ~[java/:?]
   [junit4]   2> 	at org.apache.solr.metrics.SolrMetricManager.loadReporter(SolrMetricManager.java:916) ~[java/:?]
   [junit4]   2> 	at org.apache.solr.metrics.SolrMetricManager.loadReporters(SolrMetricManager.java:843) ~[java/:?]
   [junit4]   2> 	at org.apache.solr.core.CoreContainer.load(CoreContainer.java:600) ~[java/:?]
   [junit4]   2> 	at org.apache.solr.servlet.SolrDispatchFilter.createCoreContainer(SolrDispatchFilter.java:252) ~[java/:?]
   [junit4]   2> 	at org.apache.solr.servlet.SolrDispatchFilter.init(SolrDispatchFilter.java:172) ~[java/:?]
   [junit4]   2> 	at org.eclipse.jetty.servlet.FilterHolder.initialize(FilterHolder.java:136) ~[jetty-servlet-9.4.14.v20181114.jar:9.4.14.v20181114]
   [junit4]   2> 	at org.eclipse.jetty.servlet.ServletHandler.lambda$initialize$0(ServletHandler.java:750) ~[jetty-servlet-9.4.14.v20181114.jar:9.4.14.v20181114]
   [junit4]   2> 	at java.util.Spliterators$ArraySpliterator.forEachRemaining(Spliterators.java:948) ~[?:1.8.0_191]
   [junit4]   2> 	at java.util.stream.Streams$ConcatSpliterator.forEachRemaining(Streams.java:742) ~[?:1.8.0_191]
   [junit4]   2> 	at java.util.stream.Streams$ConcatSpliterator.forEachRemaining(Streams.java:742) ~[?:1.8.0_191]
   [junit4]   2> 	at java.util.stream.ReferencePipeline$Head.forEach(ReferencePipeline.java:580) ~[?:1.8.0_191]
   [junit4]   2> 	at org.eclipse.jetty.servlet.ServletHandler.initialize(ServletHandler.java:744) ~[jetty-servlet-9.4.14.v20181114.jar:9.4.14.v20181114]
   [junit4]   2> 	at org.eclipse.jetty.servlet.ServletHandler.updateMappings(ServletHandler.java:1449) ~[jetty-servlet-9.4.14.v20181114.jar:9.4.14.v20181114]
   [junit4]   2> 	at org.eclipse.jetty.servlet.ServletHandler.setFilterMappings(ServletHandler.java:1513) ~[jetty-servlet-9.4.14.v20181114.jar:9.4.14.v20181114]
   [junit4]   2> 	at org.eclipse.jetty.servlet.ServletHandler.addFilterMapping(ServletHandler.java:1158) ~[jetty-servlet-9.4.14.v20181114.jar:9.4.14.v20181114]
   [junit4]   2> 	at org.eclipse.jetty.servlet.ServletHandler.addFilterWithMapping(ServletHandler.java:995) ~[jetty-servlet-9.4.14.v20181114.jar:9.4.14.v20181114]
   [junit4]   2> 	at org.eclipse.jetty.servlet.ServletContextHandler.addFilter(ServletContextHandler.java:467) ~[jetty-servlet-9.4.14.v20181114.jar:9.4.14.v20181114]
   [junit4]   2> 	at org.apache.solr.client.solrj.embedded.JettySolrRunner$1.lifeCycleStarted(JettySolrRunner.java:381) ~[java/:?]
   [junit4]   2> 	at org.eclipse.jetty.util.component.AbstractLifeCycle.setStarted(AbstractLifeCycle.java:179) ~[jetty-util-9.4.14.v20181114.jar:9.4.14.v20181114]
   [junit4]   2> 	at org.eclipse.jetty.util.component.AbstractLifeCycle.start(AbstractLifeCycle.java:69) ~[jetty-util-9.4.14.v20181114.jar:9.4.14.v20181114]
   [junit4]   2> 	at org.apache.solr.client.solrj.embedded.JettySolrRunner.retryOnPortBindFailure(JettySolrRunner.java:544) ~[java/:?]
   [junit4]   2> 	at org.apache.solr.client.solrj.embedded.JettySolrRunner.start(JettySolrRunner.java:483) ~[java/:?]
   [junit4]   2> 	at org.apache.solr.client.solrj.embedded.JettySolrRunner.start(JettySolrRunner.java:451) ~[java/:?]
   [junit4]   2> 	at org.apache.solr.cloud.AbstractFullDistribZkTestBase.lambda$createJettys$2(AbstractFullDistribZkTestBase.java:464) ~[java/:?]
   [junit4]   2> 	at java.util.concurrent.Executors$RunnableAdapter.call(Executors.java:511) ~[?:1.8.0_191]
   [junit4]   2> 	at java.util.concurrent.FutureTask.run(FutureTask.java:266) ~[?:1.8.0_191]
   [junit4]   2> 	at org.apache.solr.common.util.ExecutorUtil$MDCAwareThreadPoolExecutor.lambda$execute$0(ExecutorUtil.java:209) ~[java/:?]
   [junit4]   2> 	at java.util.concurrent.ThreadPoolExecutor.runWorker(ThreadPoolExecutor.java:1149) [?:1.8.0_191]
   [junit4]   2> 	at java.util.concurrent.ThreadPoolExecutor$Worker.run(ThreadPoolExecutor.java:624) [?:1.8.0_191]
   [junit4]   2> 	at java.lang.Thread.run(Thread.java:748) [?:1.8.0_191]
   [junit4]   2> 2251012 INFO  (TEST-RestartWhileUpdatingTest.test-seed#[A8D95E0C3EC09BBD]) [    ] o.a.s.c.AbstractFullDistribZkTestBase create jetty 3 in directory /x1/jenkins/jenkins-slave/workspace/Lucene-Solr-BadApples-NightlyTests-master/checkout/solr/build/solr-core/test/J1/temp/solr.cloud.RestartWhileUpdatingTest_A8D95E0C3EC09BBD-001/shard-3-001 of type NRT
   [junit4]   2> 2251043 WARN  (closeThreadPool-14870-thread-3) [    ] o.e.j.s.AbstractConnector Ignoring deprecated socket close linger time
   [junit4]   2> 2251044 INFO  (closeThreadPool-14870-thread-3) [    ] o.a.s.c.s.e.JettySolrRunner Start Jetty (original configured port=0)
   [junit4]   2> 2251044 INFO  (closeThreadPool-14870-thread-3) [    ] o.a.s.c.s.e.JettySolrRunner Trying to start Jetty on port 0 try number 1 ...
   [junit4]   2> 2251044 INFO  (closeThreadPool-14870-thread-3) [    ] o.e.j.s.Server jetty-9.4.14.v20181114; built: 2018-11-14T21:20:31.478Z; git: c4550056e785fb5665914545889f21dc136ad9e6; jvm 1.8.0_191-b12
   [junit4]   2> 2251045 INFO  (closeThreadPool-14870-thread-3) [    ] o.e.j.s.session DefaultSessionIdManager workerName=node0
   [junit4]   2> 2251045 INFO  (closeThreadPool-14870-thread-3) [    ] o.e.j.s.session No SessionScavenger set, using defaults
   [junit4]   2> 2251045 INFO  (closeThreadPool-14870-thread-3) [    ] o.e.j.s.session node0 Scavenging every 660000ms
   [junit4]   2> 2251046 INFO  (closeThreadPool-14870-thread-3) [    ] o.e.j.s.h.ContextHandler Started o.e.j.s.ServletContextHandler@6f073f86{/,null,AVAILABLE}
   [junit4]   2> 2251046 WARN  (closeThreadPool-14870-thread-3) [    ] o.e.j.u.s.S.config No Client EndPointIdentificationAlgorithm configured for SslContextFactory@2f10c7fc[provider=null,keyStore=null,trustStore=null]
   [junit4]   2> 2251047 INFO  (closeThreadPool-14870-thread-3) [    ] o.e.j.s.AbstractConnector Started ServerConnector@5ca0b56a{SSL,[ssl, http/1.1]}{127.0.0.1:46045}
   [junit4]   2> 2251047 INFO  (closeThreadPool-14870-thread-3) [    ] o.e.j.s.Server Started @2251123ms
   [junit4]   2> 2251047 INFO  (closeThreadPool-14870-thread-3) [    ] o.a.s.c.s.e.JettySolrRunner Jetty properties: {solr.data.dir=/x1/jenkins/jenkins-slave/workspace/Lucene-Solr-BadApples-NightlyTests-master/checkout/solr/build/solr-core/test/J1/temp/solr.cloud.RestartWhileUpdatingTest_A8D95E0C3EC09BBD-001/tempDir-001/jetty3, solrconfig=solrconfig.xml, hostContext=/, hostPort=46045, coreRootDirectory=/x1/jenkins/jenkins-slave/workspace/Lucene-Solr-BadApples-NightlyTests-master/checkout/solr/build/solr-core/test/J1/temp/solr.cloud.RestartWhileUpdatingTest_A8D95E0C3EC09BBD-001/shard-3-001/cores}
   [junit4]   2> 2251047 ERROR (closeThreadPool-14870-thread-3) [    ] o.a.s.u.StartupLoggingUtils Missing Java Option solr.log.dir. Logging may be missing or incomplete.
   [junit4]   2> 2251047 INFO  (closeThreadPool-14870-thread-3) [    ] o.a.s.s.SolrDispatchFilter Using logger factory org.apache.logging.slf4j.Log4jLoggerFactory
   [junit4]   2> 2251047 INFO  (closeThreadPool-14870-thread-3) [    ] o.a.s.s.SolrDispatchFilter  ___      _       Welcome to Apache Solr? version 9.0.0
   [junit4]   2> 2251047 INFO  (closeThreadPool-14870-thread-3) [    ] o.a.s.s.SolrDispatchFilter / __| ___| |_ _   Starting in cloud mode on port null
   [junit4]   2> 2251047 INFO  (closeThreadPool-14870-thread-3) [    ] o.a.s.s.SolrDispatchFilter \__ \/ _ \ | '_|  Install dir: null
   [junit4]   2> 2251047 INFO  (closeThreadPool-14870-thread-3) [    ] o.a.s.s.SolrDispatchFilter |___/\___/_|_|    Start time: 2019-02-02T14:46:18.942Z
   [junit4]   2> 2251049 INFO  (zkConnectionManagerCallback-14908-thread-1) [    ] o.a.s.c.c.ConnectionManager zkClient has connected
   [junit4]   2> 2251050 INFO  (closeThreadPool-14870-thread-3) [    ] o.a.s.s.SolrDispatchFilter Loading solr.xml from SolrHome (not found in ZooKeeper)
   [junit4]   2> 2251050 INFO  (closeThreadPool-14870-thread-3) [    ] o.a.s.c.SolrXmlConfig Loading container configuration from /x1/jenkins/jenkins-slave/workspace/Lucene-Solr-BadApples-NightlyTests-master/checkout/solr/build/solr-core/test/J1/temp/solr.cloud.RestartWhileUpdatingTest_A8D95E0C3EC09BBD-001/shard-3-001/solr.xml
   [junit4]   2> 2251055 INFO  (closeThreadPool-14870-thread-1) [n:127.0.0.1:35846_    ] o.a.s.m.r.SolrJmxReporter JMX monitoring for 'solr.node' (registry 'solr.node') enabled at server: com.sun.jmx.mbeanserver.JmxMBeanServer@2ea6e21c
   [junit4]   2> 2251056 INFO  (closeThreadPool-14870-thread-3) [    ] o.a.s.c.SolrXmlConfig Configuration parameter autoReplicaFailoverWorkLoopDelay is ignored
   [junit4]   2> 2251056 INFO  (closeThreadPool-14870-thread-3) [    ] o.a.s.c.SolrXmlConfig Configuration parameter autoReplicaFailoverBadNodeExpiration is ignored
   [junit4]   2> 2251058 INFO  (closeThreadPool-14870-thread-3) [    ] o.a.s.c.SolrXmlConfig MBean server found: com.sun.jmx.mbeanserver.JmxMBeanServer@2ea6e21c, but no JMX reporters were configured - adding default JMX reporter.
   [junit4]   2> 2251060 INFO  (closeThreadPool-14870-thread-2) [n:127.0.0.1:45995_    ] o.a.s.m.r.SolrJmxReporter JMX monitoring for 'solr.node' (registry 'solr.node') enabled at server: com.sun.jmx.mbeanserver.JmxMBeanServer@2ea6e21c
   [junit4]   2> 2251076 INFO  (closeThreadPool-14870-thread-1) [n:127.0.0.1:35846_    ] o.a.s.m.r.SolrJmxReporter JMX monitoring for 'solr.jvm' (registry 'solr.jvm') enabled at server: com.sun.jmx.mbeanserver.JmxMBeanServer@2ea6e21c
   [junit4]   2> 2251076 INFO  (closeThreadPool-14870-thread-1) [n:127.0.0.1:35846_    ] o.a.s.m.r.SolrJmxReporter JMX monitoring for 'solr.jetty' (registry 'solr.jetty') enabled at server: com.sun.jmx.mbeanserver.JmxMBeanServer@2ea6e21c
   [junit4]   2> 2251078 INFO  (closeThreadPool-14870-thread-1) [n:127.0.0.1:35846_    ] o.a.s.c.CorePropertiesLocator Found 0 core definitions underneath /x1/jenkins/jenkins-slave/workspace/Lucene-Solr-BadApples-NightlyTests-master/checkout/solr/build/solr-core/test/J1/temp/solr.cloud.RestartWhileUpdatingTest_A8D95E0C3EC09BBD-001/shard-1-001/cores
   [junit4]   2> 2251079 INFO  (closeThreadPool-14870-thread-2) [n:127.0.0.1:45995_    ] o.a.s.m.r.SolrJmxReporter JMX monitoring for 'solr.jvm' (registry 'solr.jvm') enabled at server: com.sun.jmx.mbeanserver.JmxMBeanServer@2ea6e21c
   [junit4]   2> 2251079 INFO  (closeThreadPool-14870-thread-2) [n:127.0.0.1:45995_    ] o.a.s.m.r.SolrJmxReporter JMX monitoring for 'solr.jetty' (registry 'solr.jetty') enabled at server: com.sun.jmx.mbeanserver.JmxMBeanServer@2ea6e21c
   [junit4]   2> 2251081 INFO  (closeThreadPool-14870-thread-2) [n:127.0.0.1:45995_    ] o.a.s.c.CorePropertiesLocator Found 0 core definitions underneath /x1/jenkins/jenkins-slave/workspace/Lucene-Solr-BadApples-NightlyTests-master/checkout/solr/build/solr-core/test/J1/temp/solr.cloud.RestartWhileUpdatingTest_A8D95E0C3EC09BBD-001/shard-2-001/cores
   [junit4]   2> 2251141 INFO  (closeThreadPool-14870-thread-3) [    ] o.a.s.h.c.HttpShardHandlerFactory Host whitelist initialized: WhitelistHostChecker [whitelistHosts=null, whitelistHostCheckingEnabled=false]
   [junit4]   2> 2251142 WARN  (closeThreadPool-14870-thread-3) [    ] o.a.s.c.s.i.Http2SolrClient Create Http2SolrClient with HTTP/1.1 transport since Java 8 or lower versions does not support SSL + HTTP/2
   [junit4]   2> 2251142 WARN  (closeThreadPool-14870-thread-3) [    ] o.e.j.u.s.S.config No Client EndPointIdentificationAlgorithm configured for SslContextFactory@6304395e[provider=null,keyStore=null,trustStore=null]
   [junit4]   2> 2251146 WARN  (closeThreadPool-14870-thread-3) [    ] o.a.s.c.s.i.Http2SolrClient Create Http2SolrClient with HTTP/1.1 transport since Java 8 or lower versions does not support SSL + HTTP/2
   [junit4]   2> 2251147 WARN  (closeThreadPool-14870-thread-3) [    ] o.e.j.u.s.S.config No Client EndPointIdentificationAlgorithm configured for SslContextFactory@6c8b7137[provider=null,keyStore=null,trustStore=null]
   [junit4]   2> 2251148 INFO  (closeThreadPool-14870-thread-3) [    ] o.a.s.c.ZkContainer Zookeeper client=127.0.0.1:42204/solr
   [junit4]   2> 2251149 INFO  (zkConnectionManagerCallback-14914-thread-1) [    ] o.a.s.c.c.ConnectionManager zkClient has connected
   [junit4]   2> 2251152 INFO  (zkConnectionManagerCallback-14916-thread-1) [    ] o.a.s.c.c.ConnectionManager zkClient has connected
   [junit4]   2> 2251157 INFO  (closeThreadPool-14870-thread-3) [n:127.0.0.1:46045_    ] o.a.s.c.c.ZkStateReader Updated live nodes from ZooKeeper... (0) -> (3)
   [junit4]   2> 2251162 INFO  (closeThreadPool-14870-thread-3) [n:127.0.0.1:46045_    ] o.a.s.c.ZkController Publish node=127.0.0.1:46045_ as DOWN
   [junit4]   2> 2251163 INFO  (closeThreadPool-14870-thread-3) [n:127.0.0.1:46045_    ] o.a.s.c.TransientSolrCoreCacheDefault Allocating transient cache for 4 transient cores
   [junit4]   2> 2251163 INFO  (closeThreadPool-14870-thread-3) [n:127.0.0.1:46045_    ] o.a.s.c.ZkController Register node as live in ZooKeeper:/live_nodes/127.0.0.1:46045_
   [junit4]   2> 2251165 INFO  (zkCallback-14849-thread-4) [    ] o.a.s.c.c.ZkStateReader Updated live nodes from ZooKeeper... (3) -> (4)
   [junit4]   2> 2251165 INFO  (zkCallback-14868-thread-1) [    ] o.a.s.c.c.ZkStateReader Updated live nodes from ZooKeeper... (3) -> (4)
   [junit4]   2> 2251166 INFO  (zkCallback-14881-thread-1) [    ] o.a.s.c.c.ZkStateReader Updated live nodes from ZooKeeper... (3) -> (4)
   [junit4]   2> 2251166 INFO  (zkCallback-14856-thread-1) [    ] o.a.s.c.c.ZkStateReader Updated live nodes from ZooKeeper... (3) -> (4)
   [junit4]   2> 2251171 INFO  (zkCallback-14891-thread-1) [    ] o.a.s.c.c.ZkStateReader Updated live nodes from ZooKeeper... (3) -> (4)
   [junit4]   2> 2251177 INFO  (zkCallback-14903-thread-1) [    ] o.a.s.c.c.ZkStateReader Updated live nodes from ZooKeeper... (3) -> (4)
   [junit4]   2> 2251186 INFO  (zkCallback-14915-thread-1) [    ] o.a.s.c.c.ZkStateReader Updated live nodes from ZooKeeper... (3) -> (4)
   [junit4]   2> 2251187 INFO  (zkCallback-14898-thread-1) [    ] o.a.s.c.c.ZkStateReader Updated live nodes from ZooKeeper... (3) -> (4)
   [junit4]   2> 2251209 INFO  (zkConnectionManagerCallback-14923-thread-1) [    ] o.a.s.c.c.ConnectionManager zkClient has connected
   [junit4]   2> 2251210 INFO  (closeThreadPool-14870-thread-3) [n:127.0.0.1:46045_    ] o.a.s.c.c.ZkStateReader Updated live nodes from ZooKeeper... (0) -> (4)
   [junit4]   2> 2251212 INFO  (closeThreadPool-14870-thread-3) [n:127.0.0.1:46045_    ] o.a.s.c.s.i.ZkClientClusterStateProvider Cluster at 127.0.0.1:42204/solr ready
   [junit4]   2> 2251212 INFO  (closeThreadPool-14870-thread-3) [n:127.0.0.1:46045_    ] o.a.s.h.a.MetricsHistoryHandler No .system collection, keeping metrics history in memory.
   [junit4]   2> 2251244 INFO  (closeThreadPool-14870-thread-3) [n:127.0.0.1:46045_    ] o.a.s.m.r.SolrJmxReporter JMX monitoring for 'solr.node' (registry 'solr.node') enabled at server: com.sun.jmx.mbeanserver.JmxMBeanServer@2ea6e21c
   [junit4]   2> 2251263 INFO  (closeThreadPool-14870-thread-3) [n:127.0.0.1:46045_    ] o.a.s.m.r.SolrJmxReporter JMX monitoring for 'solr.jvm' (registry 'solr.jvm') enabled at server: com.sun.jmx.mbeanserver.JmxMBeanServer@2ea6e21c
   [junit4]   2> 2251264 INFO  (closeThreadPool-14870-thread-3) [n:127.0.0.1:46045_    ] o.a.s.m.r.SolrJmxReporter JMX monitoring for 'solr.jetty' (registry 'solr.jetty') enabled at server: com.sun.jmx.mbeanserver.JmxMBeanServer@2ea6e21c
   [junit4]   2> 2251266 INFO  (closeThreadPool-14870-thread-3) [n:127.0.0.1:46045_    ] o.a.s.c.CorePropertiesLocator Found 0 core definitions underneath /x1/jenkins/jenkins-slave/workspace/Lucene-Solr-BadApples-NightlyTests-master/checkout/solr/build/solr-core/test/J1/temp/solr.cloud.RestartWhileUpdatingTest_A8D95E0C3EC09BBD-001/shard-3-001/cores
   [junit4]   2> 2251349 INFO  (qtp1780132406-47409) [n:127.0.0.1:33939_    ] o.a.s.h.a.CollectionsHandler Invoked Collection Action :addreplica with params node=127.0.0.1:35846_&action=ADDREPLICA&collection=collection1&shard=shard1&type=NRT&wt=javabin&version=2 and sendToOCPQueue=true
   [junit4]   2> 2251351 INFO  (qtp1780132406-47411) [n:127.0.0.1:33939_    ] o.a.s.h.a.CollectionsHandler Invoked Collection Action :addreplica with params node=127.0.0.1:46045_&action=ADDREPLICA&collection=collection1&shard=shard1&type=NRT&wt=javabin&version=2 and sendToOCPQueue=true
   [junit4]   2> 2251351 INFO  (qtp1780132406-47410) [n:127.0.0.1:33939_    ] o.a.s.h.a.CollectionsHandler Invoked Collection Action :addreplica with params node=127.0.0.1:45995_&action=ADDREPLICA&collection=collection1&shard=shard1&type=NRT&wt=javabin&version=2 and sendToOCPQueue=true
   [junit4]   2> 2251356 INFO  (OverseerCollectionConfigSetProcessor-72729569852915717-127.0.0.1:33939_-n_0000000000) [n:127.0.0.1:33939_    ] o.a.s.c.OverseerTaskQueue Response ZK path: /overseer/collection-queue-work/qnr-0000000002 doesn't exist.  Requestor may have disconnected from ZooKeeper
   [junit4]   2> 2251364 INFO  (qtp1780132406-47412) [n:127.0.0.1:33939_    ] o.a.s.s.HttpSolrCall [admin] webapp=null path=/admin/metrics params={wt=javabin&version=2&key=solr.core.control_collection.shard1.replica_n1:INDEX.sizeInBytes} status=0 QTime=2
   [junit4]   2> 2251365 INFO  (qtp1780132406-47408) [n:127.0.0.1:33939_    ] o.a.s.s.HttpSolrCall [admin] webapp=null path=/admin/metrics params={wt=javabin&version=2&key=solr.core.control_collection.shard1.replica_n1:INDEX.sizeInBytes} status=0 QTime=0
   [junit4]   2> 2251366 INFO  (qtp1780132406-47412) [n:127.0.0.1:33939_    ] o.a.s.s.HttpSolrCall [admin] webapp=null path=/admin/metrics params={wt=javabin&version=2&key=solr.core.control_collection.shard1.replica_n1:INDEX.sizeInBytes} status=0 QTime=0
   [junit4]   2> 2251367 INFO  (qtp1780132406-47408) [n:127.0.0.1:33939_    ] o.a.s.s.HttpSolrCall [admin] webapp=null path=/admin/metrics params={prefix=CONTAINER.fs.usableSpace,CONTAINER.fs.totalSpace,CORE.coreName&wt=javabin&version=2&group=solr.node,solr.core} status=0 QTime=0
   [junit4]   2> 2251368 INFO  (qtp1780132406-47412) [n:127.0.0.1:33939_    ] o.a.s.s.HttpSolrCall [admin] webapp=null path=/admin/metrics params={prefix=CONTAINER.fs.usableSpace,CONTAINER.fs.totalSpace,CORE.coreName&wt=javabin&version=2&group=solr.node,solr.core} status=0 QTime=0
   [junit4]   2> 2251371 INFO  (qtp1780132406-47408) [n:127.0.0.1:33939_    ] o.a.s.s.HttpSolrCall [admin] webapp=null path=/admin/metrics params={prefix=CONTAINER.fs.usableSpace,CONTAINER.fs.totalSpace,CORE.coreName&wt=javabin&version=2&group=solr.node,solr.core} status=0 QTime=0
   [junit4]   2> 2251373 INFO  (qtp1780132406-47412) [n:127.0.0.1:33939_    ] o.a.s.s.HttpSolrCall [admin] webapp=null path=/admin/metrics params={prefix=CONTAINER.fs.usableSpace,CONTAINER.fs.totalSpace,CORE.coreName&wt=javabin&version=2&group=solr.node,solr.core} status=0 QTime=0
   [junit4]   2> 2251374 INFO  (qtp1780132406-47408) [n:127.0.0.1:33939_    ] o.a.s.s.HttpSolrCall [admin] webapp=null path=/admin/metrics params={prefix=CONTAINER.fs.usableSpace,CONTAINER.fs.totalSpace,CORE.coreName&wt=javabin&version=2&group=solr.node,solr.core} status=0 QTime=0
   [junit4]   2> 2251395 INFO  (qtp1243170961-47475) [n:127.0.0.1:35846_    ] o.a.s.s.HttpSolrCall [admin] webapp=null path=/admin/metrics params={prefix=CONTAINER.fs.usableSpace,CONTAINER.fs.totalSpace,CORE.coreName&wt=javabin&version=2&group=solr.node,solr.core} status=0 QTime=0
   [junit4]   2> 2251397 INFO  (qtp1243170961-47471) [n:127.0.0.1:35846_    ] o.a.s.s.HttpSolrCall [admin] webapp=null path=/admin/metrics params={prefix=CONTAINER.fs.usableSpace,CONTAINER.fs.totalSpace,CORE.coreName&wt=javabin&version=2&group=solr.node,solr.core} status=0 QTime=0
   [junit4]   2> 2251398 INFO  (qtp1243170961-47472) [n:127.0.0.1:35846_    ] o.a.s.s.HttpSolrCall [admin] webapp=null path=/admin/metrics params={prefix=CONTAINER.fs.usableSpace,CONTAINER.fs.totalSpace,CORE.coreName&wt=javabin&version=2&group=solr.node,solr.core} status=0 QTime=0
   [junit4]   2> 2251399 INFO  (qtp1243170961-47473) [n:127.0.0.1:35846_    ] o.a.s.s.HttpSolrCall [admin] webapp=null path=/admin/metrics params={prefix=CONTAINER.fs.usableSpace,CONTAINER.fs.totalSpace,CORE.coreName&wt=javabin&version=2&group=solr.node,solr.core} status=0 QTime=0
   [junit4]   2> 2251400 INFO  (qtp1243170961-47474) [n:127.0.0.1:35846_    ] o.a.s.s.HttpSolrCall [admin] webapp=null path=/admin/metrics params={prefix=CONTAINER.fs.usableSpace,CONTAINER.fs.totalSpace,CORE.coreName&wt=javabin&version=2&group=solr.node,solr.core} status=0 QTime=0
   [junit4]   2> 2251420 INFO  (qtp289687245-47484) [n:127.0.0.1:45995_    ] o.a.s.s.HttpSolrCall [admin] webapp=null path=/admin/metrics params={prefix=CONTAINER.fs.usableSpace,CONTAINER.fs.totalSpace,CORE.coreName&wt=javabin&version=2&group=solr.node,solr.core} status=0 QTime=0
   [junit4]   2> 2251421 INFO  (qtp289687245-47485) [n:127.0.0.1:45995_    ] o.a.s.s.HttpSolrCall [admin] webapp=null path=/admin/metrics params={prefix=CONTAINER.fs.usableSpace,CONTAINER.fs.totalSpace,CORE.coreName&wt=javabin&version=2&group=solr.node,solr.core} status=0 QTime=0
   [junit4]   2> 2251424 INFO  (qtp289687245-47486) [n:127.0.0.1:45995_    ] o.a.s.s.HttpSolrCall [admin] webapp=null path=/admin/metrics params={prefix=CONTAINER.fs.usableSpace,CONTAINER.fs.totalSpace,CORE.coreName&wt=javabin&version=2&group=solr.node,solr.core} status=0 QTime=0
   [junit4]   2> 2251425 INFO  (qtp289687245-47487) [n:127.0.0.1:45995_    ] o.a.s.s.HttpSolrCall [admin] webapp=null path=/admin/metrics params={prefix=CONTAINER.fs.usableSpace,CONTAINER.fs.totalSpace,CORE.coreName&wt=javabin&version=2&group=solr.node,solr.core} status=0 QTime=0
   [junit4]   2> 2251426 INFO  (qtp289687245-47488) [n:127.0.0.1:45995_    ] o.a.s.s.HttpSolrCall [admin] webapp=null path=/admin/metrics params={prefix=CONTAINER.fs.usableSpace,CONTAINER.fs.totalSpace,CORE.coreName&wt=javabin&version=2&group=solr.node,solr.core} status=0 QTime=0
   [junit4]   2> 2251443 INFO  (qtp473342491-47538) [n:127.0.0.1:46045_    ] o.a.s.s.HttpSolrCall [admin] webapp=null path=/admin/metrics params={prefix=CONTAINER.fs.usableSpace,CONTAINER.fs.totalSpace,CORE.coreName&wt=javabin&version=2&group=solr.node,solr.core} status=0 QTime=0
   [junit4]   2> 2251444 INFO  (qtp473342491-47534) [n:127.0.0.1:46045_    ] o.a.s.s.HttpSolrCall [admin] webapp=null path=/admin/metrics params={prefix=CONTAINER.fs.usableSpace,CONTAINER.fs.totalSpace,CORE.coreName&wt=javabin&version=2&group=solr.node,solr.core} status=0 QTime=0
   [junit4]   2> 2251445 INFO  (qtp473342491-47535) [n:127.0.0.1:46045_    ] o.a.s.s.HttpSolrCall [admin] webapp=null path=/admin/metrics params={prefix=CONTAINER.fs.usableSpace,CONTAINER.fs.totalSpace,CORE.coreName&wt=javabin&version=2&group=solr.node,solr.core} status=0 QTime=0
   [junit4]   2> 2251446 INFO  (qtp473342491-47536) [n:127.0.0.1:46045_    ] o.a.s.s.HttpSolrCall [admin] webapp=null path=/admin/metrics params={prefix=CONTAINER.fs.usableSpace,CONTAINER.fs.totalSpace,CORE.coreName&wt=javabin&version=2&group=solr.node,solr.core} status=0 QTime=0
   [junit4]   2> 2251447 INFO  (qtp473342491-47537) [n:127.0.0.1:46045_    ] o.a.s.s.HttpSolrCall [admin] webapp=null path=/admin/metrics params={prefix=CONTAINER.fs.usableSpace,CONTAINER.fs.totalSpace,CORE.coreName&wt=javabin&version=2&group=solr.node,solr.core} status=0 QTime=0
   [junit4]   2> 2251448 INFO  (OverseerThreadFactory-6051-thread-3-processing-n:127.0.0.1:33939_) [n:127.0.0.1:33939_ c:collection1 s:shard1  ] o.a.s.c.a.c.AddReplicaCmd Node Identified 127.0.0.1:35846_ for creating new replica of shard shard1 for collection collection1
   [junit4]   2> 2251451 INFO  (OverseerThreadFactory-6051-thread-3-processing-n:127.0.0.1:33939_) [n:127.0.0.1:33939_ c:collection1 s:shard1  ] o.a.s.c.a.c.AddReplicaCmd Returning CreateReplica command.
   [junit4]   2> 2251480 INFO  (qtp1243170961-47473) [n:127.0.0.1:35846_    x:collection1_shard1_replica_n1] o.a.s.h.a.CoreAdminOperation core create command qt=/admin/cores&collection.configName=conf1&name=collection1_shard1_replica_n1&action=CREATE&collection=collection1&shard=shard1&wt=javabin&version=2&replicaType=NRT
   [junit4]   2> 2252516 INFO  (qtp1243170961-47473) [n:127.0.0.1:35846_ c:collection1 s:shard1  x:collection1_shard1_replica_n1] o.a.s.c.SolrConfig Using Lucene MatchVersion: 9.0.0
   [junit4]   2> 2252578 INFO  (qtp1243170961-47473) [n:127.0.0.1:35846_ c:collection1 s:shard1  x:collection1_shard1_replica_n1] o.a.s.s.IndexSchema [collection1_shard1_replica_n1] Schema name=test
   [junit4]   2> 2252677 INFO  (qtp1243170961-47473) [n:127.0.0.1:35846_ c:collection1 s:shard1  x:collection1_shard1_replica_n1] o.a.s.s.IndexSchema Loaded schema test/1.6 with uniqueid field id
   [junit4]   2> 2252712 INFO  (qtp1243170961-47473) [n:127.0.0.1:35846_ c:collection1 s:shard1  x:collection1_shard1_replica_n1] o.a.s.c.CoreContainer Creating SolrCore 'collection1_shard1_replica_n1' using configuration from collection collection1, trusted=true
   [junit4]   2> 2252713 INFO  (qtp1243170961-47473) [n:127.0.0.1:35846_ c:collection1 s:shard1  x:collection1_shard1_replica_n1] o.a.s.m.r.SolrJmxReporter JMX monitoring for 'solr.core.collection1.shard1.replica_n1' (registry 'solr.core.collection1.shard1.replica_n1') enabled at server: com.sun.jmx.mbeanserver.JmxMBeanServer@2ea6e21c
   [junit4]   2> 2252713 INFO  (qtp1243170961-47473) [n:127.0.0.1:35846_ c:collection1 s:shard1  x:collection1_shard1_replica_n1] o.a.s.c.SolrCore [[collection1_shard1_replica_n1] ] Opening new SolrCore at [/x1/jenkins/jenkins-slave/workspace/Lucene-Solr-BadApples-NightlyTests-master/checkout/solr/build/solr-core/test/J1/temp/solr.cloud.RestartWhileUpdatingTest_A8D95E0C3EC09BBD-001/shard-1-001/cores/collection1_shard1_replica_n1], dataDir=[/x1/jenkins/jenkins-slave/workspace/Lucene-Solr-BadApples-NightlyTests-master/checkout/solr/build/solr-core/test/J1/temp/solr.cloud.RestartWhileUpdatingTest_A8D95E0C3EC09BBD-001/shard-1-001/cores/collection1_shard1_replica_n1/data/]
   [junit4]   2> 2252717 INFO  (qtp1243170961-47473) [n:127.0.0.1:35846_ c:collection1 s:shard1  x:collection1_shard1_replica_n1] o.a.s.u.RandomMergePolicy RandomMergePolicy wrapping class org.apache.lucene.index.LogDocMergePolicy: [LogDocMergePolicy: minMergeSize=1000, mergeFactor=22, maxMergeSize=9223372036854775807, maxMergeSizeForForcedMerge=9223372036854775807, calibrateSizeByDeletes=true, maxMergeDocs=2147483647, maxCFSSegmentSizeMB=0.583984375, noCFSRatio=0.6344138601555405]
   [junit4]   2> 2252732 WARN  (qtp1243170961-47473) [n:127.0.0.1:35846_ c:collection1 s:shard1  x:collection1_shard1_replica_n1] o.a.s.c.RequestHandlers INVALID paramSet a in requestHandler {type = requestHandler,name = /dump,class = DumpRequestHandler,attributes = {initParams=a, name=/dump, class=DumpRequestHandler},args = {defaults={a=A,b=B}}}
   [junit4]   2> 2252819 INFO  (qtp1243170961-47473) [n:127.0.0.1:35846_ c:collection1 s:shard1  x:collection1_shard1_replica_n1] o.a.s.u.UpdateHandler Using UpdateLog implementation: org.apache.solr.update.UpdateLog
   [junit4]   2> 2252819 INFO  (qtp1243170961-47473) [n:127.0.0.1:35846_ c:collection1 s:shard1  x:collection1_shard1_replica_n1] o.a.s.u.UpdateLog Initializing UpdateLog: dataDir= defaultSyncLevel=FLUSH numRecordsToKeep=100 maxNumLogsToKeep=10 numVersionBuckets=65536
   [junit4]   2> 2252822 INFO  (qtp1243170961-47473) [n:127.0.0.1:35846_ c:collection1 s:shard1  x:collection1_shard1_replica_n1] o.a.s.u.CommitTracker Hard AutoCommit: if uncommitted for 30000ms; 
   [junit4]   2> 2252822 INFO  (qtp1243170961-47473) [n:127.0.0.1:35846_ c:collection1 s:shard1  x:collection1_shard1_replica_n1] o.a.s.u.CommitTracker Soft AutoCommit: if uncommitted for 3000ms; 
   [junit4]   2> 2252823 INFO  (qtp1243170961-47473) [n:127.0.0.1:35846_ c:collection1 s:shard1  x:collection1_shard1_replica_n1] o.a.s.u.RandomMergePolicy RandomMergePolicy wrapping class org.apache.lucene.index.LogByteSizeMergePolicy: [LogByteSizeMergePolicy: minMergeSize=1677721, mergeFactor=37, maxMergeSize=2147483648, maxMergeSizeForForcedMerge=9223372036854775807, calibrateSizeByDeletes=false, maxMergeDocs=2147483647, maxCFSSegmentSizeMB=8.796093022207999E12, noCFSRatio=0.5275168808969725]
   [junit4]   2> 2252824 INFO  (qtp1243170961-47473) [n:127.0.0.1:35846_ c:collection1 s:shard1  x:collection1_shard1_replica_n1] o.a.s.s.SolrIndexSearcher Opening [Searcher@1da7af9c[collection1_shard1_replica_n1] main]
   [junit4]   2> 2252826 INFO  (qtp1243170961-47473) [n:127.0.0.1:35846_ c:collection1 s:shard1  x:collection1_shard1_replica_n1] o.a.s.r.ManagedResourceStorage Configured ZooKeeperStorageIO with znodeBase: /configs/conf1
   [junit4]   2> 2252826 INFO  (qtp1243170961-47473) [n:127.0.0.1:35846_ c:collection1 s:shard1  x:collection1_shard1_replica_n1] o.a.s.r.ManagedResourceStorage Loaded null at path _rest_managed.json using ZooKeeperStorageIO:path=/configs/conf1
   [junit4]   2> 2252827 INFO  (qtp1243170961-47473) [n:127.0.0.1:35846_ c:collection1 s:shard1  x:collection1_shard1_replica_n1] o.a.s.h.ReplicationHandler Commits will be reserved for 10000ms.
   [junit4]   2> 2252827 INFO  (qtp1243170961-47473) [n:127.0.0.1:35846_ c:collection1 s:shard1  x:collection1_shard1_replica_n1] o.a.s.u.UpdateLog Could not find max version in index or recent updates, using new clock 1624368774614351872
   [junit4]   2> 2252831 INFO  (searcherExecutor-6088-thread-1-processing-n:127.0.0.1:35846_ x:collection1_shard1_replica_n1 c:collection1 s:shard1) [n:127.0.0.1:35846_ c:collection1 s:shard1  x:collection1_shard1_replica_n1] o.a.s.c.SolrCore [collection1_shard1_replica_n1] Registered new searcher Searcher@1da7af9c[collection1_shard1_replica_n1] main{ExitableDirectoryReader(UninvertingDirectoryReader())}
   [junit4]   2> 2252834 INFO  (qtp1243170961-47473) [n:127.0.0.1:35846_ c:collection1 s:shard1  x:collection1_shard1_replica_n1] o.a.s.c.ZkShardTerms Successful update of terms at /collections/collection1/terms/shard1 to Terms{values={core_node2=0}, version=0}
   [junit4]   2> 2252834 INFO  (qtp1243170961-47473) [n:127.0.0.1:35846_ c:collection1 s:shard1  x:collection1_shard1_replica_n1] o.a.s.c.ShardLeaderElectionContextBase make sure parent is created /collections/collection1/leaders/shard1
   [junit4]   2> 2252838 INFO  (qtp1243170961-47473) [n:127.0.0.1:35846_ c:collection1 s:shard1  x:collection1_shard1_replica_n1] o.a.s.c.ShardLeaderElectionContext Enough replicas found to continue.
   [junit4]   2> 2252838 INFO  (qtp1243170961-47473) [n:127.0.0.1:35846_ c:collection1 s:shard1  x:collection1_shard1_replica_n1] o.a.s.c.ShardLeaderElectionContext I may be the new leader - try and sync
   [junit4]   2> 2252838 INFO  (qtp1243170961-47473) [n:127.0.0.1:35846_ c:collection1 s:shard1  x:collection1_shard1_replica_n1] o.a.s.c.SyncStrategy Sync replicas to https://127.0.0.1:35846/collection1_shard1_replica_n1/
   [junit4]   2> 2252838 INFO  (qtp1243170961-47473) [n:127.0.0.1:35846_ c:collection1 s:shard1  x:collection1_shard1_replica_n1] o.a.s.c.SyncStrategy Sync Success - now sync replicas to me
   [junit4]   2> 2252839 INFO  (qtp1243170961-47473) [n:127.0.0.1:35846_ c:collection1 s:shard1  x:collection1_shard1_replica_n1] o.a.s.c.SyncStrategy https://127.0.0.1:35846/collection1_shard1_replica_n1/ has no replicas
   [junit4]   2> 2252839 INFO  (qtp1243170961-47473) [n:127.0.0.1:35846_ c:collection1 s:shard1  x:collection1_shard1_replica_n1] o.a.s.c.ShardLeaderElectionContextBase Creating leader registration node /collections/collection1/leaders/shard1/leader after winning as /collections/collection1/leader_elect/shard1/election/72729569852915726-core_node2-n_0000000000
   [junit4]   2> 2252841 INFO  (qtp1243170961-47473) [n:127.0.0.1:35846_ c:collection1 s:shard1  x:collection1_shard1_replica_n1] o.a.s.c.ShardLeaderElectionContext I am the new leader: https://127.0.0.1:35846/collection1_shard1_replica_n1/ shard1
   [junit4]   2> 2252943 INFO  (zkCallback-14891-thread-1) [    ] o.a.s.c.c.ZkStateReader A cluster state change: [WatchedEvent state:SyncConnected type:NodeDataChanged path:/collections/collection1/state.json] for collection [collection1] has occurred - updating... (live nodes size: [4])
   [junit4]   2> 2252943 INFO  (zkCallback-14891-thread-2) [    ] o.a.s.c.c.ZkStateReader A cluster state change: [WatchedEvent state:SyncConnected type:NodeDataChanged path:/collections/collection1/state.json] for collection [collection1] has occurred - updating... (live nodes size: [4])
   [junit4]   2> 2252945 INFO  (qtp1243170961-47473) [n:127.0.0.1:35846_ c:collection1 s:shard1  x:collection1_shard1_replica_n1] o.a.s.c.ZkController I am the leader, no recovery necessary
   [junit4]   2> 2252949 INFO  (qtp1243170961-47473) [n:127.0.0.1:35846_ c:collection1 s:shard1  x:collection1_shard1_replica_n1] o.a.s.s.HttpSolrCall [admin] webapp=null path=/admin/cores params={qt=/admin/cores&collection.configName=conf1&name=collection1_shard1_replica_n1&action=CREATE&collection=collection1&shard=shard1&wt=javabin&version=2&replicaType=NRT} status=0 QTime=1469
   [junit4]   2> 2252952 INFO  (qtp1780132406-47409) [n:127.0.0.1:33939_ c:collection1   ] o.a.s.s.HttpSolrCall [admin] webapp=null path=/admin/collections params={node=127.0.0.1:35846_&action=ADDREPLICA&collection=collection1&shard=shard1&type=NRT&wt=javabin&version=2} status=0 QTime=1603
   [junit4]   2> 2253047 INFO  (zkCallback-14891-thread-2) [    ] o.a.s.c.c.ZkStateReader A cluster state change: [WatchedEvent state:SyncConnected type:NodeDataChanged path:/collections/collection1/state.json] for collection [collection1] has occurred - updating... (live nodes size: [4])
   [junit4]   2> 2253047 INFO  (zkCallback-14891-thread-1) [    ] o.a.s.c.c.ZkStateReader A cluster state change: [WatchedEvent state:SyncConnected type:NodeDataChanged path:/collections/collection1/state.json] for collection [collection1] has occurred - updating... (live nodes size: [4])
   [junit4]   2> 2253048 INFO  (zkCallback-14891-thread-3) [    ] o.a.s.c.c.ZkStateReader A cluster state change: [WatchedEvent state:SyncConnected type:NodeDataChanged path:/collections/collection1/state.json] for collection [collection1] has occurred - updating... (live nodes size: [4])
   [junit4]   2> 2253366 INFO  (OverseerCollectionConfigSetProcessor-72729569852915717-127.0.0.1:33939_-n_0000000000) [n:127.0.0.1:33939_    ] o.a.s.c.OverseerTaskQueue Response ZK path: /overseer/collection-queue-work/qnr-0000000004 doesn't exist.  Requestor may have disconnected from ZooKeeper
  

[...truncated too long message...]

le = /x1/jenkins/jenkins-slave/workspace/Lucene-Solr-BadApples-NightlyTests-master/checkout/lucene/top-level-ivy-settings.xml

resolve:

ivy-availability-check:
[loadresource] Do not set property disallowed.ivy.jars.list as its length is 0.

-ivy-fail-disallowed-ivy-version:

ivy-fail:

ivy-fail:

ivy-configure:
[ivy:configure] :: loading settings :: file = /x1/jenkins/jenkins-slave/workspace/Lucene-Solr-BadApples-NightlyTests-master/checkout/lucene/top-level-ivy-settings.xml

resolve:

ivy-availability-check:
[loadresource] Do not set property disallowed.ivy.jars.list as its length is 0.

-ivy-fail-disallowed-ivy-version:

ivy-fail:

ivy-configure:
[ivy:configure] :: loading settings :: file = /x1/jenkins/jenkins-slave/workspace/Lucene-Solr-BadApples-NightlyTests-master/checkout/lucene/top-level-ivy-settings.xml

resolve:

ivy-availability-check:
[loadresource] Do not set property disallowed.ivy.jars.list as its length is 0.

-ivy-fail-disallowed-ivy-version:

ivy-fail:

ivy-fail:

ivy-configure:
[ivy:configure] :: loading settings :: file = /x1/jenkins/jenkins-slave/workspace/Lucene-Solr-BadApples-NightlyTests-master/checkout/lucene/top-level-ivy-settings.xml

resolve:

ivy-availability-check:
[loadresource] Do not set property disallowed.ivy.jars.list as its length is 0.

-ivy-fail-disallowed-ivy-version:

ivy-fail:

ivy-fail:

ivy-configure:
[ivy:configure] :: loading settings :: file = /x1/jenkins/jenkins-slave/workspace/Lucene-Solr-BadApples-NightlyTests-master/checkout/lucene/top-level-ivy-settings.xml

resolve:

ivy-availability-check:
[loadresource] Do not set property disallowed.ivy.jars.list as its length is 0.

-ivy-fail-disallowed-ivy-version:

ivy-fail:

ivy-fail:

ivy-configure:
[ivy:configure] :: loading settings :: file = /x1/jenkins/jenkins-slave/workspace/Lucene-Solr-BadApples-NightlyTests-master/checkout/lucene/top-level-ivy-settings.xml

resolve:

ivy-availability-check:
[loadresource] Do not set property disallowed.ivy.jars.list as its length is 0.

-ivy-fail-disallowed-ivy-version:

ivy-fail:

ivy-fail:

ivy-configure:
[ivy:configure] :: loading settings :: file = /x1/jenkins/jenkins-slave/workspace/Lucene-Solr-BadApples-NightlyTests-master/checkout/lucene/top-level-ivy-settings.xml

resolve:

ivy-availability-check:
[loadresource] Do not set property disallowed.ivy.jars.list as its length is 0.

-ivy-fail-disallowed-ivy-version:

ivy-fail:

ivy-fail:

ivy-configure:
[ivy:configure] :: loading settings :: file = /x1/jenkins/jenkins-slave/workspace/Lucene-Solr-BadApples-NightlyTests-master/checkout/lucene/top-level-ivy-settings.xml

resolve:

ivy-availability-check:
[loadresource] Do not set property disallowed.ivy.jars.list as its length is 0.

-ivy-fail-disallowed-ivy-version:

ivy-fail:

ivy-fail:

ivy-configure:
[ivy:configure] :: loading settings :: file = /x1/jenkins/jenkins-slave/workspace/Lucene-Solr-BadApples-NightlyTests-master/checkout/lucene/top-level-ivy-settings.xml

resolve:

ivy-availability-check:
[loadresource] Do not set property disallowed.ivy.jars.list as its length is 0.

-ivy-fail-disallowed-ivy-version:

ivy-fail:

ivy-fail:

ivy-configure:
[ivy:configure] :: loading settings :: file = /x1/jenkins/jenkins-slave/workspace/Lucene-Solr-BadApples-NightlyTests-master/checkout/lucene/top-level-ivy-settings.xml

resolve:

ivy-availability-check:
[loadresource] Do not set property disallowed.ivy.jars.list as its length is 0.

-ivy-fail-disallowed-ivy-version:

ivy-fail:

ivy-fail:

ivy-configure:
[ivy:configure] :: loading settings :: file = /x1/jenkins/jenkins-slave/workspace/Lucene-Solr-BadApples-NightlyTests-master/checkout/lucene/top-level-ivy-settings.xml

resolve:

ivy-availability-check:
[loadresource] Do not set property disallowed.ivy.jars.list as its length is 0.

-ivy-fail-disallowed-ivy-version:

ivy-fail:

ivy-fail:

ivy-configure:
[ivy:configure] :: loading settings :: file = /x1/jenkins/jenkins-slave/workspace/Lucene-Solr-BadApples-NightlyTests-master/checkout/lucene/top-level-ivy-settings.xml

resolve:

ivy-availability-check:
[loadresource] Do not set property disallowed.ivy.jars.list as its length is 0.

-ivy-fail-disallowed-ivy-version:

ivy-fail:

ivy-fail:

ivy-configure:
[ivy:configure] :: loading settings :: file = /x1/jenkins/jenkins-slave/workspace/Lucene-Solr-BadApples-NightlyTests-master/checkout/lucene/top-level-ivy-settings.xml

resolve:

jar-checksums:
    [mkdir] Created dir: /x1/jenkins/jenkins-slave/workspace/Lucene-Solr-BadApples-NightlyTests-master/checkout/solr/null487544769
     [copy] Copying 237 files to /x1/jenkins/jenkins-slave/workspace/Lucene-Solr-BadApples-NightlyTests-master/checkout/solr/null487544769
   [delete] Deleting directory /x1/jenkins/jenkins-slave/workspace/Lucene-Solr-BadApples-NightlyTests-master/checkout/solr/null487544769

check-working-copy:
[ivy:cachepath] :: resolving dependencies :: org.eclipse.jgit#org.eclipse.jgit-caller;working
[ivy:cachepath] 	confs: [default]
[ivy:cachepath] 	found org.eclipse.jgit#org.eclipse.jgit;4.6.0.201612231935-r in public
[ivy:cachepath] 	found com.jcraft#jsch;0.1.53 in public
[ivy:cachepath] 	found com.googlecode.javaewah#JavaEWAH;1.1.6 in public
[ivy:cachepath] 	found org.apache.httpcomponents#httpclient;4.3.6 in public
[ivy:cachepath] 	found org.apache.httpcomponents#httpcore;4.3.3 in public
[ivy:cachepath] 	found commons-logging#commons-logging;1.1.3 in public
[ivy:cachepath] 	found commons-codec#commons-codec;1.6 in public
[ivy:cachepath] 	found org.slf4j#slf4j-api;1.7.2 in public
[ivy:cachepath] :: resolution report :: resolve 31ms :: artifacts dl 10ms
	---------------------------------------------------------------------
	|                  |            modules            ||   artifacts   |
	|       conf       | number| search|dwnlded|evicted|| number|dwnlded|
	---------------------------------------------------------------------
	|      default     |   8   |   0   |   0   |   0   ||   8   |   0   |
	---------------------------------------------------------------------
[wc-checker] Initializing working copy...
[wc-checker] SLF4J: Failed to load class "org.slf4j.impl.StaticLoggerBinder".
[wc-checker] SLF4J: Defaulting to no-operation (NOP) logger implementation
[wc-checker] SLF4J: See http://www.slf4j.org/codes.html#StaticLoggerBinder for further details.
[wc-checker] Checking working copy status...

-jenkins-base:

BUILD SUCCESSFUL
Total time: 314 minutes 41 seconds
Archiving artifacts
java.lang.InterruptedException: no matches found within 10000
	at hudson.FilePath$ValidateAntFileMask.hasMatch(FilePath.java:2847)
	at hudson.FilePath$ValidateAntFileMask.invoke(FilePath.java:2726)
	at hudson.FilePath$ValidateAntFileMask.invoke(FilePath.java:2707)
	at hudson.FilePath$FileCallableWrapper.call(FilePath.java:3086)
Also:   hudson.remoting.Channel$CallSiteStackTrace: Remote call to lucene
		at hudson.remoting.Channel.attachCallSiteStackTrace(Channel.java:1741)
		at hudson.remoting.UserRequest$ExceptionResponse.retrieve(UserRequest.java:357)
		at hudson.remoting.Channel.call(Channel.java:955)
		at hudson.FilePath.act(FilePath.java:1072)
		at hudson.FilePath.act(FilePath.java:1061)
		at hudson.FilePath.validateAntFileMask(FilePath.java:2705)
		at hudson.tasks.ArtifactArchiver.perform(ArtifactArchiver.java:243)
		at hudson.tasks.BuildStepCompatibilityLayer.perform(BuildStepCompatibilityLayer.java:81)
		at hudson.tasks.BuildStepMonitor$1.perform(BuildStepMonitor.java:20)
		at hudson.model.AbstractBuild$AbstractBuildExecution.perform(AbstractBuild.java:744)
		at hudson.model.AbstractBuild$AbstractBuildExecution.performAllBuildSteps(AbstractBuild.java:690)
		at hudson.model.Build$BuildExecution.post2(Build.java:186)
		at hudson.model.AbstractBuild$AbstractBuildExecution.post(AbstractBuild.java:635)
		at hudson.model.Run.execute(Run.java:1835)
		at hudson.model.FreeStyleBuild.run(FreeStyleBuild.java:43)
		at hudson.model.ResourceController.execute(ResourceController.java:97)
		at hudson.model.Executor.run(Executor.java:429)
Caused: hudson.FilePath$TunneledInterruptedException
	at hudson.FilePath$FileCallableWrapper.call(FilePath.java:3088)
	at hudson.remoting.UserRequest.perform(UserRequest.java:212)
	at hudson.remoting.UserRequest.perform(UserRequest.java:54)
	at hudson.remoting.Request$2.run(Request.java:369)
	at hudson.remoting.InterceptingExecutorService$1.call(InterceptingExecutorService.java:72)
	at java.util.concurrent.FutureTask.run(FutureTask.java:266)
	at java.util.concurrent.ThreadPoolExecutor.runWorker(ThreadPoolExecutor.java:1142)
	at java.util.concurrent.ThreadPoolExecutor$Worker.run(ThreadPoolExecutor.java:617)
	at java.lang.Thread.run(Thread.java:748)
Caused: java.lang.InterruptedException: java.lang.InterruptedException: no matches found within 10000
	at hudson.FilePath.act(FilePath.java:1074)
	at hudson.FilePath.act(FilePath.java:1061)
	at hudson.FilePath.validateAntFileMask(FilePath.java:2705)
	at hudson.tasks.ArtifactArchiver.perform(ArtifactArchiver.java:243)
	at hudson.tasks.BuildStepCompatibilityLayer.perform(BuildStepCompatibilityLayer.java:81)
	at hudson.tasks.BuildStepMonitor$1.perform(BuildStepMonitor.java:20)
	at hudson.model.AbstractBuild$AbstractBuildExecution.perform(AbstractBuild.java:744)
	at hudson.model.AbstractBuild$AbstractBuildExecution.performAllBuildSteps(AbstractBuild.java:690)
	at hudson.model.Build$BuildExecution.post2(Build.java:186)
	at hudson.model.AbstractBuild$AbstractBuildExecution.post(AbstractBuild.java:635)
	at hudson.model.Run.execute(Run.java:1835)
	at hudson.model.FreeStyleBuild.run(FreeStyleBuild.java:43)
	at hudson.model.ResourceController.execute(ResourceController.java:97)
	at hudson.model.Executor.run(Executor.java:429)
No artifacts found that match the file pattern "**/*.events,heapdumps/**,**/hs_err_pid*". Configuration error?
Recording test results
Build step 'Publish JUnit test result report' changed build result to UNSTABLE
Email was triggered for: Unstable (Test Failures)
Sending email for trigger: Unstable (Test Failures)

Mime
View raw message