lucene-dev mailing list archives

Site index · List index
Message view « Date » · « Thread »
Top « Date » · « Thread »
From Apache Jenkins Server <jenk...@builds.apache.org>
Subject [JENKINS] Lucene-Solr-NightlyTests-7.7 - Build # 5 - Still Unstable
Date Wed, 06 Feb 2019 12:54:07 GMT
Build: https://builds.apache.org/job/Lucene-Solr-NightlyTests-7.7/5/

1 tests failed.
FAILED:  org.apache.solr.cloud.LIROnShardRestartTest.testAllReplicasInLIR

Error Message:
Path must not end with / character

Stack Trace:
java.lang.IllegalArgumentException: Path must not end with / character
	at __randomizedtesting.SeedInfo.seed([D1072771A351DC8D:8B9F1DB7DDD1BB6A]:0)
	at org.apache.zookeeper.common.PathUtils.validatePath(PathUtils.java:58)
	at org.apache.zookeeper.ZooKeeper.getChildren(ZooKeeper.java:1523)
	at org.apache.solr.common.cloud.SolrZkClient.lambda$getChildren$4(SolrZkClient.java:346)
	at org.apache.solr.common.cloud.ZkCmdExecutor.retryOperation(ZkCmdExecutor.java:71)
	at org.apache.solr.common.cloud.SolrZkClient.getChildren(SolrZkClient.java:346)
	at org.apache.solr.cloud.LIROnShardRestartTest.testAllReplicasInLIR(LIROnShardRestartTest.java:168)
	at sun.reflect.NativeMethodAccessorImpl.invoke0(Native Method)
	at sun.reflect.NativeMethodAccessorImpl.invoke(NativeMethodAccessorImpl.java:62)
	at sun.reflect.DelegatingMethodAccessorImpl.invoke(DelegatingMethodAccessorImpl.java:43)
	at java.lang.reflect.Method.invoke(Method.java:498)
	at com.carrotsearch.randomizedtesting.RandomizedRunner.invoke(RandomizedRunner.java:1750)
	at com.carrotsearch.randomizedtesting.RandomizedRunner$8.evaluate(RandomizedRunner.java:938)
	at com.carrotsearch.randomizedtesting.RandomizedRunner$9.evaluate(RandomizedRunner.java:974)
	at com.carrotsearch.randomizedtesting.RandomizedRunner$10.evaluate(RandomizedRunner.java:988)
	at com.carrotsearch.randomizedtesting.rules.SystemPropertiesRestoreRule$1.evaluate(SystemPropertiesRestoreRule.java:57)
	at org.apache.lucene.util.TestRuleSetupTeardownChained$1.evaluate(TestRuleSetupTeardownChained.java:49)
	at org.apache.lucene.util.AbstractBeforeAfterRule$1.evaluate(AbstractBeforeAfterRule.java:45)
	at org.apache.lucene.util.TestRuleThreadAndTestName$1.evaluate(TestRuleThreadAndTestName.java:48)
	at org.apache.lucene.util.TestRuleIgnoreAfterMaxFailures$1.evaluate(TestRuleIgnoreAfterMaxFailures.java:64)
	at org.apache.lucene.util.TestRuleMarkFailure$1.evaluate(TestRuleMarkFailure.java:47)
	at com.carrotsearch.randomizedtesting.rules.StatementAdapter.evaluate(StatementAdapter.java:36)
	at com.carrotsearch.randomizedtesting.ThreadLeakControl$StatementRunner.run(ThreadLeakControl.java:368)
	at com.carrotsearch.randomizedtesting.ThreadLeakControl.forkTimeoutingTask(ThreadLeakControl.java:817)
	at com.carrotsearch.randomizedtesting.ThreadLeakControl$3.evaluate(ThreadLeakControl.java:468)
	at com.carrotsearch.randomizedtesting.RandomizedRunner.runSingleTest(RandomizedRunner.java:947)
	at com.carrotsearch.randomizedtesting.RandomizedRunner$5.evaluate(RandomizedRunner.java:832)
	at com.carrotsearch.randomizedtesting.RandomizedRunner$6.evaluate(RandomizedRunner.java:883)
	at com.carrotsearch.randomizedtesting.RandomizedRunner$7.evaluate(RandomizedRunner.java:894)
	at com.carrotsearch.randomizedtesting.rules.StatementAdapter.evaluate(StatementAdapter.java:36)
	at com.carrotsearch.randomizedtesting.rules.SystemPropertiesRestoreRule$1.evaluate(SystemPropertiesRestoreRule.java:57)
	at org.apache.lucene.util.AbstractBeforeAfterRule$1.evaluate(AbstractBeforeAfterRule.java:45)
	at com.carrotsearch.randomizedtesting.rules.StatementAdapter.evaluate(StatementAdapter.java:36)
	at org.apache.lucene.util.TestRuleStoreClassName$1.evaluate(TestRuleStoreClassName.java:41)
	at com.carrotsearch.randomizedtesting.rules.NoShadowingOrOverridesOnMethodsRule$1.evaluate(NoShadowingOrOverridesOnMethodsRule.java:40)
	at com.carrotsearch.randomizedtesting.rules.NoShadowingOrOverridesOnMethodsRule$1.evaluate(NoShadowingOrOverridesOnMethodsRule.java:40)
	at com.carrotsearch.randomizedtesting.rules.StatementAdapter.evaluate(StatementAdapter.java:36)
	at com.carrotsearch.randomizedtesting.rules.StatementAdapter.evaluate(StatementAdapter.java:36)
	at com.carrotsearch.randomizedtesting.rules.StatementAdapter.evaluate(StatementAdapter.java:36)
	at org.apache.lucene.util.TestRuleAssertionsRequired$1.evaluate(TestRuleAssertionsRequired.java:53)
	at org.apache.lucene.util.TestRuleMarkFailure$1.evaluate(TestRuleMarkFailure.java:47)
	at org.apache.lucene.util.TestRuleIgnoreAfterMaxFailures$1.evaluate(TestRuleIgnoreAfterMaxFailures.java:64)
	at org.apache.lucene.util.TestRuleIgnoreTestSuites$1.evaluate(TestRuleIgnoreTestSuites.java:54)
	at com.carrotsearch.randomizedtesting.rules.StatementAdapter.evaluate(StatementAdapter.java:36)
	at com.carrotsearch.randomizedtesting.ThreadLeakControl$StatementRunner.run(ThreadLeakControl.java:368)
	at java.lang.Thread.run(Thread.java:748)




Build Log:
[...truncated 14556 lines...]
   [junit4] Suite: org.apache.solr.cloud.LIROnShardRestartTest
   [junit4]   2> Creating dataDir: /x1/jenkins/jenkins-slave/workspace/Lucene-Solr-NightlyTests-7.7/checkout/solr/build/solr-core/test/J0/temp/solr.cloud.LIROnShardRestartTest_D1072771A351DC8D-001/init-core-data-001
   [junit4]   2> 2396927 INFO  (SUITE-LIROnShardRestartTest-seed#[D1072771A351DC8D]-worker) [    ] o.a.s.c.MiniSolrCloudCluster Starting cluster of 3 servers in /x1/jenkins/jenkins-slave/workspace/Lucene-Solr-NightlyTests-7.7/checkout/solr/build/solr-core/test/J0/temp/solr.cloud.LIROnShardRestartTest_D1072771A351DC8D-001/tempDir-001
   [junit4]   2> 2396928 INFO  (SUITE-LIROnShardRestartTest-seed#[D1072771A351DC8D]-worker) [    ] o.a.s.c.ZkTestServer STARTING ZK TEST SERVER
   [junit4]   2> 2396931 INFO  (ZkTestServer Run Thread) [    ] o.a.s.c.ZkTestServer client port:0.0.0.0/0.0.0.0:0
   [junit4]   2> 2396932 INFO  (ZkTestServer Run Thread) [    ] o.a.s.c.ZkTestServer Starting server
   [junit4]   2> 2397031 INFO  (SUITE-LIROnShardRestartTest-seed#[D1072771A351DC8D]-worker) [    ] o.a.s.c.ZkTestServer start zk server on port:37182
   [junit4]   2> 2397032 INFO  (SUITE-LIROnShardRestartTest-seed#[D1072771A351DC8D]-worker) [    ] o.a.s.c.ZkTestServer parse host and port list: 127.0.0.1:37182
   [junit4]   2> 2397032 INFO  (SUITE-LIROnShardRestartTest-seed#[D1072771A351DC8D]-worker) [    ] o.a.s.c.ZkTestServer connecting to 127.0.0.1 37182
   [junit4]   2> 2397036 INFO  (zkConnectionManagerCallback-7975-thread-1) [    ] o.a.s.c.c.ConnectionManager zkClient has connected
   [junit4]   2> 2397038 INFO  (zkConnectionManagerCallback-7977-thread-1) [    ] o.a.s.c.c.ConnectionManager zkClient has connected
   [junit4]   2> 2397040 INFO  (zkConnectionManagerCallback-7979-thread-1) [    ] o.a.s.c.c.ConnectionManager zkClient has connected
   [junit4]   2> 2397065 WARN  (jetty-launcher-7980-thread-3) [    ] o.e.j.s.AbstractConnector Ignoring deprecated socket close linger time
   [junit4]   2> 2397065 WARN  (jetty-launcher-7980-thread-1) [    ] o.e.j.s.AbstractConnector Ignoring deprecated socket close linger time
   [junit4]   2> 2397065 INFO  (jetty-launcher-7980-thread-3) [    ] o.a.s.c.s.e.JettySolrRunner Start Jetty (original configured port=0)
   [junit4]   2> 2397065 INFO  (jetty-launcher-7980-thread-3) [    ] o.a.s.c.s.e.JettySolrRunner Trying to start Jetty on port 0 try number 1 ...
   [junit4]   2> 2397066 INFO  (jetty-launcher-7980-thread-3) [    ] o.e.j.s.Server jetty-9.4.14.v20181114; built: 2018-11-14T21:20:31.478Z; git: c4550056e785fb5665914545889f21dc136ad9e6; jvm 1.8.0_191-b12
   [junit4]   2> 2397066 WARN  (jetty-launcher-7980-thread-2) [    ] o.e.j.s.AbstractConnector Ignoring deprecated socket close linger time
   [junit4]   2> 2397068 INFO  (jetty-launcher-7980-thread-3) [    ] o.e.j.s.session DefaultSessionIdManager workerName=node0
   [junit4]   2> 2397068 INFO  (jetty-launcher-7980-thread-3) [    ] o.e.j.s.session No SessionScavenger set, using defaults
   [junit4]   2> 2397068 INFO  (jetty-launcher-7980-thread-3) [    ] o.e.j.s.session node0 Scavenging every 600000ms
   [junit4]   2> 2397068 INFO  (jetty-launcher-7980-thread-3) [    ] o.e.j.s.h.ContextHandler Started o.e.j.s.ServletContextHandler@67600473{/solr,null,AVAILABLE}
   [junit4]   2> 2397068 INFO  (jetty-launcher-7980-thread-2) [    ] o.a.s.c.s.e.JettySolrRunner Start Jetty (original configured port=0)
   [junit4]   2> 2397068 INFO  (jetty-launcher-7980-thread-2) [    ] o.a.s.c.s.e.JettySolrRunner Trying to start Jetty on port 0 try number 1 ...
   [junit4]   2> 2397069 INFO  (jetty-launcher-7980-thread-2) [    ] o.e.j.s.Server jetty-9.4.14.v20181114; built: 2018-11-14T21:20:31.478Z; git: c4550056e785fb5665914545889f21dc136ad9e6; jvm 1.8.0_191-b12
   [junit4]   2> 2397069 INFO  (jetty-launcher-7980-thread-1) [    ] o.a.s.c.s.e.JettySolrRunner Start Jetty (original configured port=0)
   [junit4]   2> 2397069 INFO  (jetty-launcher-7980-thread-1) [    ] o.a.s.c.s.e.JettySolrRunner Trying to start Jetty on port 0 try number 1 ...
   [junit4]   2> 2397069 INFO  (jetty-launcher-7980-thread-1) [    ] o.e.j.s.Server jetty-9.4.14.v20181114; built: 2018-11-14T21:20:31.478Z; git: c4550056e785fb5665914545889f21dc136ad9e6; jvm 1.8.0_191-b12
   [junit4]   2> 2397069 WARN  (jetty-launcher-7980-thread-3) [    ] o.e.j.u.s.S.config No Client EndPointIdentificationAlgorithm configured for SslContextFactory@5e49a80[provider=null,keyStore=null,trustStore=null]
   [junit4]   2> 2397070 INFO  (jetty-launcher-7980-thread-2) [    ] o.e.j.s.session DefaultSessionIdManager workerName=node0
   [junit4]   2> 2397070 INFO  (jetty-launcher-7980-thread-2) [    ] o.e.j.s.session No SessionScavenger set, using defaults
   [junit4]   2> 2397070 INFO  (jetty-launcher-7980-thread-2) [    ] o.e.j.s.session node0 Scavenging every 600000ms
   [junit4]   2> 2397071 INFO  (jetty-launcher-7980-thread-2) [    ] o.e.j.s.h.ContextHandler Started o.e.j.s.ServletContextHandler@447b4c0d{/solr,null,AVAILABLE}
   [junit4]   2> 2397071 WARN  (jetty-launcher-7980-thread-2) [    ] o.e.j.u.s.S.config No Client EndPointIdentificationAlgorithm configured for SslContextFactory@bca96e0[provider=null,keyStore=null,trustStore=null]
   [junit4]   2> 2397072 INFO  (jetty-launcher-7980-thread-1) [    ] o.e.j.s.session DefaultSessionIdManager workerName=node0
   [junit4]   2> 2397072 INFO  (jetty-launcher-7980-thread-1) [    ] o.e.j.s.session No SessionScavenger set, using defaults
   [junit4]   2> 2397072 INFO  (jetty-launcher-7980-thread-1) [    ] o.e.j.s.session node0 Scavenging every 600000ms
   [junit4]   2> 2397073 INFO  (jetty-launcher-7980-thread-1) [    ] o.e.j.s.h.ContextHandler Started o.e.j.s.ServletContextHandler@4a84a53f{/solr,null,AVAILABLE}
   [junit4]   2> 2397073 WARN  (jetty-launcher-7980-thread-1) [    ] o.e.j.u.s.S.config No Client EndPointIdentificationAlgorithm configured for SslContextFactory@baa1312[provider=null,keyStore=null,trustStore=null]
   [junit4]   2> 2397074 INFO  (jetty-launcher-7980-thread-3) [    ] o.e.j.s.AbstractConnector Started ServerConnector@165adc56{SSL,[ssl, http/1.1]}{127.0.0.1:44504}
   [junit4]   2> 2397074 INFO  (jetty-launcher-7980-thread-3) [    ] o.e.j.s.Server Started @2397134ms
   [junit4]   2> 2397074 INFO  (jetty-launcher-7980-thread-3) [    ] o.a.s.c.s.e.JettySolrRunner Jetty properties: {hostContext=/solr, hostPort=44504}
   [junit4]   2> 2397074 ERROR (jetty-launcher-7980-thread-3) [    ] o.a.s.u.StartupLoggingUtils Missing Java Option solr.log.dir. Logging may be missing or incomplete.
   [junit4]   2> 2397074 INFO  (jetty-launcher-7980-thread-3) [    ] o.a.s.s.SolrDispatchFilter Using logger factory org.apache.logging.slf4j.Log4jLoggerFactory
   [junit4]   2> 2397074 INFO  (jetty-launcher-7980-thread-3) [    ] o.a.s.s.SolrDispatchFilter  ___      _       Welcome to Apache Solr? version 7.7.0
   [junit4]   2> 2397074 INFO  (jetty-launcher-7980-thread-3) [    ] o.a.s.s.SolrDispatchFilter / __| ___| |_ _   Starting in cloud mode on port null
   [junit4]   2> 2397074 INFO  (jetty-launcher-7980-thread-3) [    ] o.a.s.s.SolrDispatchFilter \__ \/ _ \ | '_|  Install dir: null
   [junit4]   2> 2397074 INFO  (jetty-launcher-7980-thread-3) [    ] o.a.s.s.SolrDispatchFilter |___/\___/_|_|    Start time: 2019-02-06T12:01:31.455Z
   [junit4]   2> 2397076 INFO  (jetty-launcher-7980-thread-2) [    ] o.e.j.s.AbstractConnector Started ServerConnector@6d85e5ec{SSL,[ssl, http/1.1]}{127.0.0.1:37812}
   [junit4]   2> 2397076 INFO  (jetty-launcher-7980-thread-2) [    ] o.e.j.s.Server Started @2397136ms
   [junit4]   2> 2397076 INFO  (jetty-launcher-7980-thread-2) [    ] o.a.s.c.s.e.JettySolrRunner Jetty properties: {hostContext=/solr, hostPort=37812}
   [junit4]   2> 2397076 ERROR (jetty-launcher-7980-thread-2) [    ] o.a.s.u.StartupLoggingUtils Missing Java Option solr.log.dir. Logging may be missing or incomplete.
   [junit4]   2> 2397076 INFO  (jetty-launcher-7980-thread-2) [    ] o.a.s.s.SolrDispatchFilter Using logger factory org.apache.logging.slf4j.Log4jLoggerFactory
   [junit4]   2> 2397076 INFO  (jetty-launcher-7980-thread-2) [    ] o.a.s.s.SolrDispatchFilter  ___      _       Welcome to Apache Solr? version 7.7.0
   [junit4]   2> 2397076 INFO  (jetty-launcher-7980-thread-2) [    ] o.a.s.s.SolrDispatchFilter / __| ___| |_ _   Starting in cloud mode on port null
   [junit4]   2> 2397076 INFO  (jetty-launcher-7980-thread-2) [    ] o.a.s.s.SolrDispatchFilter \__ \/ _ \ | '_|  Install dir: null
   [junit4]   2> 2397076 INFO  (jetty-launcher-7980-thread-2) [    ] o.a.s.s.SolrDispatchFilter |___/\___/_|_|    Start time: 2019-02-06T12:01:31.457Z
   [junit4]   2> 2397077 INFO  (jetty-launcher-7980-thread-1) [    ] o.e.j.s.AbstractConnector Started ServerConnector@65092ad7{SSL,[ssl, http/1.1]}{127.0.0.1:42764}
   [junit4]   2> 2397077 INFO  (jetty-launcher-7980-thread-1) [    ] o.e.j.s.Server Started @2397137ms
   [junit4]   2> 2397077 INFO  (jetty-launcher-7980-thread-1) [    ] o.a.s.c.s.e.JettySolrRunner Jetty properties: {hostContext=/solr, hostPort=42764}
   [junit4]   2> 2397078 ERROR (jetty-launcher-7980-thread-1) [    ] o.a.s.u.StartupLoggingUtils Missing Java Option solr.log.dir. Logging may be missing or incomplete.
   [junit4]   2> 2397078 INFO  (jetty-launcher-7980-thread-1) [    ] o.a.s.s.SolrDispatchFilter Using logger factory org.apache.logging.slf4j.Log4jLoggerFactory
   [junit4]   2> 2397078 INFO  (jetty-launcher-7980-thread-1) [    ] o.a.s.s.SolrDispatchFilter  ___      _       Welcome to Apache Solr? version 7.7.0
   [junit4]   2> 2397078 INFO  (jetty-launcher-7980-thread-1) [    ] o.a.s.s.SolrDispatchFilter / __| ___| |_ _   Starting in cloud mode on port null
   [junit4]   2> 2397078 INFO  (jetty-launcher-7980-thread-1) [    ] o.a.s.s.SolrDispatchFilter \__ \/ _ \ | '_|  Install dir: null
   [junit4]   2> 2397078 INFO  (jetty-launcher-7980-thread-1) [    ] o.a.s.s.SolrDispatchFilter |___/\___/_|_|    Start time: 2019-02-06T12:01:31.459Z
   [junit4]   2> 2397079 INFO  (zkConnectionManagerCallback-7984-thread-1) [    ] o.a.s.c.c.ConnectionManager zkClient has connected
   [junit4]   2> 2397079 INFO  (zkConnectionManagerCallback-7986-thread-1) [    ] o.a.s.c.c.ConnectionManager zkClient has connected
   [junit4]   2> 2397080 INFO  (zkConnectionManagerCallback-7982-thread-1) [    ] o.a.s.c.c.ConnectionManager zkClient has connected
   [junit4]   2> 2397080 INFO  (jetty-launcher-7980-thread-1) [    ] o.a.s.s.SolrDispatchFilter solr.xml found in ZooKeeper. Loading...
   [junit4]   2> 2397080 INFO  (jetty-launcher-7980-thread-3) [    ] o.a.s.s.SolrDispatchFilter solr.xml found in ZooKeeper. Loading...
   [junit4]   2> 2397083 INFO  (jetty-launcher-7980-thread-2) [    ] o.a.s.s.SolrDispatchFilter solr.xml found in ZooKeeper. Loading...
   [junit4]   2> 2397215 INFO  (jetty-launcher-7980-thread-3) [    ] o.a.s.h.c.HttpShardHandlerFactory Host whitelist initialized: WhitelistHostChecker [whitelistHosts=null, whitelistHostCheckingEnabled=true]
   [junit4]   2> 2397219 INFO  (jetty-launcher-7980-thread-1) [    ] o.a.s.h.c.HttpShardHandlerFactory Host whitelist initialized: WhitelistHostChecker [whitelistHosts=null, whitelistHostCheckingEnabled=true]
   [junit4]   2> 2397220 INFO  (jetty-launcher-7980-thread-3) [    ] o.a.s.c.ZkContainer Zookeeper client=127.0.0.1:37182/solr
   [junit4]   2> 2397228 INFO  (zkConnectionManagerCallback-7990-thread-1) [    ] o.a.s.c.c.ConnectionManager zkClient has connected
   [junit4]   2> 2397228 INFO  (jetty-launcher-7980-thread-1) [    ] o.a.s.c.ZkContainer Zookeeper client=127.0.0.1:37182/solr
   [junit4]   2> 2397234 INFO  (zkConnectionManagerCallback-7994-thread-1) [    ] o.a.s.c.c.ConnectionManager zkClient has connected
   [junit4]   2> 2397238 INFO  (zkConnectionManagerCallback-7996-thread-1) [    ] o.a.s.c.c.ConnectionManager zkClient has connected
   [junit4]   2> 2397238 INFO  (zkConnectionManagerCallback-7998-thread-1) [    ] o.a.s.c.c.ConnectionManager zkClient has connected
   [junit4]   2> 2397342 INFO  (jetty-launcher-7980-thread-1) [n:127.0.0.1:42764_solr    ] o.a.s.c.OverseerElectionContext I am going to be the leader 127.0.0.1:42764_solr
   [junit4]   2> 2397343 INFO  (jetty-launcher-7980-thread-1) [n:127.0.0.1:42764_solr    ] o.a.s.c.Overseer Overseer (id=72751571333349385-127.0.0.1:42764_solr-n_0000000000) starting
   [junit4]   2> 2397368 INFO  (zkConnectionManagerCallback-8007-thread-1) [    ] o.a.s.c.c.ConnectionManager zkClient has connected
   [junit4]   2> 2397370 INFO  (jetty-launcher-7980-thread-1) [n:127.0.0.1:42764_solr    ] o.a.s.c.s.i.ZkClientClusterStateProvider Cluster at 127.0.0.1:37182/solr ready
   [junit4]   2> 2397371 INFO  (OverseerStateUpdate-72751571333349385-127.0.0.1:42764_solr-n_0000000000) [n:127.0.0.1:42764_solr    ] o.a.s.c.Overseer Starting to work on the main queue : 127.0.0.1:42764_solr
   [junit4]   2> 2397372 INFO  (jetty-launcher-7980-thread-3) [n:127.0.0.1:44504_solr    ] o.a.s.c.ZkController Register node as live in ZooKeeper:/live_nodes/127.0.0.1:44504_solr
   [junit4]   2> 2397380 INFO  (jetty-launcher-7980-thread-1) [n:127.0.0.1:42764_solr    ] o.a.s.c.ZkController Publish node=127.0.0.1:42764_solr as DOWN
   [junit4]   2> 2397381 INFO  (jetty-launcher-7980-thread-1) [n:127.0.0.1:42764_solr    ] o.a.s.c.TransientSolrCoreCacheDefault Allocating transient cache for 2147483647 transient cores
   [junit4]   2> 2397381 INFO  (jetty-launcher-7980-thread-1) [n:127.0.0.1:42764_solr    ] o.a.s.c.ZkController Register node as live in ZooKeeper:/live_nodes/127.0.0.1:42764_solr
   [junit4]   2> 2397404 INFO  (zkCallback-7997-thread-1) [    ] o.a.s.c.c.ZkStateReader Updated live nodes from ZooKeeper... (0) -> (2)
   [junit4]   2> 2397420 INFO  (zkCallback-8006-thread-1) [    ] o.a.s.c.c.ZkStateReader Updated live nodes from ZooKeeper... (0) -> (2)
   [junit4]   2> 2397423 INFO  (zkCallback-7995-thread-1) [    ] o.a.s.c.c.ZkStateReader Updated live nodes from ZooKeeper... (0) -> (2)
   [junit4]   2> 2397480 INFO  (jetty-launcher-7980-thread-1) [n:127.0.0.1:42764_solr    ] o.a.s.h.a.MetricsHistoryHandler No .system collection, keeping metrics history in memory.
   [junit4]   2> 2397496 INFO  (zkConnectionManagerCallback-8013-thread-1) [    ] o.a.s.c.c.ConnectionManager zkClient has connected
   [junit4]   2> 2397497 INFO  (jetty-launcher-7980-thread-3) [n:127.0.0.1:44504_solr    ] o.a.s.c.c.ZkStateReader Updated live nodes from ZooKeeper... (0) -> (2)
   [junit4]   2> 2397498 INFO  (jetty-launcher-7980-thread-3) [n:127.0.0.1:44504_solr    ] o.a.s.c.s.i.ZkClientClusterStateProvider Cluster at 127.0.0.1:37182/solr ready
   [junit4]   2> 2397514 INFO  (jetty-launcher-7980-thread-3) [n:127.0.0.1:44504_solr    ] o.a.s.h.a.MetricsHistoryHandler No .system collection, keeping metrics history in memory.
   [junit4]   2> 2397537 INFO  (jetty-launcher-7980-thread-1) [n:127.0.0.1:42764_solr    ] o.a.s.m.r.SolrJmxReporter JMX monitoring for 'solr_42764.solr.node' (registry 'solr.node') enabled at server: com.sun.jmx.mbeanserver.JmxMBeanServer@533f992d
   [junit4]   2> 2397551 INFO  (jetty-launcher-7980-thread-3) [n:127.0.0.1:44504_solr    ] o.a.s.m.r.SolrJmxReporter JMX monitoring for 'solr_44504.solr.node' (registry 'solr.node') enabled at server: com.sun.jmx.mbeanserver.JmxMBeanServer@533f992d
   [junit4]   2> 2397563 INFO  (jetty-launcher-7980-thread-1) [n:127.0.0.1:42764_solr    ] o.a.s.m.r.SolrJmxReporter JMX monitoring for 'solr_42764.solr.jvm' (registry 'solr.jvm') enabled at server: com.sun.jmx.mbeanserver.JmxMBeanServer@533f992d
   [junit4]   2> 2397563 INFO  (jetty-launcher-7980-thread-1) [n:127.0.0.1:42764_solr    ] o.a.s.m.r.SolrJmxReporter JMX monitoring for 'solr_42764.solr.jetty' (registry 'solr.jetty') enabled at server: com.sun.jmx.mbeanserver.JmxMBeanServer@533f992d
   [junit4]   2> 2397565 INFO  (jetty-launcher-7980-thread-3) [n:127.0.0.1:44504_solr    ] o.a.s.m.r.SolrJmxReporter JMX monitoring for 'solr_44504.solr.jvm' (registry 'solr.jvm') enabled at server: com.sun.jmx.mbeanserver.JmxMBeanServer@533f992d
   [junit4]   2> 2397565 INFO  (jetty-launcher-7980-thread-3) [n:127.0.0.1:44504_solr    ] o.a.s.m.r.SolrJmxReporter JMX monitoring for 'solr_44504.solr.jetty' (registry 'solr.jetty') enabled at server: com.sun.jmx.mbeanserver.JmxMBeanServer@533f992d
   [junit4]   2> 2397565 INFO  (jetty-launcher-7980-thread-1) [n:127.0.0.1:42764_solr    ] o.a.s.c.CorePropertiesLocator Found 0 core definitions underneath /x1/jenkins/jenkins-slave/workspace/Lucene-Solr-NightlyTests-7.7/checkout/solr/build/solr-core/test/J0/temp/solr.cloud.LIROnShardRestartTest_D1072771A351DC8D-001/tempDir-001/node1/.
   [junit4]   2> 2397567 INFO  (jetty-launcher-7980-thread-3) [n:127.0.0.1:44504_solr    ] o.a.s.c.CorePropertiesLocator Found 0 core definitions underneath /x1/jenkins/jenkins-slave/workspace/Lucene-Solr-NightlyTests-7.7/checkout/solr/build/solr-core/test/J0/temp/solr.cloud.LIROnShardRestartTest_D1072771A351DC8D-001/tempDir-001/node3/.
   [junit4]   2> 2397572 INFO  (jetty-launcher-7980-thread-2) [    ] o.a.s.h.c.HttpShardHandlerFactory Host whitelist initialized: WhitelistHostChecker [whitelistHosts=null, whitelistHostCheckingEnabled=true]
   [junit4]   2> 2397581 INFO  (jetty-launcher-7980-thread-2) [    ] o.a.s.c.ZkContainer Zookeeper client=127.0.0.1:37182/solr
   [junit4]   2> 2397583 INFO  (zkConnectionManagerCallback-8018-thread-1) [    ] o.a.s.c.c.ConnectionManager zkClient has connected
   [junit4]   2> 2397596 INFO  (zkConnectionManagerCallback-8020-thread-1) [    ] o.a.s.c.c.ConnectionManager zkClient has connected
   [junit4]   2> 2397600 INFO  (jetty-launcher-7980-thread-2) [n:127.0.0.1:37812_solr    ] o.a.s.c.c.ZkStateReader Updated live nodes from ZooKeeper... (0) -> (2)
   [junit4]   2> 2397604 INFO  (jetty-launcher-7980-thread-2) [n:127.0.0.1:37812_solr    ] o.a.s.c.ZkController Publish node=127.0.0.1:37812_solr as DOWN
   [junit4]   2> 2397605 INFO  (jetty-launcher-7980-thread-2) [n:127.0.0.1:37812_solr    ] o.a.s.c.TransientSolrCoreCacheDefault Allocating transient cache for 2147483647 transient cores
   [junit4]   2> 2397605 INFO  (jetty-launcher-7980-thread-2) [n:127.0.0.1:37812_solr    ] o.a.s.c.ZkController Register node as live in ZooKeeper:/live_nodes/127.0.0.1:37812_solr
   [junit4]   2> 2397606 INFO  (zkCallback-7997-thread-2) [    ] o.a.s.c.c.ZkStateReader Updated live nodes from ZooKeeper... (2) -> (3)
   [junit4]   2> 2397620 INFO  (zkCallback-7995-thread-1) [    ] o.a.s.c.c.ZkStateReader Updated live nodes from ZooKeeper... (2) -> (3)
   [junit4]   2> 2397620 INFO  (zkCallback-8019-thread-1) [    ] o.a.s.c.c.ZkStateReader Updated live nodes from ZooKeeper... (2) -> (3)
   [junit4]   2> 2397620 INFO  (zkCallback-8006-thread-1) [    ] o.a.s.c.c.ZkStateReader Updated live nodes from ZooKeeper... (2) -> (3)
   [junit4]   2> 2397620 INFO  (zkCallback-8012-thread-1) [    ] o.a.s.c.c.ZkStateReader Updated live nodes from ZooKeeper... (2) -> (3)
   [junit4]   2> 2397662 INFO  (zkConnectionManagerCallback-8027-thread-1) [    ] o.a.s.c.c.ConnectionManager zkClient has connected
   [junit4]   2> 2397664 INFO  (jetty-launcher-7980-thread-2) [n:127.0.0.1:37812_solr    ] o.a.s.c.c.ZkStateReader Updated live nodes from ZooKeeper... (0) -> (3)
   [junit4]   2> 2397665 INFO  (jetty-launcher-7980-thread-2) [n:127.0.0.1:37812_solr    ] o.a.s.c.s.i.ZkClientClusterStateProvider Cluster at 127.0.0.1:37182/solr ready
   [junit4]   2> 2397665 INFO  (jetty-launcher-7980-thread-2) [n:127.0.0.1:37812_solr    ] o.a.s.h.a.MetricsHistoryHandler No .system collection, keeping metrics history in memory.
   [junit4]   2> 2397691 INFO  (jetty-launcher-7980-thread-2) [n:127.0.0.1:37812_solr    ] o.a.s.m.r.SolrJmxReporter JMX monitoring for 'solr_37812.solr.node' (registry 'solr.node') enabled at server: com.sun.jmx.mbeanserver.JmxMBeanServer@533f992d
   [junit4]   2> 2397705 INFO  (jetty-launcher-7980-thread-2) [n:127.0.0.1:37812_solr    ] o.a.s.m.r.SolrJmxReporter JMX monitoring for 'solr_37812.solr.jvm' (registry 'solr.jvm') enabled at server: com.sun.jmx.mbeanserver.JmxMBeanServer@533f992d
   [junit4]   2> 2397706 INFO  (jetty-launcher-7980-thread-2) [n:127.0.0.1:37812_solr    ] o.a.s.m.r.SolrJmxReporter JMX monitoring for 'solr_37812.solr.jetty' (registry 'solr.jetty') enabled at server: com.sun.jmx.mbeanserver.JmxMBeanServer@533f992d
   [junit4]   2> 2397707 INFO  (jetty-launcher-7980-thread-2) [n:127.0.0.1:37812_solr    ] o.a.s.c.CorePropertiesLocator Found 0 core definitions underneath /x1/jenkins/jenkins-slave/workspace/Lucene-Solr-NightlyTests-7.7/checkout/solr/build/solr-core/test/J0/temp/solr.cloud.LIROnShardRestartTest_D1072771A351DC8D-001/tempDir-001/node2/.
   [junit4]   2> 2397765 INFO  (zkConnectionManagerCallback-8033-thread-1) [    ] o.a.s.c.c.ConnectionManager zkClient has connected
   [junit4]   2> 2397766 INFO  (SUITE-LIROnShardRestartTest-seed#[D1072771A351DC8D]-worker) [    ] o.a.s.c.c.ZkStateReader Updated live nodes from ZooKeeper... (0) -> (3)
   [junit4]   2> 2397767 INFO  (SUITE-LIROnShardRestartTest-seed#[D1072771A351DC8D]-worker) [    ] o.a.s.c.s.i.ZkClientClusterStateProvider Cluster at 127.0.0.1:37182/solr ready
   [junit4]   2> 2397824 INFO  (qtp573306819-36763) [n:127.0.0.1:42764_solr    ] o.a.s.h.a.CollectionsHandler Invoked Collection Action :create with params pullReplicas=0&name=allReplicasInLIR&nrtReplicas=3&action=CREATE&numShards=1&tlogReplicas=0&wt=javabin&version=2 and sendToOCPQueue=true
   [junit4]   2> 2397830 INFO  (OverseerThreadFactory-8180-thread-1-processing-n:127.0.0.1:42764_solr) [n:127.0.0.1:42764_solr    ] o.a.s.c.a.c.CreateCollectionCmd Create collection allReplicasInLIR
   [junit4]   2> 2397831 INFO  (OverseerThreadFactory-8180-thread-1-processing-n:127.0.0.1:42764_solr) [n:127.0.0.1:42764_solr    ] o.a.s.c.c.ZkConfigManager Copying zk node /configs/_default/managed-schema to /configs/allReplicasInLIR.AUTOCREATED/managed-schema
   [junit4]   2> 2397834 INFO  (OverseerThreadFactory-8180-thread-1-processing-n:127.0.0.1:42764_solr) [n:127.0.0.1:42764_solr    ] o.a.s.c.c.ZkConfigManager Copying zk node /configs/_default/protwords.txt to /configs/allReplicasInLIR.AUTOCREATED/protwords.txt
   [junit4]   2> 2397835 INFO  (OverseerThreadFactory-8180-thread-1-processing-n:127.0.0.1:42764_solr) [n:127.0.0.1:42764_solr    ] o.a.s.c.c.ZkConfigManager Copying zk node /configs/_default/solrconfig.xml to /configs/allReplicasInLIR.AUTOCREATED/solrconfig.xml
   [junit4]   2> 2397837 INFO  (OverseerThreadFactory-8180-thread-1-processing-n:127.0.0.1:42764_solr) [n:127.0.0.1:42764_solr    ] o.a.s.c.c.ZkConfigManager Copying zk node /configs/_default/synonyms.txt to /configs/allReplicasInLIR.AUTOCREATED/synonyms.txt
   [junit4]   2> 2397839 INFO  (OverseerThreadFactory-8180-thread-1-processing-n:127.0.0.1:42764_solr) [n:127.0.0.1:42764_solr    ] o.a.s.c.c.ZkConfigManager Copying zk node /configs/_default/stopwords.txt to /configs/allReplicasInLIR.AUTOCREATED/stopwords.txt
   [junit4]   2> 2397841 INFO  (OverseerThreadFactory-8180-thread-1-processing-n:127.0.0.1:42764_solr) [n:127.0.0.1:42764_solr    ] o.a.s.c.c.ZkConfigManager Copying zk node /configs/_default/lang/contractions_it.txt to /configs/allReplicasInLIR.AUTOCREATED/lang/contractions_it.txt
   [junit4]   2> 2397843 INFO  (OverseerThreadFactory-8180-thread-1-processing-n:127.0.0.1:42764_solr) [n:127.0.0.1:42764_solr    ] o.a.s.c.c.ZkConfigManager Copying zk node /configs/_default/lang/contractions_ca.txt to /configs/allReplicasInLIR.AUTOCREATED/lang/contractions_ca.txt
   [junit4]   2> 2397845 INFO  (OverseerThreadFactory-8180-thread-1-processing-n:127.0.0.1:42764_solr) [n:127.0.0.1:42764_solr    ] o.a.s.c.c.ZkConfigManager Copying zk node /configs/_default/lang/stemdict_nl.txt to /configs/allReplicasInLIR.AUTOCREATED/lang/stemdict_nl.txt
   [junit4]   2> 2397846 INFO  (OverseerThreadFactory-8180-thread-1-processing-n:127.0.0.1:42764_solr) [n:127.0.0.1:42764_solr    ] o.a.s.c.c.ZkConfigManager Copying zk node /configs/_default/lang/stopwords_no.txt to /configs/allReplicasInLIR.AUTOCREATED/lang/stopwords_no.txt
   [junit4]   2> 2397848 INFO  (OverseerThreadFactory-8180-thread-1-processing-n:127.0.0.1:42764_solr) [n:127.0.0.1:42764_solr    ] o.a.s.c.c.ZkConfigManager Copying zk node /configs/_default/lang/stopwords_hy.txt to /configs/allReplicasInLIR.AUTOCREATED/lang/stopwords_hy.txt
   [junit4]   2> 2397850 INFO  (OverseerThreadFactory-8180-thread-1-processing-n:127.0.0.1:42764_solr) [n:127.0.0.1:42764_solr    ] o.a.s.c.c.ZkConfigManager Copying zk node /configs/_default/lang/stopwords_id.txt to /configs/allReplicasInLIR.AUTOCREATED/lang/stopwords_id.txt
   [junit4]   2> 2397851 INFO  (OverseerThreadFactory-8180-thread-1-processing-n:127.0.0.1:42764_solr) [n:127.0.0.1:42764_solr    ] o.a.s.c.c.ZkConfigManager Copying zk node /configs/_default/lang/stopwords_hi.txt to /configs/allReplicasInLIR.AUTOCREATED/lang/stopwords_hi.txt
   [junit4]   2> 2397853 INFO  (OverseerThreadFactory-8180-thread-1-processing-n:127.0.0.1:42764_solr) [n:127.0.0.1:42764_solr    ] o.a.s.c.c.ZkConfigManager Copying zk node /configs/_default/lang/stopwords_ga.txt to /configs/allReplicasInLIR.AUTOCREATED/lang/stopwords_ga.txt
   [junit4]   2> 2397855 INFO  (OverseerThreadFactory-8180-thread-1-processing-n:127.0.0.1:42764_solr) [n:127.0.0.1:42764_solr    ] o.a.s.c.c.ZkConfigManager Copying zk node /configs/_default/lang/stopwords_da.txt to /configs/allReplicasInLIR.AUTOCREATED/lang/stopwords_da.txt
   [junit4]   2> 2397857 INFO  (OverseerThreadFactory-8180-thread-1-processing-n:127.0.0.1:42764_solr) [n:127.0.0.1:42764_solr    ] o.a.s.c.c.ZkConfigManager Copying zk node /configs/_default/lang/stopwords_ja.txt to /configs/allReplicasInLIR.AUTOCREATED/lang/stopwords_ja.txt
   [junit4]   2> 2397859 INFO  (OverseerThreadFactory-8180-thread-1-processing-n:127.0.0.1:42764_solr) [n:127.0.0.1:42764_solr    ] o.a.s.c.c.ZkConfigManager Copying zk node /configs/_default/lang/stopwords_pt.txt to /configs/allReplicasInLIR.AUTOCREATED/lang/stopwords_pt.txt
   [junit4]   2> 2397861 INFO  (OverseerThreadFactory-8180-thread-1-processing-n:127.0.0.1:42764_solr) [n:127.0.0.1:42764_solr    ] o.a.s.c.c.ZkConfigManager Copying zk node /configs/_default/lang/stopwords_hu.txt to /configs/allReplicasInLIR.AUTOCREATED/lang/stopwords_hu.txt
   [junit4]   2> 2397862 INFO  (OverseerThreadFactory-8180-thread-1-processing-n:127.0.0.1:42764_solr) [n:127.0.0.1:42764_solr    ] o.a.s.c.c.ZkConfigManager Copying zk node /configs/_default/lang/stopwords_el.txt to /configs/allReplicasInLIR.AUTOCREATED/lang/stopwords_el.txt
   [junit4]   2> 2397864 INFO  (OverseerThreadFactory-8180-thread-1-processing-n:127.0.0.1:42764_solr) [n:127.0.0.1:42764_solr    ] o.a.s.c.c.ZkConfigManager Copying zk node /configs/_default/lang/stopwords_ru.txt to /configs/allReplicasInLIR.AUTOCREATED/lang/stopwords_ru.txt
   [junit4]   2> 2397866 INFO  (OverseerThreadFactory-8180-thread-1-processing-n:127.0.0.1:42764_solr) [n:127.0.0.1:42764_solr    ] o.a.s.c.c.ZkConfigManager Copying zk node /configs/_default/lang/stopwords_tr.txt to /configs/allReplicasInLIR.AUTOCREATED/lang/stopwords_tr.txt
   [junit4]   2> 2397867 INFO  (OverseerThreadFactory-8180-thread-1-processing-n:127.0.0.1:42764_solr) [n:127.0.0.1:42764_solr    ] o.a.s.c.c.ZkConfigManager Copying zk node /configs/_default/lang/stopwords_ar.txt to /configs/allReplicasInLIR.AUTOCREATED/lang/stopwords_ar.txt
   [junit4]   2> 2397869 INFO  (OverseerThreadFactory-8180-thread-1-processing-n:127.0.0.1:42764_solr) [n:127.0.0.1:42764_solr    ] o.a.s.c.c.ZkConfigManager Copying zk node /configs/_default/lang/userdict_ja.txt to /configs/allReplicasInLIR.AUTOCREATED/lang/userdict_ja.txt
   [junit4]   2> 2397871 INFO  (OverseerThreadFactory-8180-thread-1-processing-n:127.0.0.1:42764_solr) [n:127.0.0.1:42764_solr    ] o.a.s.c.c.ZkConfigManager Copying zk node /configs/_default/lang/stopwords_eu.txt to /configs/allReplicasInLIR.AUTOCREATED/lang/stopwords_eu.txt
   [junit4]   2> 2397873 INFO  (OverseerThreadFactory-8180-thread-1-processing-n:127.0.0.1:42764_solr) [n:127.0.0.1:42764_solr    ] o.a.s.c.c.ZkConfigManager Copying zk node /configs/_default/lang/stopwords_it.txt to /configs/allReplicasInLIR.AUTOCREATED/lang/stopwords_it.txt
   [junit4]   2> 2397874 INFO  (OverseerThreadFactory-8180-thread-1-processing-n:127.0.0.1:42764_solr) [n:127.0.0.1:42764_solr    ] o.a.s.c.c.ZkConfigManager Copying zk node /configs/_default/lang/stopwords_cz.txt to /configs/allReplicasInLIR.AUTOCREATED/lang/stopwords_cz.txt
   [junit4]   2> 2397876 INFO  (OverseerThreadFactory-8180-thread-1-processing-n:127.0.0.1:42764_solr) [n:127.0.0.1:42764_solr    ] o.a.s.c.c.ZkConfigManager Copying zk node /configs/_default/lang/stoptags_ja.txt to /configs/allReplicasInLIR.AUTOCREATED/lang/stoptags_ja.txt
   [junit4]   2> 2397878 INFO  (OverseerThreadFactory-8180-thread-1-processing-n:127.0.0.1:42764_solr) [n:127.0.0.1:42764_solr    ] o.a.s.c.c.ZkConfigManager Copying zk node /configs/_default/lang/contractions_fr.txt to /configs/allReplicasInLIR.AUTOCREATED/lang/contractions_fr.txt
   [junit4]   2> 2397879 INFO  (OverseerThreadFactory-8180-thread-1-processing-n:127.0.0.1:42764_solr) [n:127.0.0.1:42764_solr    ] o.a.s.c.c.ZkConfigManager Copying zk node /configs/_default/lang/stopwords_de.txt to /configs/allReplicasInLIR.AUTOCREATED/lang/stopwords_de.txt
   [junit4]   2> 2397881 INFO  (OverseerThreadFactory-8180-thread-1-processing-n:127.0.0.1:42764_solr) [n:127.0.0.1:42764_solr    ] o.a.s.c.c.ZkConfigManager Copying zk node /configs/_default/lang/stopwords_fa.txt to /configs/allReplicasInLIR.AUTOCREATED/lang/stopwords_fa.txt
   [junit4]   2> 2397882 INFO  (OverseerThreadFactory-8180-thread-1-processing-n:127.0.0.1:42764_solr) [n:127.0.0.1:42764_solr    ] o.a.s.c.c.ZkConfigManager Copying zk node /configs/_default/lang/contractions_ga.txt to /configs/allReplicasInLIR.AUTOCREATED/lang/contractions_ga.txt
   [junit4]   2> 2397884 INFO  (OverseerThreadFactory-8180-thread-1-processing-n:127.0.0.1:42764_solr) [n:127.0.0.1:42764_solr    ] o.a.s.c.c.ZkConfigManager Copying zk node /configs/_default/lang/stopwords_ca.txt to /configs/allReplicasInLIR.AUTOCREATED/lang/stopwords_ca.txt
   [junit4]   2> 2397886 INFO  (OverseerThreadFactory-8180-thread-1-processing-n:127.0.0.1:42764_solr) [n:127.0.0.1:42764_solr    ] o.a.s.c.c.ZkConfigManager Copying zk node /configs/_default/lang/stopwords_nl.txt to /configs/allReplicasInLIR.AUTOCREATED/lang/stopwords_nl.txt
   [junit4]   2> 2397887 INFO  (OverseerThreadFactory-8180-thread-1-processing-n:127.0.0.1:42764_solr) [n:127.0.0.1:42764_solr    ] o.a.s.c.c.ZkConfigManager Copying zk node /configs/_default/lang/stopwords_bg.txt to /configs/allReplicasInLIR.AUTOCREATED/lang/stopwords_bg.txt
   [junit4]   2> 2397889 INFO  (OverseerThreadFactory-8180-thread-1-processing-n:127.0.0.1:42764_solr) [n:127.0.0.1:42764_solr    ] o.a.s.c.c.ZkConfigManager Copying zk node /configs/_default/lang/stopwords_en.txt to /configs/allReplicasInLIR.AUTOCREATED/lang/stopwords_en.txt
   [junit4]   2> 2397892 INFO  (OverseerThreadFactory-8180-thread-1-processing-n:127.0.0.1:42764_solr) [n:127.0.0.1:42764_solr    ] o.a.s.c.c.ZkConfigManager Copying zk node /configs/_default/lang/stopwords_es.txt to /configs/allReplicasInLIR.AUTOCREATED/lang/stopwords_es.txt
   [junit4]   2> 2397894 INFO  (OverseerThreadFactory-8180-thread-1-processing-n:127.0.0.1:42764_solr) [n:127.0.0.1:42764_solr    ] o.a.s.c.c.ZkConfigManager Copying zk node /configs/_default/lang/stopwords_lv.txt to /configs/allReplicasInLIR.AUTOCREATED/lang/stopwords_lv.txt
   [junit4]   2> 2397895 INFO  (OverseerThreadFactory-8180-thread-1-processing-n:127.0.0.1:42764_solr) [n:127.0.0.1:42764_solr    ] o.a.s.c.c.ZkConfigManager Copying zk node /configs/_default/lang/stopwords_ro.txt to /configs/allReplicasInLIR.AUTOCREATED/lang/stopwords_ro.txt
   [junit4]   2> 2397898 INFO  (OverseerThreadFactory-8180-thread-1-processing-n:127.0.0.1:42764_solr) [n:127.0.0.1:42764_solr    ] o.a.s.c.c.ZkConfigManager Copying zk node /configs/_default/lang/stopwords_th.txt to /configs/allReplicasInLIR.AUTOCREATED/lang/stopwords_th.txt
   [junit4]   2> 2397899 INFO  (OverseerThreadFactory-8180-thread-1-processing-n:127.0.0.1:42764_solr) [n:127.0.0.1:42764_solr    ] o.a.s.c.c.ZkConfigManager Copying zk node /configs/_default/lang/stopwords_fr.txt to /configs/allReplicasInLIR.AUTOCREATED/lang/stopwords_fr.txt
   [junit4]   2> 2397901 INFO  (OverseerThreadFactory-8180-thread-1-processing-n:127.0.0.1:42764_solr) [n:127.0.0.1:42764_solr    ] o.a.s.c.c.ZkConfigManager Copying zk node /configs/_default/lang/stopwords_sv.txt to /configs/allReplicasInLIR.AUTOCREATED/lang/stopwords_sv.txt
   [junit4]   2> 2397903 INFO  (OverseerThreadFactory-8180-thread-1-processing-n:127.0.0.1:42764_solr) [n:127.0.0.1:42764_solr    ] o.a.s.c.c.ZkConfigManager Copying zk node /configs/_default/lang/stopwords_fi.txt to /configs/allReplicasInLIR.AUTOCREATED/lang/stopwords_fi.txt
   [junit4]   2> 2397904 INFO  (OverseerThreadFactory-8180-thread-1-processing-n:127.0.0.1:42764_solr) [n:127.0.0.1:42764_solr    ] o.a.s.c.c.ZkConfigManager Copying zk node /configs/_default/lang/hyphenations_ga.txt to /configs/allReplicasInLIR.AUTOCREATED/lang/hyphenations_ga.txt
   [junit4]   2> 2397906 INFO  (OverseerThreadFactory-8180-thread-1-processing-n:127.0.0.1:42764_solr) [n:127.0.0.1:42764_solr    ] o.a.s.c.c.ZkConfigManager Copying zk node /configs/_default/lang/stopwords_gl.txt to /configs/allReplicasInLIR.AUTOCREATED/lang/stopwords_gl.txt
   [junit4]   2> 2397908 INFO  (OverseerThreadFactory-8180-thread-1-processing-n:127.0.0.1:42764_solr) [n:127.0.0.1:42764_solr    ] o.a.s.c.c.ZkConfigManager Copying zk node /configs/_default/params.json to /configs/allReplicasInLIR.AUTOCREATED/params.json
   [junit4]   2> 2398019 INFO  (qtp573306819-36760) [n:127.0.0.1:42764_solr    ] o.a.s.s.HttpSolrCall [admin] webapp=null path=/admin/metrics params={prefix=CONTAINER.fs.usableSpace,CONTAINER.fs.totalSpace,CORE.coreName&wt=javabin&version=2&group=solr.node,solr.core} status=0 QTime=0
   [junit4]   2> 2398020 INFO  (qtp573306819-36762) [n:127.0.0.1:42764_solr    ] o.a.s.s.HttpSolrCall [admin] webapp=null path=/admin/metrics params={prefix=CONTAINER.fs.usableSpace,CONTAINER.fs.totalSpace,CORE.coreName&wt=javabin&version=2&group=solr.node,solr.core} status=0 QTime=0
   [junit4]   2> 2398021 INFO  (qtp573306819-36764) [n:127.0.0.1:42764_solr    ] o.a.s.s.HttpSolrCall [admin] webapp=null path=/admin/metrics params={prefix=CONTAINER.fs.usableSpace,CONTAINER.fs.totalSpace,CORE.coreName&wt=javabin&version=2&group=solr.node,solr.core} status=0 QTime=0
   [junit4]   2> 2398022 INFO  (qtp573306819-36766) [n:127.0.0.1:42764_solr    ] o.a.s.s.HttpSolrCall [admin] webapp=null path=/admin/metrics params={prefix=CONTAINER.fs.usableSpace,CONTAINER.fs.totalSpace,CORE.coreName&wt=javabin&version=2&group=solr.node,solr.core} status=0 QTime=0
   [junit4]   2> 2398023 INFO  (qtp573306819-36760) [n:127.0.0.1:42764_solr    ] o.a.s.s.HttpSolrCall [admin] webapp=null path=/admin/metrics params={prefix=CONTAINER.fs.usableSpace,CONTAINER.fs.totalSpace,CORE.coreName&wt=javabin&version=2&group=solr.node,solr.core} status=0 QTime=0
   [junit4]   2> 2398039 INFO  (qtp1690783789-36748) [n:127.0.0.1:44504_solr    ] o.a.s.s.HttpSolrCall [admin] webapp=null path=/admin/metrics params={prefix=CONTAINER.fs.usableSpace,CONTAINER.fs.totalSpace,CORE.coreName&wt=javabin&version=2&group=solr.node,solr.core} status=0 QTime=0
   [junit4]   2> 2398039 INFO  (qtp1690783789-36744) [n:127.0.0.1:44504_solr    ] o.a.s.s.HttpSolrCall [admin] webapp=null path=/admin/metrics params={prefix=CONTAINER.fs.usableSpace,CONTAINER.fs.totalSpace,CORE.coreName&wt=javabin&version=2&group=solr.node,solr.core} status=0 QTime=0
   [junit4]   2> 2398040 INFO  (qtp1690783789-36745) [n:127.0.0.1:44504_solr    ] o.a.s.s.HttpSolrCall [admin] webapp=null path=/admin/metrics params={prefix=CONTAINER.fs.usableSpace,CONTAINER.fs.totalSpace,CORE.coreName&wt=javabin&version=2&group=solr.node,solr.core} status=0 QTime=0
   [junit4]   2> 2398041 INFO  (qtp1690783789-36746) [n:127.0.0.1:44504_solr    ] o.a.s.s.HttpSolrCall [admin] webapp=null path=/admin/metrics params={prefix=CONTAINER.fs.usableSpace,CONTAINER.fs.totalSpace,CORE.coreName&wt=javabin&version=2&group=solr.node,solr.core} status=0 QTime=0
   [junit4]   2> 2398042 INFO  (qtp1690783789-36747) [n:127.0.0.1:44504_solr    ] o.a.s.s.HttpSolrCall [admin] webapp=null path=/admin/metrics params={prefix=CONTAINER.fs.usableSpace,CONTAINER.fs.totalSpace,CORE.coreName&wt=javabin&version=2&group=solr.node,solr.core} status=0 QTime=0
   [junit4]   2> 2398054 INFO  (qtp2018269168-36757) [n:127.0.0.1:37812_solr    ] o.a.s.s.HttpSolrCall [admin] webapp=null path=/admin/metrics params={prefix=CONTAINER.fs.usableSpace,CONTAINER.fs.totalSpace,CORE.coreName&wt=javabin&version=2&group=solr.node,solr.core} status=0 QTime=0
   [junit4]   2> 2398055 INFO  (qtp2018269168-36754) [n:127.0.0.1:37812_solr    ] o.a.s.s.HttpSolrCall [admin] webapp=null path=/admin/metrics params={prefix=CONTAINER.fs.usableSpace,CONTAINER.fs.totalSpace,CORE.coreName&wt=javabin&version=2&group=solr.node,solr.core} status=0 QTime=0
   [junit4]   2> 2398057 INFO  (qtp2018269168-36753) [n:127.0.0.1:37812_solr    ] o.a.s.s.HttpSolrCall [admin] webapp=null path=/admin/metrics params={prefix=CONTAINER.fs.usableSpace,CONTAINER.fs.totalSpace,CORE.coreName&wt=javabin&version=2&group=solr.node,solr.core} status=0 QTime=0
   [junit4]   2> 2398058 INFO  (qtp2018269168-36755) [n:127.0.0.1:37812_solr    ] o.a.s.s.HttpSolrCall [admin] webapp=null path=/admin/metrics params={prefix=CONTAINER.fs.usableSpace,CONTAINER.fs.totalSpace,CORE.coreName&wt=javabin&version=2&group=solr.node,solr.core} status=0 QTime=0
   [junit4]   2> 2398059 INFO  (qtp2018269168-36756) [n:127.0.0.1:37812_solr    ] o.a.s.s.HttpSolrCall [admin] webapp=null path=/admin/metrics params={prefix=CONTAINER.fs.usableSpace,CONTAINER.fs.totalSpace,CORE.coreName&wt=javabin&version=2&group=solr.node,solr.core} status=0 QTime=0
   [junit4]   2> 2398066 INFO  (OverseerStateUpdate-72751571333349385-127.0.0.1:42764_solr-n_0000000000) [n:127.0.0.1:42764_solr    ] o.a.s.c.o.SliceMutator createReplica() {
   [junit4]   2>   "operation":"ADDREPLICA",
   [junit4]   2>   "collection":"allReplicasInLIR",
   [junit4]   2>   "shard":"shard1",
   [junit4]   2>   "core":"allReplicasInLIR_shard1_replica_n1",
   [junit4]   2>   "state":"down",
   [junit4]   2>   "base_url":"https://127.0.0.1:37812/solr",
   [junit4]   2>   "type":"NRT",
   [junit4]   2>   "waitForFinalState":"false"} 
   [junit4]   2> 2398069 INFO  (OverseerStateUpdate-72751571333349385-127.0.0.1:42764_solr-n_0000000000) [n:127.0.0.1:42764_solr    ] o.a.s.c.o.SliceMutator createReplica() {
   [junit4]   2>   "operation":"ADDREPLICA",
   [junit4]   2>   "collection":"allReplicasInLIR",
   [junit4]   2>   "shard":"shard1",
   [junit4]   2>   "core":"allReplicasInLIR_shard1_replica_n2",
   [junit4]   2>   "state":"down",
   [junit4]   2>   "base_url":"https://127.0.0.1:44504/solr",
   [junit4]   2>   "type":"NRT",
   [junit4]   2>   "waitForFinalState":"false"} 
   [junit4]   2> 2398073 INFO  (OverseerStateUpdate-72751571333349385-127.0.0.1:42764_solr-n_0000000000) [n:127.0.0.1:42764_solr    ] o.a.s.c.o.SliceMutator createReplica() {
   [junit4]   2>   "operation":"ADDREPLICA",
   [junit4]   2>   "collection":"allReplicasInLIR",
   [junit4]   2>   "shard":"shard1",
   [junit4]   2>   "core":"allReplicasInLIR_shard1_replica_n4",
   [junit4]   2>   "state":"down",
   [junit4]   2>   "base_url":"https://127.0.0.1:42764/solr",
   [junit4]   2>   "type":"NRT",
   [junit4]   2>   "waitForFinalState":"false"} 
   [junit4]   2> 2398282 INFO  (qtp1690783789-36748) [n:127.0.0.1:44504_solr    x:allReplicasInLIR_shard1_replica_n2] o.a.s.h.a.CoreAdminOperation core create command qt=/admin/cores&coreNodeName=core_node5&collection.configName=allReplicasInLIR.AUTOCREATED&newCollection=true&name=allReplicasInLIR_shard1_replica_n2&action=CREATE&numShards=1&collection=allReplicasInLIR&shard=shard1&wt=javabin&version=2&replicaType=NRT
   [junit4]   2> 2398282 INFO  (qtp573306819-36762) [n:127.0.0.1:42764_solr    x:allReplicasInLIR_shard1_replica_n4] o.a.s.h.a.CoreAdminOperation core create command qt=/admin/cores&coreNodeName=core_node6&collection.configName=allReplicasInLIR.AUTOCREATED&newCollection=true&name=allReplicasInLIR_shard1_replica_n4&action=CREATE&numShards=1&collection=allReplicasInLIR&shard=shard1&wt=javabin&version=2&replicaType=NRT
   [junit4]   2> 2398282 INFO  (qtp1690783789-36748) [n:127.0.0.1:44504_solr    x:allReplicasInLIR_shard1_replica_n2] o.a.s.c.TransientSolrCoreCacheDefault Allocating transient cache for 2147483647 transient cores
   [junit4]   2> 2398291 INFO  (qtp2018269168-36757) [n:127.0.0.1:37812_solr    x:allReplicasInLIR_shard1_replica_n1] o.a.s.h.a.CoreAdminOperation core create command qt=/admin/cores&coreNodeName=core_node3&collection.configName=allReplicasInLIR.AUTOCREATED&newCollection=true&name=allReplicasInLIR_shard1_replica_n1&action=CREATE&numShards=1&collection=allReplicasInLIR&shard=shard1&wt=javabin&version=2&replicaType=NRT
   [junit4]   2> 2399299 INFO  (qtp1690783789-36748) [n:127.0.0.1:44504_solr c:allReplicasInLIR s:shard1 r:core_node5 x:allReplicasInLIR_shard1_replica_n2] o.a.s.c.RequestParams conf resource params.json loaded . version : 0 
   [junit4]   2> 2399299 INFO  (qtp573306819-36762) [n:127.0.0.1:42764_solr c:allReplicasInLIR s:shard1 r:core_node6 x:allReplicasInLIR_shard1_replica_n4] o.a.s.c.RequestParams conf resource params.json loaded . version : 0 
   [junit4]   2> 2399299 INFO  (qtp1690783789-36748) [n:127.0.0.1:44504_solr c:allReplicasInLIR s:shard1 r:core_node5 x:allReplicasInLIR_shard1_replica_n2] o.a.s.c.RequestParams request params refreshed to version 0
   [junit4]   2> 2399299 INFO  (qtp573306819-36762) [n:127.0.0.1:42764_solr c:allReplicasInLIR s:shard1 r:core_node6 x:allReplicasInLIR_shard1_replica_n4] o.a.s.c.RequestParams request params refreshed to version 0
   [junit4]   2> 2399299 WARN  (qtp1690783789-36748) [n:127.0.0.1:44504_solr c:allReplicasInLIR s:shard1 r:core_node5 x:allReplicasInLIR_shard1_replica_n2] o.a.s.c.SolrConfig Couldn't add files from /x1/jenkins/jenkins-slave/workspace/Lucene-Solr-NightlyTests-7.7/checkout/solr/build/solr-core/test/J0/temp/solr.cloud.LIROnShardRestartTest_D1072771A351DC8D-001/tempDir-001/node3/allReplicasInLIR_shard1_replica_n2/../../../../contrib/extraction/lib filtered by .*\.jar to classpath: /x1/jenkins/jenkins-slave/workspace/Lucene-Solr-NightlyTests-7.7/checkout/solr/build/solr-core/test/J0/temp/solr.cloud.LIROnShardRestartTest_D1072771A351DC8D-001/tempDir-001/node3/allReplicasInLIR_shard1_replica_n2/../../../../contrib/extraction/lib
   [junit4]   2> 2399300 WARN  (qtp573306819-36762) [n:127.0.0.1:42764_solr c:allReplicasInLIR s:shard1 r:core_node6 x:allReplicasInLIR_shard1_replica_n4] o.a.s.c.SolrConfig Couldn't add files from /x1/jenkins/jenkins-slave/workspace/Lucene-Solr-NightlyTests-7.7/checkout/solr/build/solr-core/test/J0/temp/solr.cloud.LIROnShardRestartTest_D1072771A351DC8D-001/tempDir-001/node1/allReplicasInLIR_shard1_replica_n4/../../../../contrib/extraction/lib filtered by .*\.jar to classpath: /x1/jenkins/jenkins-slave/workspace/Lucene-Solr-NightlyTests-7.7/checkout/solr/build/solr-core/test/J0/temp/solr.cloud.LIROnShardRestartTest_D1072771A351DC8D-001/tempDir-001/node1/allReplicasInLIR_shard1_replica_n4/../../../../contrib/extraction/lib
   [junit4]   2> 2399301 WARN  (qtp1690783789-36748) [n:127.0.0.1:44504_solr c:allReplicasInLIR s:shard1 r:core_node5 x:allReplicasInLIR_shard1_replica_n2] o.a.s.c.SolrConfig Couldn't add files from /x1/jenkins/jenkins-slave/workspace/Lucene-Solr-NightlyTests-7.7/checkout/solr/build/solr-core/test/J0/temp/solr.cloud.LIROnShardRestartTest_D1072771A351DC8D-001/tempDir-001/node3/allReplicasInLIR_shard1_replica_n2/../../../../dist filtered by solr-cell-\d.*\.jar to classpath: /x1/jenkins/jenkins-slave/workspace/Lucene-Solr-NightlyTests-7.7/checkout/solr/build/solr-core/test/J0/temp/solr.cloud.LIROnShardRestartTest_D1072771A351DC8D-001/tempDir-001/node3/allReplicasInLIR_shard1_replica_n2/../../../../dist
   [junit4]   2> 2399301 WARN  (qtp573306819-36762) [n:127.0.0.1:42764_solr c:allReplicasInLIR s:shard1 r:core_node6 x:allReplicasInLIR_shard1_replica_n4] o.a.s.c.SolrConfig Couldn't add files from /x1/jenkins/jenkins-slave/workspace/Lucene-Solr-NightlyTests-7.7/checkout/solr/build/solr-core/test/J0/temp/solr.cloud.LIROnShardRestartTest_D1072771A351DC8D-001/tempDir-001/node1/allReplicasInLIR_shard1_replica_n4/../../../../dist filtered by solr-cell-\d.*\.jar to classpath: /x1/jenkins/jenkins-slave/workspace/Lucene-Solr-NightlyTests-7.7/checkout/solr/build/solr-core/test/J0/temp/solr.cloud.LIROnShardRestartTest_D1072771A351DC8D-001/tempDir-001/node1/allReplicasInLIR_shard1_replica_n4/../../../../dist
   [junit4]   2> 2399301 WARN  (qtp1690783789-36748) [n:127.0.0.1:44504_solr c:allReplicasInLIR s:shard1 r:core_node5 x:allReplicasInLIR_shard1_replica_n2] o.a.s.c.SolrConfig Couldn't add files from /x1/jenkins/jenkins-slave/workspace/Lucene-Solr-NightlyTests-7.7/checkout/solr/build/solr-core/test/J0/temp/solr.cloud.LIROnShardRestartTest_D1072771A351DC8D-001/tempDir-001/node3/allReplicasInLIR_shard1_replica_n2/../../../../contrib/clustering/lib filtered by .*\.jar to classpath: /x1/jenkins/jenkins-slave/workspace/Lucene-Solr-NightlyTests-7.7/checkout/solr/build/solr-core/test/J0/temp/solr.cloud.LIROnShardRestartTest_D1072771A351DC8D-001/tempDir-001/node3/allReplicasInLIR_shard1_replica_n2/../../../../contrib/clustering/lib
   [junit4]   2> 2399301 WARN  (qtp573306819-36762) [n:127.0.0.1:42764_solr c:allReplicasInLIR s:shard1 r:core_node6 x:allReplicasInLIR_shard1_replica_n4] o.a.s.c.SolrConfig Couldn't add files from /x1/jenkins/jenkins-slave/workspace/Lucene-Solr-NightlyTests-7.7/checkout/solr/build/solr-core/test/J0/temp/solr.cloud.LIROnShardRestartTest_D1072771A351DC8D-001/tempDir-001/node1/allReplicasInLIR_shard1_replica_n4/../../../../contrib/clustering/lib filtered by .*\.jar to classpath: /x1/jenkins/jenkins-slave/workspace/Lucene-Solr-NightlyTests-7.7/checkout/solr/build/solr-core/test/J0/temp/solr.cloud.LIROnShardRestartTest_D1072771A351DC8D-001/tempDir-001/node1/allReplicasInLIR_shard1_replica_n4/../../../../contrib/clustering/lib
   [junit4]   2> 2399301 WARN  (qtp1690783789-36748) [n:127.0.0.1:44504_solr c:allReplicasInLIR s:shard1 r:core_node5 x:allReplicasInLIR_shard1_replica_n2] o.a.s.c.SolrConfig Couldn't add files from /x1/jenkins/jenkins-slave/workspace/Lucene-Solr-NightlyTests-7.7/checkout/solr/build/solr-core/test/J0/temp/solr.cloud.LIROnShardRestartTest_D1072771A351DC8D-001/tempDir-001/node3/allReplicasInLIR_shard1_replica_n2/../../../../dist filtered by solr-clustering-\d.*\.jar to classpath: /x1/jenkins/jenkins-slave/workspace/Lucene-Solr-NightlyTests-7.7/checkout/solr/build/solr-core/test/J0/temp/solr.cloud.LIROnShardRestartTest_D1072771A351DC8D-001/tempDir-001/node3/allReplicasInLIR_shard1_replica_n2/../../../../dist
   [junit4]   2> 2399301 WARN  (qtp573306819-36762) [n:127.0.0.1:42764_solr c:allReplicasInLIR s:shard1 r:core_node6 x:allReplicasInLIR_shard1_replica_n4] o.a.s.c.SolrConfig Couldn't add files from /x1/jenkins/jenkins-slave/workspace/Lucene-Solr-NightlyTests-7.7/checkout/solr/build/solr-core/test/J0/temp/solr.cloud.LIROnShardRestartTest_D1072771A351DC8D-001/tempDir-001/node1/allReplicasInLIR_shard1_replica_n4/../../../../dist filtered by solr-clustering-\d.*\.jar to classpath: /x1/jenkins/jenkins-slave/workspace/Lucene-Solr-NightlyTests-7.7/checkout/solr/build/solr-core/test/J0/temp/solr.cloud.LIROnShardRestartTest_D1072771A351DC8D-001/tempDir-001/node1/allReplicasInLIR_shard1_replica_n4/../../../../dist
   [junit4]   2> 2399301 WARN  (qtp1690783789-36748) [n:127.0.0.1:44504_solr c:allReplicasInLIR s:shard1 r:core_node5 x:allReplicasInLIR_shard1_replica_n2] o.a.s.c.SolrConfig Couldn't add files from /x1/jenkins/jenkins-slave/workspace/Lucene-Solr-NightlyTests-7.7/checkout/solr/build/solr-core/test/J0/temp/solr.cloud.LIROnShardRestartTest_D1072771A351DC8D-001/tempDir-001/node3/allReplicasInLIR_shard1_replica_n2/../../../../contrib/langid/lib filtered by .*\.jar to classpath: /x1/jenkins/jenkins-slave/workspace/Lucene-Solr-NightlyTests-7.7/checkout/solr/build/solr-core/test/J0/temp/solr.cloud.LIROnShardRestartTest_D1072771A351DC8D-001/tempDir-001/node3/allReplicasInLIR_shard1_replica_n2/../../../../contrib/langid/lib
   [junit4]   2> 2399302 WARN  (qtp573306819-36762) [n:127.0.0.1:42764_solr c:allReplicasInLIR s:shard1 r:core_node6 x:allReplicasInLIR_shard1_replica_n4] o.a.s.c.SolrConfig Couldn't add files from /x1/jenkins/jenkins-slave/workspace/Lucene-Solr-NightlyTests-7.7/checkout/solr/build/solr-core/test/J0/temp/solr.cloud.LIROnShardRestartTest_D1072771A351DC8D-001/tempDir-001/node1/allReplicasInLIR_shard1_replica_n4/../../../../contrib/langid/lib filtered by .*\.jar to classpath: /x1/jenkins/jenkins-slave/workspace/Lucene-Solr-NightlyTests-7.7/checkout/solr/build/solr-core/test/J0/temp/solr.cloud.LIROnShardRestartTest_D1072771A351DC8D-001/tempDir-001/node1/allReplicasInLIR_shard1_replica_n4/../../../../contrib/langid/lib
   [junit4]   2> 2399302 WARN  (qtp1690783789-36748) [n:127.0.0.1:44504_solr c:allReplicasInLIR s:shard1 r:core_node5 x:allReplicasInLIR_shard1_replica_n2] o.a.s.c.SolrConfig Couldn't add files from /x1/jenkins/jenkins-slave/workspace/Lucene-Solr-NightlyTests-7.7/checkout/solr/build/solr-core/test/J0/temp/solr.cloud.LIROnShardRestartTest_D1072771A351DC8D-001/tempDir-001/node3/allReplicasInLIR_shard1_replica_n2/../../../../dist filtered by solr-langid-\d.*\.jar to classpath: /x1/jenkins/jenkins-slave/workspace/Lucene-Solr-NightlyTests-7.7/checkout/solr/build/solr-core/test/J0/temp/solr.cloud.LIROnShardRestartTest_D1072771A351DC8D-001/tempDir-001/node3/allReplicasInLIR_shard1_replica_n2/../../../../dist
   [junit4]   2> 2399302 WARN  (qtp573306819-36762) [n:127.0.0.1:42764_solr c:allReplicasInLIR s:shard1 r:core_node6 x:allReplicasInLIR_shard1_replica_n4] o.a.s.c.SolrConfig Couldn't add files from /x1/jenkins/jenkins-slave/workspace/Lucene-Solr-NightlyTests-7.7/checkout/solr/build/solr-core/test/J0/temp/solr.cloud.LIROnShardRestartTest_D1072771A351DC8D-001/tempDir-001/node1/allReplicasInLIR_shard1_replica_n4/../../../../dist filtered by solr-langid-\d.*\.jar to classpath: /x1/jenkins/jenkins-slave/workspace/Lucene-Solr-NightlyTests-7.7/checkout/solr/build/solr-core/test/J0/temp/solr.cloud.LIROnShardRestartTest_D1072771A351DC8D-001/tempDir-001/node1/allReplicasInLIR_shard1_replica_n4/../../../../dist
   [junit4]   2> 2399302 WARN  (qtp1690783789-36748) [n:127.0.0.1:44504_solr c:allReplicasInLIR s:shard1 r:core_node5 x:allReplicasInLIR_shard1_replica_n2] o.a.s.c.SolrConfig Couldn't add files from /x1/jenkins/jenkins-slave/workspace/Lucene-Solr-NightlyTests-7.7/checkout/solr/build/solr-core/test/J0/temp/solr.cloud.LIROnShardRestartTest_D1072771A351DC8D-001/tempDir-001/node3/allReplicasInLIR_shard1_replica_n2/../../../../contrib/velocity/lib filtered by .*\.jar to classpath: /x1/jenkins/jenkins-slave/workspace/Lucene-Solr-NightlyTests-7.7/checkout/solr/build/solr-core/test/J0/temp/solr.cloud.LIROnShardRestartTest_D1072771A351DC8D-001/tempDir-001/node3/allReplicasInLIR_shard1_replica_n2/../../../../contrib/velocity/lib
   [junit4]   2> 2399302 WARN  (qtp573306819-36762) [n:127.0.0.1:42764_solr c:allReplicasInLIR s:shard1 r:core_node6 x:allReplicasInLIR_shard1_replica_n4] o.a.s.c.SolrConfig Couldn't add files from /x1/jenkins/jenkins-slave/workspace/Lucene-Solr-NightlyTests-7.7/checkout/solr/build/solr-core/test/J0/temp/solr.cloud.LIROnShardRestartTest_D1072771A351DC8D-001/tempDir-001/node1/allReplicasInLIR_shard1_replica_n4/../../../../contrib/velocity/lib filtered by .*\.jar to classpath: /x1/jenkins/jenkins-slave/workspace/Lucene-Solr-NightlyTests-7.7/checkout/solr/build/solr-core/test/J0/temp/solr.cloud.LIROnShardRestartTest_D1072771A351DC8D-001/tempDir-001/node1/allReplicasInLIR_shard1_replica_n4/../../../../contrib/velocity/lib
   [junit4]   2> 2399302 WARN  (qtp1690783789-36748) [n:127.0.0.1:44504_solr c:allReplicasInLIR s:shard1 r:core_node5 x:allReplicasInLIR_shard1_replica_n2] o.a.s.c.SolrConfig Couldn't add files from /x1/jenkins/jenkins-slave/workspace/Lucene-Solr-NightlyTests-7.7/checkout/solr/build/solr-core/test/J0/temp/solr.cloud.LIROnShardRestartTest_D1072771A351DC8D-001/tempDir-001/node3/allReplicasInLIR_shard1_replica_n2/../../../../dist filtered by solr-velocity-\d.*\.jar to classpath: /x1/jenkins/jenkins-slave/workspace/Lucene-Solr-NightlyTests-7.7/checkout/solr/build/solr-core/test/J0/temp/solr.cloud.LIROnShardRestartTest_D1072771A351DC8D-001/tempDir-001/node3/allReplicasInLIR_shard1_replica_n2/../../../../dist
   [junit4]   2> 2399302 WARN  (qtp573306819-36762) [n:127.0.0.1:42764_solr c:allReplicasInLIR s:shard1 r:core_node6 x:allReplicasInLIR_shard1_replica_n4] o.a.s.c.SolrConfig Couldn't add files from /x1/jenkins/jenkins-slave/workspace/Lucene-Solr-NightlyTests-7.7/checkout/solr/build/solr-core/test/J0/temp/solr.cloud.LIROnShardRestartTest_D1072771A351DC8D-001/tempDir-001/node1/allReplicasInLIR_shard1_replica_n4/../../../../dist filtered by solr-velocity-\d.*\.jar to classpath: /x1/jenkins/jenkins-slave/workspace/Lucene-Solr-NightlyTests-7.7/checkout/solr/build/solr-core/test/J0/temp/solr.cloud.LIROnShardRestartTest_D1072771A351DC8D-001/tempDir-001/node1/allReplicasInLIR_shard1_replica_n4/../../../../dist
   [junit4]   2> 2399313 INFO  (qtp1690783789-36748) [n:127.0.0.1:44504_solr c:allReplicasInLIR s:shard1 r:core_node5 x:allReplicasInLIR_shard1_replica_n2] o.a.s.c.SolrConfig Using Lucene MatchVersion: 7.7.0
   [junit4]   2> 2399316 INFO  (qtp2018269168-36757) [n:127.0.0.1:37812_solr c:allReplicasInLIR s:shard1 r:core_node3 x:allReplicasInLIR_shard1_replica_n1] o.a.s.c.RequestParams conf resource params.json loaded . version : 0 
   [junit4]   2> 2399316 INFO  (qtp2018269168-36757) [n:127.0.0.1:37812_solr c:allReplicasInLIR s:shard1 r:core_node3 x:allReplicasInLIR_shard1_replica_n1] o.a.s.c.RequestParams request params refreshed to version 0
   [junit4]   2> 2399317 INFO  (qtp573306819-36762) [n:127.0.0.1:42764_solr c:allReplicasInLIR s:shard1 r:core_node6 x:allReplicasInLIR_shard1_replica_n4] o.a.s.c.SolrConfig Using Lucene MatchVersion: 7.7.0
   [junit4]   2> 2399317 WARN  (qtp2018269168-36757) [n:127.0.0.1:37812_solr c:allReplicasInLIR s:shard1 r:core_node3 x:allReplicasInLIR_shard1_replica_n1] o.a.s.c.SolrConfig Couldn't add files from /x1/jenkins/jenkins-slave/workspace/Lucene-Solr-NightlyTests-7.7/checkout/solr/build/solr-core/test/J0/temp/solr.cloud.LIROnShardRestartTest_D1072771A351DC8D-001/tempDir-001/node2/allReplicasInLIR_shard1_replica_n1/../../../../contrib/extraction/lib filtered by .*\.jar to classpath: /x1/jenkins/jenkins-slave/workspace/Lucene-Solr-NightlyTests-7.7/checkout/solr/build/solr-core/test/J0/temp/solr.cloud.LIROnShardRestartTest_D1072771A351DC8D-001/tempDir-001/node2/allReplicasInLIR_shard1_replica_n1/../../../../contrib/extraction/lib
   [junit4]   2> 2399317 WARN  (qtp2018269168-36757) [n:127.0.0.1:37812_solr c:allReplicasInLIR s:shard1 r:core_node3 x:allReplicasInLIR_shard1_replica_n1] o.a.s.c.SolrConfig Couldn't add files from /x1/jenkins/jenkins-slave/workspace/Lucene-Solr-NightlyTests-7.7/checkout/solr/build/solr-core/test/J0/temp/solr.cloud.LIROnShardRestartTest_D1072771A351DC8D-001/tempDir-001/node2/allReplicasInLIR_shard1_replica_n1/../../../../dist filtered by solr-cell-\d.*\.jar to classpath: /x1/jenkins/jenkins-slave/workspace/Lucene-Solr-NightlyTests-7.7/checkout/solr/build/solr-core/test/J0/temp/solr.cloud.LIROnShardRestartTest_D1072771A351DC8D-001/tempDir-001/node2/allReplicasInLIR_shard1_replica_n1/../../../../dist
   [junit4]   2> 2399318 WARN  (qtp2018269168-36757) [n:127.0.0.1:37812_solr c:allReplicasInLIR s:shard1 r:core_node3 x:allReplicasInLIR_shard1_replica_n1] o.a.s.c.SolrConfig Couldn't add files from /x1/jenkins/jenkins-slave/workspace/Lucene-Solr-NightlyTests-7.7/checkout/solr/build/solr-core/test/J0/temp/solr.cloud.LIROnShardRestartTest_D1072771A351DC8D-001/tempDir-001/node2/allReplicasInLIR_shard1_replica_n1/../../../../contrib/clustering/lib filtered by .*\.jar to classpath: /x1/jenkins/jenkins-slave/workspace/Lucene-Solr-NightlyTests-7.7/checkout/solr/build/solr-core/test/J0/temp/solr.cloud.LIROnShardRestartTest_D1072771A351DC8D-001/tempDir-001/node2/allReplicasInLIR_shard1_replica_n1/../../../../contrib/clustering/lib
   [junit4]   2> 2399318 WARN  (qtp2018269168-36757) [n:127.0.0.1:37812_solr c:allReplicasInLIR s:shard1 r:core_node3 x:allReplicasInLIR_shard1_replica_n1] o.a.s.c.SolrConfig Couldn't add files from /x1/jenkins/jenkins-slave/workspace/Lucene-Solr-NightlyTests-7.7/checkout/solr/build/solr-core/test/J0/temp/solr.cloud.LIROnShardRestartTest_D1072771A351DC8D-001/tempDir-001/node2/allReplicasInLIR_shard1_replica_n1/../../../../dist filtered by solr-clustering-\d.*\.jar to classpath: /x1/jenkins/jenkins-slave/workspace/Lucene-Solr-NightlyTests-7.7/checkout/solr/build/solr-core/test/J0/temp/solr.cloud.LIROnShardRestartTest_D1072771A351DC8D-001/tempDir-001/node2/allReplicasInLIR_shard1_replica_n1/../../../../dist
   [junit4]   2> 2399318 WARN  (qtp2018269168-36757) [n:127.0.0.1:37812_solr c:allReplicasInLIR s:shard1 r:core_node3 x:allReplicasInLIR_shard1_replica_n1] o.a.s.c.SolrConfig Couldn't add files from /x1/jenkins/jenkins-slave/workspace/Lucene-Solr-NightlyTests-7.7/checkout/solr/build/solr-core/test/J0/temp/solr.cloud.LIROnShardRestartTest_D1072771A351DC8D-001/tempDir-001/node2/allReplicasInLIR_shard1_replica_n1/../../../../contrib/langid/lib filtered by .*\.jar to classpath: /x1/jenkins/jenkins-slave/workspace/Lucene-Solr-NightlyTests-7.7/checkout/solr/build/solr-core/test/J0/temp/solr.cloud.LIROnShardRestartTest_D1072771A351DC8D-001/tempDir-001/node2/allReplicasInLIR_shard1_replica_n1/../../../../contrib/langid/lib
   [junit4]   2> 2399318 WARN  (qtp2018269168-36757) [n:127.0.0.1:37812_solr c:allReplicasInLIR s:shard1 r:core_node3 x:allReplicasInLIR_shard1_replica_n1] o.a.s.c.SolrConfig Couldn't add files from /x1/jenkins/jenkins-slave/workspace/Lucene-Solr-NightlyTests-7.7/checkout/solr/build/solr-core/test/J0/temp/solr.cloud.LIROnShardRestartTest_D1072771A351DC8D-001/tempDir-001/node2/allReplicasInLIR_shard1_replica_n1/../../../../dist filtered by solr-langid-\d.*\.jar to classpath: /x1/jenkins/jenkins-slave/workspace/Lucene-Solr-NightlyTests-7.7/checkout/solr/build/solr-core/test/J0/temp/solr.cloud.LIROnShardRestartTest_D1072771A351DC8D-001/tempDir-001/node2/allReplicasInLIR_shard1_replica_n1/../../../../dist
   [junit4]   2> 2399319 WARN  (qtp2018269168-36757) [n:127.0.0.1:37812_solr c:allReplicasInLIR s:shard1 r:core_node3 x:allReplicasInLIR_shard1_replica_n1] o.a.s.c.SolrConfig Couldn't add files from /x1/jenkins/jenkins-slave/workspace/Lucene-Solr-NightlyTests-7.7/checkout/solr/build/solr-core/test/J0/temp/solr.cloud.LIROnShardRestartTest_D1072771A351DC8D-001/tempDir-001/node2/allReplicasInLIR_shard1_replica_n1/../../../../contrib/velocity/lib filtered by .*\.jar to classpath: /x1/jenkins/jenkins-slave/workspace/Lucene-Solr-NightlyTests-7.7/checkout/solr/build/solr-core/test/J0/temp/solr.cloud.LIROnShardRestartTest_D1072771A351DC8D-001/tempDir-001/node2/allReplicasInLIR_shard1_replica_n1/../../../../contrib/velocity/lib
   [junit4]   2> 2399319 WARN  (qtp2018269168-36757) [n:127.0.0.1:37812_solr c:allReplicasInLIR s:shard1 r:core_node3 x:allReplicasInLIR_shard1_replica_n1] o.a.s.c.SolrConfig Couldn't add files from /x1/jenkins/jenkins-slave/workspace/Lucene-Solr-NightlyTests-7.7/checkout/solr/build/solr-core/test/J0/temp/solr.cloud.LIROnShardRestartTest_D1072771A351DC8D-001/tempDir-001/node2/allReplicasInLIR_shard1_replica_n1/../../../../dist filtered by solr-velocity-\d.*\.jar to classpath: /x1/jenkins/jenkins-slave/workspace/Lucene-Solr-NightlyTests-7.7/checkout/solr/build/solr-core/test/J0/temp/solr.cloud.LIROnShardRestartTest_D1072771A351DC8D-001/tempDir-001/node2/allReplicasInLIR_shard1_replica_n1/../../../../dist
   [junit4]   2> 2399328 INFO  (qtp2018269168-36757) [n:127.0.0.1:37812_solr c:allReplicasInLIR s:shard1 r:core_node3 x:allReplicasInLIR_shard1_replica_n1] o.a.s.c.SolrConfig Using Lucene MatchVersion: 7.7.0
   [junit4]   2> 2399355 INFO  (qtp1690783789-36748) [n:127.0.0.1:44504_solr c:allReplicasInLIR s:shard1 r:core_node5 x:allReplicasInLIR_shard1_replica_n2] o.a.s.s.IndexSchema [allReplicasInLIR_shard1_replica_n2] Schema name=default-config
   [junit4]   2> 2399359 INFO  (qtp573306819-36762) [n:127.0.0.1:42764_solr c:allReplicasInLIR s:shard1 r:core_node6 x:allReplicasInLIR_shard1_replica_n4] o.a.s.s.IndexSchema [allReplicasInLIR_shard1_replica_n4] Schema name=default-config
   [junit4]   2> 2399371 INFO  (qtp2018269168-36757) [n:127.0.0.1:37812_solr c:allReplicasInLIR s:shard1 r:core_node3 x:allReplicasInLIR_shard1_replica_n1] o.a.s.s.IndexSchema [allReplicasInLIR_shard1_replica_n1] Schema name=default-config
   [junit4]   2> 2399602 INFO  (qtp1690783789-36748) [n:127.0.0.1:44504_solr c:allReplicasInLIR s:shard1 r:core_node5 x:allReplicasInLIR_shard1_replica_n2] o.a.s.s.IndexSchema Loaded schema default-config/1.6 with uniqueid field id
   [junit4]   2> 2399611 INFO  (qtp573306819-36762) [n:127.0.0.1:42764_solr c:allReplicasInLIR s:shard1 r:core_node6 x:allReplicasInLIR_shard1_replica_n4] o.a.s.s.IndexSchema Loaded schema default-config/1.6 with uniqueid field id
   [junit4]   2> 2399613 INFO  (qtp2018269168-36757) [n:127.0.0.1:37812_solr c:allReplicasInLIR s:shard1 r:core_node3 x:allReplicasInLIR_shard1_replica_n1] o.a.s.s.IndexSchema Loaded schema default-config/1.6 with uniqueid field id
   [junit4]   2> 2399656 INFO  (qtp1690783789-36748) [n:127.0.0.1:44504_solr c:allReplicasInLIR s:shard1 r:core_node5 x:allReplicasInLIR_shard1_replica_n2] o.a.s.c.CoreContainer Creating SolrCore 'allReplicasInLIR_shard1_replica_n2' using configuration from collection allReplicasInLIR, trusted=true
   [junit4]   2> 2399656 INFO  (qtp1690783789-36748) [n:127.0.0.1:44504_solr c:allReplicasInLIR s:shard1 r:core_node5 x:allReplicasInLIR_shard1_replica_n2] o.a.s.m.r.SolrJmxReporter JMX monitoring for 'solr_44504.solr.core.allReplicasInLIR.shard1.replica_n2' (registry 'solr.core.allReplicasInLIR.shard1.replica_n2') enabled at server: com.sun.jmx.mbeanserver.JmxMBeanServer@533f992d
   [junit4]   2> 2399657 INFO  (qtp1690783789-36748) [n:127.0.0.1:44504_solr c:allReplicasInLIR s:shard1 r:core_node5 x:allReplicasInLIR_shard1_replica_n2] o.a.s.c.SolrCore [[allReplicasInLIR_shard1_replica_n2] ] Opening new SolrCore at [/x1/jenkins/jenkins-slave/workspace/Lucene-Solr-NightlyTests-7.7/checkout/solr/build/solr-core/test/J0/temp/solr.cloud.LIROnShardRestartTest_D1072771A351DC8D-001/tempDir-001/node3/allReplicasInLIR_shard1_replica_n2], dataDir=[/x1/jenkins/jenkins-slave/workspace/Lucene-Solr-NightlyTests-7.7/checkout/solr/build/solr-core/test/J0/temp/solr.cloud.LIROnShardRestartTest_D1072771A351DC8D-001/tempDir-001/node3/./allReplicasInLIR_shard1_replica_n2/data/]
   [junit4]   2> 2399659 INFO  (qtp573306819-36762) [n:127.0.0.1:42764_solr c:allReplicasInLIR s:shard1 r:core_node6 x:allReplicasInLIR_shard1_replica_n4] o.a.s.c.CoreContainer Creating SolrCore 'allReplicasInLIR_shard1_replica_n4' using configuration from collection allReplicasInLIR, trusted=true
   [junit4]   2> 2399659 INFO  (qtp573306819-36762) [n:127.0.0.1:42764_solr c:allReplicasInLIR s:shard1 r:core_node6 x:allReplicasInLIR_shard1_replica_n4] o.a.s.m.r.SolrJmxReporter JMX monitoring for 'solr_42764.solr.core.allReplicasInLIR.shard1.replica_n4' (registry 'solr.core.allReplicasInLIR.shard1.replica_n4') enabled at server: com.sun.jmx.mbeanserver.JmxMBeanServer@533f992d
   [junit4]   2> 2399659 INFO  (qtp573306819-36762) [n:127.0.0.1:42764_solr c:allReplicasInLIR s:shard1 r:core_node6 x:allReplicasInLIR_shard1_replica_n4] o.a.s.c.SolrCore [[allReplicasInLIR_shard1_replica_n4] ] Opening new SolrCore at [/x1/jenkins/jenkins-slave/workspace/Lucene-Solr-NightlyTests-7.7/checkout/solr/build/solr-core/test/J0/temp/solr.cloud.LIROnShardRestartTest_D1072771A351DC8D-001/tempDir-001/node1/allReplicasInLIR_shard1_replica_n4], dataDir=[/x1/jenkins/jenkins-slave/workspace/Lucene-Solr-NightlyTests-7.7/checkout/solr/build/solr-core/test/J0/temp/solr.cloud.LIROnShardRestartTest_D1072771A351DC8D-001/tempDir-001/node1/./allReplicasInLIR_shard1_replica_n4/data/]
   [junit4]   2> 2399672 INFO  (qtp573306819-36762) [n:127.0.0.1:42764_solr c:allReplicasInLIR s:shard1 r:core_node6 x:allReplicasInLIR_shard1_replica_n4] o.a.s.r.XSLTResponseWriter xsltCacheLifetimeSeconds=5
   [junit4]   2> 2399677 INFO  (qtp2018269168-36757) [n:127.0.0.1:37812_solr c:allReplicasInLIR s:shard1 r:core_node3 x:allReplicasInLIR_shard1_replica_n1] o.a.s.c.CoreContainer Creating SolrCore 'allReplicasInLIR_shard1_replica_n1' using configuration from collection allReplicasInLIR, trusted=true
   [junit4]   2> 2399677 INFO  (qtp2018269168-36757) [n:127.0.0.1:37812_solr c:allReplicasInLIR s:shard1 r:core_node3 x:allReplicasInLIR_shard1_replica_n1] o.a.s.m.r.SolrJmxReporter JMX monitoring for 'solr_37812.solr.core.allReplicasInLIR.shard1.replica_n1' (registry 'solr.core.allReplicasInLIR.shard1.replica_n1') enabled at server: com.sun.jmx.mbeanserver.JmxMBeanServer@533f992d
   [junit4]   2> 2399678 INFO  (qtp2018269168-36757) [n:127.0.0.1:37812_solr c:allReplicasInLIR s:shard1 r:core_node3 x:allReplicasInLIR_shard1_replica_n1] o.a.s.c.SolrCore [[allReplicasInLIR_shard1_replica_n1] ] Opening new SolrCore at [/x1/jenkins/jenkins-slave/workspace/Lucene-Solr-NightlyTests-7.7/checkout/solr/build/solr-core/test/J0/temp/solr.cloud.LIROnShardRestartTest_D1072771A351DC8D-001/tempDir-001/node2/allReplicasInLIR_shard1_replica_n1], dataDir=[/x1/jenkins/jenkins-slave/workspace/Lucene-Solr-NightlyTests-7.7/checkout/solr/build/solr-core/test/J0/temp/solr.cloud.LIROnShardRestartTest_D1072771A351DC8D-001/tempDir-001/node2/./allReplicasInLIR_shard1_replica_n1/data/]
   [junit4]   2> 2399681 INFO  (qtp1690783789-36748) [n:127.0.0.1:44504_solr c:allReplicasInLIR s:shard1 r:core_node5 x:allReplicasInLIR_shard1_replica_n2] o.a.s.r.XSLTResponseWriter xsltCacheLifetimeSeconds=5
   [junit4]   2> 2399694 INFO  (qtp2018269168-36757) [n:127.0.0.1:37812_solr c:allReplicasInLIR s:shard1 r:core_node3 x:allReplicasInLIR_shard1_replica_n1] o.a.s.r.XSLTResponseWriter xsltCacheLifetimeSeconds=5
   [junit4]   2> 2399800 INFO  (qtp573306819-36762) [n:127.0.0.1:42764_solr c:allReplicasInLIR s:shard1 r:core_node6 x:allReplicasInLIR_shard1_replica_n4] o.a.s.u.UpdateHandler Using UpdateLog implementation: org.apache.solr.update.UpdateLog
   [junit4]   2> 2399800 INFO  (qtp573306819-36762) [n:127.0.0.1:42764_solr c:allReplicasInLIR s:shard1 r:core_node6 x:allReplicasInLIR_shard1_replica_n4] o.a.s.u.UpdateLog Initializing UpdateLog: dataDir= defaultSyncLevel=FLUSH numRecordsToKeep=100 maxNumLogsToKeep=10 numVersionBuckets=65536
   [junit4]   2> 2399803 INFO  (qtp573306819-36762) [n:127.0.0.1:42764_solr c:allReplicasInLIR s:shard1 r:core_node6 x:allReplicasInLIR_shard1_replica_n4] o.a.s.u.CommitTracker Hard AutoCommit: if uncommitted for 15000ms; 
   [junit4]   2> 2399803 INFO  (qtp573306819-36762) [n:127.0.0.1:42764_solr c:allReplicasInLIR s:shard1 r:core_node6 x:allReplicasInLIR_shard1_replica_n4] o.a.s.u.CommitTracker Soft AutoCommit: disabled
   [junit4]   2> 2399806 INFO  (qtp573306819-36762) [n:127.0.0.1:42764_solr c:allReplicasInLIR s:shard1 r:core_node6 x:allReplicasInLIR_shard1_replica_n4] o.a.s.s.SolrIndexSearcher Opening [Searcher@7912b4e3[allReplicasInLIR_shard1_replica_n4] main]
   [junit4]   2> 2399807 INFO  (qtp1690783789-36748) [n:127.0.0.1:44504_solr c:allReplicasInLIR s:shard1 r:core_node5 x:allReplicasInLIR_shard1_replica_n2] o.a.s.u.UpdateHandler Using UpdateLog implementation: org.apache.solr.update.UpdateLog
   [junit4]   2> 2399808 INFO  (qtp1690783789-36748) [n:127.0.0.1:44504_solr c:allReplicasInLIR s:shard1 r:core_node5 x:allReplicasInLIR_shard1_replica_n2] o.a.s.u.UpdateLog Initializing UpdateLog: dataDir= defaultSyncLevel=FLUSH numRecordsToKeep=100 maxNumLogsToKeep=10 numVersionBuckets=65536
   [junit4]   2> 2399811 INFO  (qtp1690783789-36748) [n:127.0.0.1:44504_solr c:allReplicasInLIR s:shard1 r:core_node5 x:allReplicasInLIR_shard1_replica_n2] o.a.s.u.CommitTracker Hard AutoCommit: if uncommitted for 15000ms; 
   [junit4]   2> 2399811 INFO  (qtp1690783789-36748) [n:127.0.0.1:44504_solr c:allReplicasInLIR s:shard1 r:core_node5 x:allReplicasInLIR_shard1_replica_n2] o.a.s.u.CommitTracker Soft AutoCommit: disabled
   [junit4]   2> 2399812 INFO  (qtp573306819-36762) [n:127.0.0.1:42764_solr c:allReplicasInLIR s:shard1 r:core_node6 x:allReplicasInLIR_shard1_replica_n4] o.a.s.r.ManagedResourceStorage Configured ZooKeeperStorageIO with znodeBase: /configs/allReplicasInLIR.AUTOCREATED
   [junit4]   2> 2399812 INFO  (qtp573306819-36762) [n:127.0.0.1:42764_solr c:allReplicasInLIR s:shard1 r:core_node6 x:allReplicasInLIR_shard1_replica_n4] o.a.s.r.ManagedResourceStorage Loaded null at path _rest_managed.json using ZooKeeperStorageIO:path=/configs/allReplicasInLIR.AUTOCREATED
   [junit4]   2> 2399812 INFO  (qtp573306819-36762) [n:127.0.0.1:42764_solr c:allReplicasInLIR s:shard1 r:core_node6 x:allReplicasInLIR_shard1_replica_n4] o.a.s.s.ZkIndexSchemaReader Creating ZooKeeper watch for the managed schema at /configs/allReplicasInLIR.AUTOCREATED/managed-schema
   [junit4]   2> 2399813 INFO  (qtp573306819-36762) [n:127.0.0.1:42764_solr c:allReplicasInLIR s:shard1 r:core_node6 x:allReplicasInLIR_shard1_replica_n4] o.a.s.s.ZkIndexSchemaReader Current schema version 0 is already the latest
   [junit4]   2> 2399814 INFO  (qtp573306819-36762) [n:127.0.0.1:42764_solr c:allReplicasInLIR s:shard1 r:core_node6 x:allReplicasInLIR_shard1_replica_n4] o.a.s.h.c.SpellCheckComponent Initializing spell checkers
   [junit4]   2> 2399814 INFO  (qtp573306819-36762) [n:127.0.0.1:42764_solr c:allReplicasInLIR s:shard1 r:core_node6 x:allReplicasInLIR_shard1_replica_n4] o.a.s.s.DirectSolrSpellChecker init: {name=default,field=_text_,classname=solr.DirectSolrSpellChecker,distanceMeasure=internal,accuracy=0.5,maxEdits=2,minPrefix=1,maxInspections=5,minQueryLength=4,maxQueryFrequency=0.01}
   [junit4]   2> 2399815 INFO  (qtp1690783789-36748) [n:127.0.0.1:44504_solr c:allReplicasInLIR s:shard1 r:core_node5 x:allReplicasInLIR_shard1_replica_n2] o.a.s.s.SolrIndexSearcher Opening [Searcher@7258d18c[allReplicasInLIR_shard1_replica_n2] main]
   [junit4]   2> 2399816 INFO  (qtp1690783789-36748) [n:127.0.0.1:44504_solr c:allReplicasInLIR s:shard1 r:core_node5 x:allReplicasInLIR_shard1_replica_n2] o.a.s.r.ManagedResourceStorage Configured ZooKeeperStorageIO with znodeBase: /configs/allReplicasInLIR.AUTOCREATED
   [junit4]   2> 2399817 INFO  (qtp573306819-36762) [n:127.0.0.1:42764_solr c:allReplicasInLIR s:shard1 r:core_node6 x:allReplicasInLIR_shard1_replica_n4] o.a.s.h.ReplicationHandler Commits will be reserved for 10000ms.
   [junit4]   2> 2399817 INFO  (qtp1690783789-36748) [n:127.0.0.1:44504_solr c:allReplicasInLIR s:shard1 r:core_node5 x:allReplicasInLIR_shard1_replica_n2] o.a.s.r.ManagedResourceStorage Loaded null at path _rest_managed.json using ZooKeeperStorageIO:path=/configs/allReplicasInLIR.AUTOCREATED
   [junit4]   2> 2399817 INFO  (qtp573306819-36762) [n:127.0.0.1:42764_solr c:allReplicasInLIR s:shard1 r:core_node6 x:allReplicasInLIR_shard1_replica_n4] o.a.s.u.UpdateLog Could not find max version in index or recent updates, using new clock 1624720795708162048
   [junit4]   2> 2399817 INFO  (qtp1690783789-36748) [n:127.0.0.1:44504_solr c:allReplicasInLIR s:shard1 r:core_node5 x:allReplicasInLIR_shard1_replica_n2] o.a.s.s.ZkIndexSchemaReader Creating ZooKeeper watch for the managed schema at /configs/allReplicasInLIR.AUTOCREATED/managed-schema
   [junit4]   2> 2399818 INFO  (qtp1690783789-36748) [n:127.0.0.1:44504_solr c:allReplicasInLIR s:shard1 r:core_node5 x:allReplicasInLIR_shard1_replica_n2] o.a.s.s.ZkIndexSchemaReader Current schema version 0 is already the latest
   [junit4]   2> 2399819 INFO  (qtp1690783789-36748) [n:127.0.0.1:44504_solr c:allReplicasInLIR s:shard1 r:core_node5 x:allReplicasInLIR_shard1_replica_n2] o.a.s.h.c.SpellCheckComponent Initializing spell checkers
   [junit4]   2> 2399819 INFO  (qtp1690783789-36748) [n:127.0.0.1:44504_solr c:allReplicasInLIR s:shard1 r:core_node5 x:allReplicasInLIR_shard1_replica_n2] o.a.s.s.DirectSolrSpellChecker init: {name=default,field=_text_,classname=solr.DirectSolrSpellChecker,distanceMeasure=internal,accuracy=0.5,maxEdits=2,minPrefix=1,maxInspections=5,minQueryLength=4,maxQueryFrequency=0.01}
   [junit4]   2> 2399822 INFO  (qtp1690783789-36748) [n:127.0.0.1:44504_solr c:allReplicasInLIR s:shard1 r:core_node5 x:allReplicasInLIR_shard1_replica_n2] o.a.s.h.ReplicationHandler Commits will be reserved for 10000ms.
   [junit4]   2> 2399822 INFO  (qtp1690783789-36748) [n:127.0.0.1:44504_solr c:allReplicasInLIR s:shard1 r:core_node5 x:allReplicasInLIR_shard1_replica_n2] o.a.s.u.UpdateLog Could not find max version in index or recent updates, using new clock 1624720795713404928
   [junit4]   2> 2399824 INFO  (qtp2018269168-36757) [n:127.0.0.1:37812_solr c:allReplicasInLIR s:shard1 r:core_node3 x:allReplicasInLIR_shard1_replica_n1] o.a.s.u.UpdateHandler Using UpdateLog implementation: org.apache.solr.update.UpdateLog
   [junit4]   2> 2399824 INFO  (qtp2018269168-36757) [n:127.0.0.1:37812_solr c:allReplicasInLIR s:shard1 r:core_node3 x:allReplicasInLIR_shard1_replica_n1] o.a.s.u.UpdateLog Initializing UpdateLog: dataDir= defaultSyncLevel=FLUSH numRecordsToKeep=100 maxNumLogsToKeep=10 numVersionBuckets=65536
   [junit4]   2> 2399824 INFO  (searcherExecutor-8196-thread-1-processing-n:127.0.0.1:44504_solr x:allReplicasInLIR_shard1_replica_n2 c:allReplicasInLIR s:shard1 r:core_node5) [n:127.0.0.1:44504_solr c:allReplicasInLIR s:shard1 r:core_node5 x:allReplicasInLIR_shard1_replica_n2] o.a.s.c.QuerySenderListener QuerySenderListener sending requests to Searcher@7258d18c[allReplicasInLIR_shard1_replica_n2] main{ExitableDirectoryReader(UninvertingDirectoryReader())}
   [junit4]   2> 2399824 INFO  (searcherExecutor-8196-thread-1-processing-n:127.0.0.1:44504_solr x:allReplicasInLIR_shard1_replica_n2 c:allReplicasInLIR s:shard1 r:core_node5) [n:127.0.0.1:44504_solr c:allReplicasInLIR s:shard1 r:core_node5 x:allReplicasInLIR_shard1_replica_n2] o.a.s.c.QuerySenderListener QuerySenderListener done.
   [junit4]   2> 2399824 INFO  (searcherExecutor-8196-thread-1-processing-n:127.0.0.1:44504_solr x:allReplicasInLIR_shard1_replica_n2 c:allReplicasInLIR s:shard1 r:core_node5) [n:127.0.0.1:44504_solr c:allReplicasInLIR s:shard1 r:core_node5 x:allReplicasInLIR_shard1_replica_n2] o.a.s.h.c.SpellCheckComponent Loading spell index for spellchecker: default
   [junit4]   2> 2399826 INFO  (searcherExecutor-8196-thread-1-processing-n:127.0.0.1:44504_solr x:allReplicasInLIR_shard1_replica_n2 c:allReplicasInLIR s:shard1 r:core_node5) [n:127.0.0.1:44504_solr c:allReplicasInLIR s:shard1 r:core_node5 x:allReplicasInLIR_shard1_replica_n2] o.a.s.c.SolrCore [allReplicasInLIR_shard1_replica_n2] Registered new searcher Searcher@7258d18c[allReplicasInLIR_shard1_replica_n2] main{ExitableDirectoryReader(UninvertingDirectoryReader())}
   [junit4]   2> 2399827 INFO  (qtp2018269168-36757) [n:127.0.0.1:37812_solr c:allReplicasInLIR s:shard1 r:core_node3 x:allReplicasInLIR_shard1_replica_n1] o.a.s.u.CommitTracker Hard AutoCommit: if uncommitted for 15000ms; 
   [junit4]   2> 2399827 INFO  (qtp2018269168-36757) [n:127.0.0.1:37812_solr c:allReplicasInLIR s:shard1 r:core_node3 x:allReplicasInLIR_shard1_replica_n1] o.a.s.u.CommitTracker Soft AutoCommit: disabled
   [junit4]   2> 2399830 INFO  (searcherExecutor-8197-thread-1-processing-n:127.0.0.1:42764_solr x:allReplicasInLIR_shard1_replica_n4 c:allReplicasInLIR s:shard1 r:core_node6) [n:127.0.0.1:42764_solr c:allReplicasInLIR s:shard1 r:core_node6 x:allReplicasInLIR_shard1_replica_n4] o.a.s.c.QuerySenderListener QuerySenderListener sending requests to Searcher@7912b4e3[allReplicasInLIR_shard1_replica_n4] main{ExitableDirectoryReader(UninvertingDirectoryReader())}
   [junit4]   2> 2399830 INFO  (searcherExecutor-8197-thread-1-processing-n:127.0.0.1:42764_solr x:allReplicasInLIR_shard1_replica_n4 c:allReplicasInLIR s:shard1 r:core_node6) [n:127.0.0.1:42764_solr c:allReplicasInLIR s:shard1 r:core_node6 x:allReplicasInLIR_shard1_replica_n4] o.a.s.c.QuerySenderListener QuerySenderListener done.
   [junit4]   2> 2399830 INFO  (searcherExecutor-8197-thread-1-processing-n:127.0.0.1:42764_solr x:allReplicasInLIR_shard1_replica_n4 c:allReplicasInLIR s:shard1 r:core_node6) [n:127.0.0.1:42764_solr c:allReplicasInLIR s:shard1 r:core_node6 x:allReplicasInLIR_shard1_replica_n4] o.a.s.h.c.SpellCheckComponent Loading spell index for spellchecker: default
   [junit4]   2> 2399830 INFO  (qtp1690783789-36748) [n:127.0.0.1:44504_solr c:allReplicasInLIR s:shard1 r:core_node5 x:allReplicasInLIR_shard1_replica_n2] o.a.s.c.ZkShardTerms Successful update of terms at /collections/allReplicasInLIR/terms/shard1 to Terms{values={core_node5=0}, version=0}
   [junit4]   2> 2399831 INFO  (qtp1690783789-36748) [n:127.0.0.1:44504_solr c:allReplicasInLIR s:shard1 r:core_node5 x:allReplicasInLIR_shard1_replica_n2] o.a.s.c.ShardLeaderElectionContextBase make sure parent is created /collections/allReplicasInLIR/leaders/shard1
   [junit4]   2> 2399831 INFO  (qtp2018269168-36757) [n:127.0.0.1:37812_solr c:allReplicasInLIR s:shard1 r:core_node3 x:allReplicasInLIR_shard1_replica_n1] o.a.s.s.SolrIndexSearcher Opening [Searcher@14e7af69[allReplicasInLIR_shard1_replica_n1] main]
   [junit4]   2> 2399832 INFO  (searcherExecutor-8197-thread-1-processing-n:127.0.0.1:42764_solr x:allReplicasInLIR_shard1_replica_n4 c:allReplicasInLIR s:shard1 r:core_node6) [n:127.0.0.1:42764_solr c:allReplicasInLIR s:shard1 r:core_node6 x:allReplicasInLIR_shard1_replica_n4] o.a.s.c.SolrCore [allReplicasInLIR_shard1_replica_n4] Registered new searcher Searcher@7912b4e3[allReplicasInLIR_shard1_replica_n4] main{ExitableDirectoryReader(UninvertingDirectoryReader())}
   [junit4]   2> 2399832 INFO  (qtp2018269168-36757) [n:127.0.0.1:37812_solr c:allReplicasInLIR s:shard1 r:core_node3 x:allReplicasInLIR_shard1_replica_n1] o.a.s.r.ManagedResourceStorage Configured ZooKeeperStorageIO with znodeBase: /configs/allReplicasInLIR.AUTOCREATED
   [junit4]   2> 2399833 INFO  (qtp2018269168-36757) [n:127.0.0.1:37812_solr c:allReplicasInLIR s:shard1 r:core_node3 x:allReplicasInLIR_shard1_replica_n1] o.a.s.r.ManagedResourceStorage Loaded null at path _rest_managed.json using ZooKeeperStorageIO:path=/configs/allReplicasInLIR.AUTOCREATED
   [junit4]   2> 2399833 INFO  (qtp2018269168-36757) [n:127.0.0.1:37812_solr c:allReplicasInLIR s:shard1 r:core_node3 x:allReplicasInLIR_shard1_replica_n1] o.a.s.s.ZkIndexSchemaReader Creating ZooKeeper watch for the managed schema at /configs/allReplicasInLIR.AUTOCREATED/managed-schema
   [junit4]   2> 2399834 INFO  (qtp2018269168-36757) [n:127.0.0.1:37812_solr c:allReplicasInLIR s:shard1 r:core_node3 x:allReplicasInLIR_shard1_replica_n1] o.a.s.s.ZkIndexSchemaReader Current schema version 0 is already the latest
   [junit4]   2> 2399835 INFO  (qtp2018269168-36757) [n:127.0.0.1:37812_solr c:allReplicasInLIR s:shard1 r:core_node3 x:allReplicasInLIR_shard1_replica_n1] o.a.s.h.c.SpellCheckComponent Initializing spell checkers
   [junit4]   2> 2399835 INFO  (qtp2018269168-36757) [n:127.0.0.1:37812_solr c:allReplicasInLIR s:shard1 r:core_node3 x:allReplicasInLIR_shard1_replica_n1] o.a.s.s.DirectSolrSpellChecker init: {name=default,field=_text_,classname=solr.DirectSolrSpellChecker,distanceMeasure=internal,accuracy=0.5,maxEdits=2,minPrefix=1,maxInspections=5,minQueryLength=4,maxQueryFrequency=0.01}
   [junit4]   2> 2399837 INFO  (qtp2018269168-36757) [n:127.0.0.1:37812_solr c:allReplicasInLIR s:shard1 r:core_node3 x:allReplicasInLIR_shard1_replica_n1] o.a.s.h.ReplicationHandler Commits will be reserved for 10000ms.
   [junit4]   2> 2399837 INFO  (qtp2018269168-36757) [n:127.0.0.1:37812_solr c:allReplicasInLIR s:shard1 r:core_node3 x:allReplicasInLIR_shard1_replica_n1] o.a.s.u.UpdateLog Could not find max version in index or recent updates, using new clock 1624720795729133568
   [junit4]   2> 2399840 INFO  (qtp573306819-36762) [n:127.0.0.1:42764_solr c:allReplicasInLIR s:shard1 r:core_node6 x:allReplicasInLIR_shard1_replica_n4] o.a.s.c.ZkShardTerms Successful update of terms at /collections/allReplicasInLIR/terms/shard1 to Terms{values={core_node6=0, core_node5=0}, version=1}
   [junit4]   2> 2399841 INFO  (qtp573306819-36762) [n:127.0.0.1:42764_solr c:allReplicasInLIR s:shard1 r:core_node6 x:allReplicasInLIR_shard1_replica_n4] o.a.s.c.ShardLeaderElectionContextBase make sure parent is created /collections/allReplicasInLIR/leaders/shard1
   [junit4]   2> 2399841 INFO  (searcherExecutor-8198-thread-1-processing-n:127.0.0.1:37812_solr x:allReplicasInLIR_shard1_replica_n1 c:allReplicasInLIR s:shard1 r:core_node3) [n:127.0.0.1:37812_solr c:allReplicasInLIR s:shard1 r:core_node3 x:allReplicasInLIR_shard1_replica_n1] o.a.s.c.QuerySenderListener QuerySenderListener sending requests to Searcher@14e7af69[allReplicasInLIR_shard1_replica_n1] main{ExitableDirectoryReader(UninvertingDirectoryReader())}
   [junit4]   2> 2399841 INFO  (searcherExecutor-8198-thread-1-processing-n:127.0.0.1:37812_solr x:allReplicasInLIR_shard1_replica_n1 c:allReplicasInLIR s:shard1 r:core_node3) [n:127.0.0.1:37812_solr c:allReplicasInLIR s:shard1 r:core_node3 x:allReplicasInLIR_shard1_replica_n1] o.a.s.c.QuerySenderListener QuerySenderListener done.
   [junit4]   2> 2399841 INFO  (searcherExecutor-8198-thread-1-processing-n:127.0.0.1:37812_solr x:allReplicasInLIR_shard1_replica_n1 c:allReplicasInLIR s:shard1 r:core_node3) [n:127.0.0.1:37812_solr c:allReplicasInLIR s:shard1 r:core_node3 x:allReplicasInLIR_shard1_replica_n1] o.a.s.h.c.SpellCheckComponent Loading spell index for spellchecker: default
   [junit4]   2> 2399843 INFO  (searcherExecutor-8198-thread-1-processing-n:127.0.0.1:37812_solr x:allReplicasInLIR_shard1_replica_n1 c:allReplicasInLIR s:shard1 r:core_node3) [n:127.0.0.1:37812_solr c:allReplicasInLIR s:shard1 r:core_node3 x:allReplicasInLIR_shard1_replica_n1] o.a.s.c.SolrCore [allReplicasInLIR_shard1_replica_n1] Registered new searcher Searcher@14e7af69[allReplicasInLIR_shard1_replica_n1] main{ExitableDirectoryReader(UninvertingDirectoryReader())}
   [junit4]   2> 2399847 INFO  (qtp573306819-36762) [n:127.0.0.1:42764_solr c:allReplicasInLIR s:shard1 r:core_node6 x:allReplicasInLIR_shard1_replica_n4] o.a.s.c.ShardLeaderElectionContext Waiting until we see more replicas up for shard shard1: total=3 found=1 timeoutin=9999ms
   [junit4]   2> 2399849 INFO  (qtp2018269168-36757) [n:127.0.0.1:37812_solr c:allReplicasInLIR s:shard1 r:core_node3 x:allReplicasInLIR_shard1_replica_n1] o.a.s.c.ZkShardTerms Successful update of terms at /collections/allReplicasInLIR/terms/shard1 to Terms{values={core_node6=0, core_node3=0, core_node5=0}, version=2}
   [junit4]   2> 2399849 INFO  (qtp2018269168-36757) [n:127.0.0.1:37812_solr c:allReplicasInLIR s:shard1 r:core_node3 x:allReplicasInLIR_shard1_replica_n1] o.a.s.c.ShardLeaderElectionContextBase make sure parent is created /collections/allReplicasInLIR/leaders/shard1
   [junit4]   2> 2400348 INFO  (qtp573306819-36762) [n:127.0.0.1:42764_solr c:allReplicasInLIR s:shard1 r:core_node6 x:allReplicasInLIR_shard1_replica_n4] o.a.s.c.ShardLeaderElectionContext Enough replicas found to continue.
   [junit4]   2> 2400348 INFO  (qtp573306819-36762) [n:127.0.0.1:42764_solr c:allReplicasInLIR s:shard1 r:core_node6 x:allReplicasInLIR_shard1_replica_n4] o.a.s.c.ShardLeaderElectionContext I may be the new leader - try and sync
   [junit4]   2> 2400349 INFO  (qtp573306819-36762) [n:127.0.0.1:42764_solr c:allReplicasInLIR s:shard1 r:core_node6 x:allReplicasInLIR_shard1_replica_n4] o.a.s.c.SyncStrategy Sync replicas to https://127.0.0.1:42764/solr/allReplicasInLIR_shard1_replica_n4/
   [junit4]   2> 2400350 INFO  (qtp573306819-36762) [n:127.0.0.1:42764_solr c:allReplicasInLIR s:shard1 r:core_node6 x:allReplicasInLIR_shard1_replica_n4] o.a.s.u.PeerSync PeerSync: core=allReplicasInLIR_shard1_replica_n4 url=https://127.0.0.1:42764/solr START replicas=[https://127.0.0.1:37812/solr/allReplicasInLIR_shard1_replica_n1/, https://127.0.0.1:44504/solr/allReplicasInLIR_shard1_replica_n2/] nUpdates=100
   [junit4]   2> 2400351 INFO  (qtp573306819-36762) [n:127.0.0.1:42764_solr c:allReplicasInLIR s:shard1 r:core_node6 x:allReplicasInLIR_shard1_replica_n4] o.a.s.u.PeerSync PeerSync: core=allReplicasInLIR_shard1_replica_n4 url=https://127.0.0.1:42764/solr DONE.  We have no versions.  sync failed.
   [junit4]   2> 2400364 INFO  (qtp2018269168-36754) [n:127.0.0.1:37812_solr c:allReplicasInLIR s:shard1 r:core_node3 x:allReplicasInLIR_shard1_replica_n1] o.a.s.c.S.Request [allReplicasInLIR_shard1_replica_n1]  webapp=/solr path=/get params={distrib=false&qt=/get&fingerprint=false&getVersions=100&wt=javabin&version=2} status=0 QTime=0
  

[...truncated too long message...]

vy-availability-check:
[loadresource] Do not set property disallowed.ivy.jars.list as its length is 0.

-ivy-fail-disallowed-ivy-version:

ivy-fail:

ivy-configure:
[ivy:configure] :: loading settings :: file = /x1/jenkins/jenkins-slave/workspace/Lucene-Solr-NightlyTests-7.7/checkout/lucene/top-level-ivy-settings.xml

resolve:

ivy-availability-check:
[loadresource] Do not set property disallowed.ivy.jars.list as its length is 0.

-ivy-fail-disallowed-ivy-version:

ivy-fail:

ivy-fail:

ivy-configure:
[ivy:configure] :: loading settings :: file = /x1/jenkins/jenkins-slave/workspace/Lucene-Solr-NightlyTests-7.7/checkout/lucene/top-level-ivy-settings.xml

resolve:

ivy-availability-check:
[loadresource] Do not set property disallowed.ivy.jars.list as its length is 0.

-ivy-fail-disallowed-ivy-version:

ivy-fail:

ivy-configure:
[ivy:configure] :: loading settings :: file = /x1/jenkins/jenkins-slave/workspace/Lucene-Solr-NightlyTests-7.7/checkout/lucene/top-level-ivy-settings.xml

resolve:

ivy-availability-check:
[loadresource] Do not set property disallowed.ivy.jars.list as its length is 0.

-ivy-fail-disallowed-ivy-version:

ivy-fail:

ivy-fail:

ivy-configure:
[ivy:configure] :: loading settings :: file = /x1/jenkins/jenkins-slave/workspace/Lucene-Solr-NightlyTests-7.7/checkout/lucene/top-level-ivy-settings.xml

resolve:

ivy-availability-check:
[loadresource] Do not set property disallowed.ivy.jars.list as its length is 0.

-ivy-fail-disallowed-ivy-version:

ivy-fail:

ivy-fail:

ivy-configure:
[ivy:configure] :: loading settings :: file = /x1/jenkins/jenkins-slave/workspace/Lucene-Solr-NightlyTests-7.7/checkout/lucene/top-level-ivy-settings.xml

resolve:

ivy-availability-check:
[loadresource] Do not set property disallowed.ivy.jars.list as its length is 0.

-ivy-fail-disallowed-ivy-version:

ivy-fail:

ivy-fail:

ivy-configure:
[ivy:configure] :: loading settings :: file = /x1/jenkins/jenkins-slave/workspace/Lucene-Solr-NightlyTests-7.7/checkout/lucene/top-level-ivy-settings.xml

resolve:

ivy-availability-check:
[loadresource] Do not set property disallowed.ivy.jars.list as its length is 0.

-ivy-fail-disallowed-ivy-version:

ivy-fail:

ivy-fail:

ivy-configure:
[ivy:configure] :: loading settings :: file = /x1/jenkins/jenkins-slave/workspace/Lucene-Solr-NightlyTests-7.7/checkout/lucene/top-level-ivy-settings.xml

resolve:

ivy-availability-check:
[loadresource] Do not set property disallowed.ivy.jars.list as its length is 0.

-ivy-fail-disallowed-ivy-version:

ivy-fail:

ivy-fail:

ivy-configure:
[ivy:configure] :: loading settings :: file = /x1/jenkins/jenkins-slave/workspace/Lucene-Solr-NightlyTests-7.7/checkout/lucene/top-level-ivy-settings.xml

resolve:

ivy-availability-check:
[loadresource] Do not set property disallowed.ivy.jars.list as its length is 0.

-ivy-fail-disallowed-ivy-version:

ivy-fail:

ivy-fail:

ivy-configure:
[ivy:configure] :: loading settings :: file = /x1/jenkins/jenkins-slave/workspace/Lucene-Solr-NightlyTests-7.7/checkout/lucene/top-level-ivy-settings.xml

resolve:

ivy-availability-check:
[loadresource] Do not set property disallowed.ivy.jars.list as its length is 0.

-ivy-fail-disallowed-ivy-version:

ivy-fail:

ivy-fail:

ivy-configure:
[ivy:configure] :: loading settings :: file = /x1/jenkins/jenkins-slave/workspace/Lucene-Solr-NightlyTests-7.7/checkout/lucene/top-level-ivy-settings.xml

resolve:

ivy-availability-check:
[loadresource] Do not set property disallowed.ivy.jars.list as its length is 0.

-ivy-fail-disallowed-ivy-version:

ivy-fail:

ivy-fail:

ivy-configure:
[ivy:configure] :: loading settings :: file = /x1/jenkins/jenkins-slave/workspace/Lucene-Solr-NightlyTests-7.7/checkout/lucene/top-level-ivy-settings.xml

resolve:

ivy-availability-check:
[loadresource] Do not set property disallowed.ivy.jars.list as its length is 0.

-ivy-fail-disallowed-ivy-version:

ivy-fail:

ivy-fail:

ivy-configure:
[ivy:configure] :: loading settings :: file = /x1/jenkins/jenkins-slave/workspace/Lucene-Solr-NightlyTests-7.7/checkout/lucene/top-level-ivy-settings.xml

resolve:

ivy-availability-check:
[loadresource] Do not set property disallowed.ivy.jars.list as its length is 0.

-ivy-fail-disallowed-ivy-version:

ivy-fail:

ivy-fail:

ivy-configure:
[ivy:configure] :: loading settings :: file = /x1/jenkins/jenkins-slave/workspace/Lucene-Solr-NightlyTests-7.7/checkout/lucene/top-level-ivy-settings.xml

resolve:

jar-checksums:
    [mkdir] Created dir: /x1/jenkins/jenkins-slave/workspace/Lucene-Solr-NightlyTests-7.7/checkout/solr/null1676570175
     [copy] Copying 242 files to /x1/jenkins/jenkins-slave/workspace/Lucene-Solr-NightlyTests-7.7/checkout/solr/null1676570175
   [delete] Deleting directory /x1/jenkins/jenkins-slave/workspace/Lucene-Solr-NightlyTests-7.7/checkout/solr/null1676570175

check-working-copy:
[ivy:cachepath] :: resolving dependencies :: org.eclipse.jgit#org.eclipse.jgit-caller;working
[ivy:cachepath] 	confs: [default]
[ivy:cachepath] 	found org.eclipse.jgit#org.eclipse.jgit;4.6.0.201612231935-r in public
[ivy:cachepath] 	found com.jcraft#jsch;0.1.53 in public
[ivy:cachepath] 	found com.googlecode.javaewah#JavaEWAH;1.1.6 in public
[ivy:cachepath] 	found org.apache.httpcomponents#httpclient;4.3.6 in public
[ivy:cachepath] 	found org.apache.httpcomponents#httpcore;4.3.3 in public
[ivy:cachepath] 	found commons-logging#commons-logging;1.1.3 in public
[ivy:cachepath] 	found commons-codec#commons-codec;1.6 in public
[ivy:cachepath] 	found org.slf4j#slf4j-api;1.7.2 in public
[ivy:cachepath] :: resolution report :: resolve 55ms :: artifacts dl 4ms
	---------------------------------------------------------------------
	|                  |            modules            ||   artifacts   |
	|       conf       | number| search|dwnlded|evicted|| number|dwnlded|
	---------------------------------------------------------------------
	|      default     |   8   |   0   |   0   |   0   ||   8   |   0   |
	---------------------------------------------------------------------
[wc-checker] Initializing working copy...
[wc-checker] SLF4J: Failed to load class "org.slf4j.impl.StaticLoggerBinder".
[wc-checker] SLF4J: Defaulting to no-operation (NOP) logger implementation
[wc-checker] SLF4J: See http://www.slf4j.org/codes.html#StaticLoggerBinder for further details.
[wc-checker] Checking working copy status...

-jenkins-base:

BUILD SUCCESSFUL
Total time: 253 minutes 32 seconds
Archiving artifacts
java.lang.InterruptedException: no matches found within 10000
	at hudson.FilePath$ValidateAntFileMask.hasMatch(FilePath.java:2847)
	at hudson.FilePath$ValidateAntFileMask.invoke(FilePath.java:2726)
	at hudson.FilePath$ValidateAntFileMask.invoke(FilePath.java:2707)
	at hudson.FilePath$FileCallableWrapper.call(FilePath.java:3086)
Also:   hudson.remoting.Channel$CallSiteStackTrace: Remote call to lucene
		at hudson.remoting.Channel.attachCallSiteStackTrace(Channel.java:1741)
		at hudson.remoting.UserRequest$ExceptionResponse.retrieve(UserRequest.java:357)
		at hudson.remoting.Channel.call(Channel.java:955)
		at hudson.FilePath.act(FilePath.java:1072)
		at hudson.FilePath.act(FilePath.java:1061)
		at hudson.FilePath.validateAntFileMask(FilePath.java:2705)
		at hudson.tasks.ArtifactArchiver.perform(ArtifactArchiver.java:243)
		at hudson.tasks.BuildStepCompatibilityLayer.perform(BuildStepCompatibilityLayer.java:81)
		at hudson.tasks.BuildStepMonitor$1.perform(BuildStepMonitor.java:20)
		at hudson.model.AbstractBuild$AbstractBuildExecution.perform(AbstractBuild.java:744)
		at hudson.model.AbstractBuild$AbstractBuildExecution.performAllBuildSteps(AbstractBuild.java:690)
		at hudson.model.Build$BuildExecution.post2(Build.java:186)
		at hudson.model.AbstractBuild$AbstractBuildExecution.post(AbstractBuild.java:635)
		at hudson.model.Run.execute(Run.java:1835)
		at hudson.model.FreeStyleBuild.run(FreeStyleBuild.java:43)
		at hudson.model.ResourceController.execute(ResourceController.java:97)
		at hudson.model.Executor.run(Executor.java:429)
Caused: hudson.FilePath$TunneledInterruptedException
	at hudson.FilePath$FileCallableWrapper.call(FilePath.java:3088)
	at hudson.remoting.UserRequest.perform(UserRequest.java:212)
	at hudson.remoting.UserRequest.perform(UserRequest.java:54)
	at hudson.remoting.Request$2.run(Request.java:369)
	at hudson.remoting.InterceptingExecutorService$1.call(InterceptingExecutorService.java:72)
	at java.util.concurrent.FutureTask.run(FutureTask.java:266)
	at java.util.concurrent.ThreadPoolExecutor.runWorker(ThreadPoolExecutor.java:1142)
	at java.util.concurrent.ThreadPoolExecutor$Worker.run(ThreadPoolExecutor.java:617)
	at java.lang.Thread.run(Thread.java:748)
Caused: java.lang.InterruptedException: java.lang.InterruptedException: no matches found within 10000
	at hudson.FilePath.act(FilePath.java:1074)
	at hudson.FilePath.act(FilePath.java:1061)
	at hudson.FilePath.validateAntFileMask(FilePath.java:2705)
	at hudson.tasks.ArtifactArchiver.perform(ArtifactArchiver.java:243)
	at hudson.tasks.BuildStepCompatibilityLayer.perform(BuildStepCompatibilityLayer.java:81)
	at hudson.tasks.BuildStepMonitor$1.perform(BuildStepMonitor.java:20)
	at hudson.model.AbstractBuild$AbstractBuildExecution.perform(AbstractBuild.java:744)
	at hudson.model.AbstractBuild$AbstractBuildExecution.performAllBuildSteps(AbstractBuild.java:690)
	at hudson.model.Build$BuildExecution.post2(Build.java:186)
	at hudson.model.AbstractBuild$AbstractBuildExecution.post(AbstractBuild.java:635)
	at hudson.model.Run.execute(Run.java:1835)
	at hudson.model.FreeStyleBuild.run(FreeStyleBuild.java:43)
	at hudson.model.ResourceController.execute(ResourceController.java:97)
	at hudson.model.Executor.run(Executor.java:429)
No artifacts found that match the file pattern "**/*.events,heapdumps/**,**/hs_err_pid*". Configuration error?
Recording test results
Build step 'Publish JUnit test result report' changed build result to UNSTABLE
Email was triggered for: Unstable (Test Failures)
Sending email for trigger: Unstable (Test Failures)

Mime
View raw message