lucene-dev mailing list archives

Site index · List index
Message view « Date » · « Thread »
Top « Date » · « Thread »
From Policeman Jenkins Server <jenk...@thetaphi.de>
Subject [JENKINS-EA] Lucene-Solr-8.x-Linux (64bit/jdk-13-ea+8) - Build # 197 - Still Unstable!
Date Fri, 22 Feb 2019 23:49:39 GMT
Build: https://jenkins.thetaphi.de/job/Lucene-Solr-8.x-Linux/197/
Java: 64bit/jdk-13-ea+8 -XX:+UseCompressedOops -XX:+UseParallelGC

4 tests failed.
FAILED:  junit.framework.TestSuite.org.apache.solr.core.TestDynamicURP

Error Message:
1 thread leaked from SUITE scope at org.apache.solr.core.TestDynamicURP:     1) Thread[id=269, name=Log4j2-TF-2-AsyncLoggerConfig--2, state=TIMED_WAITING, group=TGRP-TestDynamicURP]         at java.base@13-ea/jdk.internal.misc.Unsafe.park(Native Method)         at java.base@13-ea/java.util.concurrent.locks.LockSupport.parkNanos(LockSupport.java:235)         at java.base@13-ea/java.util.concurrent.locks.AbstractQueuedSynchronizer$ConditionObject.awaitNanos(AbstractQueuedSynchronizer.java:2123)         at app//com.lmax.disruptor.TimeoutBlockingWaitStrategy.waitFor(TimeoutBlockingWaitStrategy.java:38)         at app//com.lmax.disruptor.ProcessingSequenceBarrier.waitFor(ProcessingSequenceBarrier.java:56)         at app//com.lmax.disruptor.BatchEventProcessor.run(BatchEventProcessor.java:128)         at java.base@13-ea/java.lang.Thread.run(Thread.java:835)

Stack Trace:
com.carrotsearch.randomizedtesting.ThreadLeakError: 1 thread leaked from SUITE scope at org.apache.solr.core.TestDynamicURP: 
   1) Thread[id=269, name=Log4j2-TF-2-AsyncLoggerConfig--2, state=TIMED_WAITING, group=TGRP-TestDynamicURP]
        at java.base@13-ea/jdk.internal.misc.Unsafe.park(Native Method)
        at java.base@13-ea/java.util.concurrent.locks.LockSupport.parkNanos(LockSupport.java:235)
        at java.base@13-ea/java.util.concurrent.locks.AbstractQueuedSynchronizer$ConditionObject.awaitNanos(AbstractQueuedSynchronizer.java:2123)
        at app//com.lmax.disruptor.TimeoutBlockingWaitStrategy.waitFor(TimeoutBlockingWaitStrategy.java:38)
        at app//com.lmax.disruptor.ProcessingSequenceBarrier.waitFor(ProcessingSequenceBarrier.java:56)
        at app//com.lmax.disruptor.BatchEventProcessor.run(BatchEventProcessor.java:128)
        at java.base@13-ea/java.lang.Thread.run(Thread.java:835)
	at __randomizedtesting.SeedInfo.seed([54B30AC62A2D71E]:0)


FAILED:  junit.framework.TestSuite.org.apache.solr.core.TestDynamicURP

Error Message:
There are still zombie threads that couldn't be terminated:    1) Thread[id=269, name=Log4j2-TF-2-AsyncLoggerConfig--2, state=TIMED_WAITING, group=TGRP-TestDynamicURP]         at java.base@13-ea/jdk.internal.misc.Unsafe.park(Native Method)         at java.base@13-ea/java.util.concurrent.locks.LockSupport.parkNanos(LockSupport.java:235)         at java.base@13-ea/java.util.concurrent.locks.AbstractQueuedSynchronizer$ConditionObject.awaitNanos(AbstractQueuedSynchronizer.java:2123)         at app//com.lmax.disruptor.TimeoutBlockingWaitStrategy.waitFor(TimeoutBlockingWaitStrategy.java:38)         at app//com.lmax.disruptor.ProcessingSequenceBarrier.waitFor(ProcessingSequenceBarrier.java:56)         at app//com.lmax.disruptor.BatchEventProcessor.run(BatchEventProcessor.java:128)         at java.base@13-ea/java.lang.Thread.run(Thread.java:835)

Stack Trace:
com.carrotsearch.randomizedtesting.ThreadLeakError: There are still zombie threads that couldn't be terminated:
   1) Thread[id=269, name=Log4j2-TF-2-AsyncLoggerConfig--2, state=TIMED_WAITING, group=TGRP-TestDynamicURP]
        at java.base@13-ea/jdk.internal.misc.Unsafe.park(Native Method)
        at java.base@13-ea/java.util.concurrent.locks.LockSupport.parkNanos(LockSupport.java:235)
        at java.base@13-ea/java.util.concurrent.locks.AbstractQueuedSynchronizer$ConditionObject.awaitNanos(AbstractQueuedSynchronizer.java:2123)
        at app//com.lmax.disruptor.TimeoutBlockingWaitStrategy.waitFor(TimeoutBlockingWaitStrategy.java:38)
        at app//com.lmax.disruptor.ProcessingSequenceBarrier.waitFor(ProcessingSequenceBarrier.java:56)
        at app//com.lmax.disruptor.BatchEventProcessor.run(BatchEventProcessor.java:128)
        at java.base@13-ea/java.lang.Thread.run(Thread.java:835)
	at __randomizedtesting.SeedInfo.seed([54B30AC62A2D71E]:0)


FAILED:  junit.framework.TestSuite.org.apache.solr.core.TestJmxIntegration

Error Message:
1 thread leaked from SUITE scope at org.apache.solr.core.TestJmxIntegration:     1) Thread[id=35, name=Log4j2-TF-2-AsyncLoggerConfig--2, state=TIMED_WAITING, group=TGRP-TestJmxIntegration]         at java.base@13-ea/jdk.internal.misc.Unsafe.park(Native Method)         at java.base@13-ea/java.util.concurrent.locks.LockSupport.parkNanos(LockSupport.java:235)         at java.base@13-ea/java.util.concurrent.locks.AbstractQueuedSynchronizer$ConditionObject.awaitNanos(AbstractQueuedSynchronizer.java:2123)         at app//com.lmax.disruptor.TimeoutBlockingWaitStrategy.waitFor(TimeoutBlockingWaitStrategy.java:38)         at app//com.lmax.disruptor.ProcessingSequenceBarrier.waitFor(ProcessingSequenceBarrier.java:56)         at app//com.lmax.disruptor.BatchEventProcessor.run(BatchEventProcessor.java:128)         at java.base@13-ea/java.lang.Thread.run(Thread.java:835)

Stack Trace:
com.carrotsearch.randomizedtesting.ThreadLeakError: 1 thread leaked from SUITE scope at org.apache.solr.core.TestJmxIntegration: 
   1) Thread[id=35, name=Log4j2-TF-2-AsyncLoggerConfig--2, state=TIMED_WAITING, group=TGRP-TestJmxIntegration]
        at java.base@13-ea/jdk.internal.misc.Unsafe.park(Native Method)
        at java.base@13-ea/java.util.concurrent.locks.LockSupport.parkNanos(LockSupport.java:235)
        at java.base@13-ea/java.util.concurrent.locks.AbstractQueuedSynchronizer$ConditionObject.awaitNanos(AbstractQueuedSynchronizer.java:2123)
        at app//com.lmax.disruptor.TimeoutBlockingWaitStrategy.waitFor(TimeoutBlockingWaitStrategy.java:38)
        at app//com.lmax.disruptor.ProcessingSequenceBarrier.waitFor(ProcessingSequenceBarrier.java:56)
        at app//com.lmax.disruptor.BatchEventProcessor.run(BatchEventProcessor.java:128)
        at java.base@13-ea/java.lang.Thread.run(Thread.java:835)
	at __randomizedtesting.SeedInfo.seed([54B30AC62A2D71E]:0)


FAILED:  junit.framework.TestSuite.org.apache.solr.core.TestJmxIntegration

Error Message:
There are still zombie threads that couldn't be terminated:    1) Thread[id=35, name=Log4j2-TF-2-AsyncLoggerConfig--2, state=TIMED_WAITING, group=TGRP-TestJmxIntegration]         at java.base@13-ea/jdk.internal.misc.Unsafe.park(Native Method)         at java.base@13-ea/java.util.concurrent.locks.LockSupport.parkNanos(LockSupport.java:235)         at java.base@13-ea/java.util.concurrent.locks.AbstractQueuedSynchronizer$ConditionObject.awaitNanos(AbstractQueuedSynchronizer.java:2123)         at app//com.lmax.disruptor.TimeoutBlockingWaitStrategy.waitFor(TimeoutBlockingWaitStrategy.java:38)         at app//com.lmax.disruptor.ProcessingSequenceBarrier.waitFor(ProcessingSequenceBarrier.java:56)         at app//com.lmax.disruptor.BatchEventProcessor.run(BatchEventProcessor.java:128)         at java.base@13-ea/java.lang.Thread.run(Thread.java:835)

Stack Trace:
com.carrotsearch.randomizedtesting.ThreadLeakError: There are still zombie threads that couldn't be terminated:
   1) Thread[id=35, name=Log4j2-TF-2-AsyncLoggerConfig--2, state=TIMED_WAITING, group=TGRP-TestJmxIntegration]
        at java.base@13-ea/jdk.internal.misc.Unsafe.park(Native Method)
        at java.base@13-ea/java.util.concurrent.locks.LockSupport.parkNanos(LockSupport.java:235)
        at java.base@13-ea/java.util.concurrent.locks.AbstractQueuedSynchronizer$ConditionObject.awaitNanos(AbstractQueuedSynchronizer.java:2123)
        at app//com.lmax.disruptor.TimeoutBlockingWaitStrategy.waitFor(TimeoutBlockingWaitStrategy.java:38)
        at app//com.lmax.disruptor.ProcessingSequenceBarrier.waitFor(ProcessingSequenceBarrier.java:56)
        at app//com.lmax.disruptor.BatchEventProcessor.run(BatchEventProcessor.java:128)
        at java.base@13-ea/java.lang.Thread.run(Thread.java:835)
	at __randomizedtesting.SeedInfo.seed([54B30AC62A2D71E]:0)




Build Log:
[...truncated 12651 lines...]
   [junit4] Suite: org.apache.solr.core.TestJmxIntegration
   [junit4]   2> Creating dataDir: /home/jenkins/workspace/Lucene-Solr-8.x-Linux/solr/build/solr-core/test/J0/temp/solr.core.TestJmxIntegration_54B30AC62A2D71E-001/init-core-data-001
   [junit4]   2> 3265 INFO  (SUITE-TestJmxIntegration-seed#[54B30AC62A2D71E]-worker) [    ] o.a.s.SolrTestCaseJ4 Using TrieFields (NUMERIC_POINTS_SYSPROP=false) w/NUMERIC_DOCVALUES_SYSPROP=false
   [junit4]   2> 3364 INFO  (SUITE-TestJmxIntegration-seed#[54B30AC62A2D71E]-worker) [    ] o.e.j.u.log Logging initialized @3370ms to org.eclipse.jetty.util.log.Slf4jLog
   [junit4]   2> 3375 INFO  (SUITE-TestJmxIntegration-seed#[54B30AC62A2D71E]-worker) [    ] o.a.s.SolrTestCaseJ4 Randomized ssl (false) and clientAuth (false) via: @org.apache.solr.util.RandomizeSSL(reason="", value=0.0/0.0, ssl=0.0/0.0, clientAuth=0.0/0.0)
   [junit4]   2> 3394 INFO  (SUITE-TestJmxIntegration-seed#[54B30AC62A2D71E]-worker) [    ] o.a.s.SolrTestCaseJ4 SecureRandom sanity checks: test.solr.allowed.securerandom=null & java.security.egd=file:/dev/./urandom
   [junit4]   2> 3407 INFO  (SUITE-TestJmxIntegration-seed#[54B30AC62A2D71E]-worker) [    ] o.a.s.SolrTestCaseJ4 ####initCore
   [junit4]   2> 3501 INFO  (SUITE-TestJmxIntegration-seed#[54B30AC62A2D71E]-worker) [    ] o.a.s.c.SolrResourceLoader Using system property solr.solr.home: /home/jenkins/workspace/Lucene-Solr-8.x-Linux/solr/core/src/test-files/solr
   [junit4]   2> 3511 INFO  (SUITE-TestJmxIntegration-seed#[54B30AC62A2D71E]-worker) [    ] o.a.s.c.SolrResourceLoader [null] Added 2 libs to classloader, from paths: [/home/jenkins/workspace/Lucene-Solr-8.x-Linux/solr/core/src/test-files/solr/collection1/lib, /home/jenkins/workspace/Lucene-Solr-8.x-Linux/solr/core/src/test-files/solr/collection1/lib/classes]
   [junit4]   2> 3755 INFO  (SUITE-TestJmxIntegration-seed#[54B30AC62A2D71E]-worker) [    ] o.a.s.c.SolrConfig Using Lucene MatchVersion: 8.1.0
   [junit4]   2> 3999 INFO  (SUITE-TestJmxIntegration-seed#[54B30AC62A2D71E]-worker) [    ] o.a.s.s.IndexSchema [null] Schema name=test
   [junit4]   2> 4011 WARN  (SUITE-TestJmxIntegration-seed#[54B30AC62A2D71E]-worker) [    ] o.a.s.c.SolrResourceLoader Solr loaded a deprecated plugin/analysis class [solr.TrieIntField]. Please consult documentation how to replace it accordingly.
   [junit4]   2> 4015 WARN  (SUITE-TestJmxIntegration-seed#[54B30AC62A2D71E]-worker) [    ] o.a.s.c.SolrResourceLoader Solr loaded a deprecated plugin/analysis class [solr.TrieFloatField]. Please consult documentation how to replace it accordingly.
   [junit4]   2> 4019 WARN  (SUITE-TestJmxIntegration-seed#[54B30AC62A2D71E]-worker) [    ] o.a.s.c.SolrResourceLoader Solr loaded a deprecated plugin/analysis class [solr.TrieLongField]. Please consult documentation how to replace it accordingly.
   [junit4]   2> 4023 WARN  (SUITE-TestJmxIntegration-seed#[54B30AC62A2D71E]-worker) [    ] o.a.s.c.SolrResourceLoader Solr loaded a deprecated plugin/analysis class [solr.TrieDoubleField]. Please consult documentation how to replace it accordingly.
   [junit4]   2> 4162 WARN  (SUITE-TestJmxIntegration-seed#[54B30AC62A2D71E]-worker) [    ] o.a.s.c.SolrResourceLoader Solr loaded a deprecated plugin/analysis class [solr.TrieDateField]. Please consult documentation how to replace it accordingly.
   [junit4]   2> 4417 WARN  (SUITE-TestJmxIntegration-seed#[54B30AC62A2D71E]-worker) [    ] o.a.s.c.SolrResourceLoader Solr loaded a deprecated plugin/analysis class [solr.WordDelimiterFilterFactory]. Please consult documentation how to replace it accordingly.
   [junit4]   2> 4531 WARN  (SUITE-TestJmxIntegration-seed#[54B30AC62A2D71E]-worker) [    ] o.a.s.c.SolrResourceLoader Solr loaded a deprecated plugin/analysis class [solr.GeoHashField]. Please consult documentation how to replace it accordingly.
   [junit4]   2> 4535 WARN  (SUITE-TestJmxIntegration-seed#[54B30AC62A2D71E]-worker) [    ] o.a.s.c.SolrResourceLoader Solr loaded a deprecated plugin/analysis class [solr.LatLonType]. Please consult documentation how to replace it accordingly.
   [junit4]   2> 4540 WARN  (SUITE-TestJmxIntegration-seed#[54B30AC62A2D71E]-worker) [    ] o.a.s.c.SolrResourceLoader Solr loaded a deprecated plugin/analysis class [solr.CurrencyField]. Please consult documentation how to replace it accordingly.
   [junit4]   2> 4618 WARN  (SUITE-TestJmxIntegration-seed#[54B30AC62A2D71E]-worker) [    ] o.a.s.c.SolrResourceLoader Solr loaded a deprecated plugin/analysis class [solr.EnumField]. Please consult documentation how to replace it accordingly.
   [junit4]   2> 4775 INFO  (SUITE-TestJmxIntegration-seed#[54B30AC62A2D71E]-worker) [    ] o.a.s.s.IndexSchema Loaded schema test/1.0 with uniqueid field id
   [junit4]   2> 5573 INFO  (SUITE-TestJmxIntegration-seed#[54B30AC62A2D71E]-worker) [    ] o.a.s.h.c.HttpShardHandlerFactory Host whitelist initialized: WhitelistHostChecker [whitelistHosts=null, whitelistHostCheckingEnabled=true]
   [junit4]   2> 5834 WARN  (SUITE-TestJmxIntegration-seed#[54B30AC62A2D71E]-worker) [    ] o.e.j.u.s.S.config No Client EndPointIdentificationAlgorithm configured for SslContextFactory@132bdf3b[provider=null,keyStore=null,trustStore=null]
   [junit4]   2> 6044 WARN  (SUITE-TestJmxIntegration-seed#[54B30AC62A2D71E]-worker) [    ] o.e.j.u.s.S.config No Client EndPointIdentificationAlgorithm configured for SslContextFactory@2d10c1ac[provider=null,keyStore=null,trustStore=null]
   [junit4]   2> 6352 INFO  (SUITE-TestJmxIntegration-seed#[54B30AC62A2D71E]-worker) [    ] o.a.s.c.TransientSolrCoreCacheDefault Allocating transient cache for 2147483647 transient cores
   [junit4]   2> 6354 INFO  (SUITE-TestJmxIntegration-seed#[54B30AC62A2D71E]-worker) [    ] o.a.s.h.a.MetricsHistoryHandler No .system collection, keeping metrics history in memory.
   [junit4]   2> 6515 INFO  (SUITE-TestJmxIntegration-seed#[54B30AC62A2D71E]-worker) [    ] o.a.s.m.r.SolrJmxReporter JMX monitoring for 'solr.node' (registry 'solr.node') enabled at server: com.sun.jmx.mbeanserver.JmxMBeanServer@7cb3b793
   [junit4]   2> 6516 INFO  (SUITE-TestJmxIntegration-seed#[54B30AC62A2D71E]-worker) [    ] o.a.s.m.r.SolrJmxReporter JMX monitoring for 'solr.jvm' (registry 'solr.jvm') enabled at server: com.sun.jmx.mbeanserver.JmxMBeanServer@7cb3b793
   [junit4]   2> 6516 INFO  (SUITE-TestJmxIntegration-seed#[54B30AC62A2D71E]-worker) [    ] o.a.s.m.r.SolrJmxReporter JMX monitoring for 'solr.jetty' (registry 'solr.jetty') enabled at server: com.sun.jmx.mbeanserver.JmxMBeanServer@7cb3b793
   [junit4]   2> 6590 INFO  (coreLoadExecutor-9-thread-1) [    x:collection1] o.a.s.c.SolrResourceLoader [null] Added 2 libs to classloader, from paths: [/home/jenkins/workspace/Lucene-Solr-8.x-Linux/solr/core/src/test-files/solr/collection1/lib, /home/jenkins/workspace/Lucene-Solr-8.x-Linux/solr/core/src/test-files/solr/collection1/lib/classes]
   [junit4]   2> 6731 INFO  (coreLoadExecutor-9-thread-1) [    x:collection1] o.a.s.c.SolrConfig Using Lucene MatchVersion: 8.1.0
   [junit4]   2> 6851 INFO  (coreLoadExecutor-9-thread-1) [    x:collection1] o.a.s.s.IndexSchema [collection1] Schema name=test
   [junit4]   2> 7182 INFO  (coreLoadExecutor-9-thread-1) [    x:collection1] o.a.s.s.IndexSchema Loaded schema test/1.0 with uniqueid field id
   [junit4]   2> 7252 INFO  (coreLoadExecutor-9-thread-1) [    x:collection1] o.a.s.c.CoreContainer Creating SolrCore 'collection1' using configuration from instancedir /home/jenkins/workspace/Lucene-Solr-8.x-Linux/solr/core/src/test-files/solr/collection1, trusted=true
   [junit4]   2> 7316 INFO  (coreLoadExecutor-9-thread-1) [    x:collection1] o.a.s.m.r.SolrJmxReporter JMX monitoring for 'solr.core.collection1' (registry 'solr.core.collection1') enabled at server: com.sun.jmx.mbeanserver.JmxMBeanServer@7cb3b793
   [junit4]   2> 7329 INFO  (coreLoadExecutor-9-thread-1) [    x:collection1] o.a.s.c.SolrCore [[collection1] ] Opening new SolrCore at [/home/jenkins/workspace/Lucene-Solr-8.x-Linux/solr/core/src/test-files/solr/collection1], dataDir=[/home/jenkins/workspace/Lucene-Solr-8.x-Linux/solr/build/solr-core/test/J0/temp/solr.core.TestJmxIntegration_54B30AC62A2D71E-001/init-core-data-001/]
   [junit4]   2> 7370 INFO  (coreLoadExecutor-9-thread-1) [    x:collection1] o.a.s.u.RandomMergePolicy RandomMergePolicy wrapping class org.apache.lucene.index.LogDocMergePolicy: [LogDocMergePolicy: minMergeSize=1000, mergeFactor=31, maxMergeSize=9223372036854775807, maxMergeSizeForForcedMerge=9223372036854775807, calibrateSizeByDeletes=true, maxMergeDocs=2147483647, maxCFSSegmentSizeMB=8.796093022207999E12, noCFSRatio=0.18581625122836726]
   [junit4]   2> 7956 INFO  (coreLoadExecutor-9-thread-1) [    x:collection1] o.a.s.u.UpdateHandler Using UpdateLog implementation: org.apache.solr.update.UpdateLog
   [junit4]   2> 7957 INFO  (coreLoadExecutor-9-thread-1) [    x:collection1] o.a.s.u.UpdateLog Initializing UpdateLog: dataDir= defaultSyncLevel=FLUSH numRecordsToKeep=100 maxNumLogsToKeep=10 numVersionBuckets=65536
   [junit4]   2> 7970 INFO  (coreLoadExecutor-9-thread-1) [    x:collection1] o.a.s.u.CommitTracker Hard AutoCommit: disabled
   [junit4]   2> 7970 INFO  (coreLoadExecutor-9-thread-1) [    x:collection1] o.a.s.u.CommitTracker Soft AutoCommit: disabled
   [junit4]   2> 7973 INFO  (coreLoadExecutor-9-thread-1) [    x:collection1] o.a.s.u.RandomMergePolicy RandomMergePolicy wrapping class org.apache.lucene.index.LogByteSizeMergePolicy: [LogByteSizeMergePolicy: minMergeSize=1677721, mergeFactor=28, maxMergeSize=2147483648, maxMergeSizeForForcedMerge=9223372036854775807, calibrateSizeByDeletes=false, maxMergeDocs=2147483647, maxCFSSegmentSizeMB=8.796093022207999E12, noCFSRatio=0.0]
   [junit4]   2> 7982 INFO  (coreLoadExecutor-9-thread-1) [    x:collection1] o.a.s.s.SolrIndexSearcher Opening [Searcher@4555ba55[collection1] main]
   [junit4]   2> 8003 INFO  (coreLoadExecutor-9-thread-1) [    x:collection1] o.a.s.h.c.SpellCheckComponent Initializing spell checkers
   [junit4]   2> 8152 INFO  (coreLoadExecutor-9-thread-1) [    x:collection1] o.a.s.s.DirectSolrSpellChecker init: {name=direct,classname=DirectSolrSpellChecker,field=lowerfilt,minQueryLength=3}
   [junit4]   2> 8266 INFO  (coreLoadExecutor-9-thread-1) [    x:collection1] o.a.s.h.ReplicationHandler Commits will be reserved for 10000ms.
   [junit4]   2> 8269 INFO  (coreLoadExecutor-9-thread-1) [    x:collection1] o.a.s.u.UpdateLog Could not find max version in index or recent updates, using new clock 1626213130087432192
   [junit4]   2> 8277 INFO  (searcherExecutor-10-thread-1-processing-x:collection1) [    x:collection1] o.a.s.h.c.SpellCheckComponent Loading spell index for spellchecker: default
   [junit4]   2> 8280 INFO  (SUITE-TestJmxIntegration-seed#[54B30AC62A2D71E]-worker) [    ] o.a.s.SolrTestCaseJ4 ####initCore end
   [junit4]   2> 8281 INFO  (searcherExecutor-10-thread-1-processing-x:collection1) [    x:collection1] o.a.s.h.c.SpellCheckComponent Loading spell index for spellchecker: direct
   [junit4]   2> 8281 INFO  (searcherExecutor-10-thread-1-processing-x:collection1) [    x:collection1] o.a.s.h.c.SpellCheckComponent Loading spell index for spellchecker: wordbreak
   [junit4]   2> 8281 INFO  (searcherExecutor-10-thread-1-processing-x:collection1) [    x:collection1] o.a.s.h.c.SpellCheckComponent Loading spell index for spellchecker: multipleFields
   [junit4]   2> 8282 INFO  (searcherExecutor-10-thread-1-processing-x:collection1) [    x:collection1] o.a.s.h.c.SpellCheckComponent Loading spell index for spellchecker: jarowinkler
   [junit4]   2> 8282 INFO  (searcherExecutor-10-thread-1-processing-x:collection1) [    x:collection1] o.a.s.h.c.SpellCheckComponent Loading spell index for spellchecker: external
   [junit4]   2> 8283 INFO  (searcherExecutor-10-thread-1-processing-x:collection1) [    x:collection1] o.a.s.h.c.SpellCheckComponent Loading spell index for spellchecker: freq
   [junit4]   2> 8283 INFO  (searcherExecutor-10-thread-1-processing-x:collection1) [    x:collection1] o.a.s.h.c.SpellCheckComponent Loading spell index for spellchecker: fqcn
   [junit4]   2> 8284 INFO  (searcherExecutor-10-thread-1-processing-x:collection1) [    x:collection1] o.a.s.h.c.SpellCheckComponent Loading spell index for spellchecker: perDict
   [junit4]   2> 8289 INFO  (searcherExecutor-10-thread-1-processing-x:collection1) [    x:collection1] o.a.s.c.SolrCore [collection1] Registered new searcher Searcher@4555ba55[collection1] main{ExitableDirectoryReader(UninvertingDirectoryReader())}
   [junit4]   2> 8292 INFO  (TEST-TestJmxIntegration.testJmxUpdate-seed#[54B30AC62A2D71E]) [    ] o.a.s.SolrTestCaseJ4 ###Starting testJmxUpdate
   [junit4]   2> 8314 INFO  (TEST-TestJmxIntegration.testJmxUpdate-seed#[54B30AC62A2D71E]) [    ] o.a.s.u.DirectUpdateHandler2 [collection1] REMOVING ALL DOCUMENTS FROM INDEX
   [junit4]   2> 8315 INFO  (TEST-TestJmxIntegration.testJmxUpdate-seed#[54B30AC62A2D71E]) [    ] o.a.s.s.SolrIndexSearcher Opening [Searcher@6840b757[collection1] realtime]
   [junit4]   2> 8316 INFO  (TEST-TestJmxIntegration.testJmxUpdate-seed#[54B30AC62A2D71E]) [    ] o.a.s.u.p.LogUpdateProcessorFactory [collection1]  webapp=null path=null params={_version_=-9223372036854775807&update.distrib=FROMLEADER&versions=true&wt=json&indent=true}{deleteByQuery=*:* (-9223372036854775807)} 0 21
   [junit4]   2> 8343 INFO  (TEST-TestJmxIntegration.testJmxUpdate-seed#[54B30AC62A2D71E]) [    ] o.a.s.u.DirectUpdateHandler2 start commit{_version_=1626213130165026816,optimize=false,openSearcher=true,waitSearcher=true,expungeDeletes=false,softCommit=false,prepareCommit=false}
   [junit4]   2> 8343 INFO  (TEST-TestJmxIntegration.testJmxUpdate-seed#[54B30AC62A2D71E]) [    ] o.a.s.u.SolrIndexWriter Calling setCommitData with IW:org.apache.solr.update.SolrIndexWriter@1c272480 commitCommandVersion:1626213130165026816
   [junit4]   2> 8345 INFO  (TEST-TestJmxIntegration.testJmxUpdate-seed#[54B30AC62A2D71E]) [    ] o.a.s.s.SolrIndexSearcher Opening [Searcher@7cf0e638[collection1] main]
   [junit4]   2> 8346 INFO  (TEST-TestJmxIntegration.testJmxUpdate-seed#[54B30AC62A2D71E]) [    ] o.a.s.u.DirectUpdateHandler2 end_commit_flush
   [junit4]   2> 8357 INFO  (searcherExecutor-10-thread-1) [    ] o.a.s.c.SolrCore [collection1] Registered new searcher Searcher@7cf0e638[collection1] main{ExitableDirectoryReader(UninvertingDirectoryReader())}
   [junit4]   2> 8358 INFO  (TEST-TestJmxIntegration.testJmxUpdate-seed#[54B30AC62A2D71E]) [    ] o.a.s.u.p.LogUpdateProcessorFactory [collection1]  webapp=null path=null params={}{commit=} 0 39
   [junit4]   2> 8373 INFO  (TEST-TestJmxIntegration.testJmxUpdate-seed#[54B30AC62A2D71E]) [    ] o.a.s.c.TestJmxIntegration Mbeans in server: [solr:dom1=core,dom2=collection1,category=QUERY,scope=/terms,name=serverErrors, solr:dom1=core,dom2=collection1,category=QUERY,scope=/dismax,name=handlerStart, solr:dom1=core,dom2=collection1,category=QUERY,scope=/mock,name=requests, java.lang:type=Threading, solr:dom1=node,category=QUERY,scope=/admin/metrics/collector,name=handlerStart, solr:dom1=node,category=ADMIN,scope=/admin/metrics,name=requests, solr:dom1=core,dom2=collection1,category=ADMIN,scope=/admin/mbeans,name=shardRequests, solr:dom1=core,dom2=collection1,category=QUERY,scope=/mock,name=errors, solr:dom1=core,dom2=collection1,category=QUERY,scope=/get,name=errors, solr:dom1=core,dom2=collection1,category=QUERY,scope=/spellCheckCompRH1,name=requestTimes, solr:dom1=core,dom2=collection1,category=QUERY,scope=/defaults,name=serverErrors, solr:dom1=core,dom2=collection1,category=QUERY,scope=/search-facet-def,name=requestTimes, solr:dom1=core,dom2=collection1,category=UPDATE,scope=update,name=requestTimes, solr:dom1=core,dom2=collection1,category=UPDATE,scope=/update,name=timeouts, solr:dom1=core,dom2=collection1,category=QUERY,scope=/spellCheckWithWordbreak,name=shardRequests, solr:dom1=node,category=QUERY,scope=httpShardHandler,name=threadPool.httpShardExecutor.duration, solr:dom1=core,dom2=collection1,category=QUERY,scope=/mock,name=handlerStart, org.apache.logging.log4j2:type=4e0e2f2a,component=Loggers,name=org.apache.solr.hadoop,subtype=RingBuffer, solr:dom1=node,category=QUERY,scope=/admin/metrics/history,name=requests, solr:dom1=node,category=ADMIN,scope=/admin/metrics,name=serverErrors, solr:dom1=core,dom2=collection1,category=UPDATE,scope=/update,name=handlerStart, solr:dom1=core,dom2=collection1,category=UPDATE,scope=/update,name=totalTime, solr:dom1=core,dom2=collection1,category=ADMIN,scope=/admin/luke,name=requests, solr:dom1=core,dom2=collection1,category=QUERY,scope=/search-facet-def,name=timeouts, solr:dom1=core,dom2=collection1,category=UPDATE,scope=updateHandler,name=rollbacks, solr:dom1=node,category=UPDATE,scope=updateShardHandler,name=threadPool.recoveryExecutor.submitted, solr:dom1=node,category=ADMIN,scope=/admin/cores,name=serverErrors, solr:dom1=core,dom2=collection1,category=QUERY,scope=/stream,name=requestTimes, solr:dom1=core,dom2=collection1,category=ADMIN,scope=/admin/system,name=shardRequests, solr:dom1=core,dom2=collection1,category=QUERY,scope=/dismax,name=clientErrors, solr:dom1=node,category=CONTAINER,scope=threadPool,name=coreContainerWorkExecutor.running, solr:dom1=core,dom2=collection1,category=QUERY,scope=/graph,name=clientErrors, solr:dom1=core,dom2=collection1,category=UPDATE,scope=/update/json,name=timeouts, solr:dom1=core,dom2=collection1,category=QUERY,scope=/terms,name=timeouts, solr:dom1=core,dom2=collection1,category=QUERY,scope=/mltrh,name=shardRequests, solr:dom1=node,category=ADMIN,scope=/admin/collections,name=requestTimes, solr:dom1=core,dom2=collection1,category=SEARCHER,scope=searcher,name=reader, solr:dom1=core,dom2=collection1,category=HIGHLIGHTER,scope=SolrFragmenter,name=gap.requests, solr:dom1=core,dom2=collection1,category=QUERY,scope=/export,name=requestTimes, solr:dom1=core,dom2=collection1,category=HIGHLIGHTER,scope=SolrBoundaryScanner,name=breakIterator.requests, solr:dom1=node,category=ADMIN,scope=/admin/authorization,name=requestTimes, solr:dom1=core,dom2=collection1,category=QUERY,scope=/debug/dump,name=shardRequests, solr:dom1=node,category=ADMIN,scope=/admin/collections,name=handlerStart, solr:dom1=core,dom2=collection1,category=ADMIN,scope=/admin/segments,name=totalTime, solr:dom1=node,category=ADMIN,scope=/admin/autoscaling/history,name=clientErrors, solr:dom1=core,dom2=collection1,category=ADMIN,scope=/admin/ping,name=errors, solr:dom1=node,category=QUERY,scope=/admin/metrics/history,name=shardRequests, solr:dom1=core,dom2=collection1,category=ADMIN,scope=/schema,name=clientErrors, solr:dom1=core,dom2=collection1,category=ADMIN,scope=/admin/health,name=shardRequests, solr:dom1=core,dom2=collection1,category=QUERY,scope=/stream,name=timeouts, org.apache.logging.log4j2:type=4e0e2f2a,component=Loggers,name=,subtype=RingBuffer, solr:dom1=core,dom2=collection1,category=UPDATE,scope=updateHandler,name=errors, solr:dom1=core,dom2=collection1,category=ADMIN,scope=/admin/file,name=errors, solr:dom1=core,dom2=collection1,category=QUERY,scope=/sql,name=requests, solr:dom1=core,dom2=collection1,category=ADMIN,scope=/admin/logging,name=shardRequests, solr:dom1=core,dom2=collection1,category=TLOG,name=state, solr:dom1=core,dom2=collection1,category=CORE,scope=fs,name=spins, solr:dom1=core,dom2=collection1,category=QUERY,scope=/search-facet-def,name=errors, solr:dom1=node,category=ADMIN,scope=/admin/cores,name=threadPool.parallelCoreAdminExecutor.submitted, solr:dom1=core,dom2=collection1,category=TLOG,scope=replay,name=remaining.bytes, solr:dom1=core,dom2=collection1,category=ADMIN,scope=/admin/properties,name=timeouts, solr:dom1=node,category=CONTAINER,scope=cores,name=loaded, solr:dom1=core,dom2=collection1,category=ADMIN,scope=/schema,name=handlerStart, solr:dom1=node,category=ADMIN,scope=/admin/autoscaling/history,name=timeouts, solr:dom1=node,category=ADMIN,scope=/admin/authorization,name=handlerStart, solr:dom1=core,dom2=collection1,category=ADMIN,scope=/admin/luke,name=shardRequests, solr:dom1=core,dom2=collection1,category=QUERY,scope=/mltrh,name=totalTime, solr:dom1=core,dom2=collection1,category=UPDATE,scope=/update,name=clientErrors, solr:dom1=core,dom2=collection1,category=QUERY,scope=/search-facet-invariants,name=clientErrors, solr:dom1=core,dom2=collection1,category=QUERY,scope=/export,name=totalTime, solr:dom1=core,dom2=collection1,category=SEARCHER,scope=new,name=errors, solr:dom1=core,dom2=collection1,category=QUERY,scope=/sql,name=timeouts, solr:dom1=core,dom2=collection1,category=ADMIN,scope=/config,name=clientErrors, solr:dom1=core,dom2=collection1,category=UPDATE,scope=/update/csv,name=handlerStart, solr:dom1=node,category=QUERY,scope=httpShardHandler,name=threadPool.httpShardExecutor.completed, solr:dom1=core,dom2=collection1,category=QUERY,scope=/debug/dump,name=clientErrors, solr:dom1=core,dom2=collection1,category=REPLICATION,scope=/replication,name=handlerStart, solr:dom1=core,dom2=collection1,category=QUERY,scope=/graph,name=serverErrors, solr:dom1=core,dom2=collection1,category=QUERY,scope=/spellCheckWithWordbreak_Direct,name=serverErrors, java.lang:type=Runtime, solr:dom1=core,dom2=collection1,category=UPDATE,scope=updateHandler,name=cumulativeDeletesById, solr:dom1=core,dom2=collection1,category=QUERY,scope=/defaults,name=timeouts, solr:dom1=core,dom2=collection1,category=UPDATE,scope=updateHandler,name=cumulativeDeletesByQuery, solr:dom1=core,dom2=collection1,category=QUERY,scope=/dismax,name=timeouts, solr:dom1=node,category=ADMIN,scope=/admin/authorization,name=errors, solr:dom1=node,category=UPDATE,scope=updateShardHandler,name=threadPool.recoveryExecutor.duration, solr:dom1=core,dom2=collection1,category=QUERY,scope=/spellCheckWithWordbreak_Direct,name=timeouts, solr:dom1=core,dom2=collection1,category=CORE,scope=fs,name=totalSpace, solr:dom1=core,dom2=collection1,category=QUERY,scope=/spellCheckCompRH_Direct,name=clientErrors, solr:dom1=core,dom2=collection1,category=QUERY,scope=/terms,name=clientErrors, solr:dom1=core,dom2=collection1,category=ADMIN,scope=/admin/mbeans,name=serverErrors, solr:dom1=core,dom2=collection1,category=QUERY,scope=/search-facet-def,name=handlerStart, solr:dom1=node,category=CONTAINER,scope=threadPool,name=coreContainerWorkExecutor.duration, solr:dom1=core,dom2=collection1,category=QUERY,scope=/spellCheckWithWordbreak_Direct,name=requests, solr:dom1=node,category=ADMIN,scope=/admin/zookeeper,name=clientErrors, solr:dom1=core,dom2=collection1,category=ADMIN,scope=/admin/segments,name=timeouts, solr:dom1=core,dom2=collection1,category=QUERY,scope=/spellCheckWithWordbreak_Direct,name=clientErrors, solr:dom1=node,category=UPDATE,scope=updateShardHandler,name=threadPool.updateOnlyExecutor.running, org.apache.logging.log4j2:type=4e0e2f2a, solr:dom1=node,category=CONTAINER,scope=cores,name=unloaded, solr:dom1=node,category=ADMIN,scope=/admin/metrics,name=requestTimes, solr:dom1=core,dom2=collection1,category=QUERY,scope=/search-facet-invariants,name=serverErrors, java.lang:name=PS Eden Space,type=MemoryPool, solr:dom1=node,category=ADMIN,scope=/admin/metrics,name=timeouts, solr:dom1=core,dom2=collection1,category=CORE,scope=fs,name=usableSpace, solr:dom1=core,dom2=collection1,category=QUERY,scope=/spellCheckCompRH,name=serverErrors, solr:dom1=core,dom2=collection1,category=UPDATE,scope=updateHandler,name=cumulativeErrors, java.lang:name=PS Survivor Space,type=MemoryPool, solr:dom1=node,category=QUERY,scope=/admin/metrics/collector,name=requestTimes, solr:dom1=core,dom2=collection1,category=QUERY,scope=/spellCheckCompRH,name=errors, solr:dom1=core,dom2=collection1,category=QUERY,scope=/mlt,name=handlerStart, solr:dom1=node,category=UPDATE,scope=updateShardHandler,name=threadPool.recoveryExecutor.running, solr:dom1=core,dom2=collection1,category=QUERY,scope=/spellCheckWithWordbreak,name=timeouts, solr:dom1=core,dom2=collection1,category=UPDATE,scope=/update,name=requestTimes, solr:dom1=core,dom2=collection1,category=QUERY,scope=/spellCheckWithWordbreak,name=errors, solr:dom1=node,category=CONTAINER,scope=fs,name=path, solr:dom1=node,category=ADMIN,scope=/admin/zookeeper,name=timeouts, solr:dom1=node,category=ADMIN,scope=/admin/authorization,name=timeouts, solr:dom1=core,dom2=collection1,category=SEARCHER,scope=searcher,name=caching, solr:dom1=node,category=ADMIN,scope=/admin/zookeeper/status,name=serverErrors, solr:dom1=core,dom2=collection1,category=QUERY,scope=/mock,name=serverErrors, solr:dom1=core,dom2=collection1,category=HIGHLIGHTER,scope=SolrFormatter,name=html.requests, solr:dom1=node,category=CONTAINER,scope=fs,name=spins, solr:dom1=node,category=ADMIN,scope=/admin/cores,name=clientErrors, solr:dom1=core,dom2=collection1,category=UPDATE,scope=updateHandler,name=deletesByQuery, solr:dom1=core,dom2=collection1,category=ADMIN,scope=/schema,name=tim...
   [junit4]   2> 8429 INFO  (TEST-TestJmxIntegration.testJmxUpdate-seed#[54B30AC62A2D71E]) [    ] o.a.s.u.p.LogUpdateProcessorFactory [collection1]  webapp=null path=null params={}{add=[1 (1626213130205921280)]} 0 49
   [junit4]   2> 8430 INFO  (TEST-TestJmxIntegration.testJmxUpdate-seed#[54B30AC62A2D71E]) [    ] o.a.s.u.DirectUpdateHandler2 start commit{_version_=1626213130256252928,optimize=false,openSearcher=true,waitSearcher=true,expungeDeletes=false,softCommit=false,prepareCommit=false}
   [junit4]   2> 8430 INFO  (TEST-TestJmxIntegration.testJmxUpdate-seed#[54B30AC62A2D71E]) [    ] o.a.s.u.SolrIndexWriter Calling setCommitData with IW:org.apache.solr.update.SolrIndexWriter@1c272480 commitCommandVersion:1626213130256252928
   [junit4]   2> 8510 INFO  (TEST-TestJmxIntegration.testJmxUpdate-seed#[54B30AC62A2D71E]) [    ] o.a.s.s.SolrIndexSearcher Opening [Searcher@7919673f[collection1] main]
   [junit4]   2> 8511 INFO  (TEST-TestJmxIntegration.testJmxUpdate-seed#[54B30AC62A2D71E]) [    ] o.a.s.u.DirectUpdateHandler2 end_commit_flush
   [junit4]   2> 8517 INFO  (searcherExecutor-10-thread-1) [    ] o.a.s.c.SolrCore [collection1] Registered new searcher Searcher@7919673f[collection1] main{ExitableDirectoryReader(UninvertingDirectoryReader(Uninverting(_0(8.1.0):C1:[diagnostics={os=Linux, java.vendor=Oracle Corporation, java.version=13-ea, java.vm.version=13-ea+8, lucene.version=8.1.0, os.arch=amd64, java.runtime.version=13-ea+8, source=flush, os.version=4.18.0-15-generic, timestamp=1550877695373}])))}
   [junit4]   2> 8517 INFO  (TEST-TestJmxIntegration.testJmxUpdate-seed#[54B30AC62A2D71E]) [    ] o.a.s.u.p.LogUpdateProcessorFactory [collection1]  webapp=null path=null params={}{commit=} 0 87
   [junit4]   2> 8520 INFO  (TEST-TestJmxIntegration.testJmxUpdate-seed#[54B30AC62A2D71E]) [    ] o.a.s.SolrTestCaseJ4 ###Ending testJmxUpdate
   [junit4]   2> 8527 INFO  (TEST-TestJmxIntegration.testJmxOnCoreReload-seed#[54B30AC62A2D71E]) [    ] o.a.s.SolrTestCaseJ4 ###Starting testJmxOnCoreReload
   [junit4]   2> 8527 INFO  (TEST-TestJmxIntegration.testJmxOnCoreReload-seed#[54B30AC62A2D71E]) [    ] o.a.s.u.DirectUpdateHandler2 [collection1] REMOVING ALL DOCUMENTS FROM INDEX
   [junit4]   2> 8528 INFO  (TEST-TestJmxIntegration.testJmxOnCoreReload-seed#[54B30AC62A2D71E]) [    ] o.a.s.s.SolrIndexSearcher Opening [Searcher@116cc031[collection1] realtime]
   [junit4]   2> 8528 INFO  (TEST-TestJmxIntegration.testJmxOnCoreReload-seed#[54B30AC62A2D71E]) [    ] o.a.s.u.p.LogUpdateProcessorFactory [collection1]  webapp=null path=null params={_version_=-9223372036854775807&update.distrib=FROMLEADER&versions=true&wt=json&indent=true}{deleteByQuery=*:* (-9223372036854775807)} 0 1
   [junit4]   2> 8529 INFO  (TEST-TestJmxIntegration.testJmxOnCoreReload-seed#[54B30AC62A2D71E]) [    ] o.a.s.u.DirectUpdateHandler2 start commit{_version_=1626213130360061952,optimize=false,openSearcher=true,waitSearcher=true,expungeDeletes=false,softCommit=false,prepareCommit=false}
   [junit4]   2> 8529 INFO  (TEST-TestJmxIntegration.testJmxOnCoreReload-seed#[54B30AC62A2D71E]) [    ] o.a.s.u.SolrIndexWriter Calling setCommitData with IW:org.apache.solr.update.SolrIndexWriter@1c272480 commitCommandVersion:1626213130360061952
   [junit4]   2> 8530 INFO  (TEST-TestJmxIntegration.testJmxOnCoreReload-seed#[54B30AC62A2D71E]) [    ] o.a.s.s.SolrIndexSearcher Opening [Searcher@7fd4c55b[collection1] main]
   [junit4]   2> 8530 INFO  (TEST-TestJmxIntegration.testJmxOnCoreReload-seed#[54B30AC62A2D71E]) [    ] o.a.s.u.DirectUpdateHandler2 end_commit_flush
   [junit4]   2> 8535 INFO  (searcherExecutor-10-thread-1) [    ] o.a.s.c.SolrCore [collection1] Registered new searcher Searcher@7fd4c55b[collection1] main{ExitableDirectoryReader(UninvertingDirectoryReader())}
   [junit4]   2> 8544 INFO  (TEST-TestJmxIntegration.testJmxOnCoreReload-seed#[54B30AC62A2D71E]) [    ] o.a.s.u.p.LogUpdateProcessorFactory [collection1]  webapp=null path=null params={}{commit=} 0 15
   [junit4]   2> 8552 INFO  (TEST-TestJmxIntegration.testJmxOnCoreReload-seed#[54B30AC62A2D71E]) [    ] o.a.s.c.S.Request [collection1]  webapp=null path=null params={q=*:*&wt=xml} hits=0 status=0 QTime=7
   [junit4]   2> 8577 INFO  (TEST-TestJmxIntegration.testJmxOnCoreReload-seed#[54B30AC62A2D71E]) [    ] o.a.s.c.TestJmxIntegration Before Reload: size of all core metrics: 443 MBeans: 443
   [junit4]   2> 8580 ERROR (TEST-TestJmxIntegration.testJmxOnCoreReload-seed#[54B30AC62A2D71E]) [    ] o.a.s.c.CorePropertiesLocator Couldn't load core descriptor from /home/jenkins/workspace/Lucene-Solr-8.x-Linux/solr/core/src/test-files/solr/collection1/core.properties:java.nio.file.NoSuchFileException: /home/jenkins/workspace/Lucene-Solr-8.x-Linux/solr/core/src/test-files/solr/collection1/core.properties
   [junit4]   2> 8580 INFO  (TEST-TestJmxIntegration.testJmxOnCoreReload-seed#[54B30AC62A2D71E]) [    ] o.a.s.c.SolrResourceLoader [null] Added 2 libs to classloader, from paths: [/home/jenkins/workspace/Lucene-Solr-8.x-Linux/solr/core/src/test-files/solr/collection1/lib, /home/jenkins/workspace/Lucene-Solr-8.x-Linux/solr/core/src/test-files/solr/collection1/lib/classes]
   [junit4]   2> 8643 INFO  (TEST-TestJmxIntegration.testJmxOnCoreReload-seed#[54B30AC62A2D71E]) [    ] o.a.s.c.SolrConfig Using Lucene MatchVersion: 8.1.0
   [junit4]   2> 8692 INFO  (TEST-TestJmxIntegration.testJmxOnCoreReload-seed#[54B30AC62A2D71E]) [    ] o.a.s.s.IndexSchema [collection1] Schema name=test
   [junit4]   2> 8847 INFO  (TEST-TestJmxIntegration.testJmxOnCoreReload-seed#[54B30AC62A2D71E]) [    ] o.a.s.s.IndexSchema Loaded schema test/1.0 with uniqueid field id
   [junit4]   2> 8873 INFO  (TEST-TestJmxIntegration.testJmxOnCoreReload-seed#[54B30AC62A2D71E]) [    ] o.a.s.c.CoreContainer Reloading SolrCore 'collection1' using configuration from instancedir /home/jenkins/workspace/Lucene-Solr-8.x-Linux/solr/core/src/test-files/solr/collection1
   [junit4]   2> 8933 INFO  (TEST-TestJmxIntegration.testJmxOnCoreReload-seed#[54B30AC62A2D71E]) [    x:collection1] o.a.s.m.r.SolrJmxReporter JMX monitoring for 'solr.core.collection1' (registry 'solr.core.collection1') enabled at server: com.sun.jmx.mbeanserver.JmxMBeanServer@7cb3b793
   [junit4]   2> 8933 INFO  (TEST-TestJmxIntegration.testJmxOnCoreReload-seed#[54B30AC62A2D71E]) [    x:collection1] o.a.s.c.SolrCore [[collection1] ] Opening new SolrCore at [/home/jenkins/workspace/Lucene-Solr-8.x-Linux/solr/core/src/test-files/solr/collection1], dataDir=[/home/jenkins/workspace/Lucene-Solr-8.x-Linux/solr/build/solr-core/test/J0/temp/solr.core.TestJmxIntegration_54B30AC62A2D71E-001/init-core-data-001/]
   [junit4]   2> 9059 INFO  (TEST-TestJmxIntegration.testJmxOnCoreReload-seed#[54B30AC62A2D71E]) [    x:collection1] o.a.s.u.CommitTracker Hard AutoCommit: disabled
   [junit4]   2> 9059 INFO  (TEST-TestJmxIntegration.testJmxOnCoreReload-seed#[54B30AC62A2D71E]) [    x:collection1] o.a.s.u.CommitTracker Soft AutoCommit: disabled
   [junit4]   2> 9062 INFO  (TEST-TestJmxIntegration.testJmxOnCoreReload-seed#[54B30AC62A2D71E]) [    x:collection1] o.a.s.s.SolrIndexSearcher Opening [Searcher@7bd042e3[collection1] main]
   [junit4]   2> 9063 INFO  (TEST-TestJmxIntegration.testJmxOnCoreReload-seed#[54B30AC62A2D71E]) [    x:collection1] o.a.s.h.c.SpellCheckComponent Initializing spell checkers
   [junit4]   2> 9064 INFO  (TEST-TestJmxIntegration.testJmxOnCoreReload-seed#[54B30AC62A2D71E]) [    x:collection1] o.a.s.s.DirectSolrSpellChecker init: {name=direct,classname=DirectSolrSpellChecker,field=lowerfilt,minQueryLength=3}
   [junit4]   2> 9077 INFO  (TEST-TestJmxIntegration.testJmxOnCoreReload-seed#[54B30AC62A2D71E]) [    x:collection1] o.a.s.h.ReplicationHandler Commits will be reserved for 10000ms.
   [junit4]   2> 9082 INFO  (searcherExecutor-15-thread-1-processing-x:collection1) [    x:collection1] o.a.s.h.c.SpellCheckComponent Loading spell index for spellchecker: default
   [junit4]   2> 9083 INFO  (TEST-TestJmxIntegration.testJmxOnCoreReload-seed#[54B30AC62A2D71E]) [    x:collection1] o.a.s.u.RandomMergePolicy RandomMergePolicy wrapping class org.apache.lucene.index.LogByteSizeMergePolicy: [LogByteSizeMergePolicy: minMergeSize=1677721, mergeFactor=36, maxMergeSize=2147483648, maxMergeSizeForForcedMerge=9223372036854775807, calibrateSizeByDeletes=true, maxMergeDocs=2147483647, maxCFSSegmentSizeMB=8.796093022207999E12, noCFSRatio=0.22183030890992825]
   [junit4]   2> 9084 INFO  (TEST-TestJmxIntegration.testJmxOnCoreReload-seed#[54B30AC62A2D71E]) [    x:collection1] o.a.s.u.DefaultSolrCoreState New IndexWriter is ready to be used.
   [junit4]   2> 9091 INFO  (searcherExecutor-15-thread-1-processing-x:collection1) [    x:collection1] o.a.s.h.c.SpellCheckComponent Loading spell index for spellchecker: direct
   [junit4]   2> 9091 INFO  (searcherExecutor-15-thread-1-processing-x:collection1) [    x:collection1] o.a.s.h.c.SpellCheckComponent Loading spell index for spellchecker: wordbreak
   [junit4]   2> 9091 INFO  (searcherExecutor-15-thread-1-processing-x:collection1) [    x:collection1] o.a.s.h.c.SpellCheckComponent Loading spell index for spellchecker: multipleFields
   [junit4]   2> 9092 INFO  (searcherExecutor-15-thread-1-processing-x:collection1) [    x:collection1] o.a.s.h.c.SpellCheckComponent Loading spell index for spellchecker: jarowinkler
   [junit4]   2> 9092 INFO  (searcherExecutor-15-thread-1-processing-x:collection1) [    x:collection1] o.a.s.h.c.SpellCheckComponent Loading spell index for spellchecker: external
   [junit4]   2> 9093 INFO  (searcherExecutor-15-thread-1-processing-x:collection1) [    x:collection1] o.a.s.h.c.SpellCheckComponent Loading spell index for spellchecker: freq
   [junit4]   2> 9098 INFO  (searcherExecutor-15-thread-1-processing-x:collection1) [    x:collection1] o.a.s.h.c.SpellCheckComponent Loading spell index for spellchecker: fqcn
   [junit4]   2> 9099 INFO  (searcherExecutor-15-thread-1-processing-x:collection1) [    x:collection1] o.a.s.h.c.SpellCheckComponent Loading spell index for spellchecker: perDict
   [junit4]   2> 9107 INFO  (searcherExecutor-15-thread-1-processing-x:collection1) [    x:collection1] o.a.s.c.SolrCore [collection1] Registered new searcher Searcher@7bd042e3[collection1] main{ExitableDirectoryReader(UninvertingDirectoryReader())}
   [junit4]   2> 9108 INFO  (TEST-TestJmxIntegration.testJmxOnCoreReload-seed#[54B30AC62A2D71E]) [    x:collection1] o.a.s.s.SolrIndexSearcher Opening [Searcher@7abecc5b[collection1] main]
   [junit4]   2> 9109 INFO  (TEST-TestJmxIntegration.testJmxOnCoreReload-seed#[54B30AC62A2D71E]) [    x:collection1] o.a.s.c.SolrCore [collection1]  CLOSING SolrCore org.apache.solr.core.SolrCore@6d8ef64a
   [junit4]   2> 9109 INFO  (TEST-TestJmxIntegration.testJmxOnCoreReload-seed#[54B30AC62A2D71E]) [    x:collection1] o.a.s.m.SolrMetricManager Closing metric reporters for registry=solr.core.collection1, tag=6d8ef64a
   [junit4]   2> 9110 INFO  (TEST-TestJmxIntegration.testJmxOnCoreReload-seed#[54B30AC62A2D71E]) [    x:collection1] o.a.s.m.r.SolrJmxReporter Closing reporter [org.apache.solr.metrics.reporters.SolrJmxReporter@442cd782: rootName = null, domain = solr.core.collection1, service url = null, agent id = null] for registry solr.core.collection1 / com.codahale.metrics.MetricRegistry@288352df
   [junit4]   2> 9144 INFO  (searcherExecutor-15-thread-1-processing-x:collection1) [    x:collection1] o.a.s.c.SolrCore [collection1] Registered new searcher Searcher@7abecc5b[collection1] main{ExitableDirectoryReader(UninvertingDirectoryReader())}
   [junit4]   2> 9152 INFO  (TEST-TestJmxIntegration.testJmxOnCoreReload-seed#[54B30AC62A2D71E]) [    x:collection1] o.a.s.c.S.Request [collection1]  webapp=null path=null params={q=*:*&wt=xml} hits=0 status=0 QTime=0
   [junit4]   2> 9178 INFO  (TEST-TestJmxIntegration.testJmxOnCoreReload-seed#[54B30AC62A2D71E]) [    x:collection1] o.a.s.c.TestJmxIntegration After Reload: size of all core metrics: 443 MBeans: 443
   [junit4]   2> 9179 INFO  (TEST-TestJmxIntegration.testJmxOnCoreReload-seed#[54B30AC62A2D71E]) [    x:collection1] o.a.s.SolrTestCaseJ4 ###Ending testJmxOnCoreReload
   [junit4]   2> 9188 INFO  (TEST-TestJmxIntegration.testJmxRegistration-seed#[54B30AC62A2D71E]) [    x:collection1] o.a.s.SolrTestCaseJ4 ###Starting testJmxRegistration
   [junit4]   2> 9189 INFO  (TEST-TestJmxIntegration.testJmxRegistration-seed#[54B30AC62A2D71E]) [    x:collection1] o.a.s.u.DirectUpdateHandler2 [collection1] REMOVING ALL DOCUMENTS FROM INDEX
   [junit4]   2> 9218 INFO  (TEST-TestJmxIntegration.testJmxRegistration-seed#[54B30AC62A2D71E]) [    x:collection1] o.a.s.s.SolrIndexSearcher Opening [Searcher@8cc970[collection1] realtime]
   [junit4]   2> 9220 INFO  (TEST-TestJmxIntegration.testJmxRegistration-seed#[54B30AC62A2D71E]) [    x:collection1] o.a.s.u.p.LogUpdateProcessorFactory [collection1]  webapp=null path=null params={_version_=-9223372036854775807&update.distrib=FROMLEADER&versions=true&wt=json&indent=true}{deleteByQuery=*:* (-9223372036854775807)} 0 31
   [junit4]   2> 9220 INFO  (TEST-TestJmxIntegration.testJmxRegistration-seed#[54B30AC62A2D71E]) [    x:collection1] o.a.s.u.DirectUpdateHandler2 start commit{_version_=1626213131084627968,optimize=false,openSearcher=true,waitSearcher=true,expungeDeletes=false,softCommit=false,prepareCommit=false}
   [junit4]   2> 9220 INFO  (TEST-TestJmxIntegration.testJmxRegistration-seed#[54B30AC62A2D71E]) [    x:collection1] o.a.s.u.SolrIndexWriter Calling setCommitData with IW:org.apache.solr.update.SolrIndexWriter@70e741d9 commitCommandVersion:1626213131084627968
   [junit4]   2> 9227 INFO  (TEST-TestJmxIntegration.testJmxRegistration-seed#[54B30AC62A2D71E]) [    x:collection1] o.a.s.s.SolrIndexSearcher Opening [Searcher@2c27493d[collection1] main]
   [junit4]   2> 9230 INFO  (searcherExecutor-15-thread-1-processing-x:collection1) [    x:collection1] o.a.s.c.SolrCore [collection1] Registered new searcher Searcher@2c27493d[collection1] main{ExitableDirectoryReader(UninvertingDirectoryReader())}
   [junit4]   2> 9231 INFO  (TEST-TestJmxIntegration.testJmxRegistration-seed#[54B30AC62A2D71E]) [    x:collection1] o.a.s.u.DirectUpdateHandler2 end_commit_flush
   [junit4]   2> 9231 INFO  (TEST-TestJmxIntegration.testJmxRegistration-seed#[54B30AC62A2D71E]) [    x:collection1] o.a.s.u.p.LogUpdateProcessorFactory [collection1]  webapp=null path=null params={}{commit=} 0 10
   [junit4]   2> 9555 INFO  (TEST-TestJmxIntegration.testJmxRegistration-seed#[54B30AC62A2D71E]) [    x:collection1] o.a.s.SolrTestCaseJ4 ###Ending testJmxRegistration
   [junit4]   2> 9570 INFO  (SUITE-TestJmxIntegration-seed#[54B30AC62A2D71E]-worker) [    x:collection1] o.a.s.SolrTestCaseJ4 ###deleteCore
   [junit4]   2> 9570 INFO  (SUITE-TestJmxIntegration-seed#[54B30AC62A2D71E]-worker) [    x:collection1] o.a.s.c.CoreContainer Shutting down CoreContainer instance=1255532997
   [junit4]   2> 9580 INFO  (coreCloseExecutor-19-thread-1-processing-x:collection1) [    x:collection1] o.a.s.c.SolrCore [collection1]  CLOSING SolrCore org.apache.solr.core.SolrCore@90717f4
   [junit4]   2> 9580 INFO  (coreCloseExecutor-19-thread-1-processing-x:collection1) [    x:collection1] o.a.s.m.SolrMetricManager Closing metric reporters for registry=solr.core.collection1, tag=90717f4
   [junit4]   2> 9580 INFO  (coreCloseExecutor-19-thread-1-processing-x:collection1) [    x:collection1] o.a.s.m.r.SolrJmxReporter Closing reporter [org.apache.solr.metrics.reporters.SolrJmxReporter@1c2db999: rootName = null, domain = solr.core.collection1, service url = null, agent id = null] for registry solr.core.collection1 / com.codahale.metrics.MetricRegistry@288352df
   [junit4]   2> 9680 INFO  (SUITE-TestJmxIntegration-seed#[54B30AC62A2D71E]-worker) [    x:collection1] o.a.s.m.SolrMetricManager Closing metric reporters for registry=solr.node, tag=null
   [junit4]   2> 9681 INFO  (SUITE-TestJmxIntegration-seed#[54B30AC62A2D71E]-worker) [    x:collection1] o.a.s.m.r.SolrJmxReporter Closing reporter [org.apache.solr.metrics.reporters.SolrJmxReporter@3b9918a1: rootName = null, domain = solr.node, service url = null, agent id = null] for registry solr.node / com.codahale.metrics.MetricRegistry@56248d24
   [junit4]   2> 9688 INFO  (SUITE-TestJmxIntegration-seed#[54B30AC62A2D71E]-worker) [    x:collection1] o.a.s.m.SolrMetricManager Closing metric reporters for registry=solr.jvm, tag=null
   [junit4]   2> 9689 INFO  (SUITE-TestJmxIntegration-seed#[54B30AC62A2D71E]-worker) [    x:collection1] o.a.s.m.r.SolrJmxReporter Closing reporter [org.apache.solr.metrics.reporters.SolrJmxReporter@21ba22ef: rootName = null, domain = solr.jvm, service url = null, agent id = null] for registry solr.jvm / com.codahale.metrics.MetricRegistry@24e90106
   [junit4]   2> 9689 INFO  (SUITE-TestJmxIntegration-seed#[54B30AC62A2D71E]-worker) [    x:collection1] o.a.s.m.SolrMetricManager Closing metric reporters for registry=solr.jetty, tag=null
   [junit4]   2> 9689 INFO  (SUITE-TestJmxIntegration-seed#[54B30AC62A2D71E]-worker) [    x:collection1] o.a.s.m.r.SolrJmxReporter Closing reporter [org.apache.solr.metrics.reporters.SolrJmxReporter@766711fb: rootName = null, domain = solr.jetty, service url = null, agent id = null] for registry solr.jetty / com.codahale.metrics.MetricRegistry@5fa1681e
   [junit4]   1> Done close org.apache.solr.common.util.ExecutorUtil$MDCAwareThreadPoolExecutor@79928568[Terminated, pool size = 0, active threads = 0, queued tasks = 0, completed tasks = 1]
   [junit4]   1> Done close org.apache.solr.common.util.ExecutorUtil$MDCAwareThreadPoolExecutor@4aa27344[Terminated, pool size = 0, active threads = 0, queued tasks = 0, completed tasks = 1]
   [junit4]   2> 9726 INFO  (SUITE-TestJmxIntegration-seed#[54B30AC62A2D71E]-worker) [    x:collection1] o.a.s.SolrTestCaseJ4 ------------------------------------------------------- Done waiting for tracked resources to be released
   [junit4]   2> Feb 22, 2019 11:21:36 PM com.carrotsearch.randomizedtesting.ThreadLeakControl checkThreadLeaks
   [junit4]   2> WARNING: Will linger awaiting termination of 1 leaked thread(s).
   [junit4]   2> Feb 22, 2019 11:21:46 PM com.carrotsearch.randomizedtesting.ThreadLeakControl checkThreadLeaks
   [junit4]   2> SEVERE: 1 thread leaked from SUITE scope at org.apache.solr.core.TestJmxIntegration: 
   [junit4]   2>    1) Thread[id=35, name=Log4j2-TF-2-AsyncLoggerConfig--2, state=TIMED_WAITING, group=TGRP-TestJmxIntegration]
   [junit4]   2>         at java.base@13-ea/jdk.internal.misc.Unsafe.park(Native Method)
   [junit4]   2>         at java.base@13-ea/java.util.concurrent.locks.LockSupport.parkNanos(LockSupport.java:235)
   [junit4]   2>         at java.base@13-ea/java.util.concurrent.locks.AbstractQueuedSynchronizer$ConditionObject.awaitNanos(AbstractQueuedSynchronizer.java:2123)
   [junit4]   2>         at app//com.lmax.disruptor.TimeoutBlockingWaitStrategy.waitFor(TimeoutBlockingWaitStrategy.java:38)
   [junit4]   2>         at app//com.lmax.disruptor.ProcessingSequenceBarrier.waitFor(ProcessingSequenceBarrier.java:56)
   [junit4]   2>         at app//com.lmax.disruptor.BatchEventProcessor.run(BatchEventProcessor.java:128)
   [junit4]   2>         at java.base@13-ea/java.lang.Thread.run(Thread.java:835)
   [junit4]   2> Feb 22, 2019 11:21:46 PM com.carrotsearch.randomizedtesting.ThreadLeakControl tryToInterruptAll
   [junit4]   2> INFO: Starting to interrupt leaked threads:
   [junit4]   2>    1) Thread[id=35, name=Log4j2-TF-2-AsyncLoggerConfig--2, state=TIMED_WAITING, group=TGRP-TestJmxIntegration]
   [junit4]   2> AsyncLogger error handling event seq=0, value='null':
   [junit4]   2> java.lang.InterruptedException
   [junit4]   2> 	at java.base/java.util.concurrent.locks.AbstractQueuedSynchronizer$ConditionObject.reportInterruptAfterWait(AbstractQueuedSynchronizer.java:2056)
   [junit4]   2> 	at java.base/java.util.concurrent.locks.AbstractQueuedSynchronizer$ConditionObject.awaitNanos(AbstractQueuedSynchronizer.java:2133)
   [junit4]   2> 	at com.lmax.disruptor.TimeoutBlockingWaitStrategy.waitFor(TimeoutBlockingWaitStrategy.java:38)
   [junit4]   2> 	at com.lmax.disruptor.ProcessingSequenceBarrier.waitFor(ProcessingSequenceBarrier.java:56)
   [junit4]   2> 	at com.lmax.disruptor.BatchEventProcessor.run(BatchEventProcessor.java:128)
   [junit4]   2> 	at java.base/java.lang.Thread.run(Thread.java:835)
   [junit4]   2> AsyncLogger error handling event seq=1, value='null':
   [junit4]   2> java.lang.InterruptedException
   [junit4]   2> 	at java.base/java.util.concurrent.locks.AbstractQueuedSynchronizer$ConditionObject.reportInterruptAfterWait(AbstractQueuedSynchronizer.java:2056)
   [junit4]   2> 	at java.base/java.util.concurrent.locks.AbstractQueuedSynchronizer$ConditionObject.awaitNanos(AbstractQueuedSynchronizer.java:2133)
   [junit4]   2> 	at com.lmax.disruptor.TimeoutBlockingWaitStrategy.waitFor(TimeoutBlockingWaitStrategy.java:38)
   [junit4]   2> 	at com.lmax.disruptor.ProcessingSequenceBarrier.waitFor(ProcessingSequenceBarrier.java:56)
   [junit4]   2> 	at com.lmax.disruptor.BatchEventProcessor.run(BatchEventProcessor.java:128)
   [junit4]   2> 	at java.base/java.lang.Thread.run(Thread.java:835)
   [junit4]   2> AsyncLogger error handling event seq=2, value='null':
   [junit4]   2> java.lang.InterruptedException
   [junit4]   2> 	at java.base/java.util.concurrent.locks.AbstractQueuedSynchronizer$ConditionObject.reportInterruptAfterWait(AbstractQueuedSynchronizer.java:2056)
   [junit4]   2> 	at java.base/java.util.concurrent.locks.AbstractQueuedSynchronizer$ConditionObject.awaitNanos(AbstractQueuedSynchronizer.java:2133)
   [junit4]   2> 	at com.lmax.disruptor.TimeoutBlockingWaitStrategy.waitFor(TimeoutBlockingWaitStrategy.java:38)
   [junit4]   2> 	at com.lmax.disruptor.ProcessingSequenceBarrier.waitFor(ProcessingSequenceBarrier.java:56)
   [junit4]   2> 	at com.lmax.disruptor.BatchEventProcessor.run(BatchEventProcessor.java:128)
   [junit4]   2> 	at java.base/java.lang.Thread.run(Thread.java:835)
   [junit4]   2> AsyncLogger error handling event seq=3, value='null':
   [junit4]   2> java.lang.InterruptedException
   [junit4]   2> 	at java.base/java.util.concurrent.locks.AbstractQueuedSynchronizer$ConditionObject.reportInterruptAfterWait(AbstractQueuedSynchronizer.java:2056)
   [junit4]   2> 	at java.base/java.util.concurrent.locks.AbstractQueuedSynchronizer$ConditionObject.awaitNanos(AbstractQueuedSynchronizer.java:2133)
   [junit4]   2> 	at com.lmax.disruptor.TimeoutBlockingWaitStrategy.waitFor(TimeoutBlockingWaitStrategy.java:38)
   [junit4]   2> 	at com.lmax.disruptor.ProcessingSequenceBarrier.waitFor(ProcessingSequenceBarrier.java:56)
   [junit4]   2> 	at com.lmax.disruptor.BatchEventProcessor.run(BatchEventProcessor.java:128)
   [junit4]   2> 	at java.base/java.lang.Thread.run(Thread.java:835)
   [junit4]   2> AsyncLogger error handling event seq=4, value='null':
   [junit4]   2> java.lang.InterruptedException
   [junit4]   2> 	at java.base/java.util.concurrent.locks.AbstractQueuedSynchronizer$ConditionObject.reportInterruptAfterWait(AbstractQueuedSynchronizer.java:2056)
   [junit4]   2> 	at java.base/java.util.concurrent.locks.AbstractQueuedSynchronizer$ConditionObject.awaitNanos(AbstractQueuedSynchronizer.java:2133)
   [junit4]   2> 	at com.lmax.disruptor.TimeoutBlockingWaitStrategy.waitFor(TimeoutBlockingWaitStrategy.java:38)
   [junit4]   2> 	at com.lmax.disruptor.ProcessingSequenceBarrier.waitFor(ProcessingSequenceBarrier.java:56)
   [junit4]   2> 	at com.lmax.disruptor.BatchEventProcessor.run(BatchEventProcessor.java:128)
   [junit4]   2> 	at java.base/java.lang.Thread.run(Thread.java:835)
   [junit4]   2> Feb 22, 2019 11:21:49 PM com.carrotsearch.randomizedtesting.ThreadLeakControl tryToInterruptAll
   [junit4]   2> SEVERE: There are still zombie threads that couldn't be terminated:
   [junit4]   2>    1) Thread[id=35, name=Log4j2-TF-2-AsyncLoggerConfig--2, state=TIMED_WAITING, group=TGRP-TestJmxIntegration]
   [junit4]   2>         at java.base@13-ea/jdk.internal.misc.Unsafe.park(Native Method)
   [junit4]   2>         at java.base@13-ea/java.util.concurrent.locks.LockSupport.parkNanos(LockSupport.java:235)
   [junit4]   2>         at java.base@13-ea/java.util.concurrent.locks.AbstractQueuedSynchronizer$ConditionObject.awaitNanos(AbstractQueuedSynchronizer.java:2123)
   [junit4]   2>         at app//com.lmax.disruptor.TimeoutBlockingWaitStrategy.waitFor(TimeoutBlockingWaitStrategy.java:38)
   [junit4]   2>         at app//com.lmax.disruptor.ProcessingSequenceBarrier.waitFor(ProcessingSequenceBarrier.java:56)
   [junit4]   2>         at app//com.lmax.disruptor.BatchEventProcessor.run(BatchEventProcessor.java:128)
   [junit4]   2>         at java.base@13-ea/java.lang.Thread.run(Thread.java:835)
   [junit4]   2> NOTE: test params are: codec=HighCompressionCompressingStoredFields(storedFieldsFormat=CompressingStoredFieldsFormat(compressionMode=HIGH_COMPRESSION, chunkSize=31290, maxDocsPerChunk=3, blockSize=4), termVectorsFormat=CompressingTermVectorsFormat(compressionMode=HIGH_COMPRESSION, chunkSize=31290, blockSize=4)), sim=Asserting(org.apache.lucene.search.similarities.AssertingSimilarity@176deb70), locale=lv-LV, timezone=Asia/Riyadh
   [junit4]   2> NOTE: Linux 4.18.0-15-generic amd64/Oracle Corporation 13-ea (64-bit)/cpus=8,threads=3,free=403074928,total=500170752
   [junit4]   2> NOTE: All tests run in this JVM: [TestJmxIntegration]
   [junit4]   2> NOTE: reproduce with: ant test  -Dtestcase=TestJmxIntegration -Dtests.seed=54B30AC62A2D71E -Dtests.multiplier=3 -Dtests.slow=true -Dtests.locale=lv-LV -Dtests.timezone=Asia/Riyadh -Dtests.asserts=true -Dtests.file.encoding=UTF-8
   [junit4] ERROR   0.00s J0 | TestJmxIntegration (suite) <<<
   [junit4]    > Throwable #1: com.carrotsearch.randomizedtesting.ThreadLeakError: 1 thread leaked from SUITE scope at org.apache.solr.core.TestJmxIntegration: 
   [junit4]    >    1) Thread[id=35, name=Log4j2-TF-2-AsyncLoggerConfig--2, state=TIMED_WAITING, group=TGRP-TestJmxIntegration]
   [junit4]    >         at java.base@13-ea/jdk.internal.misc.Unsafe.park(Native Method)
   [junit4]    >         at java.base@13-ea/java.util.concurrent.locks.LockSupport.parkNanos(LockSupport.java:235)
   [junit4]    >         at java.base@13-ea/java.util.concurrent.locks.AbstractQueuedSynchronizer$ConditionObject.awaitNanos(AbstractQueuedSynchronizer.java:2123)
   [junit4]    >         at app//com.lmax.disruptor.TimeoutBlockingWaitStrategy.waitFor(TimeoutBlockingWaitStrategy.java:38)
   [junit4]    >         at app//com.lmax.disruptor.ProcessingSequenceBarrier.waitFor(ProcessingSequenceBarrier.java:56)
   [junit4]    >         at app//com.lmax.disruptor.BatchEventProcessor.run(BatchEventProcessor.java:128)
   [junit4]    >         at java.base@13-ea/java.lang.Thread.run(Thread.java:835)
   [junit4]    > 	at __randomizedtesting.SeedInfo.seed([54B30AC62A2D71E]:0)Throwable #2: com.carrotsearch.randomizedtesting.ThreadLeakError: There are still zombie threads that couldn't be terminated:
   [junit4]    >    1) Thread[id=35, name=Log4j2-TF-2-AsyncLoggerConfig--2, state=TIMED_WAITING, group=TGRP-TestJmxIntegration]
   [junit4]    >         at java.base@13-ea/jdk.internal.misc.Unsafe.park(Native Method)
   [junit4]    >         at java.base@13-ea/java.util.concurrent.locks.LockSupport.parkNanos(LockSupport.java:235)
   [junit4]    >         at java.base@13-ea/java.util.concurrent.locks.AbstractQueuedSynchronizer$ConditionObject.awaitNanos(AbstractQueuedSynchronizer.java:2123)
   [junit4]    >         at app//com.lmax.disruptor.TimeoutBlockingWaitStrategy.waitFor(TimeoutBlockingWaitStrategy.java:38)
   [junit4]    >         at app//com.lmax.disruptor.ProcessingSequenceBarrier.waitFor(ProcessingSequenceBarrier.java:56)
   [junit4]    >         at app//com.lmax.disruptor.BatchEventProcessor.run(BatchEventProcessor.java:128)
   [junit4]    >         at java.base@13-ea/java.lang.Thread.run(Thread.java:835)
   [junit4]    > 	at __randomizedtesting.SeedInfo.seed([54B30AC62A2D71E]:0)
   [junit4] Completed [3/844 (1!)] on J0 in 21.22s, 3 tests, 2 errors <<< FAILURES!

[...truncated 480 lines...]
   [junit4] Suite: org.apache.solr.core.TestDynamicURP
   [junit4]   2> Creating dataDir: /home/jenkins/workspace/Lucene-Solr-8.x-Linux/solr/build/solr-core/test/J2/temp/solr.core.TestDynamicURP_54B30AC62A2D71E-001/init-core-data-001
   [junit4]   2> 3291 INFO  (SUITE-TestDynamicURP-seed#[54B30AC62A2D71E]-worker) [    ] o.a.s.SolrTestCaseJ4 Using TrieFields (NUMERIC_POINTS_SYSPROP=false) w/NUMERIC_DOCVALUES_SYSPROP=false
   [junit4]   2> 3330 INFO  (SUITE-TestDynamicURP-seed#[54B30AC62A2D71E]-worker) [    ] o.e.j.u.log Logging initialized @3342ms to org.eclipse.jetty.util.log.Slf4jLog
   [junit4]   2> 3342 INFO  (SUITE-TestDynamicURP-seed#[54B30AC62A2D71E]-worker) [    ] o.a.s.SolrTestCaseJ4 Randomized ssl (false) and clientAuth (false) via: @org.apache.solr.util.RandomizeSSL(reason="", value=0.0/0.0, ssl=0.0/0.0, clientAuth=0.0/0.0)
   [junit4]   2> 3355 INFO  (SUITE-TestDynamicURP-seed#[54B30AC62A2D71E]-worker) [    ] o.a.s.SolrTestCaseJ4 SecureRandom sanity checks: test.solr.allowed.securerandom=null & java.security.egd=file:/dev/./urandom
   [junit4]   2> 3362 INFO  (SUITE-TestDynamicURP-seed#[54B30AC62A2D71E]-worker) [    ] o.a.s.c.MiniSolrCloudCluster Starting cluster of 3 servers in /home/jenkins/workspace/Lucene-Solr-8.x-Linux/solr/build/solr-core/test/J2/temp/solr.core.TestDynamicURP_54B30AC62A2D71E-001/tempDir-001
   [junit4]   2> 3376 INFO  (SUITE-TestDynamicURP-seed#[54B30AC62A2D71E]-worker) [    ] o.a.s.c.ZkTestServer STARTING ZK TEST SERVER
   [junit4]   2> 3378 INFO  (ZkTestServer Run Thread) [    ] o.a.s.c.ZkTestServer client port:0.0.0.0/0.0.0.0:0
   [junit4]   2> 3378 INFO  (ZkTestServer Run Thread) [    ] o.a.s.c.ZkTestServer Starting server
   [junit4]   2> 3478 INFO  (SUITE-TestDynamicURP-seed#[54B30AC62A2D71E]-worker) [    ] o.a.s.c.ZkTestServer start zk server on port:37337
   [junit4]   2> 3480 INFO  (SUITE-TestDynamicURP-seed#[54B30AC62A2D71E]-worker) [    ] o.a.s.c.ZkTestServer parse host and port list: 127.0.0.1:37337
   [junit4]   2> 3484 INFO  (SUITE-TestDynamicURP-seed#[54B30AC62A2D71E]-worker) [    ] o.a.s.c.ZkTestServer connecting to 127.0.0.1 37337
   [junit4]   2> 3607 INFO  (zkConnectionManagerCallback-3-thread-1) [    ] o.a.s.c.c.ConnectionManager zkClient has connected
   [junit4]   2> 3626 INFO  (zkConnectionManagerCallback-5-thread-1) [    ] o.a.s.c.c.ConnectionManager zkClient has connected
   [junit4]   2> 3632 INFO  (zkConnectionManagerCallback-7-thread-1) [    ] o.a.s.c.c.ConnectionManager zkClient has connected
   [junit4]   2> 3755 WARN  (jetty-launcher-8-thread-3) [    ] o.e.j.s.AbstractConnector Ignoring deprecated socket close linger time
   [junit4]   2> 3756 WARN  (jetty-launcher-8-thread-2) [    ] o.e.j.s.AbstractConnector Ignoring deprecated socket close linger time
   [junit4]   2> 3758 WARN  (jetty-launcher-8-thread-1) [    ] o.e.j.s.AbstractConnector Ignoring deprecated socket close linger time
   [junit4]   2> 3949 INFO  (jetty-launcher-8-thread-1) [    ] o.a.s.c.s.e.JettySolrRunner Start Jetty (original configured port=0)
   [junit4]   2> 3949 INFO  (jetty-launcher-8-thread-3) [    ] o.a.s.c.s.e.JettySolrRunner Start Jetty (original configured port=0)
   [junit4]   2> 3949 INFO  (jetty-launcher-8-thread-1) [    ] o.a.s.c.s.e.JettySolrRunner Trying to start Jetty on port 0 try number 1 ...
   [junit4]   2> 3949 INFO  (jetty-launcher-8-thread-3) [    ] o.a.s.c.s.e.JettySolrRunner Trying to start Jetty on port 0 try number 1 ...
   [junit4]   2> 3949 INFO  (jetty-launcher-8-thread-2) [    ] o.a.s.c.s.e.JettySolrRunner Start Jetty (original configured port=0)
   [junit4]   2> 3949 INFO  (jetty-launcher-8-thread-2) [    ] o.a.s.c.s.e.JettySolrRunner Trying to start Jetty on port 0 try number 1 ...
   [junit4]   2> 3954 INFO  (jetty-launcher-8-thread-3) [    ] o.e.j.s.Server jetty-9.4.14.v20181114; built: 2018-11-14T21:20:31.478Z; git: c4550056e785fb5665914545889f21dc136ad9e6; jvm 13-ea+8
   [junit4]   2> 3954 INFO  (jetty-launcher-8-thread-1) [    ] o.e.j.s.Server jetty-9.4.14.v20181114; built: 2018-11-14T21:20:31.478Z; git: c4550056e785fb5665914545889f21dc136ad9e6; jvm 13-ea+8
   [junit4]   2> 3959 INFO  (jetty-launcher-8-thread-2) [    ] o.e.j.s.Server jetty-9.4.14.v20181114; built: 2018-11-14T21:20:31.478Z; git: c4550056e785fb5665914545889f21dc136ad9e6; jvm 13-ea+8
   [junit4]   2> 4003 INFO  (jetty-launcher-8-thread-1) [    ] o.e.j.s.session DefaultSessionIdManager workerName=node0
   [junit4]   2> 4003 INFO  (jetty-launcher-8-thread-1) [    ] o.e.j.s.session No SessionScavenger set, using defaults
   [junit4]   2> 4005 INFO  (jetty-launcher-8-thread-1) [    ] o.e.j.s.session node0 Scavenging every 660000ms
   [junit4]   2> 4006 INFO  (jetty-launcher-8-thread-2) [    ] o.e.j.s.session DefaultSessionIdManager workerName=node0
   [junit4]   2> 4006 INFO  (jetty-launcher-8-thread-2) [    ] o.e.j.s.session No SessionScavenger set, using defaults
   [junit4]   2> 4006 INFO  (jetty-launcher-8-thread-3) [    ] o.e.j.s.session DefaultSessionIdManager workerName=node0
   [junit4]   2> 4006 INFO  (jetty-launcher-8-thread-3) [    ] o.e.j.s.session No SessionScavenger set, using defaults
   [junit4]   2> 4006 INFO  (jetty-launcher-8-thread-2) [    ] o.e.j.s.session node0 Scavenging every 660000ms
   [junit4]   2> 4006 INFO  (jetty-launcher-8-thread-3) [    ] o.e.j.s.session node0 Scavenging every 660000ms
   [junit4]   2> 4025 INFO  (jetty-launcher-8-thread-2) [    ] o.e.j.s.h.ContextHandler Started o.e.j.s.ServletContextHandler@34237600{/solr,null,AVAILABLE}
   [junit4]   2> 4027 INFO  (jetty-launcher-8-thread-1) [    ] o.e.j.s.h.ContextHandler Started o.e.j.s.ServletContextHandler@4da26673{/solr,null,AVAILABLE}
   [junit4]   2> 4027 INFO  (jetty-launcher-8-thread-3) [    ] o.e.j.s.h.ContextHandler Started o.e.j.s.ServletContextHandler@4942b25e{/solr,null,AVAILABLE}
   [junit4]   2> 4039 INFO  (jetty-launcher-8-thread-3) [    ] o.e.j.s.AbstractConnector Started ServerConnector@695c5d91{HTTP/1.1,[http/1.1, h2c]}{127.0.0.1:36383}
   [junit4]   2> 4039 INFO  (jetty-launcher-8-thread-3) [    ] o.e.j.s.Server Started @4059ms
   [junit4]   2> 4040 INFO  (jetty-launcher-8-thread-3) [    ] o.a.s.c.s.e.JettySolrRunner Jetty properties: {hostContext=/solr, hostPort=36383}
   [junit4]   2> 4046 INFO  (jetty-launcher-8-thread-2) [    ] o.e.j.s.AbstractConnector Started ServerConnector@1e0d0c04{HTTP/1.1,[http/1.1, h2c]}{127.0.0.1:37197}
   [junit4]   2> 4046 INFO  (jetty-launcher-8-thread-2) [    ] o.e.j.s.Server Started @4066ms
   [junit4]   2> 4046 INFO  (jetty-launcher-8-thread-2) [    ] o.a.s.c.s.e.JettySolrRunner Jetty properties: {hostContext=/solr, hostPort=37197}
   [junit4]   2> 4047 INFO  (jetty-launcher-8-thread-1) [    ] o.e.j.s.AbstractConnector Started ServerConnector@5e32fc9e{HTTP/1.1,[http/1.1, h2c]}{127.0.0.1:44843}
   [junit4]   2> 4047 INFO  (jetty-launcher-8-thread-1) [    ] o.e.j.s.Server Started @4066ms
   [junit4]   2> 4047 INFO  (jetty-launcher-8-thread-1) [    ] o.a.s.c.s.e.JettySolrRunner Jetty properties: {hostContext=/solr, hostPort=44843}
   [junit4]   2> 4054 INFO  (jetty-launcher-8-thread-1) [    ] o.a.s.u.c.SSLCredentialProviderFactory Processing SSL Credential Provider chain: env;sysprop
   [junit4]   2> 4061 ERROR (jetty-launcher-8-thread-2) [    ] o.a.s.u.StartupLoggingUtils Missing Java Option solr.log.dir. Logging may be missing or incomplete.
   [junit4]   2> 4061 ERROR (jetty-launcher-8-thread-3) [    ] o.a.s.u.StartupLoggingUtils Missing Java Option solr.log.dir. Logging may be missing or incomplete.
   [junit4]   2> 4061 ERROR (jetty-launcher-8-thread-1) [    ] o.a.s.u.StartupLoggingUtils Missing Java Option solr.log.dir. Logging may be missing or incomplete.
   [junit4]   2> 4061 INFO  (jetty-launcher-8-thread-2) [    ] o.a.s.s.SolrDispatchFilter Using logger factory org.apache.logging.slf4j.Log4jLoggerFactory
   [junit4]   2> 4061 INFO  (jetty-launcher-8-thread-1) [    ] o.a.s.s.SolrDispatchFilter Using logger factory org.apache.logging.slf4j.Log4jLoggerFactory
   [junit4]   2> 4061 INFO  (jetty-launcher-8-thread-3) [    ] o.a.s.s.SolrDispatchFilter Using logger factory org.apache.logging.slf4j.Log4jLoggerFactory
   [junit4]   2> 4061 INFO  (jetty-launcher-8-thread-2) [    ] o.a.s.s.SolrDispatchFilter  ___      _       Welcome to Apache Solr™ version 8.1.0
   [junit4]   2> 4063 INFO  (jetty-launcher-8-thread-3) [    ] o.a.s.s.SolrDispatchFilter  ___      _       Welcome to Apache Solr™ version 8.1.0
   [junit4]   2> 4064 INFO  (jetty-launcher-8-thread-3) [    ] o.a.s.s.SolrDispatchFilter / __| ___| |_ _   Starting in cloud mode on port null
   [junit4]   2> 4064 INFO  (jetty-launcher-8-thread-2) [    ] o.a.s.s.SolrDispatchFilter / __| ___| |_ _   Starting in cloud mode on port null
   [junit4]   2> 4065 INFO  (jetty-launcher-8-thread-1) [    ] o.a.s.s.SolrDispatchFilter  ___      _       Welcome to Apache Solr™ version 8.1.0
   [junit4]   2> 4065 INFO  (jetty-launcher-8-thread-3) [    ] o.a.s.s.SolrDispatchFilter \__ \/ _ \ | '_|  Install dir: null
   [junit4]   2> 4065 INFO  (jetty-launcher-8-thread-1) [    ] o.a.s.s.SolrDispatchFilter / __| ___| |_ _   Starting in cloud mode on port null
   [junit4]   2> 4065 INFO  (jetty-launcher-8-thread-1) [    ] o.a.s.s.SolrDispatchFilter \__ \/ _ \ | '_|  Install dir: null
   [junit4]   2> 4065 INFO  (jetty-launcher-8-thread-3) [    ] o.a.s.s.SolrDispatchFilter |___/\___/_|_|    Start time: 2019-02-22T23:21:30.971241Z
   [junit4]   2> 4065 INFO  (jetty-launcher-8-thread-1) [    ] o.a.s.s.SolrDispatchFilter |___/\___/_|_|    Start time: 2019-02-22T23:21:30.971364Z
   [junit4]   2> 4066 INFO  (jetty-launcher-8-thread-2) [    ] o.a.s.s.SolrDispatchFilter \__ \/ _ \ | '_|  Install dir: null
   [junit4]   2> 4066 INFO  (jetty-launcher-8-thread-2) [    ] o.a.s.s.SolrDispatchFilter |___/\___/_|_|    Start time: 2019-02-22T23:21:30.972923Z
   [junit4]   2> 4097 INFO  (jetty-launcher-8-thread-2) [    ] o.a.s.c.SolrResourceLoader solr home defaulted to 'solr/' (could not find system property or JNDI)
   [junit4]   2> 4109 INFO  (zkConnectionManagerCallback-12-thread-1) [    ] o.a.s.c.c.ConnectionManager zkClient has connected
   [junit4]   2> 4112 INFO  (zkConnectionManagerCallback-10-thread-1) [    ] o.a.s.c.c.ConnectionManager zkClient has connected
   [junit4]   2> 4114 INFO  (jetty-launcher-8-thread-2) [    ] o.a.s.s.SolrDispatchFilter solr.xml found in ZooKeeper. Loading...
   [junit4]   2> 4115 INFO  (jetty-launcher-8-thread-3) [    ] o.a.s.s.SolrDispatchFilter solr.xml found in ZooKeeper. Loading...
   [junit4]   2> 4115 INFO  (zkConnectionManagerCallback-14-thread-1) [    ] o.a.s.c.c.ConnectionManager zkClient has connected
   [junit4]   2> 4122 INFO  (jetty-launcher-8-thread-1) [    ] o.a.s.s.SolrDispatchFilter solr.xml found in ZooKeeper. Loading...
   [junit4]   2> 4225 WARN  (NIOServerCxn.Factory:0.0.0.0/0.0.0.0:0) [    ] o.a.z.s.NIOServerCnxn Unable to read additional data from client sessionid 0x1001af50f2a0004, likely client has closed socket
   [junit4]   2> 4893 INFO  (jetty-launcher-8-thread-1) [    ] o.a.s.h.c.HttpShardHandlerFactory Host whitelist initialized: WhitelistHostChecker [whitelistHosts=null, whitelistHostCheckingEnabled=true]
   [junit4]   2> 5071 INFO  (jetty-launcher-8-thread-3) [    ] o.a.s.h.c.HttpShardHandlerFactory Host whitelist initialized: WhitelistHostChecker [whitelistHosts=null, whitelistHostCheckingEnabled=true]
   [junit4]   2> 5319 WARN  (jetty-launcher-8-thread-3) [    ] o.e.j.u.s.S.config No Client EndPointIdentificationAlgorithm configured for SslContextFactory@3ab962[provider=null,keyStore=null,trustStore=null]
   [junit4]   2> 5320 WARN  (jetty-launcher-8-thread-1) [    ] o.e.j.u.s.S.config No Client EndPointIdentificationAlgorithm configured for SslContextFactory@3cd4d8d2[provider=null,keyStore=null,trustStore=null]
   [junit4]   2> 5373 INFO  (jetty-launcher-8-thread-2) [    ] o.a.s.h.c.HttpShardHandlerFactory Host whitelist initialized: WhitelistHostChecker [whitelistHosts=null, whitelistHostCheckingEnabled=true]
   [junit4]   2> 5395 WARN  (jetty-launcher-8-thread-2) [    ] o.e.j.u.s.S.config No Client EndPointIdentificationAlgorithm configured for SslContextFactory@15c171f1[provider=null,keyStore=null,trustStore=null]
   [junit4]   2> 5545 WARN  (jetty-launcher-8-thread-3) [    ] o.e.j.u.s.S.config No Client EndPointIdentificationAlgorithm configured for SslContextFactory@295303f8[provider=null,keyStore=null,trustStore=null]
   [junit4]   2> 5554 WARN  (jetty-launcher-8-thread-1) [    ] o.e.j.u.s.S.config No Client EndPointIdentificationAlgorithm configured for SslContextFactory@5813a6c7[provider=null,keyStore=null,trustStore=null]
   [junit4]   2> 5561 INFO  (jetty-launcher-8-thread-1) [    ] o.a.s.c.ZkContainer Zookeeper client=127.0.0.1:37337/solr
   [junit4]   2> 5565 INFO  (jetty-launcher-8-thread-3) [    ] o.a.s.c.ZkContainer Zookeeper client=127.0.0.1:37337/solr
   [junit4]   2> 5630 WARN  (jetty-launcher-8-thread-2) [    ] o.e.j.u.s.S.config No Client EndPointIdentificationAlgorithm configured for SslContextFactory@35e7c438[provider=null,keyStore=null,trustStore=null]
   [junit4]   2> 5632 INFO  (jetty-launcher-8-thread-2) [    ] o.a.s.c.ZkContainer Zookeeper client=127.0.0.1:37337/solr
   [junit4]   2> 5655 INFO  (zkConnectionManagerCallback-29-thread-1) [    ] o.a.s.c.c.ConnectionManager zkClient has connected
   [junit4]   2> 5656 INFO  (zkConnectionManagerCallback-28-thread-1) [    ] o.a.s.c.c.ConnectionManager zkClient has connected
   [junit4]   2> 5671 INFO  (zkConnectionManagerCallback-32-thread-1) [    ] o.a.s.c.c.ConnectionManager zkClient has connected
   [junit4]   2> 5671 WARN  (NIOServerCxn.Factory:0.0.0.0/0.0.0.0:0) [    ] o.a.z.s.NIOServerCnxn Unable to read additional data from client sessionid 0x1001af50f2a0007, likely client has closed socket
   [junit4]   2> 5676 INFO  (zkConnectionManagerCallback-34-thread-1) [    ] o.a.s.c.c.ConnectionManager zkClient has connected
   [junit4]   2> 5709 INFO  (zkConnectionManagerCallback-36-thread-1) [    ] o.a.s.c.c.ConnectionManager zkClient has connected
   [junit4]   2> 5744 INFO  (zkConnectionManagerCallback-38-thread-1) [    ] o.a.s.c.c.ConnectionManager zkClient has connected
   [junit4]   2> 5873 INFO  (jetty-launcher-8-thread-2) [n:127.0.0.1:37197_solr    ] o.a.s.c.OverseerElectionContext I am going to be the leader 127.0.0.1:37197_solr
   [junit4]   2> 5886 INFO  (jetty-launcher-8-thread-2) [n:127.0.0.1:37197_solr    ] o.a.s.c.Overseer Overseer (id=72087233861648395-127.0.0.1:37197_solr-n_0000000000) starting
   [junit4]   2> 6016 INFO  (zkConnectionManagerCallback-49-thread-1) [    ] o.a.s.c.c.ConnectionManager zkClient has connected
   [junit4]   2> 6030 INFO  (jetty-launcher-8-thread-2) [n:127.0.0.1:37197_solr    ] o.a.s.c.s.i.ZkClientClusterStateProvider Cluster at 127.0.0.1:37337/solr ready
   [junit4]   2> 6133 INFO  (jetty-launcher-8-thread-3) [n:127.0.0.1:36383_solr    ] o.a.s.c.ZkController Register node as live in ZooKeeper:/live_nodes/127.0.0.1:36383_solr
   [junit4]   2> 6137 INFO  (OverseerStateUpdate-72087233861648395-127.0.0.1:37197_solr-n_0000000000) [n:127.0.0.1:37197_solr    ] o.a.s.c.Overseer Starting to work on the main queue : 127.0.0.1:37197_solr
   [junit4]   2> 6139 INFO  (jetty-launcher-8-thread-2) [n:127.0.0.1:37197_solr    ] o.a.s.c.ZkController Register node as live in ZooKeeper:/live_nodes/127.0.0.1:37197_solr
   [junit4]   2> 6165 INFO  (OverseerStateUpdate-72087233861648395-127.0.0.1:37197_solr-n_0000000000) [n:127.0.0.1:37197_solr    ] o.a.s.c.c.ZkStateReader Updated live nodes from ZooKeeper... (0) -> (2)
   [junit4]   2> 6181 INFO  (zkCallback-33-thread-1) [    ] o.a.s.c.c.ZkStateReader Updated live nodes from ZooKeeper... (0) -> (2)
   [junit4]   2> 6201 INFO  (zkCallback-48-thread-1) [    ] o.a.s.c.c.ZkStateReader Updated live nodes from ZooKeeper... (0) -> (2)
   [junit4]   2> 6327 INFO  (jetty-launcher-8-thread-1) [n:127.0.0.1:44843_solr    ] o.a.s.c.c.ZkStateReader Updated live nodes from ZooKeeper... (0) -> (2)
   [junit4]   2> 6332 INFO  (jetty-launcher-8-thread-1) [n:127.0.0.1:44843_solr    ] o.a.s.c.ZkController Publish node=127.0.0.1:44843_solr as DOWN
   [junit4]   2> 6338 INFO  (jetty-launcher-8-thread-1) [n:127.0.0.1:44843_solr    ] o.a.s.c.TransientSolrCoreCacheDefault Allocating transient cache for 2147483647 transient cores
   [junit4]   2> 6350 INFO  (jetty-launcher-8-thread-1) [n:127.0.0.1:44843_solr    ] o.a.s.c.ZkController Register node as live in ZooKeeper:/live_nodes/127.0.0.1:44843_solr
   [junit4]   2> 6357 INFO  (zkCallback-48-thread-1) [    ] o.a.s.c.c.ZkStateReader Updated live nodes from ZooKeeper... (2) -> (3)
   [junit4]   2> 6358 INFO  (zkCallback-37-thread-1) [    ] o.a.s.c.c.ZkStateReader Updated live nodes from ZooKeeper... (2) -> (3)
   [junit4]   2> 6381 INFO  (zkCallback-33-thread-1) [    ] o.a.s.c.c.ZkStateReader Updated live nodes from ZooKeeper... (2) -> (3)
   [junit4]   2> 6385 INFO  (zkCallback-35-thread-1) [    ] o.a.s.c.c.ZkStateReader Updated live nodes from ZooKeeper... (2) -> (3)
   [junit4]   2> 6513 INFO  (zkConnectionManagerCallback-54-thread-1) [    ] o.a.s.c.c.ConnectionManager zkClient has connected
   [junit4]   2> 6523 INFO  (jetty-launcher-8-thread-2) [n:127.0.0.1:37197_solr    ] o.a.s.h.a.MetricsHistoryHandler No .system collection, keeping metrics history in memory.
   [junit4]   2> 6549 INFO  (jetty-launcher-8-thread-3) [n:127.0.0.1:36383_solr    ] o.a.s.c.c.ZkStateReader Updated live nodes from ZooKeeper... (0) -> (3)
   [junit4]   2> 6563 INFO  (jetty-launcher-8-thread-3) [n:127.0.0.1:36383_solr    ] o.a.s.c.s.i.ZkClientClusterStateProvider Cluster at 127.0.0.1:37337/solr ready
   [junit4]   2> 6565 INFO  (zkConnectionManagerCallback-59-thread-1) [    ] o.a.s.c.c.ConnectionManager zkClient has connected
   [junit4]   2> 6593 INFO  (jetty-launcher-8-thread-3) [n:127.0.0.1:36383_solr    ] o.a.s.h.a.MetricsHistoryHandler No .system collection, keeping metrics history in memory.
   [junit4]   2> 6601 INFO  (jetty-launcher-8-thread-1) [n:127.0.0.1:44843_solr    ] o.a.s.c.c.ZkStateReader Updated live nodes from ZooKeeper... (0) -> (3)
   [junit4]   2> 6603 INFO  (jetty-launcher-8-thread-1) [n:127.0.0.1:44843_solr    ] o.a.s.c.s.i.ZkClientClusterStateProvider Cluster at 127.0.0.1:37337/solr ready
   [junit4]   2> 6612 INFO  (jetty-launcher-8-thread-1) [n:127.0.0.1:44843_solr    ] o.a.s.h.a.MetricsHistoryHandler No .system collection, keeping metrics history in memory.
   [junit4]   2> 6768 INFO  (jetty-launcher-8-thread-3) [n:127.0.0.1:36383_solr    ] o.a.s.m.r.SolrJmxReporter JMX monitoring for 'solr_36383.solr.node' (registry 'solr.node') enabled at server: com.sun.jmx.mbeanserver.JmxMBeanServer@4b86805d
   [junit4]   2> 6786 INFO  (jetty-launcher-8-thread-3) [n:127.0.0.1:36383_solr    ] o.a.s.m.r.SolrJmxReporter JMX monitoring for 'solr_36383.solr.jvm' (registry 'solr.jvm') enabled at server: com.sun.jmx.mbeanserver.JmxMBeanServer@4b86805d
   [junit4]   2> 6786 INFO  (jetty-launcher-8-thread-3) [n:127.0.0.1:36383_solr    ] o.a.s.m.r.SolrJmxReporter JMX monitoring for 'solr_36383.solr.jetty' (registry 'solr.jetty') enabled at server: com.sun.jmx.mbeanserver.JmxMBeanServer@4b86805d
   [junit4]   2> 6791 INFO  (jetty-launcher-8-thread-2) [n:127.0.0.1:37197_solr    ] o.a.s.m.r.SolrJmxReporter JMX monitoring for 'solr_37197.solr.node' (registry 'solr.node') enabled at server: com.sun.jmx.mbeanserver.JmxMBeanServer@4b86805d
   [junit4]   2> 6791 INFO  (jetty-launcher-8-thread-2) [n:127.0.0.1:37197_solr    ] o.a.s.m.r.SolrJmxReporter JMX monitoring for 'solr_37197.solr.jvm' (registry 'solr.jvm') enabled at server: com.sun.jmx.mbeanserver.JmxMBeanServer@4b86805d
   [junit4]   2> 6791 INFO  (jetty-launcher-8-thread-2) [n:127.0.0.1:37197_solr    ] o.a.s.m.r.SolrJmxReporter JMX monitoring for 'solr_37197.solr.jetty' (registry 'solr.jetty') enabled at server: com.sun.jmx.mbeanserver.JmxMBeanServer@4b86805d
   [junit4]   2> 6802 INFO  (jetty-launcher-8-thread-1) [n:127.0.0.1:44843_solr    ] o.a.s.m.r.SolrJmxReporter JMX monitoring for 'solr_44843.solr.node' (registry 'solr.node') enabled at server: com.sun.jmx.mbeanserver.JmxMBeanServer@4b86805d
   [junit4]   2> 6802 INFO  (jetty-launcher-8-thread-1) [n:127.0.0.1:44843_solr    ] o.a.s.m.r.SolrJmxReporter JMX monitoring for 'solr_44843.solr.jvm' (registry 'solr.jvm') enabled at server: com.sun.jmx.mbeanserver.JmxMBeanServer@4b86805d
   [junit4]   2> 6803 INFO  (jetty-launcher-8-thread-1) [n:127.0.0.1:44843_solr    ] o.a.s.m.r.SolrJmxReporter JMX monitoring for 'solr_44843.solr.jetty' (registry 'solr.jetty') enabled at server: com.sun.jmx.mbeanserver.JmxMBeanServer@4b86805d
   [junit4]   2> 6812 INFO  (jetty-launcher-8-thread-3) [n:127.0.0.1:36383_solr    ] o.a.s.c.CorePropertiesLocator Found 0 core definitions underneath /home/jenkins/workspace/Lucene-Solr-8.x-Linux/solr/build/solr-core/test/J2/temp/solr.core.TestDynamicURP_54B30AC62A2D71E-001/tempDir-001/node3/.
   [junit4]   2> 6842 INFO  (jetty-launcher-8-thread-2) [n:127.0.0.1:37197_solr    ] o.a.s.c.CorePropertiesLocator Found 0 core definitions underneath /home/jenkins/workspace/Lucene-Solr-8.x-Linux/solr/build/solr-core/test/J2/temp/solr.core.TestDynamicURP_54B30AC62A2D71E-001/tempDir-001/node2/.
   [junit4]   2> 6842 INFO  (jetty-launcher-8-thread-1) [n:127.0.0.1:44843_solr    ] o.a.s.c.CorePropertiesLocator Found 0 core definitions underneath /home/jenkins/workspace/Lucene-Solr-8.x-Linux/solr/build/solr-core/test/J2/temp/solr.core.TestDynamicURP_54B30AC62A2D71E-001/tempDir-001/node1/.
   [junit4]   2> 7190 INFO  (zkConnectionManagerCallback-67-thread-1) [    ] o.a.s.c.c.ConnectionManager zkClient has connected
   [junit4]   2> 7192 INFO  (SUITE-TestDynamicURP-seed#[54B30AC62A2D71E]-worker) [    ] o.a.s.c.c.ZkStateReader Updated live nodes from ZooKeeper... (0) -> (3)
   [junit4]   2> 7193 INFO  (SUITE-TestDynamicURP-seed#[54B30AC62A2D71E]-worker) [    ] o.a.s.c.s.i.ZkClientClusterStateProvider Cluster at 127.0.0.1:37337/solr ready
   [junit4]   2> 7539 INFO  (qtp1565560207-54) [n:127.0.0.1:44843_solr    ] o.a.s.h.a.CollectionsHandler Invoked Collection Action :create with params collection.configName=conf&name=testUrpColl&nrtReplicas=1&action=CREATE&numShards=3&wt=javabin&version=2 and sendToOCPQueue=true
   [junit4]   2> 7582 INFO  (OverseerThreadFactory-19-thread-1-processing-n:127.0.0.1:37197_solr) [n:127.0.0.1:37197_solr    ] o.a.s.c.a.c.CreateCollectionCmd Create collection testUrpColl
   [junit4]   2> 7704 INFO  (OverseerStateUpdate-72087233861648395-127.0.0.1:37197_solr-n_0000000000) [n:127.0.0.1:37197_solr    ] o.a.s.c.o.SliceMutator createReplica() {
   [junit4]   2>   "operation":"ADDREPLICA",
   [junit4]   2>   "collection":"testUrpColl",
   [junit4]   2>   "shard":"shard1",
   [junit4]   2>   "core":"testUrpColl_shard1_replica_n1",
   [junit4]   2>   "state":"down",
   [junit4]   2>   "base_url":"http://127.0.0.1:44843/solr",
   [junit4]   2>   "type":"NRT",
   [junit4]   2>   "waitForFinalState":"false"} 
   [junit4]   2> 7708 INFO  (OverseerStateUpdate-72087233861648395-127.0.0.1:37197_solr-n_0000000000) [n:127.0.0.1:37197_solr    ] o.a.s.c.o.SliceMutator createReplica() {
   [junit4]   2>   "operation":"ADDREPLICA",
   [junit4]   2>   "collection":"testUrpColl",
   [junit4]   2>   "shard":"shard2",
   [junit4]   2>   "core":"testUrpColl_shard2_replica_n2",
   [junit4]   2>   "state":"down",
   [junit4]   2>   "base_url":"http://127.0.0.1:37197/solr",
   [junit4]   2>   "type":"NRT",
   [junit4]   2>   "waitForFinalState":"false"} 
   [junit4]   2> 7711 INFO  (OverseerStateUpdate-72087233861648395-127.0.0.1:37197_solr-n_0000000000) [n:127.0.0.1:37197_solr    ] o.a.s.c.o.SliceMutator createReplica() {
   [junit4]   2>   "operation":"ADDREPLICA",
   [junit4]   2>   "collection":"testUrpColl",
   [junit4]   2>   "shard":"shard3",
   [junit4]   2>   "core":"testUrpColl_shard3_replica_n4",
   [junit4]   2>   "state":"down",
   [junit4]   2>   "base_url":"http://127.0.0.1:36383/solr",
   [junit4]   2>   "type":"NRT",
   [junit4]   2>   "waitForFinalState":"false"} 
   [junit4]   2> 7927 INFO  (qtp1565560207-51) [n:127.0.0.1:44843_solr    x:testUrpColl_shard1_replica_n1] o.a.s.h.a.CoreAdminOperation core create command qt=/admin/cores&coreNodeName=core_node3&collection.configName=conf&newCollection=true&name=testUrpColl_shard1_replica_n1&action=CREATE&numShards=3&collection=testUrpColl&shard=shard1&wt=javabin&version=2&replicaType=NRT
   [junit4]   2> 7928 INFO  (qtp912400333-55) [n:127.0.0.1:37197_solr    x:testUrpColl_shard2_replica_n2] o.a.s.h.a.CoreAdminOperation core create command qt=/admin/cores&coreNodeName=core_node5&collection.configName=conf&newCollection=true&name=testUrpColl_shard2_replica_n2&action=CREATE&numShards=3&collection=testUrpColl&shard=shard2&wt=javabin&version=2&replicaType=NRT
   [junit4]   2> 7929 INFO  (qtp1062712899-57) [n:127.0.0.1:36383_solr    x:testUrpColl_shard3_replica_n4] o.a.s.h.a.CoreAdminOperation core create command qt=/admin/cores&coreNodeName=core_node6&collection.configName=conf&newCollection=true&name=testUrpColl_shard3_replica_n4&action=CREATE&numShards=3&collection=testUrpColl&shard=shard3&wt=javabin&version=2&replicaType=NRT
   [junit4]   2> 7929 INFO  (qtp912400333-55) [n:127.0.0.1:37197_solr    x:testUrpColl_shard2_replica_n2] o.a.s.c.TransientSolrCoreCacheDefault Allocating transient cache for 2147483647 transient cores
   [junit4]   2> 7930 INFO  (qtp1062712899-57) [n:127.0.0.1:36383_solr    x:testUrpColl_shard3_replica_n4] o.a.s.c.TransientSolrCoreCacheDefault Allocating transient cache for 2147483647 transient cores
   [junit4]   2> 9024 INFO  (qtp912400333-55) [n:127.0.0.1:37197_solr c:testUrpColl s:shard2 r:core_node5 x:testUrpColl_shard2_replica_n2] o.a.s.c.SolrConfig Using Lucene MatchVersion: 8.1.0
   [junit4]   2> 9031 INFO  (qtp1062712899-57) [n:127.0.0.1:36383_solr c:testUrpColl s:shard3 r:core_node6 x:testUrpColl_shard3_replica_n4] o.a.s.c.SolrConfig Using Lucene MatchVersion: 8.1.0
   [junit4]   2> 9044 INFO  (qtp1565560207-51) [n:127.0.0.1:44843_solr c:testUrpColl s:shard1 r:core_node3 x:testUrpColl_shard1_replica_n1] o.a.s.c.SolrConfig Using Lucene MatchVersion: 8.1.0
   [junit4]   2> 9228 INFO  (qtp912400333-55) [n:127.0.0.1:37197_solr c:testUrpColl s:shard2 r:core_node5 x:testUrpColl_shard2_replica_n2] o.a.s.s.IndexSchema [testUrpColl_shard2_replica_n2] Schema name=minimal
   [junit4]   2> 9229 INFO  (qtp1062712899-57) [n:127.0.0.1:36383_solr c:testUrpColl s:shard3 r:core_node6 x:testUrpColl_shard3_replica_n4] o.a.s.s.IndexSchema [testUrpColl_shard3_replica_n4] Schema name=minimal
   [junit4]   2> 9269 INFO  (qtp1565560207-51) [n:127.0.0.1:44843_solr c:testUrpColl s:shard1 r:core_node3 x:testUrpColl_shard1_replica_n1] o.a.s.s.IndexSchema [testUrpColl_shard1_replica_n1] Schema name=minimal
   [junit4]   2> 9277 WARN  (qtp1062712899-57) [n:127.0.0.1:36383_solr c:testUrpColl s:shard3 r:core_node6 x:testUrpColl_shard3_replica_n4] o.a.s.c.SolrResourceLoader Solr loaded a deprecated plugin/analysis class [solr.TrieIntField]. Please consult documentation how to replace it accordingly.
   [junit4]   2> 9277 WARN  (qtp912400333-55) [n:127.0.0.1:37197_solr c:testUrpColl s:shard2 r:core_node5 x:testUrpColl_shard2_replica_n2] o.a.s.c.SolrResourceLoader Solr loaded a deprecated plugin/analysis class [solr.TrieIntField]. Please consult documentation how to replace it accordingly.
   [junit4]   2> 9278 WARN  (qtp1565560207-51) [n:127.0.0.1:44843_solr c:testUrpColl s:shard1 r:core_node3 x:testUrpColl_shard1_replica_n1] o.a.s.c.SolrResourceLoader Solr loaded a deprecated plugin/analysis class [solr.TrieIntField]. Please consult documentation how to replace it accordingly.
   [junit4]   2> 9283 WARN  (qtp912400333-55) [n:127.0.0.1:37197_solr c:testUrpColl s:shard2 r:core_node5 x:testUrpColl_shard2_replica_n2] o.a.s.c.SolrResourceLoader Solr loaded a deprecated plugin/analysis class [solr.TrieLongField]. Please consult documentation how to replace it accordingly.
   [junit4]   2> 9284 WARN  (qtp1565560207-51) [n:127.0.0.1:44843_solr c:testUrpColl s:shard1 r:core_node3 x:testUrpColl_shard1_replica_n1] o.a.s.c.SolrResourceLoader Solr loaded a deprecated plugin/analysis class [solr.TrieLongField]. Please consult documentation how to replace it accordingly.
   [junit4]   2> 9295 INFO  (qtp912400333-55) [n:127.0.0.1:37197_solr c:testUrpColl s:shard2 r:core_node5 x:testUrpColl_shard2_replica_n2] o.a.s.s.IndexSchema Loaded schema minimal/1.1 with uniqueid field id
   [junit4]   2> 9295 INFO  (qtp912400333-55) [n:127.0.0.1:37197_solr c:testUrpColl s:shard2 r:core_node5 x:testUrpColl_shard2_replica_n2] o.a.s.c.CoreContainer Creating SolrCore 'testUrpColl_shard2_replica_n2' using configuration from collection testUrpColl, trusted=true
   [junit4]   2> 9300 WARN  (qtp1062712899-57) [n:127.0.0.1:36383_solr c:testUrpColl s:shard3 r:core_node6 x:testUrpColl_shard3_replica_n4] o.a.s.c.SolrResourceLoader Solr loaded a deprecated plugin/analysis class [solr.TrieLongField]. Please consult documentation how to replace it accordingly.
   [junit4]   2> 9301 INFO  (qtp1565560207-51) [n:127.0.0.

[...truncated too long message...]

cLogger error handling event seq=0, value='null':
   [junit4]   2> java.lang.InterruptedException
   [junit4]   2> 	at java.base/java.util.concurrent.locks.AbstractQueuedSynchronizer$ConditionObject.reportInterruptAfterWait(AbstractQueuedSynchronizer.java:2056)
   [junit4]   2> 	at java.base/java.util.concurrent.locks.AbstractQueuedSynchronizer$ConditionObject.awaitNanos(AbstractQueuedSynchronizer.java:2133)
   [junit4]   2> 	at com.lmax.disruptor.TimeoutBlockingWaitStrategy.waitFor(TimeoutBlockingWaitStrategy.java:38)
   [junit4]   2> 	at com.lmax.disruptor.ProcessingSequenceBarrier.waitFor(ProcessingSequenceBarrier.java:56)
   [junit4]   2> 	at com.lmax.disruptor.BatchEventProcessor.run(BatchEventProcessor.java:128)
   [junit4]   2> 	at java.base/java.lang.Thread.run(Thread.java:835)
   [junit4]   2> AsyncLogger error handling event seq=1, value='null':
   [junit4]   2> java.lang.InterruptedException
   [junit4]   2> 	at java.base/java.util.concurrent.locks.AbstractQueuedSynchronizer$ConditionObject.reportInterruptAfterWait(AbstractQueuedSynchronizer.java:2056)
   [junit4]   2> 	at java.base/java.util.concurrent.locks.AbstractQueuedSynchronizer$ConditionObject.awaitNanos(AbstractQueuedSynchronizer.java:2133)
   [junit4]   2> 	at com.lmax.disruptor.TimeoutBlockingWaitStrategy.waitFor(TimeoutBlockingWaitStrategy.java:38)
   [junit4]   2> 	at com.lmax.disruptor.ProcessingSequenceBarrier.waitFor(ProcessingSequenceBarrier.java:56)
   [junit4]   2> 	at com.lmax.disruptor.BatchEventProcessor.run(BatchEventProcessor.java:128)
   [junit4]   2> 	at java.base/java.lang.Thread.run(Thread.java:835)
   [junit4]   2> AsyncLogger error handling event seq=2, value='null':
   [junit4]   2> java.lang.InterruptedException
   [junit4]   2> 	at java.base/java.util.concurrent.locks.AbstractQueuedSynchronizer$ConditionObject.reportInterruptAfterWait(AbstractQueuedSynchronizer.java:2056)
   [junit4]   2> 	at java.base/java.util.concurrent.locks.AbstractQueuedSynchronizer$ConditionObject.awaitNanos(AbstractQueuedSynchronizer.java:2133)
   [junit4]   2> 	at com.lmax.disruptor.TimeoutBlockingWaitStrategy.waitFor(TimeoutBlockingWaitStrategy.java:38)
   [junit4]   2> 	at com.lmax.disruptor.ProcessingSequenceBarrier.waitFor(ProcessingSequenceBarrier.java:56)
   [junit4]   2> 	at com.lmax.disruptor.BatchEventProcessor.run(BatchEventProcessor.java:128)
   [junit4]   2> 	at java.base/java.lang.Thread.run(Thread.java:835)
   [junit4]   2> AsyncLogger error handling event seq=3, value='null':
   [junit4]   2> java.lang.InterruptedException
   [junit4]   2> 	at java.base/java.util.concurrent.locks.AbstractQueuedSynchronizer$ConditionObject.reportInterruptAfterWait(AbstractQueuedSynchronizer.java:2056)
   [junit4]   2> 	at java.base/java.util.concurrent.locks.AbstractQueuedSynchronizer$ConditionObject.awaitNanos(AbstractQueuedSynchronizer.java:2133)
   [junit4]   2> 	at com.lmax.disruptor.TimeoutBlockingWaitStrategy.waitFor(TimeoutBlockingWaitStrategy.java:38)
   [junit4]   2> 	at com.lmax.disruptor.ProcessingSequenceBarrier.waitFor(ProcessingSequenceBarrier.java:56)
   [junit4]   2> 	at com.lmax.disruptor.BatchEventProcessor.run(BatchEventProcessor.java:128)
   [junit4]   2> 	at java.base/java.lang.Thread.run(Thread.java:835)
   [junit4]   2> AsyncLogger error handling event seq=4, value='null':
   [junit4]   2> java.lang.InterruptedException
   [junit4]   2> 	at java.base/java.util.concurrent.locks.AbstractQueuedSynchronizer$ConditionObject.reportInterruptAfterWait(AbstractQueuedSynchronizer.java:2056)
   [junit4]   2> 	at java.base/java.util.concurrent.locks.AbstractQueuedSynchronizer$ConditionObject.awaitNanos(AbstractQueuedSynchronizer.java:2133)
   [junit4]   2> 	at com.lmax.disruptor.TimeoutBlockingWaitStrategy.waitFor(TimeoutBlockingWaitStrategy.java:38)
   [junit4]   2> 	at com.lmax.disruptor.ProcessingSequenceBarrier.waitFor(ProcessingSequenceBarrier.java:56)
   [junit4]   2> 	at com.lmax.disruptor.BatchEventProcessor.run(BatchEventProcessor.java:128)
   [junit4]   2> 	at java.base/java.lang.Thread.run(Thread.java:835)
   [junit4]   2> Feb 22, 2019 11:21:55 PM com.carrotsearch.randomizedtesting.ThreadLeakControl tryToInterruptAll
   [junit4]   2> SEVERE: There are still zombie threads that couldn't be terminated:
   [junit4]   2>    1) Thread[id=269, name=Log4j2-TF-2-AsyncLoggerConfig--2, state=TIMED_WAITING, group=TGRP-TestDynamicURP]
   [junit4]   2>         at java.base@13-ea/jdk.internal.misc.Unsafe.park(Native Method)
   [junit4]   2>         at java.base@13-ea/java.util.concurrent.locks.LockSupport.parkNanos(LockSupport.java:235)
   [junit4]   2>         at java.base@13-ea/java.util.concurrent.locks.AbstractQueuedSynchronizer$ConditionObject.awaitNanos(AbstractQueuedSynchronizer.java:2123)
   [junit4]   2>         at app//com.lmax.disruptor.TimeoutBlockingWaitStrategy.waitFor(TimeoutBlockingWaitStrategy.java:38)
   [junit4]   2>         at app//com.lmax.disruptor.ProcessingSequenceBarrier.waitFor(ProcessingSequenceBarrier.java:56)
   [junit4]   2>         at app//com.lmax.disruptor.BatchEventProcessor.run(BatchEventProcessor.java:128)
   [junit4]   2>         at java.base@13-ea/java.lang.Thread.run(Thread.java:835)
   [junit4]   2> NOTE: test params are: codec=FastCompressingStoredFields(storedFieldsFormat=CompressingStoredFieldsFormat(compressionMode=FAST, chunkSize=6, maxDocsPerChunk=9, blockSize=6), termVectorsFormat=CompressingTermVectorsFormat(compressionMode=FAST, chunkSize=6, blockSize=6)), sim=Asserting(org.apache.lucene.search.similarities.AssertingSimilarity@335379bd), locale=rwk, timezone=Australia/Brisbane
   [junit4]   2> NOTE: Linux 4.18.0-15-generic amd64/Oracle Corporation 13-ea (64-bit)/cpus=8,threads=2,free=377806144,total=497025024
   [junit4]   2> NOTE: All tests run in this JVM: [TestDynamicURP]
   [junit4]   2> NOTE: reproduce with: ant test  -Dtestcase=TestDynamicURP -Dtests.seed=54B30AC62A2D71E -Dtests.multiplier=3 -Dtests.slow=true -Dtests.locale=rwk -Dtests.timezone=Australia/Brisbane -Dtests.asserts=true -Dtests.file.encoding=UTF-8
   [junit4] ERROR   0.00s J2 | TestDynamicURP (suite) <<<
   [junit4]    > Throwable #1: com.carrotsearch.randomizedtesting.ThreadLeakError: 1 thread leaked from SUITE scope at org.apache.solr.core.TestDynamicURP: 
   [junit4]    >    1) Thread[id=269, name=Log4j2-TF-2-AsyncLoggerConfig--2, state=TIMED_WAITING, group=TGRP-TestDynamicURP]
   [junit4]    >         at java.base@13-ea/jdk.internal.misc.Unsafe.park(Native Method)
   [junit4]    >         at java.base@13-ea/java.util.concurrent.locks.LockSupport.parkNanos(LockSupport.java:235)
   [junit4]    >         at java.base@13-ea/java.util.concurrent.locks.AbstractQueuedSynchronizer$ConditionObject.awaitNanos(AbstractQueuedSynchronizer.java:2123)
   [junit4]    >         at app//com.lmax.disruptor.TimeoutBlockingWaitStrategy.waitFor(TimeoutBlockingWaitStrategy.java:38)
   [junit4]    >         at app//com.lmax.disruptor.ProcessingSequenceBarrier.waitFor(ProcessingSequenceBarrier.java:56)
   [junit4]    >         at app//com.lmax.disruptor.BatchEventProcessor.run(BatchEventProcessor.java:128)
   [junit4]    >         at java.base@13-ea/java.lang.Thread.run(Thread.java:835)
   [junit4]    > 	at __randomizedtesting.SeedInfo.seed([54B30AC62A2D71E]:0)Throwable #2: com.carrotsearch.randomizedtesting.ThreadLeakError: There are still zombie threads that couldn't be terminated:
   [junit4]    >    1) Thread[id=269, name=Log4j2-TF-2-AsyncLoggerConfig--2, state=TIMED_WAITING, group=TGRP-TestDynamicURP]
   [junit4]    >         at java.base@13-ea/jdk.internal.misc.Unsafe.park(Native Method)
   [junit4]    >         at java.base@13-ea/java.util.concurrent.locks.LockSupport.parkNanos(LockSupport.java:235)
   [junit4]    >         at java.base@13-ea/java.util.concurrent.locks.AbstractQueuedSynchronizer$ConditionObject.awaitNanos(AbstractQueuedSynchronizer.java:2123)
   [junit4]    >         at app//com.lmax.disruptor.TimeoutBlockingWaitStrategy.waitFor(TimeoutBlockingWaitStrategy.java:38)
   [junit4]    >         at app//com.lmax.disruptor.ProcessingSequenceBarrier.waitFor(ProcessingSequenceBarrier.java:56)
   [junit4]    >         at app//com.lmax.disruptor.BatchEventProcessor.run(BatchEventProcessor.java:128)
   [junit4]    >         at java.base@13-ea/java.lang.Thread.run(Thread.java:835)
   [junit4]    > 	at __randomizedtesting.SeedInfo.seed([54B30AC62A2D71E]:0)
   [junit4] Completed [153/844 (2!)] on J2 in 25.83s, 1 test, 2 errors <<< FAILURES!

[...truncated 44755 lines...]
[repro] Jenkins log URL: https://jenkins.thetaphi.de/job/Lucene-Solr-8.x-Linux/197/consoleText

[repro] Revision: 4aa0645ea6216f556ffd8c3ad6fcb276a0cc796d

[repro] Ant options: "-Dargs=-XX:+UseCompressedOops -XX:+UseParallelGC"
[repro] Repro line:  ant test  -Dtestcase=TestJmxIntegration -Dtests.seed=54B30AC62A2D71E -Dtests.multiplier=3 -Dtests.slow=true -Dtests.locale=lv-LV -Dtests.timezone=Asia/Riyadh -Dtests.asserts=true -Dtests.file.encoding=UTF-8

[repro] Repro line:  ant test  -Dtestcase=TestDynamicURP -Dtests.seed=54B30AC62A2D71E -Dtests.multiplier=3 -Dtests.slow=true -Dtests.locale=rwk -Dtests.timezone=Australia/Brisbane -Dtests.asserts=true -Dtests.file.encoding=UTF-8

[repro] ant clean

[...truncated 6 lines...]
[repro] Test suites by module:
[repro]    solr/core
[repro]       TestJmxIntegration
[repro]       TestDynamicURP
[repro] ant compile-test

[...truncated 3580 lines...]
[repro] ant test-nocompile -Dtests.dups=5 -Dtests.maxfailures=10 -Dtests.class="*.TestJmxIntegration|*.TestDynamicURP" -Dtests.showOutput=onerror "-Dargs=-XX:+UseCompressedOops -XX:+UseParallelGC" -Dtests.seed=54B30AC62A2D71E -Dtests.multiplier=3 -Dtests.slow=true -Dtests.locale=lv-LV -Dtests.timezone=Asia/Riyadh -Dtests.asserts=true -Dtests.file.encoding=UTF-8

[...truncated 105 lines...]
[repro] Failures:
[repro]   0/5 failed: org.apache.solr.core.TestDynamicURP
[repro]   0/5 failed: org.apache.solr.core.TestJmxIntegration
[repro] Exiting with code 0

[...truncated 43 lines...]

Mime
View raw message