lucene-dev mailing list archives

Site index · List index
Message view « Date » · « Thread »
Top « Date » · « Thread »
From Apache Jenkins Server <jenk...@builds.apache.org>
Subject [JENKINS] Lucene-Solr-NightlyTests-7.x - Build # 447 - Still Unstable
Date Sun, 03 Feb 2019 10:05:45 GMT
Build: https://builds.apache.org/job/Lucene-Solr-NightlyTests-7.x/447/

1 tests failed.
FAILED:  junit.framework.TestSuite.org.apache.solr.client.solrj.impl.CloudSolrClientTest

Error Message:
ObjectTracker found 4 object(s) that were not released!!! [SolrCore, MockDirectoryWrapper, RawDirectoryWrapper, MockDirectoryWrapper] org.apache.solr.common.util.ObjectReleaseTracker$ObjectTrackerException: org.apache.solr.core.SolrCore  at org.apache.solr.common.util.ObjectReleaseTracker.track(ObjectReleaseTracker.java:42)  at org.apache.solr.core.SolrCore.<init>(SolrCore.java:1054)  at org.apache.solr.core.SolrCore.<init>(SolrCore.java:874)  at org.apache.solr.core.CoreContainer.createFromDescriptor(CoreContainer.java:1178)  at org.apache.solr.core.CoreContainer.create(CoreContainer.java:1088)  at org.apache.solr.handler.admin.CoreAdminOperation.lambda$static$0(CoreAdminOperation.java:92)  at org.apache.solr.handler.admin.CoreAdminOperation.execute(CoreAdminOperation.java:360)  at org.apache.solr.handler.admin.CoreAdminHandler$CallInfo.call(CoreAdminHandler.java:395)  at org.apache.solr.handler.admin.CoreAdminHandler.lambda$handleRequestBody$0(CoreAdminHandler.java:188)  at com.codahale.metrics.InstrumentedExecutorService$InstrumentedRunnable.run(InstrumentedExecutorService.java:176)  at org.apache.solr.common.util.ExecutorUtil$MDCAwareThreadPoolExecutor.lambda$execute$0(ExecutorUtil.java:209)  at java.util.concurrent.ThreadPoolExecutor.runWorker(ThreadPoolExecutor.java:1149)  at java.util.concurrent.ThreadPoolExecutor$Worker.run(ThreadPoolExecutor.java:624)  at java.lang.Thread.run(Thread.java:748)  org.apache.solr.common.util.ObjectReleaseTracker$ObjectTrackerException: org.apache.lucene.store.MockDirectoryWrapper  at org.apache.solr.common.util.ObjectReleaseTracker.track(ObjectReleaseTracker.java:42)  at org.apache.solr.core.CachingDirectoryFactory.get(CachingDirectoryFactory.java:348)  at org.apache.solr.handler.IndexFetcher.fetchLatestIndex(IndexFetcher.java:503)  at org.apache.solr.handler.IndexFetcher.fetchLatestIndex(IndexFetcher.java:346)  at org.apache.solr.handler.ReplicationHandler.doFetch(ReplicationHandler.java:425)  at org.apache.solr.handler.ReplicationHandler.lambda$setupPolling$13(ReplicationHandler.java:1171)  at java.util.concurrent.Executors$RunnableAdapter.call(Executors.java:511)  at java.util.concurrent.FutureTask.runAndReset(FutureTask.java:308)  at java.util.concurrent.ScheduledThreadPoolExecutor$ScheduledFutureTask.access$301(ScheduledThreadPoolExecutor.java:180)  at java.util.concurrent.ScheduledThreadPoolExecutor$ScheduledFutureTask.run(ScheduledThreadPoolExecutor.java:294)  at java.util.concurrent.ThreadPoolExecutor.runWorker(ThreadPoolExecutor.java:1149)  at java.util.concurrent.ThreadPoolExecutor$Worker.run(ThreadPoolExecutor.java:624)  at java.lang.Thread.run(Thread.java:748)  org.apache.solr.common.util.ObjectReleaseTracker$ObjectTrackerException: org.apache.lucene.store.RawDirectoryWrapper  at org.apache.solr.common.util.ObjectReleaseTracker.track(ObjectReleaseTracker.java:42)  at org.apache.solr.core.CachingDirectoryFactory.get(CachingDirectoryFactory.java:348)  at org.apache.solr.core.SolrCore.getNewIndexDir(SolrCore.java:359)  at org.apache.solr.core.SolrCore.initIndex(SolrCore.java:738)  at org.apache.solr.core.SolrCore.<init>(SolrCore.java:967)  at org.apache.solr.core.SolrCore.<init>(SolrCore.java:874)  at org.apache.solr.core.CoreContainer.createFromDescriptor(CoreContainer.java:1178)  at org.apache.solr.core.CoreContainer.create(CoreContainer.java:1088)  at org.apache.solr.handler.admin.CoreAdminOperation.lambda$static$0(CoreAdminOperation.java:92)  at org.apache.solr.handler.admin.CoreAdminOperation.execute(CoreAdminOperation.java:360)  at org.apache.solr.handler.admin.CoreAdminHandler$CallInfo.call(CoreAdminHandler.java:395)  at org.apache.solr.handler.admin.CoreAdminHandler.lambda$handleRequestBody$0(CoreAdminHandler.java:188)  at com.codahale.metrics.InstrumentedExecutorService$InstrumentedRunnable.run(InstrumentedExecutorService.java:176)  at org.apache.solr.common.util.ExecutorUtil$MDCAwareThreadPoolExecutor.lambda$execute$0(ExecutorUtil.java:209)  at java.util.concurrent.ThreadPoolExecutor.runWorker(ThreadPoolExecutor.java:1149)  at java.util.concurrent.ThreadPoolExecutor$Worker.run(ThreadPoolExecutor.java:624)  at java.lang.Thread.run(Thread.java:748)  org.apache.solr.common.util.ObjectReleaseTracker$ObjectTrackerException: org.apache.lucene.store.MockDirectoryWrapper  at org.apache.solr.common.util.ObjectReleaseTracker.track(ObjectReleaseTracker.java:42)  at org.apache.solr.core.CachingDirectoryFactory.get(CachingDirectoryFactory.java:348)  at org.apache.solr.update.SolrIndexWriter.create(SolrIndexWriter.java:95)  at org.apache.solr.core.SolrCore.initIndex(SolrCore.java:770)  at org.apache.solr.core.SolrCore.<init>(SolrCore.java:967)  at org.apache.solr.core.SolrCore.<init>(SolrCore.java:874)  at org.apache.solr.core.CoreContainer.createFromDescriptor(CoreContainer.java:1178)  at org.apache.solr.core.CoreContainer.create(CoreContainer.java:1088)  at org.apache.solr.handler.admin.CoreAdminOperation.lambda$static$0(CoreAdminOperation.java:92)  at org.apache.solr.handler.admin.CoreAdminOperation.execute(CoreAdminOperation.java:360)  at org.apache.solr.handler.admin.CoreAdminHandler$CallInfo.call(CoreAdminHandler.java:395)  at org.apache.solr.handler.admin.CoreAdminHandler.lambda$handleRequestBody$0(CoreAdminHandler.java:188)  at com.codahale.metrics.InstrumentedExecutorService$InstrumentedRunnable.run(InstrumentedExecutorService.java:176)  at org.apache.solr.common.util.ExecutorUtil$MDCAwareThreadPoolExecutor.lambda$execute$0(ExecutorUtil.java:209)  at java.util.concurrent.ThreadPoolExecutor.runWorker(ThreadPoolExecutor.java:1149)  at java.util.concurrent.ThreadPoolExecutor$Worker.run(ThreadPoolExecutor.java:624)  at java.lang.Thread.run(Thread.java:748)   expected null, but was:<ObjectTracker found 4 object(s) that were not released!!! [SolrCore, MockDirectoryWrapper, RawDirectoryWrapper, MockDirectoryWrapper] org.apache.solr.common.util.ObjectReleaseTracker$ObjectTrackerException: org.apache.solr.core.SolrCore  at org.apache.solr.common.util.ObjectReleaseTracker.track(ObjectReleaseTracker.java:42)  at org.apache.solr.core.SolrCore.<init>(SolrCore.java:1054)  at org.apache.solr.core.SolrCore.<init>(SolrCore.java:874)  at org.apache.solr.core.CoreContainer.createFromDescriptor(CoreContainer.java:1178)  at org.apache.solr.core.CoreContainer.create(CoreContainer.java:1088)  at org.apache.solr.handler.admin.CoreAdminOperation.lambda$static$0(CoreAdminOperation.java:92)  at org.apache.solr.handler.admin.CoreAdminOperation.execute(CoreAdminOperation.java:360)  at org.apache.solr.handler.admin.CoreAdminHandler$CallInfo.call(CoreAdminHandler.java:395)  at org.apache.solr.handler.admin.CoreAdminHandler.lambda$handleRequestBody$0(CoreAdminHandler.java:188)  at com.codahale.metrics.InstrumentedExecutorService$InstrumentedRunnable.run(InstrumentedExecutorService.java:176)  at org.apache.solr.common.util.ExecutorUtil$MDCAwareThreadPoolExecutor.lambda$execute$0(ExecutorUtil.java:209)  at java.util.concurrent.ThreadPoolExecutor.runWorker(ThreadPoolExecutor.java:1149)  at java.util.concurrent.ThreadPoolExecutor$Worker.run(ThreadPoolExecutor.java:624)  at java.lang.Thread.run(Thread.java:748)  org.apache.solr.common.util.ObjectReleaseTracker$ObjectTrackerException: org.apache.lucene.store.MockDirectoryWrapper  at org.apache.solr.common.util.ObjectReleaseTracker.track(ObjectReleaseTracker.java:42)  at org.apache.solr.core.CachingDirectoryFactory.get(CachingDirectoryFactory.java:348)  at org.apache.solr.handler.IndexFetcher.fetchLatestIndex(IndexFetcher.java:503)  at org.apache.solr.handler.IndexFetcher.fetchLatestIndex(IndexFetcher.java:346)  at org.apache.solr.handler.ReplicationHandler.doFetch(ReplicationHandler.java:425)  at org.apache.solr.handler.ReplicationHandler.lambda$setupPolling$13(ReplicationHandler.java:1171)  at java.util.concurrent.Executors$RunnableAdapter.call(Executors.java:511)  at java.util.concurrent.FutureTask.runAndReset(FutureTask.java:308)  at java.util.concurrent.ScheduledThreadPoolExecutor$ScheduledFutureTask.access$301(ScheduledThreadPoolExecutor.java:180)  at java.util.concurrent.ScheduledThreadPoolExecutor$ScheduledFutureTask.run(ScheduledThreadPoolExecutor.java:294)  at java.util.concurrent.ThreadPoolExecutor.runWorker(ThreadPoolExecutor.java:1149)  at java.util.concurrent.ThreadPoolExecutor$Worker.run(ThreadPoolExecutor.java:624)  at java.lang.Thread.run(Thread.java:748)  org.apache.solr.common.util.ObjectReleaseTracker$ObjectTrackerException: org.apache.lucene.store.RawDirectoryWrapper  at org.apache.solr.common.util.ObjectReleaseTracker.track(ObjectReleaseTracker.java:42)  at org.apache.solr.core.CachingDirectoryFactory.get(CachingDirectoryFactory.java:348)  at org.apache.solr.core.SolrCore.getNewIndexDir(SolrCore.java:359)  at org.apache.solr.core.SolrCore.initIndex(SolrCore.java:738)  at org.apache.solr.core.SolrCore.<init>(SolrCore.java:967)  at org.apache.solr.core.SolrCore.<init>(SolrCore.java:874)  at org.apache.solr.core.CoreContainer.createFromDescriptor(CoreContainer.java:1178)  at org.apache.solr.core.CoreContainer.create(CoreContainer.java:1088)  at org.apache.solr.handler.admin.CoreAdminOperation.lambda$static$0(CoreAdminOperation.java:92)  at org.apache.solr.handler.admin.CoreAdminOperation.execute(CoreAdminOperation.java:360)  at org.apache.solr.handler.admin.CoreAdminHandler$CallInfo.call(CoreAdminHandler.java:395)  at org.apache.solr.handler.admin.CoreAdminHandler.lambda$handleRequestBody$0(CoreAdminHandler.java:188)  at com.codahale.metrics.InstrumentedExecutorService$InstrumentedRunnable.run(InstrumentedExecutorService.java:176)  at org.apache.solr.common.util.ExecutorUtil$MDCAwareThreadPoolExecutor.lambda$execute$0(ExecutorUtil.java:209)  at java.util.concurrent.ThreadPoolExecutor.runWorker(ThreadPoolExecutor.java:1149)  at java.util.concurrent.ThreadPoolExecutor$Worker.run(ThreadPoolExecutor.java:624)  at java.lang.Thread.run(Thread.java:748)  org.apache.solr.common.util.ObjectReleaseTracker$ObjectTrackerException: org.apache.lucene.store.MockDirectoryWrapper  at org.apache.solr.common.util.ObjectReleaseTracker.track(ObjectReleaseTracker.java:42)  at org.apache.solr.core.CachingDirectoryFactory.get(CachingDirectoryFactory.java:348)  at org.apache.solr.update.SolrIndexWriter.create(SolrIndexWriter.java:95)  at org.apache.solr.core.SolrCore.initIndex(SolrCore.java:770)  at org.apache.solr.core.SolrCore.<init>(SolrCore.java:967)  at org.apache.solr.core.SolrCore.<init>(SolrCore.java:874)  at org.apache.solr.core.CoreContainer.createFromDescriptor(CoreContainer.java:1178)  at org.apache.solr.core.CoreContainer.create(CoreContainer.java:1088)  at org.apache.solr.handler.admin.CoreAdminOperation.lambda$static$0(CoreAdminOperation.java:92)  at org.apache.solr.handler.admin.CoreAdminOperation.execute(CoreAdminOperation.java:360)  at org.apache.solr.handler.admin.CoreAdminHandler$CallInfo.call(CoreAdminHandler.java:395)  at org.apache.solr.handler.admin.CoreAdminHandler.lambda$handleRequestBody$0(CoreAdminHandler.java:188)  at com.codahale.metrics.InstrumentedExecutorService$InstrumentedRunnable.run(InstrumentedExecutorService.java:176)  at org.apache.solr.common.util.ExecutorUtil$MDCAwareThreadPoolExecutor.lambda$execute$0(ExecutorUtil.java:209)  at java.util.concurrent.ThreadPoolExecutor.runWorker(ThreadPoolExecutor.java:1149)  at java.util.concurrent.ThreadPoolExecutor$Worker.run(ThreadPoolExecutor.java:624)  at java.lang.Thread.run(Thread.java:748)  >

Stack Trace:
java.lang.AssertionError: ObjectTracker found 4 object(s) that were not released!!! [SolrCore, MockDirectoryWrapper, RawDirectoryWrapper, MockDirectoryWrapper]
org.apache.solr.common.util.ObjectReleaseTracker$ObjectTrackerException: org.apache.solr.core.SolrCore
	at org.apache.solr.common.util.ObjectReleaseTracker.track(ObjectReleaseTracker.java:42)
	at org.apache.solr.core.SolrCore.<init>(SolrCore.java:1054)
	at org.apache.solr.core.SolrCore.<init>(SolrCore.java:874)
	at org.apache.solr.core.CoreContainer.createFromDescriptor(CoreContainer.java:1178)
	at org.apache.solr.core.CoreContainer.create(CoreContainer.java:1088)
	at org.apache.solr.handler.admin.CoreAdminOperation.lambda$static$0(CoreAdminOperation.java:92)
	at org.apache.solr.handler.admin.CoreAdminOperation.execute(CoreAdminOperation.java:360)
	at org.apache.solr.handler.admin.CoreAdminHandler$CallInfo.call(CoreAdminHandler.java:395)
	at org.apache.solr.handler.admin.CoreAdminHandler.lambda$handleRequestBody$0(CoreAdminHandler.java:188)
	at com.codahale.metrics.InstrumentedExecutorService$InstrumentedRunnable.run(InstrumentedExecutorService.java:176)
	at org.apache.solr.common.util.ExecutorUtil$MDCAwareThreadPoolExecutor.lambda$execute$0(ExecutorUtil.java:209)
	at java.util.concurrent.ThreadPoolExecutor.runWorker(ThreadPoolExecutor.java:1149)
	at java.util.concurrent.ThreadPoolExecutor$Worker.run(ThreadPoolExecutor.java:624)
	at java.lang.Thread.run(Thread.java:748)

org.apache.solr.common.util.ObjectReleaseTracker$ObjectTrackerException: org.apache.lucene.store.MockDirectoryWrapper
	at org.apache.solr.common.util.ObjectReleaseTracker.track(ObjectReleaseTracker.java:42)
	at org.apache.solr.core.CachingDirectoryFactory.get(CachingDirectoryFactory.java:348)
	at org.apache.solr.handler.IndexFetcher.fetchLatestIndex(IndexFetcher.java:503)
	at org.apache.solr.handler.IndexFetcher.fetchLatestIndex(IndexFetcher.java:346)
	at org.apache.solr.handler.ReplicationHandler.doFetch(ReplicationHandler.java:425)
	at org.apache.solr.handler.ReplicationHandler.lambda$setupPolling$13(ReplicationHandler.java:1171)
	at java.util.concurrent.Executors$RunnableAdapter.call(Executors.java:511)
	at java.util.concurrent.FutureTask.runAndReset(FutureTask.java:308)
	at java.util.concurrent.ScheduledThreadPoolExecutor$ScheduledFutureTask.access$301(ScheduledThreadPoolExecutor.java:180)
	at java.util.concurrent.ScheduledThreadPoolExecutor$ScheduledFutureTask.run(ScheduledThreadPoolExecutor.java:294)
	at java.util.concurrent.ThreadPoolExecutor.runWorker(ThreadPoolExecutor.java:1149)
	at java.util.concurrent.ThreadPoolExecutor$Worker.run(ThreadPoolExecutor.java:624)
	at java.lang.Thread.run(Thread.java:748)

org.apache.solr.common.util.ObjectReleaseTracker$ObjectTrackerException: org.apache.lucene.store.RawDirectoryWrapper
	at org.apache.solr.common.util.ObjectReleaseTracker.track(ObjectReleaseTracker.java:42)
	at org.apache.solr.core.CachingDirectoryFactory.get(CachingDirectoryFactory.java:348)
	at org.apache.solr.core.SolrCore.getNewIndexDir(SolrCore.java:359)
	at org.apache.solr.core.SolrCore.initIndex(SolrCore.java:738)
	at org.apache.solr.core.SolrCore.<init>(SolrCore.java:967)
	at org.apache.solr.core.SolrCore.<init>(SolrCore.java:874)
	at org.apache.solr.core.CoreContainer.createFromDescriptor(CoreContainer.java:1178)
	at org.apache.solr.core.CoreContainer.create(CoreContainer.java:1088)
	at org.apache.solr.handler.admin.CoreAdminOperation.lambda$static$0(CoreAdminOperation.java:92)
	at org.apache.solr.handler.admin.CoreAdminOperation.execute(CoreAdminOperation.java:360)
	at org.apache.solr.handler.admin.CoreAdminHandler$CallInfo.call(CoreAdminHandler.java:395)
	at org.apache.solr.handler.admin.CoreAdminHandler.lambda$handleRequestBody$0(CoreAdminHandler.java:188)
	at com.codahale.metrics.InstrumentedExecutorService$InstrumentedRunnable.run(InstrumentedExecutorService.java:176)
	at org.apache.solr.common.util.ExecutorUtil$MDCAwareThreadPoolExecutor.lambda$execute$0(ExecutorUtil.java:209)
	at java.util.concurrent.ThreadPoolExecutor.runWorker(ThreadPoolExecutor.java:1149)
	at java.util.concurrent.ThreadPoolExecutor$Worker.run(ThreadPoolExecutor.java:624)
	at java.lang.Thread.run(Thread.java:748)

org.apache.solr.common.util.ObjectReleaseTracker$ObjectTrackerException: org.apache.lucene.store.MockDirectoryWrapper
	at org.apache.solr.common.util.ObjectReleaseTracker.track(ObjectReleaseTracker.java:42)
	at org.apache.solr.core.CachingDirectoryFactory.get(CachingDirectoryFactory.java:348)
	at org.apache.solr.update.SolrIndexWriter.create(SolrIndexWriter.java:95)
	at org.apache.solr.core.SolrCore.initIndex(SolrCore.java:770)
	at org.apache.solr.core.SolrCore.<init>(SolrCore.java:967)
	at org.apache.solr.core.SolrCore.<init>(SolrCore.java:874)
	at org.apache.solr.core.CoreContainer.createFromDescriptor(CoreContainer.java:1178)
	at org.apache.solr.core.CoreContainer.create(CoreContainer.java:1088)
	at org.apache.solr.handler.admin.CoreAdminOperation.lambda$static$0(CoreAdminOperation.java:92)
	at org.apache.solr.handler.admin.CoreAdminOperation.execute(CoreAdminOperation.java:360)
	at org.apache.solr.handler.admin.CoreAdminHandler$CallInfo.call(CoreAdminHandler.java:395)
	at org.apache.solr.handler.admin.CoreAdminHandler.lambda$handleRequestBody$0(CoreAdminHandler.java:188)
	at com.codahale.metrics.InstrumentedExecutorService$InstrumentedRunnable.run(InstrumentedExecutorService.java:176)
	at org.apache.solr.common.util.ExecutorUtil$MDCAwareThreadPoolExecutor.lambda$execute$0(ExecutorUtil.java:209)
	at java.util.concurrent.ThreadPoolExecutor.runWorker(ThreadPoolExecutor.java:1149)
	at java.util.concurrent.ThreadPoolExecutor$Worker.run(ThreadPoolExecutor.java:624)
	at java.lang.Thread.run(Thread.java:748)

 expected null, but was:<ObjectTracker found 4 object(s) that were not released!!! [SolrCore, MockDirectoryWrapper, RawDirectoryWrapper, MockDirectoryWrapper]
org.apache.solr.common.util.ObjectReleaseTracker$ObjectTrackerException: org.apache.solr.core.SolrCore
	at org.apache.solr.common.util.ObjectReleaseTracker.track(ObjectReleaseTracker.java:42)
	at org.apache.solr.core.SolrCore.<init>(SolrCore.java:1054)
	at org.apache.solr.core.SolrCore.<init>(SolrCore.java:874)
	at org.apache.solr.core.CoreContainer.createFromDescriptor(CoreContainer.java:1178)
	at org.apache.solr.core.CoreContainer.create(CoreContainer.java:1088)
	at org.apache.solr.handler.admin.CoreAdminOperation.lambda$static$0(CoreAdminOperation.java:92)
	at org.apache.solr.handler.admin.CoreAdminOperation.execute(CoreAdminOperation.java:360)
	at org.apache.solr.handler.admin.CoreAdminHandler$CallInfo.call(CoreAdminHandler.java:395)
	at org.apache.solr.handler.admin.CoreAdminHandler.lambda$handleRequestBody$0(CoreAdminHandler.java:188)
	at com.codahale.metrics.InstrumentedExecutorService$InstrumentedRunnable.run(InstrumentedExecutorService.java:176)
	at org.apache.solr.common.util.ExecutorUtil$MDCAwareThreadPoolExecutor.lambda$execute$0(ExecutorUtil.java:209)
	at java.util.concurrent.ThreadPoolExecutor.runWorker(ThreadPoolExecutor.java:1149)
	at java.util.concurrent.ThreadPoolExecutor$Worker.run(ThreadPoolExecutor.java:624)
	at java.lang.Thread.run(Thread.java:748)

org.apache.solr.common.util.ObjectReleaseTracker$ObjectTrackerException: org.apache.lucene.store.MockDirectoryWrapper
	at org.apache.solr.common.util.ObjectReleaseTracker.track(ObjectReleaseTracker.java:42)
	at org.apache.solr.core.CachingDirectoryFactory.get(CachingDirectoryFactory.java:348)
	at org.apache.solr.handler.IndexFetcher.fetchLatestIndex(IndexFetcher.java:503)
	at org.apache.solr.handler.IndexFetcher.fetchLatestIndex(IndexFetcher.java:346)
	at org.apache.solr.handler.ReplicationHandler.doFetch(ReplicationHandler.java:425)
	at org.apache.solr.handler.ReplicationHandler.lambda$setupPolling$13(ReplicationHandler.java:1171)
	at java.util.concurrent.Executors$RunnableAdapter.call(Executors.java:511)
	at java.util.concurrent.FutureTask.runAndReset(FutureTask.java:308)
	at java.util.concurrent.ScheduledThreadPoolExecutor$ScheduledFutureTask.access$301(ScheduledThreadPoolExecutor.java:180)
	at java.util.concurrent.ScheduledThreadPoolExecutor$ScheduledFutureTask.run(ScheduledThreadPoolExecutor.java:294)
	at java.util.concurrent.ThreadPoolExecutor.runWorker(ThreadPoolExecutor.java:1149)
	at java.util.concurrent.ThreadPoolExecutor$Worker.run(ThreadPoolExecutor.java:624)
	at java.lang.Thread.run(Thread.java:748)

org.apache.solr.common.util.ObjectReleaseTracker$ObjectTrackerException: org.apache.lucene.store.RawDirectoryWrapper
	at org.apache.solr.common.util.ObjectReleaseTracker.track(ObjectReleaseTracker.java:42)
	at org.apache.solr.core.CachingDirectoryFactory.get(CachingDirectoryFactory.java:348)
	at org.apache.solr.core.SolrCore.getNewIndexDir(SolrCore.java:359)
	at org.apache.solr.core.SolrCore.initIndex(SolrCore.java:738)
	at org.apache.solr.core.SolrCore.<init>(SolrCore.java:967)
	at org.apache.solr.core.SolrCore.<init>(SolrCore.java:874)
	at org.apache.solr.core.CoreContainer.createFromDescriptor(CoreContainer.java:1178)
	at org.apache.solr.core.CoreContainer.create(CoreContainer.java:1088)
	at org.apache.solr.handler.admin.CoreAdminOperation.lambda$static$0(CoreAdminOperation.java:92)
	at org.apache.solr.handler.admin.CoreAdminOperation.execute(CoreAdminOperation.java:360)
	at org.apache.solr.handler.admin.CoreAdminHandler$CallInfo.call(CoreAdminHandler.java:395)
	at org.apache.solr.handler.admin.CoreAdminHandler.lambda$handleRequestBody$0(CoreAdminHandler.java:188)
	at com.codahale.metrics.InstrumentedExecutorService$InstrumentedRunnable.run(InstrumentedExecutorService.java:176)
	at org.apache.solr.common.util.ExecutorUtil$MDCAwareThreadPoolExecutor.lambda$execute$0(ExecutorUtil.java:209)
	at java.util.concurrent.ThreadPoolExecutor.runWorker(ThreadPoolExecutor.java:1149)
	at java.util.concurrent.ThreadPoolExecutor$Worker.run(ThreadPoolExecutor.java:624)
	at java.lang.Thread.run(Thread.java:748)

org.apache.solr.common.util.ObjectReleaseTracker$ObjectTrackerException: org.apache.lucene.store.MockDirectoryWrapper
	at org.apache.solr.common.util.ObjectReleaseTracker.track(ObjectReleaseTracker.java:42)
	at org.apache.solr.core.CachingDirectoryFactory.get(CachingDirectoryFactory.java:348)
	at org.apache.solr.update.SolrIndexWriter.create(SolrIndexWriter.java:95)
	at org.apache.solr.core.SolrCore.initIndex(SolrCore.java:770)
	at org.apache.solr.core.SolrCore.<init>(SolrCore.java:967)
	at org.apache.solr.core.SolrCore.<init>(SolrCore.java:874)
	at org.apache.solr.core.CoreContainer.createFromDescriptor(CoreContainer.java:1178)
	at org.apache.solr.core.CoreContainer.create(CoreContainer.java:1088)
	at org.apache.solr.handler.admin.CoreAdminOperation.lambda$static$0(CoreAdminOperation.java:92)
	at org.apache.solr.handler.admin.CoreAdminOperation.execute(CoreAdminOperation.java:360)
	at org.apache.solr.handler.admin.CoreAdminHandler$CallInfo.call(CoreAdminHandler.java:395)
	at org.apache.solr.handler.admin.CoreAdminHandler.lambda$handleRequestBody$0(CoreAdminHandler.java:188)
	at com.codahale.metrics.InstrumentedExecutorService$InstrumentedRunnable.run(InstrumentedExecutorService.java:176)
	at org.apache.solr.common.util.ExecutorUtil$MDCAwareThreadPoolExecutor.lambda$execute$0(ExecutorUtil.java:209)
	at java.util.concurrent.ThreadPoolExecutor.runWorker(ThreadPoolExecutor.java:1149)
	at java.util.concurrent.ThreadPoolExecutor$Worker.run(ThreadPoolExecutor.java:624)
	at java.lang.Thread.run(Thread.java:748)

>
	at __randomizedtesting.SeedInfo.seed([6C03F69BF1AA5CC]:0)
	at org.junit.Assert.fail(Assert.java:88)
	at org.junit.Assert.failNotNull(Assert.java:755)
	at org.junit.Assert.assertNull(Assert.java:737)
	at org.apache.solr.SolrTestCaseJ4.teardownTestCases(SolrTestCaseJ4.java:320)
	at sun.reflect.NativeMethodAccessorImpl.invoke0(Native Method)
	at sun.reflect.NativeMethodAccessorImpl.invoke(NativeMethodAccessorImpl.java:62)
	at sun.reflect.DelegatingMethodAccessorImpl.invoke(DelegatingMethodAccessorImpl.java:43)
	at java.lang.reflect.Method.invoke(Method.java:498)
	at com.carrotsearch.randomizedtesting.RandomizedRunner.invoke(RandomizedRunner.java:1750)
	at com.carrotsearch.randomizedtesting.RandomizedRunner$7.evaluate(RandomizedRunner.java:901)
	at com.carrotsearch.randomizedtesting.rules.StatementAdapter.evaluate(StatementAdapter.java:36)
	at com.carrotsearch.randomizedtesting.rules.SystemPropertiesRestoreRule$1.evaluate(SystemPropertiesRestoreRule.java:57)
	at org.apache.lucene.util.AbstractBeforeAfterRule$1.evaluate(AbstractBeforeAfterRule.java:45)
	at com.carrotsearch.randomizedtesting.rules.StatementAdapter.evaluate(StatementAdapter.java:36)
	at org.apache.lucene.util.TestRuleStoreClassName$1.evaluate(TestRuleStoreClassName.java:41)
	at com.carrotsearch.randomizedtesting.rules.NoShadowingOrOverridesOnMethodsRule$1.evaluate(NoShadowingOrOverridesOnMethodsRule.java:40)
	at com.carrotsearch.randomizedtesting.rules.NoShadowingOrOverridesOnMethodsRule$1.evaluate(NoShadowingOrOverridesOnMethodsRule.java:40)
	at com.carrotsearch.randomizedtesting.rules.StatementAdapter.evaluate(StatementAdapter.java:36)
	at com.carrotsearch.randomizedtesting.rules.StatementAdapter.evaluate(StatementAdapter.java:36)
	at com.carrotsearch.randomizedtesting.rules.StatementAdapter.evaluate(StatementAdapter.java:36)
	at org.apache.lucene.util.TestRuleAssertionsRequired$1.evaluate(TestRuleAssertionsRequired.java:53)
	at org.apache.lucene.util.TestRuleMarkFailure$1.evaluate(TestRuleMarkFailure.java:47)
	at org.apache.lucene.util.TestRuleIgnoreAfterMaxFailures$1.evaluate(TestRuleIgnoreAfterMaxFailures.java:64)
	at org.apache.lucene.util.TestRuleIgnoreTestSuites$1.evaluate(TestRuleIgnoreTestSuites.java:54)
	at com.carrotsearch.randomizedtesting.rules.StatementAdapter.evaluate(StatementAdapter.java:36)
	at com.carrotsearch.randomizedtesting.ThreadLeakControl$StatementRunner.run(ThreadLeakControl.java:368)
	at java.lang.Thread.run(Thread.java:748)




Build Log:
[...truncated 16809 lines...]
   [junit4] Suite: org.apache.solr.client.solrj.impl.CloudSolrClientTest
   [junit4]   2> Creating dataDir: /x1/jenkins/jenkins-slave/workspace/Lucene-Solr-NightlyTests-7.x/checkout/solr/build/solr-solrj/test/J0/temp/solr.client.solrj.impl.CloudSolrClientTest_6C03F69BF1AA5CC-001/init-core-data-001
   [junit4]   1> 09:42:13.894 [jetty-launcher-299-thread-3] ERROR org.apache.solr.util.StartupLoggingUtils - Missing Java Option solr.log.dir. Logging may be missing or incomplete.
   [junit4]   1> 09:42:13.895 [jetty-launcher-299-thread-2] ERROR org.apache.solr.util.StartupLoggingUtils - Missing Java Option solr.log.dir. Logging may be missing or incomplete.
   [junit4]   1> 09:42:13.990 [jetty-launcher-299-thread-1] ERROR org.apache.solr.util.StartupLoggingUtils - Missing Java Option solr.log.dir. Logging may be missing or incomplete.
   [junit4]   1> 09:42:15.767 [jetty-launcher-371-thread-3] ERROR org.apache.solr.util.StartupLoggingUtils - Missing Java Option solr.log.dir. Logging may be missing or incomplete.
   [junit4]   1> 09:42:15.771 [jetty-launcher-371-thread-1] ERROR org.apache.solr.util.StartupLoggingUtils - Missing Java Option solr.log.dir. Logging may be missing or incomplete.
   [junit4]   1> 09:42:15.773 [jetty-launcher-371-thread-2] ERROR org.apache.solr.util.StartupLoggingUtils - Missing Java Option solr.log.dir. Logging may be missing or incomplete.
   [junit4]   1> 09:42:18.425 [qtp367160593-762] ERROR org.apache.solr.common.cloud.ZkStateReader - Collection versions_collection is not lazy or watched!
   [junit4]   1> 09:42:19.435 [jetty-launcher-442-thread-3] ERROR org.apache.solr.util.StartupLoggingUtils - Missing Java Option solr.log.dir. Logging may be missing or incomplete.
   [junit4]   1> 09:42:19.445 [jetty-launcher-442-thread-1] ERROR org.apache.solr.util.StartupLoggingUtils - Missing Java Option solr.log.dir. Logging may be missing or incomplete.
   [junit4]   1> 09:42:19.446 [jetty-launcher-442-thread-2] ERROR org.apache.solr.util.StartupLoggingUtils - Missing Java Option solr.log.dir. Logging may be missing or incomplete.
   [junit4]   1> 09:42:26.386 [jetty-launcher-513-thread-1] ERROR org.apache.solr.util.StartupLoggingUtils - Missing Java Option solr.log.dir. Logging may be missing or incomplete.
   [junit4]   1> 09:42:26.386 [jetty-launcher-513-thread-3] ERROR org.apache.solr.util.StartupLoggingUtils - Missing Java Option solr.log.dir. Logging may be missing or incomplete.
   [junit4]   1> 09:42:26.389 [jetty-launcher-513-thread-2] ERROR org.apache.solr.util.StartupLoggingUtils - Missing Java Option solr.log.dir. Logging may be missing or incomplete.
   [junit4]   1> replica:core_node2 rstate:active live:true
   [junit4]   1> replica:core_node4 rstate:down live:true
   [junit4]   1> replica:core_node2 rstate:active live:true
   [junit4]   1> replica:core_node4 rstate:down live:true
   [junit4]   1> replica:core_node2 rstate:active live:true
   [junit4]   1> replica:core_node4 rstate:recovering live:true
   [junit4]   1> replica:core_node2 rstate:active live:true
   [junit4]   1> replica:core_node4 rstate:active live:true
   [junit4]   1> no one is recoverying
   [junit4]   1> replica:core_node4 rstate:active live:true
   [junit4]   1> no one is recoverying
   [junit4]   1> 09:42:31.331 [TEST-CloudSolrClientTest.testRetryUpdatesWhenClusterStateIsStale-seed#[6C03F69BF1AA5CC]] ERROR org.apache.solr.client.solrj.impl.CloudSolrClient - Request to collection [stale_state_test_col] failed due to (404) org.apache.solr.client.solrj.impl.HttpSolrClient$RemoteSolrException: Error from server at http://127.0.0.1:44681/solr/stale_state_test_col_shard1_replica_n1: Expected mime type application/octet-stream but got text/html. <html>
   [junit4]   1> <head>
   [junit4]   1> <meta http-equiv="Content-Type" content="text/html;charset=utf-8"/>
   [junit4]   1> <title>Error 404 Can not find: /solr/stale_state_test_col_shard1_replica_n1/update</title>
   [junit4]   1> </head>
   [junit4]   1> <body><h2>HTTP ERROR 404</h2>
   [junit4]   1> <p>Problem accessing /solr/stale_state_test_col_shard1_replica_n1/update. Reason:
   [junit4]   1> <pre>    Can not find: /solr/stale_state_test_col_shard1_replica_n1/update</pre></p><hr><a href="http://eclipse.org/jetty">Powered by Jetty:// 9.4.14.v20181114</a><hr/>
   [junit4]   1> 
   [junit4]   1> </body>
   [junit4]   1> </html>
   [junit4]   1> , retry=0 commError=false errorCode=404 
   [junit4]   1> 09:42:34.341 [jetty-launcher-590-thread-1] ERROR org.apache.solr.util.StartupLoggingUtils - Missing Java Option solr.log.dir. Logging may be missing or incomplete.
   [junit4]   1> 09:42:34.341 [jetty-launcher-590-thread-3] ERROR org.apache.solr.util.StartupLoggingUtils - Missing Java Option solr.log.dir. Logging may be missing or incomplete.
   [junit4]   1> 09:42:34.345 [jetty-launcher-590-thread-2] ERROR org.apache.solr.util.StartupLoggingUtils - Missing Java Option solr.log.dir. Logging may be missing or incomplete.
   [junit4]   1> 09:42:40.161 [qtp331832341-1327] ERROR org.apache.solr.handler.RequestHandlerBase - org.apache.solr.common.SolrException: Unknown action: foobar
   [junit4]   1> 	at org.apache.solr.handler.admin.ConfigSetsHandler.handleRequestBody(ConfigSetsHandler.java:109)
   [junit4]   1> 	at org.apache.solr.handler.RequestHandlerBase.handleRequest(RequestHandlerBase.java:199)
   [junit4]   1> 	at org.apache.solr.servlet.HttpSolrCall.handleAdmin(HttpSolrCall.java:735)
   [junit4]   1> 	at org.apache.solr.servlet.HttpSolrCall.handleAdminRequest(HttpSolrCall.java:716)
   [junit4]   1> 	at org.apache.solr.servlet.HttpSolrCall.call(HttpSolrCall.java:496)
   [junit4]   1> 	at org.apache.solr.servlet.SolrDispatchFilter.doFilter(SolrDispatchFilter.java:395)
   [junit4]   1> 	at org.apache.solr.servlet.SolrDispatchFilter.doFilter(SolrDispatchFilter.java:341)
   [junit4]   1> 	at org.eclipse.jetty.servlet.ServletHandler$CachedChain.doFilter(ServletHandler.java:1610)
   [junit4]   1> 	at org.apache.solr.client.solrj.embedded.JettySolrRunner$DebugFilter.doFilter(JettySolrRunner.java:158)
   [junit4]   1> 	at org.eclipse.jetty.servlet.ServletHandler$CachedChain.doFilter(ServletHandler.java:1610)
   [junit4]   1> 	at org.eclipse.jetty.servlet.ServletHandler.doHandle(ServletHandler.java:540)
   [junit4]   1> 	at org.eclipse.jetty.server.handler.ScopedHandler.nextHandle(ScopedHandler.java:255)
   [junit4]   1> 	at org.eclipse.jetty.server.session.SessionHandler.doHandle(SessionHandler.java:1588)
   [junit4]   1> 	at org.eclipse.jetty.server.handler.ScopedHandler.nextHandle(ScopedHandler.java:255)
   [junit4]   1> 	at org.eclipse.jetty.server.handler.ContextHandler.doHandle(ContextHandler.java:1345)
   [junit4]   1> 	at org.eclipse.jetty.server.handler.ScopedHandler.nextScope(ScopedHandler.java:203)
   [junit4]   1> 	at org.eclipse.jetty.servlet.ServletHandler.doScope(ServletHandler.java:480)
   [junit4]   1> 	at org.eclipse.jetty.server.session.SessionHandler.doScope(SessionHandler.java:1557)
   [junit4]   1> 	at org.eclipse.jetty.server.handler.ScopedHandler.nextScope(ScopedHandler.java:201)
   [junit4]   1> 	at org.eclipse.jetty.server.handler.ContextHandler.doScope(ContextHandler.java:1247)
   [junit4]   1> 	at org.eclipse.jetty.server.handler.ScopedHandler.handle(ScopedHandler.java:144)
   [junit4]   1> 	at org.eclipse.jetty.server.handler.gzip.GzipHandler.handle(GzipHandler.java:753)
   [junit4]   1> 	at org.eclipse.jetty.server.handler.HandlerWrapper.handle(HandlerWrapper.java:132)
   [junit4]   1> 	at org.eclipse.jetty.server.Server.handle(Server.java:502)
   [junit4]   1> 	at org.eclipse.jetty.server.HttpChannel.handle(HttpChannel.java:364)
   [junit4]   1> 	at org.eclipse.jetty.server.HttpConnection.onFillable(HttpConnection.java:260)
   [junit4]   1> 	at org.eclipse.jetty.io.AbstractConnection$ReadCallback.succeeded(AbstractConnection.java:305)
   [junit4]   1> 	at org.eclipse.jetty.io.FillInterest.fillable(FillInterest.java:103)
   [junit4]   1> 	at org.eclipse.jetty.io.ChannelEndPoint$2.run(ChannelEndPoint.java:118)
   [junit4]   1> 	at org.eclipse.jetty.util.thread.QueuedThreadPool.runJob(QueuedThreadPool.java:765)
   [junit4]   1> 	at org.eclipse.jetty.util.thread.QueuedThreadPool$2.run(QueuedThreadPool.java:683)
   [junit4]   1> 	at java.lang.Thread.run(Thread.java:748)
   [junit4]   1> 
   [junit4]   1> 09:42:40.190 [qtp331832341-1325] ERROR org.apache.solr.handler.RequestHandlerBase - org.apache.solr.common.SolrException: Unknown action: foobar
   [junit4]   1> 	at org.apache.solr.handler.admin.CollectionsHandler.handleRequestBody(CollectionsHandler.java:242)
   [junit4]   1> 	at org.apache.solr.handler.RequestHandlerBase.handleRequest(RequestHandlerBase.java:199)
   [junit4]   1> 	at org.apache.solr.servlet.HttpSolrCall.handleAdmin(HttpSolrCall.java:735)
   [junit4]   1> 	at org.apache.solr.servlet.HttpSolrCall.handleAdminRequest(HttpSolrCall.java:716)
   [junit4]   1> 	at org.apache.solr.servlet.HttpSolrCall.call(HttpSolrCall.java:496)
   [junit4]   1> 	at org.apache.solr.servlet.SolrDispatchFilter.doFilter(SolrDispatchFilter.java:395)
   [junit4]   1> 	at org.apache.solr.servlet.SolrDispatchFilter.doFilter(SolrDispatchFilter.java:341)
   [junit4]   1> 	at org.eclipse.jetty.servlet.ServletHandler$CachedChain.doFilter(ServletHandler.java:1610)
   [junit4]   1> 	at org.apache.solr.client.solrj.embedded.JettySolrRunner$DebugFilter.doFilter(JettySolrRunner.java:158)
   [junit4]   1> 	at org.eclipse.jetty.servlet.ServletHandler$CachedChain.doFilter(ServletHandler.java:1610)
   [junit4]   1> 	at org.eclipse.jetty.servlet.ServletHandler.doHandle(ServletHandler.java:540)
   [junit4]   1> 	at org.eclipse.jetty.server.handler.ScopedHandler.nextHandle(ScopedHandler.java:255)
   [junit4]   1> 	at org.eclipse.jetty.server.session.SessionHandler.doHandle(SessionHandler.java:1588)
   [junit4]   1> 	at org.eclipse.jetty.server.handler.ScopedHandler.nextHandle(ScopedHandler.java:255)
   [junit4]   1> 	at org.eclipse.jetty.server.handler.ContextHandler.doHandle(ContextHandler.java:1345)
   [junit4]   1> 	at org.eclipse.jetty.server.handler.ScopedHandler.nextScope(ScopedHandler.java:203)
   [junit4]   1> 	at org.eclipse.jetty.servlet.ServletHandler.doScope(ServletHandler.java:480)
   [junit4]   1> 	at org.eclipse.jetty.server.session.SessionHandler.doScope(SessionHandler.java:1557)
   [junit4]   1> 	at org.eclipse.jetty.server.handler.ScopedHandler.nextScope(ScopedHandler.java:201)
   [junit4]   1> 	at org.eclipse.jetty.server.handler.ContextHandler.doScope(ContextHandler.java:1247)
   [junit4]   1> 	at org.eclipse.jetty.server.handler.ScopedHandler.handle(ScopedHandler.java:144)
   [junit4]   1> 	at org.eclipse.jetty.server.handler.gzip.GzipHandler.handle(GzipHandler.java:753)
   [junit4]   1> 	at org.eclipse.jetty.server.handler.HandlerWrapper.handle(HandlerWrapper.java:132)
   [junit4]   1> 	at org.eclipse.jetty.server.Server.handle(Server.java:502)
   [junit4]   1> 	at org.eclipse.jetty.server.HttpChannel.handle(HttpChannel.java:364)
   [junit4]   1> 	at org.eclipse.jetty.server.HttpConnection.onFillable(HttpConnection.java:260)
   [junit4]   1> 	at org.eclipse.jetty.io.AbstractConnection$ReadCallback.succeeded(AbstractConnection.java:305)
   [junit4]   1> 	at org.eclipse.jetty.io.FillInterest.fillable(FillInterest.java:103)
   [junit4]   1> 	at org.eclipse.jetty.io.ChannelEndPoint$2.run(ChannelEndPoint.java:118)
   [junit4]   1> 	at org.eclipse.jetty.util.thread.QueuedThreadPool.runJob(QueuedThreadPool.java:765)
   [junit4]   1> 	at org.eclipse.jetty.util.thread.QueuedThreadPool$2.run(QueuedThreadPool.java:683)
   [junit4]   1> 	at java.lang.Thread.run(Thread.java:748)
   [junit4]   1> 
   [junit4]   1> 09:42:40.222 [qtp331832341-1326] ERROR org.apache.solr.handler.RequestHandlerBase - org.apache.solr.common.SolrException: Unsupported operation: foobar
   [junit4]   1> 	at org.apache.solr.handler.admin.CoreAdminHandler.handleCustomAction(CoreAdminHandler.java:220)
   [junit4]   1> 	at org.apache.solr.handler.admin.CoreAdminHandler.handleRequestBody(CoreAdminHandler.java:169)
   [junit4]   1> 	at org.apache.solr.handler.RequestHandlerBase.handleRequest(RequestHandlerBase.java:199)
   [junit4]   1> 	at org.apache.solr.servlet.HttpSolrCall.handleAdmin(HttpSolrCall.java:735)
   [junit4]   1> 	at org.apache.solr.servlet.HttpSolrCall.handleAdminRequest(HttpSolrCall.java:716)
   [junit4]   1> 	at org.apache.solr.servlet.HttpSolrCall.call(HttpSolrCall.java:496)
   [junit4]   1> 	at org.apache.solr.servlet.SolrDispatchFilter.doFilter(SolrDispatchFilter.java:395)
   [junit4]   1> 	at org.apache.solr.servlet.SolrDispatchFilter.doFilter(SolrDispatchFilter.java:341)
   [junit4]   1> 	at org.eclipse.jetty.servlet.ServletHandler$CachedChain.doFilter(ServletHandler.java:1610)
   [junit4]   1> 	at org.apache.solr.client.solrj.embedded.JettySolrRunner$DebugFilter.doFilter(JettySolrRunner.java:158)
   [junit4]   1> 	at org.eclipse.jetty.servlet.ServletHandler$CachedChain.doFilter(ServletHandler.java:1610)
   [junit4]   1> 	at org.eclipse.jetty.servlet.ServletHandler.doHandle(ServletHandler.java:540)
   [junit4]   1> 	at org.eclipse.jetty.server.handler.ScopedHandler.nextHandle(ScopedHandler.java:255)
   [junit4]   1> 	at org.eclipse.jetty.server.session.SessionHandler.doHandle(SessionHandler.java:1588)
   [junit4]   1> 	at org.eclipse.jetty.server.handler.ScopedHandler.nextHandle(ScopedHandler.java:255)
   [junit4]   1> 	at org.eclipse.jetty.server.handler.ContextHandler.doHandle(ContextHandler.java:1345)
   [junit4]   1> 	at org.eclipse.jetty.server.handler.ScopedHandler.nextScope(ScopedHandler.java:203)
   [junit4]   1> 	at org.eclipse.jetty.servlet.ServletHandler.doScope(ServletHandler.java:480)
   [junit4]   1> 	at org.eclipse.jetty.server.session.SessionHandler.doScope(SessionHandler.java:1557)
   [junit4]   1> 	at org.eclipse.jetty.server.handler.ScopedHandler.nextScope(ScopedHandler.java:201)
   [junit4]   1> 	at org.eclipse.jetty.server.handler.ContextHandler.doScope(ContextHandler.java:1247)
   [junit4]   1> 	at org.eclipse.jetty.server.handler.ScopedHandler.handle(ScopedHandler.java:144)
   [junit4]   1> 	at org.eclipse.jetty.server.handler.gzip.GzipHandler.handle(GzipHandler.java:753)
   [junit4]   1> 	at org.eclipse.jetty.server.handler.HandlerWrapper.handle(HandlerWrapper.java:132)
   [junit4]   1> 	at org.eclipse.jetty.server.Server.handle(Server.java:502)
   [junit4]   1> 	at org.eclipse.jetty.server.HttpChannel.handle(HttpChannel.java:364)
   [junit4]   1> 	at org.eclipse.jetty.server.HttpConnection.onFillable(HttpConnection.java:260)
   [junit4]   1> 	at org.eclipse.jetty.io.AbstractConnection$ReadCallback.succeeded(AbstractConnection.java:305)
   [junit4]   1> 	at org.eclipse.jetty.io.FillInterest.fillable(FillInterest.java:103)
   [junit4]   1> 	at org.eclipse.jetty.io.ChannelEndPoint$2.run(ChannelEndPoint.java:118)
   [junit4]   1> 	at org.eclipse.jetty.util.thread.QueuedThreadPool.runJob(QueuedThreadPool.java:765)
   [junit4]   1> 	at org.eclipse.jetty.util.thread.QueuedThreadPool$2.run(QueuedThreadPool.java:683)
   [junit4]   1> 	at java.lang.Thread.run(Thread.java:748)
   [junit4]   1> 
   [junit4]   1> 09:42:40.495 [jetty-launcher-666-thread-2] ERROR org.apache.solr.util.StartupLoggingUtils - Missing Java Option solr.log.dir. Logging may be missing or incomplete.
   [junit4]   1> 09:42:40.495 [jetty-launcher-666-thread-3] ERROR org.apache.solr.util.StartupLoggingUtils - Missing Java Option solr.log.dir. Logging may be missing or incomplete.
   [junit4]   1> 09:42:40.501 [jetty-launcher-666-thread-1] ERROR org.apache.solr.util.StartupLoggingUtils - Missing Java Option solr.log.dir. Logging may be missing or incomplete.
   [junit4]   1> 09:42:41.657 [jetty-launcher-737-thread-1] ERROR org.apache.solr.util.StartupLoggingUtils - Missing Java Option solr.log.dir. Logging may be missing or incomplete.
   [junit4]   1> 09:42:41.658 [jetty-launcher-737-thread-2] ERROR org.apache.solr.util.StartupLoggingUtils - Missing Java Option solr.log.dir. Logging may be missing or incomplete.
   [junit4]   1> 09:42:41.671 [jetty-launcher-737-thread-3] ERROR org.apache.solr.util.StartupLoggingUtils - Missing Java Option solr.log.dir. Logging may be missing or incomplete.
   [junit4]   1> 09:42:46.563 [jetty-launcher-813-thread-1] ERROR org.apache.solr.util.StartupLoggingUtils - Missing Java Option solr.log.dir. Logging may be missing or incomplete.
   [junit4]   1> 09:42:46.565 [jetty-launcher-813-thread-3] ERROR org.apache.solr.util.StartupLoggingUtils - Missing Java Option solr.log.dir. Logging may be missing or incomplete.
   [junit4]   1> 09:42:46.565 [jetty-launcher-813-thread-2] ERROR org.apache.solr.util.StartupLoggingUtils - Missing Java Option solr.log.dir. Logging may be missing or incomplete.
   [junit4]   1> 09:42:49.245 [TEST-CloudSolrClientTest.testShutdown-seed#[6C03F69BF1AA5CC]-SendThread(ff01:0:0:0:0:0:0:114:33332)] ERROR org.apache.zookeeper.ClientCnxnSocketNIO - Unable to open socket to ff01:0:0:0:0:0:0:114/ff01:0:0:0:0:0:0:114:33332
   [junit4]   1> 09:42:50.418 [TEST-CloudSolrClientTest.testShutdown-seed#[6C03F69BF1AA5CC]-SendThread(ff01:0:0:0:0:0:0:114:33332)] ERROR org.apache.zookeeper.ClientCnxnSocketNIO - Unable to open socket to ff01:0:0:0:0:0:0:114/ff01:0:0:0:0:0:0:114:33332
   [junit4]   1> 09:42:50.808 [jetty-launcher-889-thread-3] ERROR org.apache.solr.util.StartupLoggingUtils - Missing Java Option solr.log.dir. Logging may be missing or incomplete.
   [junit4]   1> 09:42:50.821 [jetty-launcher-889-thread-2] ERROR org.apache.solr.util.StartupLoggingUtils - Missing Java Option solr.log.dir. Logging may be missing or incomplete.
   [junit4]   1> 09:42:50.822 [jetty-launcher-889-thread-1] ERROR org.apache.solr.util.StartupLoggingUtils - Missing Java Option solr.log.dir. Logging may be missing or incomplete.
   [junit4]   1> 09:42:56.212 [qtp507668222-2066] ERROR org.apache.solr.servlet.SolrDispatchFilter - Error processing the request. CoreContainer is either not initialized or shutting down.
   [junit4]   1> 09:42:56.239 [indexFetcher-538-thread-1] ERROR org.apache.solr.handler.IndexFetcher - Error fetching file, doing one retry...:org.apache.solr.common.SolrException: Unable to download _0.cfs completely. Downloaded 0!=2639
   [junit4]   1> 	at org.apache.solr.handler.IndexFetcher$FileFetcher.cleanup(IndexFetcher.java:1700)
   [junit4]   1> 	at org.apache.solr.handler.IndexFetcher$FileFetcher.fetch(IndexFetcher.java:1580)
   [junit4]   1> 	at org.apache.solr.handler.IndexFetcher$FileFetcher.fetchFile(IndexFetcher.java:1550)
   [junit4]   1> 	at org.apache.solr.handler.IndexFetcher.downloadIndexFiles(IndexFetcher.java:1030)
   [junit4]   1> 	at org.apache.solr.handler.IndexFetcher.fetchLatestIndex(IndexFetcher.java:569)
   [junit4]   1> 	at org.apache.solr.handler.IndexFetcher.fetchLatestIndex(IndexFetcher.java:346)
   [junit4]   1> 	at org.apache.solr.handler.ReplicationHandler.doFetch(ReplicationHandler.java:425)
   [junit4]   1> 	at org.apache.solr.handler.ReplicationHandler.lambda$setupPolling$13(ReplicationHandler.java:1171)
   [junit4]   1> 	at java.util.concurrent.Executors$RunnableAdapter.call(Executors.java:511)
   [junit4]   1> 	at java.util.concurrent.FutureTask.runAndReset(FutureTask.java:308)
   [junit4]   1> 	at java.util.concurrent.ScheduledThreadPoolExecutor$ScheduledFutureTask.access$301(ScheduledThreadPoolExecutor.java:180)
   [junit4]   1> 	at java.util.concurrent.ScheduledThreadPoolExecutor$ScheduledFutureTask.run(ScheduledThreadPoolExecutor.java:294)
   [junit4]   1> 	at java.util.concurrent.ThreadPoolExecutor.runWorker(ThreadPoolExecutor.java:1149)
   [junit4]   1> 	at java.util.concurrent.ThreadPoolExecutor$Worker.run(ThreadPoolExecutor.java:624)
   [junit4]   1> 	at java.lang.Thread.run(Thread.java:748)
   [junit4]   1> 
   [junit4]   1> 09:42:56.252 [qtp507668222-2070] ERROR org.apache.solr.servlet.SolrDispatchFilter - Error processing the request. CoreContainer is either not initialized or shutting down.
   [junit4]   1> 09:42:56.257 [indexFetcher-538-thread-1] ERROR org.apache.solr.handler.IndexFetcher - Error deleting file: _0.cfs
   [junit4]   1> java.io.FileNotFoundException: _0.cfs
   [junit4]   1> 	at org.apache.lucene.store.RAMDirectory.deleteFile(RAMDirectory.java:178) ~[java/:?]
   [junit4]   1> 	at org.apache.lucene.store.MockDirectoryWrapper.deleteFile(MockDirectoryWrapper.java:607) ~[java/:?]
   [junit4]   1> 	at org.apache.solr.handler.IndexFetcher$DirectoryFile.delete(IndexFetcher.java:1784) ~[java/:?]
   [junit4]   1> 	at org.apache.solr.handler.IndexFetcher$FileFetcher.cleanup(IndexFetcher.java:1694) ~[java/:?]
   [junit4]   1> 	at org.apache.solr.handler.IndexFetcher$FileFetcher.fetch(IndexFetcher.java:1580) ~[java/:?]
   [junit4]   1> 	at org.apache.solr.handler.IndexFetcher$FileFetcher.fetchFile(IndexFetcher.java:1555) ~[java/:?]
   [junit4]   1> 	at org.apache.solr.handler.IndexFetcher.downloadIndexFiles(IndexFetcher.java:1030) ~[java/:?]
   [junit4]   1> 	at org.apache.solr.handler.IndexFetcher.fetchLatestIndex(IndexFetcher.java:569) ~[java/:?]
   [junit4]   1> 	at org.apache.solr.handler.IndexFetcher.fetchLatestIndex(IndexFetcher.java:346) ~[java/:?]
   [junit4]   1> 	at org.apache.solr.handler.ReplicationHandler.doFetch(ReplicationHandler.java:425) ~[java/:?]
   [junit4]   1> 	at org.apache.solr.handler.ReplicationHandler.lambda$setupPolling$13(ReplicationHandler.java:1171) ~[java/:?]
   [junit4]   1> 	at java.util.concurrent.Executors$RunnableAdapter.call(Executors.java:511) [?:1.8.0_191]
   [junit4]   1> 	at java.util.concurrent.FutureTask.runAndReset(FutureTask.java:308) [?:1.8.0_191]
   [junit4]   1> 	at java.util.concurrent.ScheduledThreadPoolExecutor$ScheduledFutureTask.access$301(ScheduledThreadPoolExecutor.java:180) [?:1.8.0_191]
   [junit4]   1> 	at java.util.concurrent.ScheduledThreadPoolExecutor$ScheduledFutureTask.run(ScheduledThreadPoolExecutor.java:294) [?:1.8.0_191]
   [junit4]   1> 	at java.util.concurrent.ThreadPoolExecutor.runWorker(ThreadPoolExecutor.java:1149) [?:1.8.0_191]
   [junit4]   1> 	at java.util.concurrent.ThreadPoolExecutor$Worker.run(ThreadPoolExecutor.java:624) [?:1.8.0_191]
   [junit4]   1> 	at java.lang.Thread.run(Thread.java:748) [?:1.8.0_191]
   [junit4]   1> 09:42:56.274 [indexFetcher-538-thread-1] ERROR org.apache.solr.handler.ReplicationHandler - Index fetch failed :org.apache.solr.common.SolrException: Unable to download _0.cfs completely. Downloaded 0!=2639
   [junit4]   1> 	at org.apache.solr.handler.IndexFetcher$FileFetcher.cleanup(IndexFetcher.java:1700)
   [junit4]   1> 	at org.apache.solr.handler.IndexFetcher$FileFetcher.fetch(IndexFetcher.java:1580)
   [junit4]   1> 	at org.apache.solr.handler.IndexFetcher$FileFetcher.fetchFile(IndexFetcher.java:1555)
   [junit4]   1> 	at org.apache.solr.handler.IndexFetcher.downloadIndexFiles(IndexFetcher.java:1030)
   [junit4]   1> 	at org.apache.solr.handler.IndexFetcher.fetchLatestIndex(IndexFetcher.java:569)
   [junit4]   1> 	at org.apache.solr.handler.IndexFetcher.fetchLatestIndex(IndexFetcher.java:346)
   [junit4]   1> 	at org.apache.solr.handler.ReplicationHandler.doFetch(ReplicationHandler.java:425)
   [junit4]   1> 	at org.apache.solr.handler.ReplicationHandler.lambda$setupPolling$13(ReplicationHandler.java:1171)
   [junit4]   1> 	at java.util.concurrent.Executors$RunnableAdapter.call(Executors.java:511)
   [junit4]   1> 	at java.util.concurrent.FutureTask.runAndReset(FutureTask.java:308)
   [junit4]   1> 	at java.util.concurrent.ScheduledThreadPoolExecutor$ScheduledFutureTask.access$301(ScheduledThreadPoolExecutor.java:180)
   [junit4]   1> 	at java.util.concurrent.ScheduledThreadPoolExecutor$ScheduledFutureTask.run(ScheduledThreadPoolExecutor.java:294)
   [junit4]   1> 	at java.util.concurrent.ThreadPoolExecutor.runWorker(ThreadPoolExecutor.java:1149)
   [junit4]   1> 	at java.util.concurrent.ThreadPoolExecutor$Worker.run(ThreadPoolExecutor.java:624)
   [junit4]   1> 	at java.lang.Thread.run(Thread.java:748)
   [junit4]   1> 
   [junit4]   1> 09:43:08.496 [indexFetcher-542-thread-1] ERROR org.apache.solr.core.CachingDirectoryFactory - Timeout waiting for all directory ref counts to be released - gave up waiting on CachedDir<<refCount=1;path=/x1/jenkins/jenkins-slave/workspace/Lucene-Solr-NightlyTests-7.x/checkout/solr/build/solr-solrj/test/J0/temp/solr.client.solrj.impl.CloudSolrClientTest_6C03F69BF1AA5CC-001/tempDir-009/node1/./replicaTypesTestColl_shard2_replica_t9/data/index;done=false>>
   [junit4]   1> 09:43:08.496 [indexFetcher-542-thread-1] ERROR org.apache.solr.core.CachingDirectoryFactory - Error closing directory:org.apache.solr.common.SolrException: Timeout waiting for all directory ref counts to be released - gave up waiting on CachedDir<<refCount=1;path=/x1/jenkins/jenkins-slave/workspace/Lucene-Solr-NightlyTests-7.x/checkout/solr/build/solr-solrj/test/J0/temp/solr.client.solrj.impl.CloudSolrClientTest_6C03F69BF1AA5CC-001/tempDir-009/node1/./replicaTypesTestColl_shard2_replica_t9/data/index;done=false>>
   [junit4]   1> 	at org.apache.solr.core.CachingDirectoryFactory.close(CachingDirectoryFactory.java:178)
   [junit4]   1> 	at org.apache.solr.core.SolrCore.close(SolrCore.java:1652)
   [junit4]   1> 	at org.apache.solr.handler.IndexFetcher.openNewSearcherAndUpdateCommitPoint(IndexFetcher.java:909)
   [junit4]   1> 	at org.apache.solr.handler.IndexFetcher.fetchLatestIndex(IndexFetcher.java:653)
   [junit4]   1> 	at org.apache.solr.handler.IndexFetcher.fetchLatestIndex(IndexFetcher.java:346)
   [junit4]   1> 	at org.apache.solr.handler.ReplicationHandler.doFetch(ReplicationHandler.java:425)
   [junit4]   1> 	at org.apache.solr.handler.ReplicationHandler.lambda$setupPolling$13(ReplicationHandler.java:1171)
   [junit4]   1> 	at java.util.concurrent.Executors$RunnableAdapter.call(Executors.java:511)
   [junit4]   1> 	at java.util.concurrent.FutureTask.runAndReset(FutureTask.java:308)
   [junit4]   1> 	at java.util.concurrent.ScheduledThreadPoolExecutor$ScheduledFutureTask.access$301(ScheduledThreadPoolExecutor.java:180)
   [junit4]   1> 	at java.util.concurrent.ScheduledThreadPoolExecutor$ScheduledFutureTask.run(ScheduledThreadPoolExecutor.java:294)
   [junit4]   1> 	at java.util.concurrent.ThreadPoolExecutor.runWorker(ThreadPoolExecutor.java:1149)
   [junit4]   1> 	at java.util.concurrent.ThreadPoolExecutor$Worker.run(ThreadPoolExecutor.java:624)
   [junit4]   1> 	at java.lang.Thread.run(Thread.java:748)
   [junit4]   1> 
   [junit4]   1> 09:43:20.627 [indexFetcher-542-thread-1] ERROR org.apache.solr.core.CachingDirectoryFactory - Timeout waiting for all directory ref counts to be released - gave up waiting on CachedDir<<refCount=1;path=/x1/jenkins/jenkins-slave/workspace/Lucene-Solr-NightlyTests-7.x/checkout/solr/build/solr-solrj/test/J0/temp/solr.client.solrj.impl.CloudSolrClientTest_6C03F69BF1AA5CC-001/tempDir-009/node1/./replicaTypesTestColl_shard2_replica_t9/data/index.20190203104256097;done=false>>
   [junit4]   1> 09:43:20.628 [indexFetcher-542-thread-1] ERROR org.apache.solr.core.CachingDirectoryFactory - Error closing directory:org.apache.solr.common.SolrException: Timeout waiting for all directory ref counts to be released - gave up waiting on CachedDir<<refCount=1;path=/x1/jenkins/jenkins-slave/workspace/Lucene-Solr-NightlyTests-7.x/checkout/solr/build/solr-solrj/test/J0/temp/solr.client.solrj.impl.CloudSolrClientTest_6C03F69BF1AA5CC-001/tempDir-009/node1/./replicaTypesTestColl_shard2_replica_t9/data/index.20190203104256097;done=false>>
   [junit4]   1> 	at org.apache.solr.core.CachingDirectoryFactory.close(CachingDirectoryFactory.java:178)
   [junit4]   1> 	at org.apache.solr.core.SolrCore.close(SolrCore.java:1652)
   [junit4]   1> 	at org.apache.solr.handler.IndexFetcher.openNewSearcherAndUpdateCommitPoint(IndexFetcher.java:909)
   [junit4]   1> 	at org.apache.solr.handler.IndexFetcher.fetchLatestIndex(IndexFetcher.java:653)
   [junit4]   1> 	at org.apache.solr.handler.IndexFetcher.fetchLatestIndex(IndexFetcher.java:346)
   [junit4]   1> 	at org.apache.solr.handler.ReplicationHandler.doFetch(ReplicationHandler.java:425)
   [junit4]   1> 	at org.apache.solr.handler.ReplicationHandler.lambda$setupPolling$13(ReplicationHandler.java:1171)
   [junit4]   1> 	at java.util.concurrent.Executors$RunnableAdapter.call(Executors.java:511)
   [junit4]   1> 	at java.util.concurrent.FutureTask.runAndReset(FutureTask.java:308)
   [junit4]   1> 	at java.util.concurrent.ScheduledThreadPoolExecutor$ScheduledFutureTask.access$301(ScheduledThreadPoolExecutor.java:180)
   [junit4]   1> 	at java.util.concurrent.ScheduledThreadPoolExecutor$ScheduledFutureTask.run(ScheduledThreadPoolExecutor.java:294)
   [junit4]   1> 	at java.util.concurrent.ThreadPoolExecutor.runWorker(ThreadPoolExecutor.java:1149)
   [junit4]   1> 	at java.util.concurrent.ThreadPoolExecutor$Worker.run(ThreadPoolExecutor.java:624)
   [junit4]   1> 	at java.lang.Thread.run(Thread.java:748)
   [junit4]   1> 
   [junit4]   1> 09:43:20.628 [indexFetcher-542-thread-1] ERROR org.apache.solr.core.SolrCore - java.lang.AssertionError: 1
   [junit4]   1> 	at org.apache.solr.core.CachingDirectoryFactory.close(CachingDirectoryFactory.java:192)
   [junit4]   1> 	at org.apache.solr.core.SolrCore.close(SolrCore.java:1652)
   [junit4]   1> 	at org.apache.solr.handler.IndexFetcher.openNewSearcherAndUpdateCommitPoint(IndexFetcher.java:909)
   [junit4]   1> 	at org.apache.solr.handler.IndexFetcher.fetchLatestIndex(IndexFetcher.java:653)
   [junit4]   1> 	at org.apache.solr.handler.IndexFetcher.fetchLatestIndex(IndexFetcher.java:346)
   [junit4]   1> 	at org.apache.solr.handler.ReplicationHandler.doFetch(ReplicationHandler.java:425)
   [junit4]   1> 	at org.apache.solr.handler.ReplicationHandler.lambda$setupPolling$13(ReplicationHandler.java:1171)
   [junit4]   1> 	at java.util.concurrent.Executors$RunnableAdapter.call(Executors.java:511)
   [junit4]   1> 	at java.util.concurrent.FutureTask.runAndReset(FutureTask.java:308)
   [junit4]   1> 	at java.util.concurrent.ScheduledThreadPoolExecutor$ScheduledFutureTask.access$301(ScheduledThreadPoolExecutor.java:180)
   [junit4]   1> 	at java.util.concurrent.ScheduledThreadPoolExecutor$ScheduledFutureTask.run(ScheduledThreadPoolExecutor.java:294)
   [junit4]   1> 	at java.util.concurrent.ThreadPoolExecutor.runWorker(ThreadPoolExecutor.java:1149)
   [junit4]   1> 	at java.util.concurrent.ThreadPoolExecutor$Worker.run(ThreadPoolExecutor.java:624)
   [junit4]   1> 	at java.lang.Thread.run(Thread.java:748)
   [junit4]   1> 
   [junit4]   1> 09:43:20.767 [jetty-launcher-960-thread-1] ERROR org.apache.solr.util.StartupLoggingUtils - Missing Java Option solr.log.dir. Logging may be missing or incomplete.
   [junit4]   1> 09:43:20.774 [jetty-launcher-960-thread-3] ERROR org.apache.solr.util.StartupLoggingUtils - Missing Java Option solr.log.dir. Logging may be missing or incomplete.
   [junit4]   1> 09:43:20.778 [jetty-launcher-960-thread-2] ERROR org.apache.solr.util.StartupLoggingUtils - Missing Java Option solr.log.dir. Logging may be missing or incomplete.
   [junit4]   1> 09:43:24.119 [jetty-launcher-1031-thread-1] ERROR org.apache.solr.util.StartupLoggingUtils - Missing Java Option solr.log.dir. Logging may be missing or incomplete.
   [junit4]   1> 09:43:24.122 [jetty-launcher-1031-thread-2] ERROR org.apache.solr.util.StartupLoggingUtils - Missing Java Option solr.log.dir. Logging may be missing or incomplete.
   [junit4]   1> 09:43:24.122 [jetty-launcher-1031-thread-3] ERROR org.apache.solr.util.StartupLoggingUtils - Missing Java Option solr.log.dir. Logging may be missing or incomplete.
   [junit4]   1> 09:43:34.158 [jetty-launcher-1107-thread-2] ERROR org.apache.solr.util.StartupLoggingUtils - Missing Java Option solr.log.dir. Logging may be missing or incomplete.
   [junit4]   1> 09:43:34.158 [jetty-launcher-1107-thread-1] ERROR org.apache.solr.util.StartupLoggingUtils - Missing Java Option solr.log.dir. Logging may be missing or incomplete.
   [junit4]   1> 09:43:34.177 [jetty-launcher-1107-thread-3] ERROR org.apache.solr.util.StartupLoggingUtils - Missing Java Option solr.log.dir. Logging may be missing or incomplete.
   [junit4]   1> 09:43:42.063 [jetty-launcher-1178-thread-1] ERROR org.apache.solr.util.StartupLoggingUtils - Missing Java Option solr.log.dir. Logging may be missing or incomplete.
   [junit4]   1> 09:43:42.066 [jetty-launcher-1178-thread-3] ERROR org.apache.solr.util.StartupLoggingUtils - Missing Java Option solr.log.dir. Logging may be missing or incomplete.
   [junit4]   1> 09:43:42.071 [jetty-launcher-1178-thread-2] ERROR org.apache.solr.util.StartupLoggingUtils - Missing Java Option solr.log.dir. Logging may be missing or incomplete.
   [junit4]   1> 09:43:45.530 [jetty-launcher-1249-thread-1] ERROR org.apache.solr.util.StartupLoggingUtils - Missing Java Option solr.log.dir. Logging may be missing or incomplete.
   [junit4]   1> 09:43:45.538 [jetty-launcher-1249-thread-2] ERROR org.apache.solr.util.StartupLoggingUtils - Missing Java Option solr.log.dir. Logging may be missing or incomplete.
   [junit4]   1> 09:43:45.542 [jetty-launcher-1249-thread-3] ERROR org.apache.solr.util.StartupLoggingUtils - Missing Java Option solr.log.dir. Logging may be missing or incomplete.
   [junit4]   1> 09:43:48.948 [jetty-launcher-1320-thread-1] ERROR org.apache.solr.util.StartupLoggingUtils - Missing Java Option solr.log.dir. Logging may be missing or incomplete.
   [junit4]   1> 09:43:48.954 [jetty-launcher-1320-thread-3] ERROR org.apache.solr.util.StartupLoggingUtils - Missing Java Option solr.log.dir. Logging may be missing or incomplete.
   [junit4]   1> 09:43:48.972 [jetty-launcher-1320-thread-2] ERROR org.apache.solr.util.StartupLoggingUtils - Missing Java Option solr.log.dir. Logging may be missing or incomplete.
   [junit4]   1> 09:43:50.206 [jetty-launcher-1396-thread-2] ERROR org.apache.solr.util.StartupLoggingUtils - Missing Java Option solr.log.dir. Logging may be missing or incomplete.
   [junit4]   1> 09:43:50.210 [jetty-launcher-1396-thread-1] ERROR org.apache.solr.util.StartupLoggingUtils - Missing Java Option solr.log.dir. Logging may be missing or incomplete.
   [junit4]   1> 09:43:50.219 [jetty-launcher-1396-thread-3] ERROR org.apache.solr.util.StartupLoggingUtils - Missing Java Option solr.log.dir. Logging may be missing or incomplete.
   [junit4]   2> SUITE-CloudSolrClientTest-seed#[6C03F69BF1AA5CC]-worker:
   [junit4]   2>     java.lang.Thread.dumpThreads(Native Method)
   [junit4]   2>     java.lang.Thread.getAllStackTraces(Thread.java:1610)
   [junit4]   2>     org.apache.solr.SolrTestCaseJ4.clearObjectTrackerAndCheckEmpty(SolrTestCaseJ4.java:391)
   [junit4]   2>     org.apache.solr.SolrTestCaseJ4.teardownTestCases(SolrTestCaseJ4.java:319)
   [junit4]   2>     [...sun.*, java.lang.reflect.*, com.carrotsearch.randomizedtesting.*]
   [junit4]   2>     org.apache.lucene.util.AbstractBeforeAfterRule$1.evaluate(AbstractBeforeAfterRule.java:45)
   [junit4]   2>     [...com.carrotsearch.randomizedtesting.*]
   [junit4]   2>     org.apache.lucene.util.TestRuleStoreClassName$1.evaluate(TestRuleStoreClassName.java:41)
   [junit4]   2>     [...com.carrotsearch.randomizedtesting.*]
   [junit4]   2>     org.apache.lucene.util.TestRuleAssertionsRequired$1.evaluate(TestRuleAssertionsRequired.java:53)
   [junit4]   2>     org.apache.lucene.util.TestRuleMarkFailure$1.evaluate(TestRuleMarkFailure.java:47)
   [junit4]   2>     org.apache.lucene.util.TestRuleIgnoreAfterMaxFailures$1.evaluate(TestRuleIgnoreAfterMaxFailures.java:64)
   [junit4]   2>     org.apache.lucene.util.TestRuleIgnoreTestSuites$1.evaluate(TestRuleIgnoreTestSuites.java:54)
   [junit4]   2>     [...com.carrotsearch.randomizedtesting.*]
   [junit4]   2>     java.lang.Thread.run(Thread.java:748)
   [junit4]   2> 
   [junit4]   2> Finalizer:
   [junit4]   2>     java.lang.Object.wait(Native Method)
   [junit4]   2>     java.lang.ref.ReferenceQueue.remove(ReferenceQueue.java:144)
   [junit4]   2>     java.lang.ref.ReferenceQueue.remove(ReferenceQueue.java:165)
   [junit4]   2>     java.lang.ref.Finalizer$FinalizerThread.run(Finalizer.java:216)
   [junit4]   2> 
   [junit4]   2> main:
   [junit4]   2>     java.lang.Object.wait(Native Method)
   [junit4]   2>     java.lang.Thread.join(Thread.java:1252)
   [junit4]   2>     java.lang.Thread.join(Thread.java:1326)
   [junit4]   2>     [...com.carrotsearch.randomizedtesting.*]
   [junit4]   2>     com.carrotsearch.ant.tasks.junit4.slave.SlaveMain.execute(SlaveMain.java:269)
   [junit4]   2>     com.carrotsearch.ant.tasks.junit4.slave.SlaveMain.main(SlaveMain.java:394)
   [junit4]   2>     com.carrotsearch.ant.tasks.junit4.slave.SlaveMainSafe.main(SlaveMainSafe.java:13)
   [junit4]   2> 
   [junit4]   2> SUITE-CloudSolrClientTest-seed#[6C03F69BF1AA5CC]:
   [junit4]   2>     java.lang.Thread.sleep(Native Method)
   [junit4]   2>     [...com.carrotsearch.randomizedtesting.*]
   [junit4]   2> 
   [junit4]   2> Signal Dispatcher:
   [junit4]   2> 
   [junit4]   2> JUnit4-serializer-daemon:
   [junit4]   2>     java.lang.Thread.sleep(Native Method)
   [junit4]   2>     com.carrotsearch.ant.tasks.junit4.events.Serializer$1.run(Serializer.java:50)
   [junit4]   2> 
   [junit4]   2> Reference Handler:
   [junit4]   2>     java.lang.Object.wait(Native Method)
   [junit4]   2>     java.lang.Object.wait(Object.java:502)
   [junit4]   2>     java.lang.ref.Reference.tryHandlePending(Reference.java:191)
   [junit4]   2>     java.lang.ref.Reference$ReferenceHandler.run(Reference.java:153)
   [junit4]   2> 
   [junit4]   2> SUITE-CloudSolrClientTest-seed#[6C03F69BF1AA5CC]-worker:
   [junit4]   2>     java.lang.Thread.dumpThreads(Native Method)
   [junit4]   2>     java.lang.Thread.getAllStackTraces(Thread.java:1610)
   [junit4]   2>     org.apache.solr.SolrTestCaseJ4.clearObjectTrackerAndCheckEmpty(SolrTestCaseJ4.java:391)
   [junit4]   2>     org.apache.solr.SolrTestCaseJ4.teardownTestCases(SolrTestCaseJ4.java:319)
   [junit4]   2>     [...sun.*, java.lang.reflect.*, com.carrotsearch.randomizedtesting.*]
   [junit4]   2>     org.apache.lucene.util.AbstractBeforeAfterRule$1.evaluate(AbstractBeforeAfterRule.java:45)
   [junit4]   2>     [...com.carrotsearch.randomizedtesting.*]
   [junit4]   2>     org.apache.lucene.util.TestRuleStoreClassName$1.evaluate(TestRuleStoreClassName.java:41)
   [junit4]   2>     [...com.carrotsearch.randomizedtesting.*]
   [junit4]   2>     org.apache.lucene.util.TestRuleAssertionsRequired$1.evaluate(TestRuleAssertionsRequired.java:53)
   [junit4]   2>     org.apache.lucene.util.TestRuleMarkFailure$1.evaluate(TestRuleMarkFailure.java:47)
   [junit4]   2>     org.apache.lucene.util.TestRuleIgnoreAfterMaxFailures$1.evaluate(TestRuleIgnoreAfterMaxFailures.java:64)
   [junit4]   2>     org.apache.lucene.util.TestRuleIgnoreTestSuites$1.evaluate(TestRuleIgnoreTestSuites.java:54)
   [junit4]   2>     [...com.carrotsearch.randomizedtesting.*]
   [junit4]   2>     java.lang.Thread.run(Thread.java:748)
   [junit4]   2> 
   [junit4]   2> Finalizer:
   [junit4]   2>     java.lang.Object.wait(Native Method)
   [junit4]   2>     java.lang.ref.ReferenceQueue.remove(ReferenceQueue.java:144)
   [junit4]   2>     java.lang.ref.ReferenceQueue.remove(ReferenceQueue.java:165)
   [junit4]   2>     java.lang.ref.Finalizer$FinalizerThread.run(Finalizer.java:216)
   [junit4]   2> 
   [junit4]   2> main:
   [junit4]   2>     java.lang.Object.wait(Native Method)
   [junit4]   2>     java.lang.Thread.join(Thread.java:1252)
   [junit4]   2>     java.lang.Thread.join(Thread.java:1326)
   [junit4]   2>     [...com.carrotsearch.randomizedtesting.*]
   [junit4]   2>     com.carrotsearch.ant.tasks.junit4.slave.SlaveMain.execute(SlaveMain.java:269)
   [junit4]   2>     com.carrotsearch.ant.tasks.junit4.slave.SlaveMain.main(SlaveMain.java:394)
   [junit4]   2>     com.carrotsearch.ant.tasks.junit4.slave.SlaveMainSafe.main(SlaveMainSafe.java:13)
   [junit4]   2> 
   [junit4]   2> SUITE-CloudSolrClientTest-seed#[6C03F69BF1AA5CC]:
   [junit4]   2>     java.lang.Thread.sleep(Native Method)
   [junit4]   2>     [...com.carrotsearch.randomizedtesting.*]
   [junit4]   2> 
   [junit4]   2> Signal Dispatcher:
   [junit4]   2> 
   [junit4]   2> JUnit4-serializer-daemon:
   [junit4]   2>     java.lang.Thread.sleep(Native Method)
   [junit4]   2>     com.carrotsearch.ant.tasks.junit4.events.Serializer$1.run(Serializer.java:50)
   [junit4]   2> 
   [junit4]   2> Reference Handler:
   [junit4]   2>     java.lang.Object.wait(Native Method)
   [junit4]   2>     java.lang.Object.wait(Object.java:502)
   [junit4]   2>     java.lang.ref.Reference.tryHandlePending(Reference.java:191)
   [junit4]   2>     java.lang.ref.Reference$ReferenceHandler.run(Reference.java:153)
   [junit4]   2> 
   [junit4]   2> SUITE-CloudSolrClientTest-seed#[6C03F69BF1AA5CC]-worker:
   [junit4]   2>     java.lang.Thread.dumpThreads(Native Method)
   [junit4]   2>     java.lang.Thread.getAllStackTraces(Thread.java:1610)
   [junit4]   2>     org.apache.solr.SolrTestCaseJ4.clearObjectTrackerAndCheckEmpty(SolrTestCaseJ4.java:391)
   [junit4]   2>     org.apache.solr.SolrTestCaseJ4.teardownTestCases(SolrTestCaseJ4.java:319)
   [junit4]   2>     [...sun.*, java.lang.reflect.*, com.carrotsearch.randomizedtesting.*]
   [junit4]   2>     org.apache.lucene.util.AbstractBeforeAfterRule$1.evaluate(AbstractBeforeAfterRule.java:45)
   [junit4]   2>     [...com.carrotsearch.randomizedtesting.*]
   [junit4]   2>     org.apache.lucene.util.TestRuleStoreClassName$1.evaluate(TestRuleStoreClassName.java:41)
   [junit4]   2>     [...com.carrotsearch.randomizedtesting.*]
   [junit4]   2>     org.apache.lucene.util.TestRuleAssertionsRequired$1.evaluate(TestRuleAssertionsRequired.java:53)
   [junit4]   2>     org.apache.lucene.util.TestRuleMarkFailure$1.evaluate(TestRuleMarkFailure.java:47)
   [junit4]   2>     org.apache.lucene.util.TestRuleIgnoreAfterMaxFailures$1.evaluate(TestRuleIgnoreAfterMaxFailures.java:64)
   [junit4]   2>     org.apache.lucene.util.TestRuleIgnoreTestSuites$1.evaluate(TestRuleIgnoreTestSuites.java:54)
   [junit4]   2>     [...com.carrotsearch.randomizedtesting.*]
   [junit4]   2>     java.lang.Thread.run(Thread.java:748)
   [junit4]   2> 
   [junit4]   2> Finalizer:
   [junit4]   2>     java.lang.Object.wait(Native Method)
   [junit4]   2>     java.lang.ref.ReferenceQueue.remove(ReferenceQueue.java:144)
   [junit4]   2>     java.lang.ref.ReferenceQueue.remove(ReferenceQueue.java:165)
   [junit4]   2>     java.lang.ref.Finalizer$FinalizerThread.run(Finalizer.java:216)
   [junit4]   2> 
   [junit4]   2> main:
   [junit4]   2>     java.lang.Object.wait(Native Method)
   [junit4]   2>     java.lang.Thread.join(Thread.java:1252)
   [junit4]   2>     java.lang.Thread.join(Thread.java:1326)
   [junit4]   2>     [...com.carrotsearch.randomizedtesting.*]
   [junit4]   2>     com.carrotsearch.ant.tasks.junit4.slave.SlaveMain.execute(SlaveMain.java:269)
   [junit4]   2>     com.carrotsearch.ant.tasks.junit4.slave.SlaveMain.main(SlaveMain.java:394)
   [junit4]   2>     com.carrotsearch.ant.tasks.junit4.slave.SlaveMainSafe.main(SlaveMainSafe.java:13)
   [junit4]   2> 
   [junit4]   2> SUITE-CloudSolrClientTest-seed#[6C03F69BF1AA5CC]:
   [junit4]   2>     java.lang.Thread.sleep(Native Method)
   [junit4]   2>     [...com.carrotsearch.randomizedtesting.*]
   [junit4]   2> 
   [junit4]   2> Signal Dispatcher:
   [junit4]   2> 
   [junit4]   2> JUnit4-serializer-daemon:
   [junit4]   2>     java.lang.Thread.sleep(Native Method)
   [junit4]   2>     com.carrotsearch.ant.tasks.junit4.events.Serializer$1.run(Serializer.java:50)
   [junit4]   2> 
   [junit4]   2> Reference Handler:
   [junit4]   2>     java.lang.Object.wait(Native Method)
   [junit4]   2>     java.lang.Object.wait(Object.java:502)
   [junit4]   2>     java.lang.ref.Reference.tryHandlePending(Reference.java:191)
   [junit4]   2>     java.lang.ref.Reference$ReferenceHandler.run(Reference.java:153)
   [junit4]   2> 
   [junit4]   2> SUITE-CloudSolrClientTest-seed#[6C03F69BF1AA5CC]-worker:
   [junit4]   2>     java.lang.Thread.dumpThreads(Native Method)
   [junit4]   2>     java.lang.Thread.getAllStackTraces(Thread.java:1610)
   [junit4]   2>     org.apache.solr.SolrTestCaseJ4.clearObjectTrackerAndCheckEmpty(SolrTestCaseJ4.java:391)
   [junit4]   2>     org.apache.solr.SolrTestCaseJ4.teardownTestCases(SolrTestCaseJ4.java:319)
   [junit4]   2>     [...sun.*, java.lang.reflect.*, com.carrotsearch.randomizedtesting.*]
   [junit4]   2>     org.apache.lucene.util.AbstractBeforeAfterRule$1.evaluate(AbstractBeforeAfterRule.java:45)
   [junit4]   2>     [...com.carrotsearch.randomizedtesting.*]
   [junit4]   2>     org.apache.lucene.util.TestRuleStoreClassName$1.evaluate(TestRuleStoreClassName.java:41)
   [junit4]   2>     [...com.carrotsearch.randomizedtesting.*]
   [junit4]   2>     org.apache.lucene.util.TestRuleAssertionsRequired$1.evaluate(TestRuleAssertionsRequired.java:53)
   [junit4]   2>     org.apache.lucene.util.TestRuleMarkFailure$1.evaluate(TestRuleMarkFailure.java:47)
   [junit4]   2>     org.apache.lucene.util.TestRuleIgnoreAfterMaxFailures$1.evaluate(TestRuleIgnoreAfterMaxFailures.java:64)
   [junit4]   2>     org.apache.lucene.util.TestRuleIgnoreTestSuites$1.evaluate(TestRuleIgnoreTestSuites.java:54)
   [junit4]   2>     [...com.carrotsearch.randomizedtesting.*]
   [junit4]   2>     java.lang.Thread.run(Thread.java:748)
   [junit4]   2> 
   [junit4]   2> Finalizer:
   [junit4]   2>     java.lang.Object.wait(Native Method)
   [junit4]   2>     java.lang.ref.ReferenceQueue.remove(ReferenceQueue.java:144)
   [junit4]   2>     java.lang.ref.ReferenceQueue.remove(ReferenceQueue.java:165)
   [junit4]   2>     java.lang.ref.Finalizer$FinalizerThread.run(Finalizer.java:216)
   [junit4]   2> 
   [junit4]   2> main:
   [junit4]   2>     java.lang.Object.wait(Native Method)
   [junit4]   2>     java.lang.Thread.join(Thread.java:1252)
   [junit4]   2>     java.lang.Thread.join(Thread.java:1326)
   [junit4]   2>     [...com.carrotsearch.randomizedtesting.*]
   [junit4]   2>     com.carrotsearch.ant.tasks.junit4.slave.SlaveMain.execute(SlaveMain.java:269)
   [junit4]   2>     com.carrotsearch.ant.tasks.junit4.slave.SlaveMain.main(SlaveMain.java:394)
   [junit4]   2>     com.carrotsearch.ant.tasks.junit4.slave.SlaveMainSafe.main(SlaveMainSafe.java:13)
   [junit4]   2> 
   [junit4]   2> SUITE-CloudSolrClientTest-seed#[6C03F69BF1AA5CC]:
   [junit4]   2>     java.lang.Thread.sleep(Native Method)
   [junit4]   2>     [...com.carrotsearch.randomizedtesting.*]
   [junit4]   2> 
   [junit4]   2> Signal Dispatcher:
   [junit4]   2> 
   [junit4]   2> JUnit4-serializer-daemon:
   [junit4]   2>     java.lang.Thread.sleep(Native Method)
   [junit4]   2>     com.carrotsearch.ant.tasks.junit4.events.Serializer$1.run(Serializer.java:50)
   [junit4]   2> 
   [junit4]   2> Reference Handler:
   [junit4]   2>     java.lang.Object.wait(Native Method)
   [junit4]   2>     java.lang.Object.wait(Object.java:502)
   [junit4]   2>     java.lang.ref.Reference.tryHandlePending(Reference.java:191)
   [junit4]   2>     java.lang.ref.Reference$ReferenceHandler.run(Reference.java:153)
   [junit4]   2> 
   [junit4]   2> SUITE-CloudSolrClientTest-seed#[6C03F69BF1AA5CC]-worker:
   [junit4]   2>     java.lang.Thread.dumpThreads(Native Method)
   [junit4]   2>     java.lang.Thread.getAllStackTraces(Thread.java:1610)
   [junit4]   2>     org.apache.solr.SolrTestCaseJ4.clearObjectTrackerAndCheckEmpty(SolrTestCaseJ4.java:391)
   [junit4]   2>     org.apache.solr.SolrTestCaseJ4.teardownTestCases(SolrTestCaseJ4.java:319)
   [junit4]   2>     [...sun.*, java.lang.reflect.*, com.carrotsearch.randomizedtesting.*]
   [junit4]   2>     org.apache.lucene.util.AbstractBeforeAfterRule$1.evaluate(AbstractBeforeAfterRule.java:45)
   [junit4]   2>     [...com.carrotsearch.randomizedtesting.*]
   [junit4]   2>     org.apache.lucene.util.TestRuleStoreClassName$1.evaluate(TestRuleStoreClassName.java:41)
   [junit4]   2>     [...com.carrotsearch.randomizedtesting.*]
   [junit4]   2>     org.apache.lucene.util.TestRuleAssertionsRequired$1.evaluate(TestRuleAssertionsRequired.java:53)
   [junit4]   2>     org.apache.lucene.util.TestRuleMarkFailure$1.evaluate(TestRuleMarkFailure.java:47)
   [junit4]   2>     org.apache.lucene.util.TestRuleIgnoreAfterMaxFailures$1.evaluate(TestRuleIgnoreAfterMaxFailures.java:64)
   [junit4]   2>     org.apache.lucene.util.TestRuleIgnoreTestSuites$1.evaluate(TestRuleIgnoreTestSuites.java:54)
   [junit4]   2>     [...com.carrotsearch.randomizedtesting.*]
   [junit4]   2>     java.lang.Thread.run(Thread.java:748)
   [junit4]   2> 
   [junit4]   2> Finalizer:
   [junit4]   2>     java.lang.Object.wait(Native Method)
   [junit4]   2>     java.lang.ref.ReferenceQueue.remove(ReferenceQueue.java:144)
   [junit4]   2>     java.lang.ref.ReferenceQueue.remove(ReferenceQueue.java:165)
   [junit4]   2>     java.lang.ref.Finalizer$FinalizerThread.run(Finalizer.java:216)
   [junit4]   2> 
   [junit4]   2> main:
   [junit4]   2>     java.lang.Object.wait(Native Method)
   [junit4]   2>     java.lang.Thread.join(Thread.java:1252)
   [junit4]   2>     java.lang.Thread.join(Thread.java:1326)
   [junit4]   2>     [...com.carrotsearch.randomizedtesting.*]
   [junit4]   2>     com.carrotsearch.ant.tasks.junit4.slave.SlaveMain.execute(SlaveMain.java:269)
   [junit4]   2>     com.carrotsearch.ant.tasks.junit4.slave.SlaveMain.main(SlaveMain.java:394)
   [junit4]   2>     com.carrotsearch.ant.tasks.junit4.slave.SlaveMainSafe.main(SlaveMainSafe.java:13)
   [junit4]   2> 
   [junit4]   2> SUITE-CloudSolrClientTest-seed#[6C03F69BF1AA5CC]:
   [junit4]   2>     java.lang.Thread.sleep(Native Method)
   [junit4]   2>     [...com.carrotsearch.randomizedtesting.*]
   [junit4]   2> 
   [junit4]   2> Signal Dispatcher:
   [junit4]   2> 
   [junit4]   2> JUnit4-serializer-daemon:
   [junit4]   2>     java.lang.Thread.sleep(Native Method)
   [junit4]   2>     com.carrotsearch.ant.tasks.junit4.events.Serializer$1.run(Serializer.java:50)
   [junit4]   2> 
   [junit4]   2> Reference Handler:
   [junit4]   2>     java.lang.Object.wait(Native Method)
   [junit4]   2>     java.lang.Object.wait(Object.java:502)
   [junit4]   2>     java.lang.ref.Reference.tryHandlePending(Reference.java:191)
   [junit4]   2>     java.lang.ref.Reference$ReferenceHandler.run(Reference.java:153)
   [junit4]   2> 
   [junit4]   2> NOTE: test params are: codec=CheapBastard, sim=RandomSimilarity(queryNorm=false): {}, locale=sv, timezone=Europe/Zagreb
   [junit4]   2> NOTE: Linux 4.4.0-137-generic amd64/Oracle Corporation 1.8.0_191 (64-bit)/cpus=4,threads=1,free=209221504,total=510132224
   [junit4]   2> NOTE: All tests run in this JVM: [AndEvaluatorTest, HttpSolrClientSSLAuthConPoolTest, StreamExpressionTest, CloudSolrClientTest]
   [junit4]   2> NOTE: download the large Jenkins line-docs file by running 'ant get-jenkins-line-docs' in the lucene directory.
   [junit4]   2> NOTE: reproduce with: ant test  -Dtestcase=CloudSolrClientTest -Dtests.seed=6C03F69BF1AA5CC -Dtests.multiplier=2 -Dtests.nightly=true -Dtests.slow=true -Dtests.linedocsfile=/home/jenkins/jenkins-slave/workspace/Lucene-Solr-NightlyTests-7.x/test-data/enwiki.random.lines.txt -Dtests.locale=sv -Dtests.timezone=Europe/Zagreb -Dtests.asserts=true -Dtests.file.encoding=UTF-8
   [junit4] ERROR   0.00s J0 | CloudSolrClientTest (suite) <<<
   [junit4]    > Throwable #1: java.lang.AssertionError: ObjectTracker found 4 object(s) that were not released!!! [SolrCore, MockDirectoryWrapper, RawDirectoryWrapper, MockDirectoryWrapper]
   [junit4]    > org.apache.solr.common.util.ObjectReleaseTracker$ObjectTrackerException: org.apache.solr.core.SolrCore
   [junit4]    > 	at org.apache.solr.common.util.ObjectReleaseTracker.track(ObjectReleaseTracker.java:42)
   [junit4]    > 	at org.apache.solr.core.SolrCore.<init>(SolrCore.java:1054)
   [junit4]    > 	at org.apache.solr.core.SolrCore.<init>(SolrCore.java:874)
   [junit4]    > 	at org.apache.solr.core.CoreContainer.createFromDescriptor(CoreContainer.java:1178)
   [junit4]    > 	at org.apache.solr.core.CoreContainer.create(CoreContainer.java:1088)
   [junit4]    > 	at org.apache.solr.handler.admin.CoreAdminOperation.lambda$static$0(CoreAdminOperation.java:92)
   [junit4]    > 	at org.apache.solr.handler.admin.CoreAdminOperation.execute(CoreAdminOperation.java:360)
   [junit4]    > 	at org.apache.solr.handler.admin.CoreAdminHandler$CallInfo.call(CoreAdminHandler.java:395)
   [junit4]    > 	at org.apache.solr.handler.admin.CoreAdminHandler.lambda$handleRequestBody$0(CoreAdminHandler.java:188)
   [junit4]    > 	at com.codahale.metrics.InstrumentedExecutorService$InstrumentedRunnable.run(InstrumentedExecutorService.java:176)
   [junit4]    > 	at org.apache.solr.common.util.ExecutorUtil$MDCAwareThreadPoolExecutor.lambda$execute$0(ExecutorUtil.java:209)
   [junit4]    > 	at java.util.concurrent.ThreadPoolExecutor.runWorker(ThreadPoolExecutor.java:1149)
   [junit4]    > 	at java.util.concurrent.ThreadPoolExecutor$Worker.run(ThreadPoolExecutor.java:624)
   [junit4]    > 	at java.lang.Thread.run(Thread.java:748)
   [junit4]    > org.apache.solr.common.util.ObjectReleaseTracker$ObjectTrackerException: org.apache.lucene.store.MockDirectoryWrapper
   [junit4]    > 	at org.apache.solr.common.util.ObjectReleaseTracker.track(ObjectReleaseTracker.java:42)
   [junit4]    > 	at org.apache.solr.core.CachingDirectoryFactory.get(CachingDirectoryFactory.java:348)
   [junit4]    > 	at org.apache.solr.handler.IndexFetcher.fetchLatestIndex(IndexFetcher.java:503)
   [junit4]    > 	at org.apache.solr.handler.IndexFetcher.fetchLatestIndex(IndexFetcher.java:346)
   [junit4]    > 	at org.apache.solr.handler.ReplicationHandler.doFetch(ReplicationHandler.java:425)
   [junit4]    > 	at org.apache.solr.handler.ReplicationHandler.lambda$setupPolling$13(ReplicationHandler.java:1171)
   [junit4]    > 	at java.util.concurrent.Executors$RunnableAdapter.call(Executors.java:511)
   [junit4]    > 	at java.util.concurrent.FutureTask.runAndReset(FutureTask.java:308)
   [junit4]    > 	at java.util.concurrent.ScheduledThreadPoolExecutor$ScheduledFutureTask.access$301(ScheduledThreadPoolExecutor.java:180)
   [junit4]    > 	at java.util.concurrent.ScheduledThreadPoolExecutor$ScheduledFutureTask.run(ScheduledThreadPoolExecutor.java:294)
   [junit4]    > 	at java.util.concurrent.ThreadPoolExecutor.runWorker(ThreadPoolExecutor.java:1149)
   [junit4]    > 	at java.util.concurrent.ThreadPoolExecutor$Worker.run(ThreadPoolExecutor.java:624)
   [junit4]    > 	at java.lang.Thread.run(Thread.java:748)
   [junit4]    > org.apache.solr.common.util.ObjectReleaseTracker$ObjectTrackerException: org.apache.lucene.store.RawDirectoryWrapper
   [junit4]    > 	at org.apache.solr.common.util.ObjectReleaseTracker.track(ObjectReleaseTracker.java:42)
   [junit4]    > 	at org.apache.solr.core.CachingDirectoryFactory.get(CachingDirectoryFactory.java:348)
   [junit4]    > 	at org.apache.solr.core.SolrCore.getNewIndexDir(SolrCore.java:359)
   [junit4]    > 	at org.apache.solr.core.SolrCore.initIndex(SolrCore.java:738)
   [junit4]    > 	at org.apache.solr.core.SolrCore.<init>(SolrCore.java:967)
   [junit4]    > 	at org.apache.solr.core.SolrCore.<init>(SolrCore.java:874)
   [junit4]    > 	at org.apache.solr.core.CoreContainer.createFromDescriptor(CoreContainer.java:1178)
   [junit4]    > 	at org.apache.solr.core.CoreContainer.create(CoreContainer.java:1088)
   [junit4]    > 	at org.apache.solr.handler.admin.CoreAdminOperation.lambda$static$0(CoreAdminOperation.java:92)
   [junit4]    > 	at org.apache.solr.handler.admin.CoreAdminOperation.execute(CoreAdminOperation.java:360)
   [junit4]    > 	at org.apache.solr.handler.admin.CoreAdminHandler$CallInfo.call(CoreAdminHandler.java:395)
   [junit4]    > 	at org.apache.solr.handler.admin.CoreAdminHandler.lambda$handleRequestBody$0(CoreAdminHandler.java:188)
   [junit4]    > 	at com.codahale.metrics.InstrumentedExecutorService$InstrumentedRunnable.run(InstrumentedExecutorService.java:176)
   [junit4]    > 	at org.apache.solr.common.util.ExecutorUtil$MDCAwareThreadPoolExecutor.lambda$execute$0(ExecutorUtil.java:209)
   [junit4]    > 	at java.util.concurrent.ThreadPoolExecutor.runWorker(ThreadPoolExecutor.java:1149)
   [junit4]    > 	at java.util.concurrent.ThreadPoolExecutor$Worker.run(ThreadPoolExecutor.java:624)
   [junit4]    > 	at java.lang.Thread.run(Thread.java:748)
   [junit4]    > org.apache.solr.common.util.ObjectReleaseTracker$ObjectTrackerException: org.apache.lucene.store.MockDirectoryWrapper
   [junit4]    > 	at org.apache.solr.common.util.ObjectReleaseTracker.track(ObjectReleaseTracker.java:42)
   [junit4]    > 	at org.apache.solr.core.CachingDirectoryFactory.get(CachingDirectoryFactory.java:348)
   [junit4]    > 	at org.apache.solr.update.SolrIndexWriter.create(SolrIndexWriter.java:95)
   [junit4]    > 	at org.apache.solr.core.SolrCore.initIndex(SolrCore.java:770)
   [junit4]    > 	at org.apache.solr.core.SolrCore.<init>(SolrCore.java:967)
   [junit4]    > 	at org.apache.solr.core.SolrCore.<init>(SolrCore.java:874)
   [junit4]    > 	at org.apache.solr.core.CoreContainer.createFromDescriptor(CoreContainer.java:1178)
   [junit4]    > 	at org.apache.solr.core.CoreContainer.create(CoreContainer.java:1088)
   [junit4]    > 	at org.apache.solr.handler.admin.CoreAdminOperation.lambda$static$0(CoreAdminOperation.java:92)
   [junit4]    > 	at org.apache.solr.handler.admin.CoreAdminOperation.execute(CoreAdminOperation.java:360)
   [junit4]    > 	at org.apache.solr.handler.admin.CoreAdminHandler$CallInfo.call(CoreAdminHandler.java:395)
   [junit4]    > 	at org.apache.solr.handler.admin.CoreAdminHandler.lambda$handleRequestBody$0(CoreAdminHandler.java:188)
   [junit4]    > 	at com.codahale.metrics.InstrumentedExecutorService$InstrumentedRunnable.run(InstrumentedExecutorService.java:176)
   [junit4]    > 	at org.apache.solr.common.util.ExecutorUtil$MDCAwareThreadPoolExecutor.lambda$execute$0(ExecutorUtil.java:209)
   [junit4]    > 	at java.util.concurrent.ThreadPoolExecutor.runWorker(ThreadPoolExecutor.java:1149)
   [junit4]    > 	at java.util.concurrent.ThreadPoolExecutor$Worker.run(ThreadPoolExecutor.java:624)
   [junit4]    > 	at java.lang.Thread.run(Thread.java:748)
   [junit4]    >  expected null, but was:<ObjectTracker found 4 object(s) that were not released!!! [SolrCore, MockDirectoryWrapper, RawDirectoryWrapper, MockDirectoryWrapper]
   [junit4]    > org.apache.solr.common.util.ObjectReleaseTracker$ObjectTrackerException: org.apache.solr.core.SolrCore
   [junit4]    > 	at org.apache.solr.common.util.ObjectReleaseTracker.track(ObjectReleaseTracker.java:42)
   [junit4]    > 	at org.apache.solr.core.SolrCore.<init>(SolrCore.java:1054)
   [junit4]    > 	at org.apache.solr.core.SolrCore.<init>(SolrCore.java:874)
   [junit4]    > 	at org.apache.solr.core.CoreContainer.createFromDescriptor(CoreContainer.java:1178)
   [junit4]    > 	at org.apache.solr.core.CoreContainer.create(CoreContainer.java:1088)
   [junit4]    > 	at org.apache.solr.handler.admin.CoreAdminOperation.lambda$static$0(CoreAdminOperation.java:92)
   [junit4]    > 	at org.apache.solr.handler.admin.CoreAdminOperation.execute(CoreAdminOperation.java:360)
   [junit4]    > 	at org.apache.solr.handler.admin.CoreAdminHandler$CallInfo.call(CoreAdminHandler.java:395)
   [junit4]    > 	at org.apache.solr.handler.admin.CoreAdminHandler.lambda$handleRequestBody$0(CoreAdminHandler.java:188)
   [junit4]    > 	at com.codahale.metrics.InstrumentedExecutorService$InstrumentedRunnable.run(InstrumentedExecutorService.java:176)
   [junit4]    > 	at org.apache.solr.common.util.ExecutorUtil$MDCAwareThreadPoolExecutor.lambda$execute$0(ExecutorUtil.java:209)
   [junit4]    > 	at java.util.concurrent.ThreadPoolExecutor.runWorker(ThreadPoolExecutor.java:1149)
   [junit4]    > 	at java.util.concurrent.ThreadPoolExecutor$Worker.run(ThreadPoolExecutor.java:624)
   [junit4]    > 	at java.lang.Thread.run(Thread.java:748)
   [junit4]    > org.apache.solr.common.util.ObjectReleaseTracker$ObjectTrackerException: org.apache.lucene.store.MockDirectoryWrapper
   [junit4]    > 	at org.apache.solr.common.util.ObjectReleaseTracker.track(ObjectReleaseTracker.java:42)
   [junit4]    > 	at org.apache.solr.core.CachingDirectoryFactory.get(CachingDirectoryFactory.java:348)
   [junit4]    > 	at org.apache.solr.handler.IndexFetcher.fetchLatestIndex(IndexFetcher.java:503)
   [junit4]    > 	at org.apache.solr.handler.IndexFetcher.fetchLatestIndex(IndexFetcher.java:346)
   [junit4]    > 	at org.apache.solr.handler.ReplicationHandler.doFetch(ReplicationHandler.java:425)
   [junit4]    > 	at org.apache.solr.handler.ReplicationHandler.lambda$setupPolling$13(ReplicationHandler.java:1171)
   [junit4]    > 	at java.util.concurrent.Executors$RunnableAdapter.call(Executors.java:511)
   [junit4]    > 	at java.util.concurrent.FutureTask.runAndReset(FutureTask.java:308)
   [junit4]    > 	at java.util.concurrent.ScheduledThreadPoolExecutor$ScheduledFutureTask.access$301(ScheduledThreadPoolExecutor.java:180)
   [junit4]    > 	at java.util.concurrent.ScheduledThreadPoolExecutor$ScheduledFutureTask.run(ScheduledThreadPoolExecutor.java:294)
   [junit4]    > 	at java.util.concurrent.ThreadPoolExecutor.runWorker(ThreadPoolExecutor.java:1149)
   [junit4]    > 	at java.util.concurrent.ThreadPoolExecutor$Worker.run(ThreadPoolExecutor.java:624)
   [junit4]    > 	at java.lang.Thread.run(Thread.java:748)
   [junit4]    > org.apache.solr.common.util.ObjectReleaseTracker$ObjectTrackerException: org.apache.lucene.store.RawDirectoryWrapper
   [junit4]    > 	at org.apache.solr.common.util.ObjectReleaseTracker.track(ObjectReleaseTracker.java:42)
   [junit4]    > 	at org.apache.solr.core.CachingDirectoryFactory.get(CachingDirectoryFactory.java:348)
   [junit4]    > 	at org.apache.solr.core.SolrCore.getNewIndexDir(SolrCore.java:359)
   [junit4]    > 	at org.apache.solr.core.SolrCore.initIndex(SolrCore.java:738)
   [junit4]    > 	at org.apache.solr.core.SolrCore.<init>(SolrCore.java:967)
   [junit4]    > 	at org.apache.solr.core.SolrCore.<init>(SolrCore.java:874)
   [junit4]    > 	at org.apache.solr.core.CoreContainer.createFromDescriptor(CoreContainer.java:1178)
   [junit4]    > 	at org.apache.solr.core.CoreContainer.create(CoreContainer.java:1088)
   [junit4]    > 	at org.apache.solr.handler.admin.CoreAdminOperation.lambda$static$0(CoreAdminOperation.java:92)
   [junit4]    > 	at org.apache.solr.handler.admin.CoreAdminOperation.execute(CoreAdminOperation.java:360)
   [junit4]    > 	at org.apache.solr.handler.admin.CoreAdminHandler$CallInfo.call(CoreAdminHandler.java:395)
   [junit4]    > 	at org.apache.solr.handler.admin.CoreAdminHandler.lambda$handleRequestBody$0(CoreAdminHandler.java:188)
   [junit4]    > 	at com.codahale.metrics.InstrumentedExecutorService$InstrumentedRunnable.run(InstrumentedExecutorService.java:176)
   [junit4]    > 	at org.apache.solr.common.util.ExecutorUtil$MDCAwareThreadPoolExecutor.lambda$execute$0(ExecutorUtil.java:209)
   [junit4]    > 	at java.util.concurrent.ThreadPoolExecutor.runWorker(ThreadPoolExecutor.java:1149)
   [junit4]    > 	at java.util.concurrent.ThreadPoolExecutor$Worker.run(ThreadPoolExecutor.java:624)
   [junit4]    > 	at java.lang.Thread.run(Thread.java:748)
   [junit4]    > org.apache.solr.common.util.ObjectReleaseTracker$ObjectTrackerException: org.apache.lucene.store.MockDirectoryWrapper
   [junit4]    > 	at org.apache.solr.common.util.ObjectReleaseTracker.track(ObjectReleaseTracker.java:42)
   [junit4]    > 	at org.apache.solr.core.CachingDirectoryFactory.get(CachingDirectoryFactory.java:348)
   [junit4]    > 	at org.apache.solr.update.SolrIndexWriter.create(SolrIndexWriter.java:95)
   [junit4]    > 	at org.apache.solr.core.SolrCore.initIndex(SolrCore.java:770)
   [junit4]    > 	at org.apache.solr.core.SolrCore.<init>(SolrCore.java:967)
   [junit4]    > 	at org.apache.solr.core.SolrCore.<init>(SolrCore.java:874)
   [junit4]    > 	at org.apache.solr.core.CoreContainer.createFromDescriptor(CoreContainer.java:1178)
   [junit4]    > 	at org.apache.solr.core.CoreContainer.create(CoreContainer.java:1088)
   [junit4]    > 	at org.apache.solr.handler.admin.CoreAdminOperation.lambda$static$0(CoreAdminOperation.java:92)
   [junit4]    > 	at org.apache.solr.handler.admin.CoreAdminOperation.execute(CoreAdminOperation.

[...truncated too long message...]

vy-availability-check:
[loadresource] Do not set property disallowed.ivy.jars.list as its length is 0.

-ivy-fail-disallowed-ivy-version:

ivy-fail:

ivy-configure:
[ivy:configure] :: loading settings :: file = /x1/jenkins/jenkins-slave/workspace/Lucene-Solr-NightlyTests-7.x/checkout/lucene/top-level-ivy-settings.xml

resolve:

ivy-availability-check:
[loadresource] Do not set property disallowed.ivy.jars.list as its length is 0.

-ivy-fail-disallowed-ivy-version:

ivy-fail:

ivy-fail:

ivy-configure:
[ivy:configure] :: loading settings :: file = /x1/jenkins/jenkins-slave/workspace/Lucene-Solr-NightlyTests-7.x/checkout/lucene/top-level-ivy-settings.xml

resolve:

ivy-availability-check:
[loadresource] Do not set property disallowed.ivy.jars.list as its length is 0.

-ivy-fail-disallowed-ivy-version:

ivy-fail:

ivy-configure:
[ivy:configure] :: loading settings :: file = /x1/jenkins/jenkins-slave/workspace/Lucene-Solr-NightlyTests-7.x/checkout/lucene/top-level-ivy-settings.xml

resolve:

ivy-availability-check:
[loadresource] Do not set property disallowed.ivy.jars.list as its length is 0.

-ivy-fail-disallowed-ivy-version:

ivy-fail:

ivy-fail:

ivy-configure:
[ivy:configure] :: loading settings :: file = /x1/jenkins/jenkins-slave/workspace/Lucene-Solr-NightlyTests-7.x/checkout/lucene/top-level-ivy-settings.xml

resolve:

ivy-availability-check:
[loadresource] Do not set property disallowed.ivy.jars.list as its length is 0.

-ivy-fail-disallowed-ivy-version:

ivy-fail:

ivy-fail:

ivy-configure:
[ivy:configure] :: loading settings :: file = /x1/jenkins/jenkins-slave/workspace/Lucene-Solr-NightlyTests-7.x/checkout/lucene/top-level-ivy-settings.xml

resolve:

ivy-availability-check:
[loadresource] Do not set property disallowed.ivy.jars.list as its length is 0.

-ivy-fail-disallowed-ivy-version:

ivy-fail:

ivy-fail:

ivy-configure:
[ivy:configure] :: loading settings :: file = /x1/jenkins/jenkins-slave/workspace/Lucene-Solr-NightlyTests-7.x/checkout/lucene/top-level-ivy-settings.xml

resolve:

ivy-availability-check:
[loadresource] Do not set property disallowed.ivy.jars.list as its length is 0.

-ivy-fail-disallowed-ivy-version:

ivy-fail:

ivy-fail:

ivy-configure:
[ivy:configure] :: loading settings :: file = /x1/jenkins/jenkins-slave/workspace/Lucene-Solr-NightlyTests-7.x/checkout/lucene/top-level-ivy-settings.xml

resolve:

ivy-availability-check:
[loadresource] Do not set property disallowed.ivy.jars.list as its length is 0.

-ivy-fail-disallowed-ivy-version:

ivy-fail:

ivy-fail:

ivy-configure:
[ivy:configure] :: loading settings :: file = /x1/jenkins/jenkins-slave/workspace/Lucene-Solr-NightlyTests-7.x/checkout/lucene/top-level-ivy-settings.xml

resolve:

ivy-availability-check:
[loadresource] Do not set property disallowed.ivy.jars.list as its length is 0.

-ivy-fail-disallowed-ivy-version:

ivy-fail:

ivy-fail:

ivy-configure:
[ivy:configure] :: loading settings :: file = /x1/jenkins/jenkins-slave/workspace/Lucene-Solr-NightlyTests-7.x/checkout/lucene/top-level-ivy-settings.xml

resolve:

ivy-availability-check:
[loadresource] Do not set property disallowed.ivy.jars.list as its length is 0.

-ivy-fail-disallowed-ivy-version:

ivy-fail:

ivy-fail:

ivy-configure:
[ivy:configure] :: loading settings :: file = /x1/jenkins/jenkins-slave/workspace/Lucene-Solr-NightlyTests-7.x/checkout/lucene/top-level-ivy-settings.xml

resolve:

ivy-availability-check:
[loadresource] Do not set property disallowed.ivy.jars.list as its length is 0.

-ivy-fail-disallowed-ivy-version:

ivy-fail:

ivy-fail:

ivy-configure:
[ivy:configure] :: loading settings :: file = /x1/jenkins/jenkins-slave/workspace/Lucene-Solr-NightlyTests-7.x/checkout/lucene/top-level-ivy-settings.xml

resolve:

ivy-availability-check:
[loadresource] Do not set property disallowed.ivy.jars.list as its length is 0.

-ivy-fail-disallowed-ivy-version:

ivy-fail:

ivy-fail:

ivy-configure:
[ivy:configure] :: loading settings :: file = /x1/jenkins/jenkins-slave/workspace/Lucene-Solr-NightlyTests-7.x/checkout/lucene/top-level-ivy-settings.xml

resolve:

ivy-availability-check:
[loadresource] Do not set property disallowed.ivy.jars.list as its length is 0.

-ivy-fail-disallowed-ivy-version:

ivy-fail:

ivy-fail:

ivy-configure:
[ivy:configure] :: loading settings :: file = /x1/jenkins/jenkins-slave/workspace/Lucene-Solr-NightlyTests-7.x/checkout/lucene/top-level-ivy-settings.xml

resolve:

jar-checksums:
    [mkdir] Created dir: /x1/jenkins/jenkins-slave/workspace/Lucene-Solr-NightlyTests-7.x/checkout/solr/null1187990949
     [copy] Copying 242 files to /x1/jenkins/jenkins-slave/workspace/Lucene-Solr-NightlyTests-7.x/checkout/solr/null1187990949
   [delete] Deleting directory /x1/jenkins/jenkins-slave/workspace/Lucene-Solr-NightlyTests-7.x/checkout/solr/null1187990949

check-working-copy:
[ivy:cachepath] :: resolving dependencies :: org.eclipse.jgit#org.eclipse.jgit-caller;working
[ivy:cachepath] 	confs: [default]
[ivy:cachepath] 	found org.eclipse.jgit#org.eclipse.jgit;4.6.0.201612231935-r in public
[ivy:cachepath] 	found com.jcraft#jsch;0.1.53 in public
[ivy:cachepath] 	found com.googlecode.javaewah#JavaEWAH;1.1.6 in public
[ivy:cachepath] 	found org.apache.httpcomponents#httpclient;4.3.6 in public
[ivy:cachepath] 	found org.apache.httpcomponents#httpcore;4.3.3 in public
[ivy:cachepath] 	found commons-logging#commons-logging;1.1.3 in public
[ivy:cachepath] 	found commons-codec#commons-codec;1.6 in public
[ivy:cachepath] 	found org.slf4j#slf4j-api;1.7.2 in public
[ivy:cachepath] :: resolution report :: resolve 54ms :: artifacts dl 6ms
	---------------------------------------------------------------------
	|                  |            modules            ||   artifacts   |
	|       conf       | number| search|dwnlded|evicted|| number|dwnlded|
	---------------------------------------------------------------------
	|      default     |   8   |   0   |   0   |   0   ||   8   |   0   |
	---------------------------------------------------------------------
[wc-checker] Initializing working copy...
[wc-checker] SLF4J: Failed to load class "org.slf4j.impl.StaticLoggerBinder".
[wc-checker] SLF4J: Defaulting to no-operation (NOP) logger implementation
[wc-checker] SLF4J: See http://www.slf4j.org/codes.html#StaticLoggerBinder for further details.
[wc-checker] Checking working copy status...

-jenkins-base:

BUILD SUCCESSFUL
Total time: 250 minutes 27 seconds
Archiving artifacts
java.lang.InterruptedException: no matches found within 10000
	at hudson.FilePath$ValidateAntFileMask.hasMatch(FilePath.java:2847)
	at hudson.FilePath$ValidateAntFileMask.invoke(FilePath.java:2726)
	at hudson.FilePath$ValidateAntFileMask.invoke(FilePath.java:2707)
	at hudson.FilePath$FileCallableWrapper.call(FilePath.java:3086)
Also:   hudson.remoting.Channel$CallSiteStackTrace: Remote call to lucene
		at hudson.remoting.Channel.attachCallSiteStackTrace(Channel.java:1741)
		at hudson.remoting.UserRequest$ExceptionResponse.retrieve(UserRequest.java:357)
		at hudson.remoting.Channel.call(Channel.java:955)
		at hudson.FilePath.act(FilePath.java:1072)
		at hudson.FilePath.act(FilePath.java:1061)
		at hudson.FilePath.validateAntFileMask(FilePath.java:2705)
		at hudson.tasks.ArtifactArchiver.perform(ArtifactArchiver.java:243)
		at hudson.tasks.BuildStepCompatibilityLayer.perform(BuildStepCompatibilityLayer.java:81)
		at hudson.tasks.BuildStepMonitor$1.perform(BuildStepMonitor.java:20)
		at hudson.model.AbstractBuild$AbstractBuildExecution.perform(AbstractBuild.java:744)
		at hudson.model.AbstractBuild$AbstractBuildExecution.performAllBuildSteps(AbstractBuild.java:690)
		at hudson.model.Build$BuildExecution.post2(Build.java:186)
		at hudson.model.AbstractBuild$AbstractBuildExecution.post(AbstractBuild.java:635)
		at hudson.model.Run.execute(Run.java:1835)
		at hudson.model.FreeStyleBuild.run(FreeStyleBuild.java:43)
		at hudson.model.ResourceController.execute(ResourceController.java:97)
		at hudson.model.Executor.run(Executor.java:429)
Caused: hudson.FilePath$TunneledInterruptedException
	at hudson.FilePath$FileCallableWrapper.call(FilePath.java:3088)
	at hudson.remoting.UserRequest.perform(UserRequest.java:212)
	at hudson.remoting.UserRequest.perform(UserRequest.java:54)
	at hudson.remoting.Request$2.run(Request.java:369)
	at hudson.remoting.InterceptingExecutorService$1.call(InterceptingExecutorService.java:72)
	at java.util.concurrent.FutureTask.run(FutureTask.java:266)
	at java.util.concurrent.ThreadPoolExecutor.runWorker(ThreadPoolExecutor.java:1142)
	at java.util.concurrent.ThreadPoolExecutor$Worker.run(ThreadPoolExecutor.java:617)
	at java.lang.Thread.run(Thread.java:748)
Caused: java.lang.InterruptedException: java.lang.InterruptedException: no matches found within 10000
	at hudson.FilePath.act(FilePath.java:1074)
	at hudson.FilePath.act(FilePath.java:1061)
	at hudson.FilePath.validateAntFileMask(FilePath.java:2705)
	at hudson.tasks.ArtifactArchiver.perform(ArtifactArchiver.java:243)
	at hudson.tasks.BuildStepCompatibilityLayer.perform(BuildStepCompatibilityLayer.java:81)
	at hudson.tasks.BuildStepMonitor$1.perform(BuildStepMonitor.java:20)
	at hudson.model.AbstractBuild$AbstractBuildExecution.perform(AbstractBuild.java:744)
	at hudson.model.AbstractBuild$AbstractBuildExecution.performAllBuildSteps(AbstractBuild.java:690)
	at hudson.model.Build$BuildExecution.post2(Build.java:186)
	at hudson.model.AbstractBuild$AbstractBuildExecution.post(AbstractBuild.java:635)
	at hudson.model.Run.execute(Run.java:1835)
	at hudson.model.FreeStyleBuild.run(FreeStyleBuild.java:43)
	at hudson.model.ResourceController.execute(ResourceController.java:97)
	at hudson.model.Executor.run(Executor.java:429)
No artifacts found that match the file pattern "**/*.events,heapdumps/**,**/hs_err_pid*". Configuration error?
Recording test results
Build step 'Publish JUnit test result report' changed build result to UNSTABLE
Email was triggered for: Unstable (Test Failures)
Sending email for trigger: Unstable (Test Failures)

Mime
View raw message