lucene-dev mailing list archives

Site index · List index
Message view « Date » · « Thread »
Top « Date » · « Thread »
From Apache Jenkins Server <jenk...@builds.apache.org>
Subject [JENKINS] Lucene-Solr-Tests-master - Build # 3164 - Unstable
Date Fri, 01 Feb 2019 07:13:01 GMT
Build: https://builds.apache.org/job/Lucene-Solr-Tests-master/3164/

2 tests failed.
FAILED:  org.apache.lucene.document.TestLatLonShape.testRandomPolygonEncoding

Error Message:


Stack Trace:
java.lang.AssertionError
	at __randomizedtesting.SeedInfo.seed([E92F1FD44199EFBE:2C3EDB8695100930]:0)
	at org.junit.Assert.fail(Assert.java:86)
	at org.junit.Assert.assertTrue(Assert.java:41)
	at org.junit.Assert.assertTrue(Assert.java:52)
	at org.apache.lucene.document.TestLatLonShape.verifyEncoding(TestLatLonShape.java:774)
	at org.apache.lucene.document.TestLatLonShape.testRandomPolygonEncoding(TestLatLonShape.java:726)
	at sun.reflect.NativeMethodAccessorImpl.invoke0(Native Method)
	at sun.reflect.NativeMethodAccessorImpl.invoke(NativeMethodAccessorImpl.java:62)
	at sun.reflect.DelegatingMethodAccessorImpl.invoke(DelegatingMethodAccessorImpl.java:43)
	at java.lang.reflect.Method.invoke(Method.java:498)
	at com.carrotsearch.randomizedtesting.RandomizedRunner.invoke(RandomizedRunner.java:1750)
	at com.carrotsearch.randomizedtesting.RandomizedRunner$8.evaluate(RandomizedRunner.java:938)
	at com.carrotsearch.randomizedtesting.RandomizedRunner$9.evaluate(RandomizedRunner.java:974)
	at com.carrotsearch.randomizedtesting.RandomizedRunner$10.evaluate(RandomizedRunner.java:988)
	at org.apache.lucene.util.TestRuleSetupTeardownChained$1.evaluate(TestRuleSetupTeardownChained.java:49)
	at org.apache.lucene.util.AbstractBeforeAfterRule$1.evaluate(AbstractBeforeAfterRule.java:45)
	at org.apache.lucene.util.TestRuleThreadAndTestName$1.evaluate(TestRuleThreadAndTestName.java:48)
	at org.apache.lucene.util.TestRuleIgnoreAfterMaxFailures$1.evaluate(TestRuleIgnoreAfterMaxFailures.java:64)
	at org.apache.lucene.util.TestRuleMarkFailure$1.evaluate(TestRuleMarkFailure.java:47)
	at com.carrotsearch.randomizedtesting.rules.StatementAdapter.evaluate(StatementAdapter.java:36)
	at com.carrotsearch.randomizedtesting.ThreadLeakControl$StatementRunner.run(ThreadLeakControl.java:368)
	at com.carrotsearch.randomizedtesting.ThreadLeakControl.forkTimeoutingTask(ThreadLeakControl.java:817)
	at com.carrotsearch.randomizedtesting.ThreadLeakControl$3.evaluate(ThreadLeakControl.java:468)
	at com.carrotsearch.randomizedtesting.RandomizedRunner.runSingleTest(RandomizedRunner.java:947)
	at com.carrotsearch.randomizedtesting.RandomizedRunner$5.evaluate(RandomizedRunner.java:832)
	at com.carrotsearch.randomizedtesting.RandomizedRunner$6.evaluate(RandomizedRunner.java:883)
	at com.carrotsearch.randomizedtesting.RandomizedRunner$7.evaluate(RandomizedRunner.java:894)
	at org.apache.lucene.util.AbstractBeforeAfterRule$1.evaluate(AbstractBeforeAfterRule.java:45)
	at com.carrotsearch.randomizedtesting.rules.StatementAdapter.evaluate(StatementAdapter.java:36)
	at org.apache.lucene.util.TestRuleStoreClassName$1.evaluate(TestRuleStoreClassName.java:41)
	at com.carrotsearch.randomizedtesting.rules.NoShadowingOrOverridesOnMethodsRule$1.evaluate(NoShadowingOrOverridesOnMethodsRule.java:40)
	at com.carrotsearch.randomizedtesting.rules.NoShadowingOrOverridesOnMethodsRule$1.evaluate(NoShadowingOrOverridesOnMethodsRule.java:40)
	at com.carrotsearch.randomizedtesting.rules.StatementAdapter.evaluate(StatementAdapter.java:36)
	at com.carrotsearch.randomizedtesting.rules.StatementAdapter.evaluate(StatementAdapter.java:36)
	at com.carrotsearch.randomizedtesting.rules.StatementAdapter.evaluate(StatementAdapter.java:36)
	at org.apache.lucene.util.TestRuleAssertionsRequired$1.evaluate(TestRuleAssertionsRequired.java:53)
	at org.apache.lucene.util.TestRuleMarkFailure$1.evaluate(TestRuleMarkFailure.java:47)
	at org.apache.lucene.util.TestRuleIgnoreAfterMaxFailures$1.evaluate(TestRuleIgnoreAfterMaxFailures.java:64)
	at org.apache.lucene.util.TestRuleIgnoreTestSuites$1.evaluate(TestRuleIgnoreTestSuites.java:54)
	at com.carrotsearch.randomizedtesting.rules.StatementAdapter.evaluate(StatementAdapter.java:36)
	at com.carrotsearch.randomizedtesting.ThreadLeakControl$StatementRunner.run(ThreadLeakControl.java:368)
	at java.lang.Thread.run(Thread.java:748)


FAILED:  org.apache.solr.client.solrj.impl.CloudSolrClientTest.testRetryUpdatesWhenClusterStateIsStale

Error Message:
Error from server at https://127.0.0.1:39042/solr/stale_state_test_col: No registered leader was found after waiting for 4000ms , collection: stale_state_test_col slice: shard1 saw state=DocCollection(stale_state_test_col//collections/stale_state_test_col/state.json/9)={   "pullReplicas":"0",   "replicationFactor":"1",   "shards":{"shard1":{       "range":"80000000-7fffffff",       "state":"active",       "replicas":{"core_node4":{           "core":"stale_state_test_col_shard1_replica_n3",           "base_url":"https://127.0.0.1:39042/solr",           "node_name":"127.0.0.1:39042_solr",           "state":"active",           "type":"NRT",           "force_set_state":"false"}}}},   "router":{"name":"compositeId"},   "maxShardsPerNode":"1",   "autoAddReplicas":"false",   "nrtReplicas":"1",   "tlogReplicas":"0"} with live_nodes=[127.0.0.1:44031_solr, 127.0.0.1:39042_solr, 127.0.0.1:44974_solr]

Stack Trace:
org.apache.solr.client.solrj.impl.HttpSolrClient$RemoteSolrException: Error from server at https://127.0.0.1:39042/solr/stale_state_test_col: No registered leader was found after waiting for 4000ms , collection: stale_state_test_col slice: shard1 saw state=DocCollection(stale_state_test_col//collections/stale_state_test_col/state.json/9)={
  "pullReplicas":"0",
  "replicationFactor":"1",
  "shards":{"shard1":{
      "range":"80000000-7fffffff",
      "state":"active",
      "replicas":{"core_node4":{
          "core":"stale_state_test_col_shard1_replica_n3",
          "base_url":"https://127.0.0.1:39042/solr",
          "node_name":"127.0.0.1:39042_solr",
          "state":"active",
          "type":"NRT",
          "force_set_state":"false"}}}},
  "router":{"name":"compositeId"},
  "maxShardsPerNode":"1",
  "autoAddReplicas":"false",
  "nrtReplicas":"1",
  "tlogReplicas":"0"} with live_nodes=[127.0.0.1:44031_solr, 127.0.0.1:39042_solr, 127.0.0.1:44974_solr]
	at __randomizedtesting.SeedInfo.seed([659674499DEA19FB:D1A7ECA17E036FD7]:0)
	at org.apache.solr.client.solrj.impl.HttpSolrClient.executeMethod(HttpSolrClient.java:650)
	at org.apache.solr.client.solrj.impl.HttpSolrClient.request(HttpSolrClient.java:256)
	at org.apache.solr.client.solrj.impl.HttpSolrClient.request(HttpSolrClient.java:245)
	at org.apache.solr.client.solrj.impl.LBSolrClient.doRequest(LBSolrClient.java:368)
	at org.apache.solr.client.solrj.impl.LBSolrClient.request(LBSolrClient.java:296)
	at org.apache.solr.client.solrj.impl.LBHttpSolrClient.request(LBHttpSolrClient.java:213)
	at org.apache.solr.client.solrj.impl.CloudSolrClient.sendRequest(CloudSolrClient.java:1110)
	at org.apache.solr.client.solrj.impl.CloudSolrClient.requestWithRetryOnStaleState(CloudSolrClient.java:884)
	at org.apache.solr.client.solrj.impl.CloudSolrClient.requestWithRetryOnStaleState(CloudSolrClient.java:997)
	at org.apache.solr.client.solrj.impl.CloudSolrClient.request(CloudSolrClient.java:817)
	at org.apache.solr.client.solrj.SolrRequest.process(SolrRequest.java:207)
	at org.apache.solr.client.solrj.request.UpdateRequest.commit(UpdateRequest.java:237)
	at org.apache.solr.client.solrj.impl.CloudSolrClientTest.testRetryUpdatesWhenClusterStateIsStale(CloudSolrClientTest.java:835)
	at sun.reflect.NativeMethodAccessorImpl.invoke0(Native Method)
	at sun.reflect.NativeMethodAccessorImpl.invoke(NativeMethodAccessorImpl.java:62)
	at sun.reflect.DelegatingMethodAccessorImpl.invoke(DelegatingMethodAccessorImpl.java:43)
	at java.lang.reflect.Method.invoke(Method.java:498)
	at com.carrotsearch.randomizedtesting.RandomizedRunner.invoke(RandomizedRunner.java:1750)
	at com.carrotsearch.randomizedtesting.RandomizedRunner$8.evaluate(RandomizedRunner.java:938)
	at com.carrotsearch.randomizedtesting.RandomizedRunner$9.evaluate(RandomizedRunner.java:974)
	at com.carrotsearch.randomizedtesting.RandomizedRunner$10.evaluate(RandomizedRunner.java:988)
	at org.junit.rules.ExpectedException$ExpectedExceptionStatement.evaluate(ExpectedException.java:239)
	at com.carrotsearch.randomizedtesting.rules.SystemPropertiesRestoreRule$1.evaluate(SystemPropertiesRestoreRule.java:57)
	at org.apache.lucene.util.TestRuleSetupTeardownChained$1.evaluate(TestRuleSetupTeardownChained.java:49)
	at org.apache.lucene.util.AbstractBeforeAfterRule$1.evaluate(AbstractBeforeAfterRule.java:45)
	at org.apache.lucene.util.TestRuleThreadAndTestName$1.evaluate(TestRuleThreadAndTestName.java:48)
	at org.apache.lucene.util.TestRuleIgnoreAfterMaxFailures$1.evaluate(TestRuleIgnoreAfterMaxFailures.java:64)
	at org.apache.lucene.util.TestRuleMarkFailure$1.evaluate(TestRuleMarkFailure.java:47)
	at com.carrotsearch.randomizedtesting.rules.StatementAdapter.evaluate(StatementAdapter.java:36)
	at com.carrotsearch.randomizedtesting.ThreadLeakControl$StatementRunner.run(ThreadLeakControl.java:368)
	at com.carrotsearch.randomizedtesting.ThreadLeakControl.forkTimeoutingTask(ThreadLeakControl.java:817)
	at com.carrotsearch.randomizedtesting.ThreadLeakControl$3.evaluate(ThreadLeakControl.java:468)
	at com.carrotsearch.randomizedtesting.RandomizedRunner.runSingleTest(RandomizedRunner.java:947)
	at com.carrotsearch.randomizedtesting.RandomizedRunner$5.evaluate(RandomizedRunner.java:832)
	at com.carrotsearch.randomizedtesting.RandomizedRunner$6.evaluate(RandomizedRunner.java:883)
	at com.carrotsearch.randomizedtesting.RandomizedRunner$7.evaluate(RandomizedRunner.java:894)
	at com.carrotsearch.randomizedtesting.rules.StatementAdapter.evaluate(StatementAdapter.java:36)
	at com.carrotsearch.randomizedtesting.rules.SystemPropertiesRestoreRule$1.evaluate(SystemPropertiesRestoreRule.java:57)
	at org.apache.lucene.util.AbstractBeforeAfterRule$1.evaluate(AbstractBeforeAfterRule.java:45)
	at com.carrotsearch.randomizedtesting.rules.StatementAdapter.evaluate(StatementAdapter.java:36)
	at org.apache.lucene.util.TestRuleStoreClassName$1.evaluate(TestRuleStoreClassName.java:41)
	at com.carrotsearch.randomizedtesting.rules.NoShadowingOrOverridesOnMethodsRule$1.evaluate(NoShadowingOrOverridesOnMethodsRule.java:40)
	at com.carrotsearch.randomizedtesting.rules.NoShadowingOrOverridesOnMethodsRule$1.evaluate(NoShadowingOrOverridesOnMethodsRule.java:40)
	at com.carrotsearch.randomizedtesting.rules.StatementAdapter.evaluate(StatementAdapter.java:36)
	at com.carrotsearch.randomizedtesting.rules.StatementAdapter.evaluate(StatementAdapter.java:36)
	at com.carrotsearch.randomizedtesting.rules.StatementAdapter.evaluate(StatementAdapter.java:36)
	at org.apache.lucene.util.TestRuleAssertionsRequired$1.evaluate(TestRuleAssertionsRequired.java:53)
	at org.apache.lucene.util.TestRuleMarkFailure$1.evaluate(TestRuleMarkFailure.java:47)
	at org.apache.lucene.util.TestRuleIgnoreAfterMaxFailures$1.evaluate(TestRuleIgnoreAfterMaxFailures.java:64)
	at org.apache.lucene.util.TestRuleIgnoreTestSuites$1.evaluate(TestRuleIgnoreTestSuites.java:54)
	at com.carrotsearch.randomizedtesting.rules.StatementAdapter.evaluate(StatementAdapter.java:36)
	at com.carrotsearch.randomizedtesting.ThreadLeakControl$StatementRunner.run(ThreadLeakControl.java:368)
	at java.lang.Thread.run(Thread.java:748)




Build Log:
[...truncated 9877 lines...]
   [junit4] Suite: org.apache.lucene.document.TestLatLonShape
   [junit4]   2> NOTE: reproduce with: ant test  -Dtestcase=TestLatLonShape -Dtests.method=testRandomPolygonEncoding -Dtests.seed=E92F1FD44199EFBE -Dtests.multiplier=2 -Dtests.slow=true -Dtests.locale=no-NO -Dtests.timezone=America/North_Dakota/Center -Dtests.asserts=true -Dtests.file.encoding=UTF-8
   [junit4] FAILURE 0.04s J2 | TestLatLonShape.testRandomPolygonEncoding <<<
   [junit4]    > Throwable #1: java.lang.AssertionError
   [junit4]    > 	at __randomizedtesting.SeedInfo.seed([E92F1FD44199EFBE:2C3EDB8695100930]:0)
   [junit4]    > 	at org.apache.lucene.document.TestLatLonShape.verifyEncoding(TestLatLonShape.java:774)
   [junit4]    > 	at org.apache.lucene.document.TestLatLonShape.testRandomPolygonEncoding(TestLatLonShape.java:726)
   [junit4]    > 	at java.lang.Thread.run(Thread.java:748)
   [junit4]   2> NOTE: leaving temporary files on disk at: /x1/jenkins/jenkins-slave/workspace/Lucene-Solr-Tests-master/lucene/build/sandbox/test/J2/temp/lucene.document.TestLatLonShape_E92F1FD44199EFBE-001
   [junit4]   2> NOTE: test params are: codec=Asserting(Lucene80): {}, docValues:{}, maxPointsInLeafNode=1441, maxMBSortInHeap=7.577899936070286, sim=Asserting(org.apache.lucene.search.similarities.AssertingSimilarity@419db2df), locale=no-NO, timezone=America/North_Dakota/Center
   [junit4]   2> NOTE: Linux 4.4.0-137-generic amd64/Oracle Corporation 1.8.0_191 (64-bit)/cpus=4,threads=1,free=168572480,total=309854208
   [junit4]   2> NOTE: All tests run in this JVM: [TestIntervals, TestLatLonLineShapeQueries, TestLatLonShape]
   [junit4] Completed [10/27 (1!)] on J2 in 14.55s, 25 tests, 1 failure, 1 skipped <<< FAILURES!

[...truncated 6468 lines...]
   [junit4] Suite: org.apache.solr.client.solrj.impl.CloudSolrClientTest
   [junit4]   2> Creating dataDir: /x1/jenkins/jenkins-slave/workspace/Lucene-Solr-Tests-master/solr/build/solr-solrj/test/J2/temp/solr.client.solrj.impl.CloudSolrClientTest_659674499DEA19FB-001/init-core-data-001
   [junit4]   2> 106747 WARN  (SUITE-CloudSolrClientTest-seed#[659674499DEA19FB]-worker) [    ] o.a.s.SolrTestCaseJ4 startTrackingSearchers: numOpens=35 numCloses=35
   [junit4]   2> 106747 INFO  (SUITE-CloudSolrClientTest-seed#[659674499DEA19FB]-worker) [    ] o.a.s.SolrTestCaseJ4 Using PointFields (NUMERIC_POINTS_SYSPROP=true) w/NUMERIC_DOCVALUES_SYSPROP=true
   [junit4]   2> 106749 INFO  (SUITE-CloudSolrClientTest-seed#[659674499DEA19FB]-worker) [    ] o.a.s.SolrTestCaseJ4 Randomized ssl (true) and clientAuth (false) via: @org.apache.solr.util.RandomizeSSL(reason=, ssl=NaN, value=NaN, clientAuth=NaN)
   [junit4]   2> 106750 INFO  (SUITE-CloudSolrClientTest-seed#[659674499DEA19FB]-worker) [    ] o.a.s.SolrTestCaseJ4 SecureRandom sanity checks: test.solr.allowed.securerandom=null & java.security.egd=file:/dev/./urandom
   [junit4]   2> 106757 INFO  (TEST-CloudSolrClientTest.testCollectionDoesntExist-seed#[659674499DEA19FB]) [    ] o.a.s.SolrTestCaseJ4 ###Starting testCollectionDoesntExist
   [junit4]   2> 106759 INFO  (TEST-CloudSolrClientTest.testCollectionDoesntExist-seed#[659674499DEA19FB]) [    ] o.a.s.c.MiniSolrCloudCluster Starting cluster of 3 servers in /x1/jenkins/jenkins-slave/workspace/Lucene-Solr-Tests-master/solr/build/solr-solrj/test/J2/temp/solr.client.solrj.impl.CloudSolrClientTest_659674499DEA19FB-001/tempDir-001
   [junit4]   2> 106759 INFO  (TEST-CloudSolrClientTest.testCollectionDoesntExist-seed#[659674499DEA19FB]) [    ] o.a.s.c.ZkTestServer STARTING ZK TEST SERVER
   [junit4]   2> 106760 INFO  (ZkTestServer Run Thread) [    ] o.a.s.c.ZkTestServer client port:0.0.0.0/0.0.0.0:0
   [junit4]   2> 106760 INFO  (ZkTestServer Run Thread) [    ] o.a.s.c.ZkTestServer Starting server
   [junit4]   2> 106860 INFO  (TEST-CloudSolrClientTest.testCollectionDoesntExist-seed#[659674499DEA19FB]) [    ] o.a.s.c.ZkTestServer start zk server on port:38935
   [junit4]   2> 106860 INFO  (TEST-CloudSolrClientTest.testCollectionDoesntExist-seed#[659674499DEA19FB]) [    ] o.a.s.c.ZkTestServer parse host and port list: 127.0.0.1:38935
   [junit4]   2> 106860 INFO  (TEST-CloudSolrClientTest.testCollectionDoesntExist-seed#[659674499DEA19FB]) [    ] o.a.s.c.ZkTestServer connecting to 127.0.0.1 38935
   [junit4]   2> 106883 INFO  (zkConnectionManagerCallback-279-thread-1) [    ] o.a.s.c.c.ConnectionManager zkClient has connected
   [junit4]   2> 106897 INFO  (zkConnectionManagerCallback-281-thread-1) [    ] o.a.s.c.c.ConnectionManager zkClient has connected
   [junit4]   2> 106904 INFO  (zkConnectionManagerCallback-283-thread-1) [    ] o.a.s.c.c.ConnectionManager zkClient has connected
   [junit4]   2> 106936 WARN  (jetty-launcher-284-thread-1) [    ] o.e.j.s.AbstractConnector Ignoring deprecated socket close linger time
   [junit4]   2> 106937 INFO  (jetty-launcher-284-thread-1) [    ] o.a.s.c.s.e.JettySolrRunner Start Jetty (original configured port=0)
   [junit4]   2> 106937 INFO  (jetty-launcher-284-thread-1) [    ] o.a.s.c.s.e.JettySolrRunner Trying to start Jetty on port 0 try number 1 ...
   [junit4]   2> 106937 INFO  (jetty-launcher-284-thread-1) [    ] o.e.j.s.Server jetty-9.4.14.v20181114; built: 2018-11-14T21:20:31.478Z; git: c4550056e785fb5665914545889f21dc136ad9e6; jvm 1.8.0_191-b12
   [junit4]   2> 106942 WARN  (jetty-launcher-284-thread-2) [    ] o.e.j.s.AbstractConnector Ignoring deprecated socket close linger time
   [junit4]   2> 106943 INFO  (jetty-launcher-284-thread-2) [    ] o.a.s.c.s.e.JettySolrRunner Start Jetty (original configured port=0)
   [junit4]   2> 106943 INFO  (jetty-launcher-284-thread-2) [    ] o.a.s.c.s.e.JettySolrRunner Trying to start Jetty on port 0 try number 1 ...
   [junit4]   2> 106943 INFO  (jetty-launcher-284-thread-2) [    ] o.e.j.s.Server jetty-9.4.14.v20181114; built: 2018-11-14T21:20:31.478Z; git: c4550056e785fb5665914545889f21dc136ad9e6; jvm 1.8.0_191-b12
   [junit4]   2> 106966 INFO  (jetty-launcher-284-thread-1) [    ] o.e.j.s.session DefaultSessionIdManager workerName=node0
   [junit4]   2> 106966 INFO  (jetty-launcher-284-thread-1) [    ] o.e.j.s.session No SessionScavenger set, using defaults
   [junit4]   2> 106966 INFO  (jetty-launcher-284-thread-1) [    ] o.e.j.s.session node0 Scavenging every 600000ms
   [junit4]   2> 106967 INFO  (jetty-launcher-284-thread-1) [    ] o.e.j.s.h.ContextHandler Started o.e.j.s.ServletContextHandler@459392a0{/solr,null,AVAILABLE}
   [junit4]   2> 106969 WARN  (jetty-launcher-284-thread-3) [    ] o.e.j.s.AbstractConnector Ignoring deprecated socket close linger time
   [junit4]   2> 106970 INFO  (jetty-launcher-284-thread-3) [    ] o.a.s.c.s.e.JettySolrRunner Start Jetty (original configured port=0)
   [junit4]   2> 106970 INFO  (jetty-launcher-284-thread-3) [    ] o.a.s.c.s.e.JettySolrRunner Trying to start Jetty on port 0 try number 1 ...
   [junit4]   2> 106970 INFO  (jetty-launcher-284-thread-3) [    ] o.e.j.s.Server jetty-9.4.14.v20181114; built: 2018-11-14T21:20:31.478Z; git: c4550056e785fb5665914545889f21dc136ad9e6; jvm 1.8.0_191-b12
   [junit4]   2> 106971 INFO  (jetty-launcher-284-thread-2) [    ] o.e.j.s.session DefaultSessionIdManager workerName=node0
   [junit4]   2> 106971 INFO  (jetty-launcher-284-thread-2) [    ] o.e.j.s.session No SessionScavenger set, using defaults
   [junit4]   2> 106971 INFO  (jetty-launcher-284-thread-2) [    ] o.e.j.s.session node0 Scavenging every 660000ms
   [junit4]   2> 106972 INFO  (jetty-launcher-284-thread-2) [    ] o.e.j.s.h.ContextHandler Started o.e.j.s.ServletContextHandler@7a02cdf9{/solr,null,AVAILABLE}
   [junit4]   2> 106973 INFO  (jetty-launcher-284-thread-3) [    ] o.e.j.s.session DefaultSessionIdManager workerName=node0
   [junit4]   2> 106973 INFO  (jetty-launcher-284-thread-3) [    ] o.e.j.s.session No SessionScavenger set, using defaults
   [junit4]   2> 106973 INFO  (jetty-launcher-284-thread-3) [    ] o.e.j.s.session node0 Scavenging every 660000ms
   [junit4]   2> 106974 INFO  (jetty-launcher-284-thread-3) [    ] o.e.j.s.h.ContextHandler Started o.e.j.s.ServletContextHandler@47d4dc19{/solr,null,AVAILABLE}
   [junit4]   2> 106974 WARN  (jetty-launcher-284-thread-2) [    ] o.e.j.u.s.S.config No Client EndPointIdentificationAlgorithm configured for SslContextFactory@51ae5a56[provider=null,keyStore=null,trustStore=null]
   [junit4]   2> 106974 WARN  (jetty-launcher-284-thread-3) [    ] o.e.j.u.s.S.config No Client EndPointIdentificationAlgorithm configured for SslContextFactory@22875bbe[provider=null,keyStore=null,trustStore=null]
   [junit4]   2> 106977 WARN  (jetty-launcher-284-thread-1) [    ] o.e.j.u.s.S.config No Client EndPointIdentificationAlgorithm configured for SslContextFactory@4a0fd709[provider=null,keyStore=null,trustStore=null]
   [junit4]   2> 106978 INFO  (jetty-launcher-284-thread-2) [    ] o.e.j.s.AbstractConnector Started ServerConnector@63fb5aa1{SSL,[ssl, http/1.1]}{127.0.0.1:39442}
   [junit4]   2> 106978 INFO  (jetty-launcher-284-thread-2) [    ] o.e.j.s.Server Started @107043ms
   [junit4]   2> 106978 INFO  (jetty-launcher-284-thread-1) [    ] o.e.j.s.AbstractConnector Started ServerConnector@4a51a584{SSL,[ssl, http/1.1]}{127.0.0.1:45538}
   [junit4]   2> 106978 INFO  (jetty-launcher-284-thread-2) [    ] o.a.s.c.s.e.JettySolrRunner Jetty properties: {hostContext=/solr, hostPort=39442}
   [junit4]   2> 106978 INFO  (jetty-launcher-284-thread-1) [    ] o.e.j.s.Server Started @107043ms
   [junit4]   2> 106978 INFO  (jetty-launcher-284-thread-1) [    ] o.a.s.c.s.e.JettySolrRunner Jetty properties: {hostContext=/solr, hostPort=45538}
   [junit4]   2> 106979 ERROR (jetty-launcher-284-thread-2) [    ] o.a.s.u.StartupLoggingUtils Missing Java Option solr.log.dir. Logging may be missing or incomplete.
   [junit4]   2> 106979 INFO  (jetty-launcher-284-thread-2) [    ] o.a.s.s.SolrDispatchFilter Using logger factory org.apache.logging.slf4j.Log4jLoggerFactory
   [junit4]   2> 106979 INFO  (jetty-launcher-284-thread-2) [    ] o.a.s.s.SolrDispatchFilter  ___      _       Welcome to Apache Solr? version 9.0.0
   [junit4]   2> 106979 INFO  (jetty-launcher-284-thread-2) [    ] o.a.s.s.SolrDispatchFilter / __| ___| |_ _   Starting in cloud mode on port null
   [junit4]   2> 106979 INFO  (jetty-launcher-284-thread-2) [    ] o.a.s.s.SolrDispatchFilter \__ \/ _ \ | '_|  Install dir: null
   [junit4]   2> 106979 ERROR (jetty-launcher-284-thread-1) [    ] o.a.s.u.StartupLoggingUtils Missing Java Option solr.log.dir. Logging may be missing or incomplete.
   [junit4]   2> 106979 INFO  (jetty-launcher-284-thread-1) [    ] o.a.s.s.SolrDispatchFilter Using logger factory org.apache.logging.slf4j.Log4jLoggerFactory
   [junit4]   2> 106979 INFO  (jetty-launcher-284-thread-2) [    ] o.a.s.s.SolrDispatchFilter |___/\___/_|_|    Start time: 2019-02-01T06:48:28.190Z
   [junit4]   2> 106979 INFO  (jetty-launcher-284-thread-1) [    ] o.a.s.s.SolrDispatchFilter  ___      _       Welcome to Apache Solr? version 9.0.0
   [junit4]   2> 106979 INFO  (jetty-launcher-284-thread-1) [    ] o.a.s.s.SolrDispatchFilter / __| ___| |_ _   Starting in cloud mode on port null
   [junit4]   2> 106979 INFO  (jetty-launcher-284-thread-1) [    ] o.a.s.s.SolrDispatchFilter \__ \/ _ \ | '_|  Install dir: null
   [junit4]   2> 106979 INFO  (jetty-launcher-284-thread-1) [    ] o.a.s.s.SolrDispatchFilter |___/\___/_|_|    Start time: 2019-02-01T06:48:28.190Z
   [junit4]   2> 106981 INFO  (jetty-launcher-284-thread-3) [    ] o.e.j.s.AbstractConnector Started ServerConnector@6559d091{SSL,[ssl, http/1.1]}{127.0.0.1:38774}
   [junit4]   2> 106981 INFO  (jetty-launcher-284-thread-3) [    ] o.e.j.s.Server Started @107045ms
   [junit4]   2> 106986 INFO  (jetty-launcher-284-thread-3) [    ] o.a.s.c.s.e.JettySolrRunner Jetty properties: {hostContext=/solr, hostPort=38774}
   [junit4]   2> 106987 ERROR (jetty-launcher-284-thread-3) [    ] o.a.s.u.StartupLoggingUtils Missing Java Option solr.log.dir. Logging may be missing or incomplete.
   [junit4]   2> 106987 INFO  (jetty-launcher-284-thread-3) [    ] o.a.s.s.SolrDispatchFilter Using logger factory org.apache.logging.slf4j.Log4jLoggerFactory
   [junit4]   2> 106987 INFO  (jetty-launcher-284-thread-3) [    ] o.a.s.s.SolrDispatchFilter  ___      _       Welcome to Apache Solr? version 9.0.0
   [junit4]   2> 106987 INFO  (jetty-launcher-284-thread-3) [    ] o.a.s.s.SolrDispatchFilter / __| ___| |_ _   Starting in cloud mode on port null
   [junit4]   2> 106987 INFO  (jetty-launcher-284-thread-3) [    ] o.a.s.s.SolrDispatchFilter \__ \/ _ \ | '_|  Install dir: null
   [junit4]   2> 106988 INFO  (jetty-launcher-284-thread-3) [    ] o.a.s.s.SolrDispatchFilter |___/\___/_|_|    Start time: 2019-02-01T06:48:28.199Z
   [junit4]   2> 107008 INFO  (zkConnectionManagerCallback-288-thread-1) [    ] o.a.s.c.c.ConnectionManager zkClient has connected
   [junit4]   2> 107013 INFO  (jetty-launcher-284-thread-1) [    ] o.a.s.s.SolrDispatchFilter solr.xml found in ZooKeeper. Loading...
   [junit4]   2> 107026 INFO  (zkConnectionManagerCallback-290-thread-1) [    ] o.a.s.c.c.ConnectionManager zkClient has connected
   [junit4]   2> 107027 INFO  (zkConnectionManagerCallback-286-thread-1) [    ] o.a.s.c.c.ConnectionManager zkClient has connected
   [junit4]   2> 107029 INFO  (jetty-launcher-284-thread-2) [    ] o.a.s.s.SolrDispatchFilter solr.xml found in ZooKeeper. Loading...
   [junit4]   2> 107029 INFO  (jetty-launcher-284-thread-3) [    ] o.a.s.s.SolrDispatchFilter solr.xml found in ZooKeeper. Loading...
   [junit4]   2> 107169 INFO  (jetty-launcher-284-thread-3) [    ] o.a.s.h.c.HttpShardHandlerFactory Host whitelist initialized: WhitelistHostChecker [whitelistHosts=null, whitelistHostCheckingEnabled=true]
   [junit4]   2> 107170 WARN  (jetty-launcher-284-thread-3) [    ] o.a.s.c.s.i.Http2SolrClient Create Http2SolrClient with HTTP/1.1 transport since Java 8 or lower versions does not support SSL + HTTP/2
   [junit4]   2> 107171 WARN  (jetty-launcher-284-thread-3) [    ] o.e.j.u.s.S.config No Client EndPointIdentificationAlgorithm configured for SslContextFactory@2282f605[provider=null,keyStore=null,trustStore=null]
   [junit4]   2> 107174 WARN  (jetty-launcher-284-thread-3) [    ] o.a.s.c.s.i.Http2SolrClient Create Http2SolrClient with HTTP/1.1 transport since Java 8 or lower versions does not support SSL + HTTP/2
   [junit4]   2> 107175 WARN  (jetty-launcher-284-thread-3) [    ] o.e.j.u.s.S.config No Client EndPointIdentificationAlgorithm configured for SslContextFactory@5c478f95[provider=null,keyStore=null,trustStore=null]
   [junit4]   2> 107176 INFO  (jetty-launcher-284-thread-3) [    ] o.a.s.c.ZkContainer Zookeeper client=127.0.0.1:38935/solr
   [junit4]   2> 107186 INFO  (zkConnectionManagerCallback-296-thread-1) [    ] o.a.s.c.c.ConnectionManager zkClient has connected
   [junit4]   2> 107195 INFO  (zkConnectionManagerCallback-298-thread-1) [    ] o.a.s.c.c.ConnectionManager zkClient has connected
   [junit4]   2> 107213 WARN  (jetty-launcher-284-thread-3) [n:127.0.0.1:38774_solr    ] o.a.s.c.ZkController The _default configset could not be uploaded. Please provide 'solr.default.confdir' parameter that points to a configset intended to be the default. Current 'solr.default.confdir' value: null
   [junit4]   2> 107221 INFO  (jetty-launcher-284-thread-3) [n:127.0.0.1:38774_solr    ] o.a.s.c.OverseerElectionContext I am going to be the leader 127.0.0.1:38774_solr
   [junit4]   2> 107226 INFO  (jetty-launcher-284-thread-3) [n:127.0.0.1:38774_solr    ] o.a.s.c.Overseer Overseer (id=72722028796313607-127.0.0.1:38774_solr-n_0000000000) starting
   [junit4]   2> 107250 INFO  (zkConnectionManagerCallback-305-thread-1) [    ] o.a.s.c.c.ConnectionManager zkClient has connected
   [junit4]   2> 107254 INFO  (jetty-launcher-284-thread-3) [n:127.0.0.1:38774_solr    ] o.a.s.c.s.i.ZkClientClusterStateProvider Cluster at 127.0.0.1:38935/solr ready
   [junit4]   2> 107261 INFO  (jetty-launcher-284-thread-3) [n:127.0.0.1:38774_solr    ] o.a.s.c.ZkController Register node as live in ZooKeeper:/live_nodes/127.0.0.1:38774_solr
   [junit4]   2> 107261 INFO  (OverseerStateUpdate-72722028796313607-127.0.0.1:38774_solr-n_0000000000) [n:127.0.0.1:38774_solr    ] o.a.s.c.Overseer Starting to work on the main queue : 127.0.0.1:38774_solr
   [junit4]   2> 107271 INFO  (OverseerStateUpdate-72722028796313607-127.0.0.1:38774_solr-n_0000000000) [n:127.0.0.1:38774_solr    ] o.a.s.c.c.ZkStateReader Updated live nodes from ZooKeeper... (0) -> (1)
   [junit4]   2> 107274 INFO  (zkCallback-304-thread-1) [    ] o.a.s.c.c.ZkStateReader Updated live nodes from ZooKeeper... (0) -> (1)
   [junit4]   2> 107286 INFO  (jetty-launcher-284-thread-1) [    ] o.a.s.h.c.HttpShardHandlerFactory Host whitelist initialized: WhitelistHostChecker [whitelistHosts=null, whitelistHostCheckingEnabled=true]
   [junit4]   2> 107287 WARN  (jetty-launcher-284-thread-1) [    ] o.a.s.c.s.i.Http2SolrClient Create Http2SolrClient with HTTP/1.1 transport since Java 8 or lower versions does not support SSL + HTTP/2
   [junit4]   2> 107303 WARN  (jetty-launcher-284-thread-1) [    ] o.e.j.u.s.S.config No Client EndPointIdentificationAlgorithm configured for SslContextFactory@3c4da384[provider=null,keyStore=null,trustStore=null]
   [junit4]   2> 107305 INFO  (jetty-launcher-284-thread-3) [n:127.0.0.1:38774_solr    ] o.a.s.h.a.MetricsHistoryHandler No .system collection, keeping metrics history in memory.
   [junit4]   2> 107345 INFO  (jetty-launcher-284-thread-3) [n:127.0.0.1:38774_solr    ] o.a.s.m.r.SolrJmxReporter JMX monitoring for 'solr_38774.solr.node' (registry 'solr.node') enabled at server: com.sun.jmx.mbeanserver.JmxMBeanServer@216a2c7f
   [junit4]   2> 107355 WARN  (jetty-launcher-284-thread-1) [    ] o.a.s.c.s.i.Http2SolrClient Create Http2SolrClient with HTTP/1.1 transport since Java 8 or lower versions does not support SSL + HTTP/2
   [junit4]   2> 107359 INFO  (jetty-launcher-284-thread-3) [n:127.0.0.1:38774_solr    ] o.a.s.m.r.SolrJmxReporter JMX monitoring for 'solr_38774.solr.jvm' (registry 'solr.jvm') enabled at server: com.sun.jmx.mbeanserver.JmxMBeanServer@216a2c7f
   [junit4]   2> 107360 INFO  (jetty-launcher-284-thread-3) [n:127.0.0.1:38774_solr    ] o.a.s.m.r.SolrJmxReporter JMX monitoring for 'solr_38774.solr.jetty' (registry 'solr.jetty') enabled at server: com.sun.jmx.mbeanserver.JmxMBeanServer@216a2c7f
   [junit4]   2> 107362 INFO  (jetty-launcher-284-thread-3) [n:127.0.0.1:38774_solr    ] o.a.s.c.CorePropertiesLocator Found 0 core definitions underneath /x1/jenkins/jenkins-slave/workspace/Lucene-Solr-Tests-master/solr/build/solr-solrj/test/J2/temp/solr.client.solrj.impl.CloudSolrClientTest_659674499DEA19FB-001/tempDir-001/node3/.
   [junit4]   2> 107363 WARN  (jetty-launcher-284-thread-1) [    ] o.e.j.u.s.S.config No Client EndPointIdentificationAlgorithm configured for SslContextFactory@7cce2244[provider=null,keyStore=null,trustStore=null]
   [junit4]   2> 107364 INFO  (jetty-launcher-284-thread-1) [    ] o.a.s.c.ZkContainer Zookeeper client=127.0.0.1:38935/solr
   [junit4]   2> 107398 INFO  (zkConnectionManagerCallback-312-thread-1) [    ] o.a.s.c.c.ConnectionManager zkClient has connected
   [junit4]   2> 107408 INFO  (zkConnectionManagerCallback-314-thread-1) [    ] o.a.s.c.c.ConnectionManager zkClient has connected
   [junit4]   2> 107415 WARN  (jetty-launcher-284-thread-1) [n:127.0.0.1:45538_solr    ] o.a.s.c.ZkController The _default configset could not be uploaded. Please provide 'solr.default.confdir' parameter that points to a configset intended to be the default. Current 'solr.default.confdir' value: null
   [junit4]   2> 107416 INFO  (jetty-launcher-284-thread-1) [n:127.0.0.1:45538_solr    ] o.a.s.c.c.ZkStateReader Updated live nodes from ZooKeeper... (0) -> (1)
   [junit4]   2> 107423 INFO  (jetty-launcher-284-thread-1) [n:127.0.0.1:45538_solr    ] o.a.s.c.ZkController Publish node=127.0.0.1:45538_solr as DOWN
   [junit4]   2> 107424 INFO  (jetty-launcher-284-thread-1) [n:127.0.0.1:45538_solr    ] o.a.s.c.TransientSolrCoreCacheDefault Allocating transient cache for 2147483647 transient cores
   [junit4]   2> 107424 INFO  (jetty-launcher-284-thread-1) [n:127.0.0.1:45538_solr    ] o.a.s.c.ZkController Register node as live in ZooKeeper:/live_nodes/127.0.0.1:45538_solr
   [junit4]   2> 107427 INFO  (zkCallback-304-thread-1) [    ] o.a.s.c.c.ZkStateReader Updated live nodes from ZooKeeper... (1) -> (2)
   [junit4]   2> 107428 INFO  (zkCallback-297-thread-1) [    ] o.a.s.c.c.ZkStateReader Updated live nodes from ZooKeeper... (1) -> (2)
   [junit4]   2> 107446 INFO  (zkCallback-313-thread-1) [    ] o.a.s.c.c.ZkStateReader Updated live nodes from ZooKeeper... (1) -> (2)
   [junit4]   2> 107464 INFO  (zkConnectionManagerCallback-321-thread-1) [    ] o.a.s.c.c.ConnectionManager zkClient has connected
   [junit4]   2> 107467 INFO  (jetty-launcher-284-thread-1) [n:127.0.0.1:45538_solr    ] o.a.s.c.c.ZkStateReader Updated live nodes from ZooKeeper... (0) -> (2)
   [junit4]   2> 107470 INFO  (jetty-launcher-284-thread-1) [n:127.0.0.1:45538_solr    ] o.a.s.c.s.i.ZkClientClusterStateProvider Cluster at 127.0.0.1:38935/solr ready
   [junit4]   2> 107472 INFO  (jetty-launcher-284-thread-1) [n:127.0.0.1:45538_solr    ] o.a.s.h.a.MetricsHistoryHandler No .system collection, keeping metrics history in memory.
   [junit4]   2> 107519 INFO  (jetty-launcher-284-thread-1) [n:127.0.0.1:45538_solr    ] o.a.s.m.r.SolrJmxReporter JMX monitoring for 'solr_45538.solr.node' (registry 'solr.node') enabled at server: com.sun.jmx.mbeanserver.JmxMBeanServer@216a2c7f
   [junit4]   2> 107534 INFO  (jetty-launcher-284-thread-1) [n:127.0.0.1:45538_solr    ] o.a.s.m.r.SolrJmxReporter JMX monitoring for 'solr_45538.solr.jvm' (registry 'solr.jvm') enabled at server: com.sun.jmx.mbeanserver.JmxMBeanServer@216a2c7f
   [junit4]   2> 107534 INFO  (jetty-launcher-284-thread-1) [n:127.0.0.1:45538_solr    ] o.a.s.m.r.SolrJmxReporter JMX monitoring for 'solr_45538.solr.jetty' (registry 'solr.jetty') enabled at server: com.sun.jmx.mbeanserver.JmxMBeanServer@216a2c7f
   [junit4]   2> 107536 INFO  (jetty-launcher-284-thread-1) [n:127.0.0.1:45538_solr    ] o.a.s.c.CorePropertiesLocator Found 0 core definitions underneath /x1/jenkins/jenkins-slave/workspace/Lucene-Solr-Tests-master/solr/build/solr-solrj/test/J2/temp/solr.client.solrj.impl.CloudSolrClientTest_659674499DEA19FB-001/tempDir-001/node1/.
   [junit4]   2> 107883 INFO  (jetty-launcher-284-thread-2) [    ] o.a.s.h.c.HttpShardHandlerFactory Host whitelist initialized: WhitelistHostChecker [whitelistHosts=null, whitelistHostCheckingEnabled=true]
   [junit4]   2> 107883 WARN  (jetty-launcher-284-thread-2) [    ] o.a.s.c.s.i.Http2SolrClient Create Http2SolrClient with HTTP/1.1 transport since Java 8 or lower versions does not support SSL + HTTP/2
   [junit4]   2> 107886 WARN  (jetty-launcher-284-thread-2) [    ] o.e.j.u.s.S.config No Client EndPointIdentificationAlgorithm configured for SslContextFactory@25d822c1[provider=null,keyStore=null,trustStore=null]
   [junit4]   2> 107889 WARN  (jetty-launcher-284-thread-2) [    ] o.a.s.c.s.i.Http2SolrClient Create Http2SolrClient with HTTP/1.1 transport since Java 8 or lower versions does not support SSL + HTTP/2
   [junit4]   2> 107891 WARN  (jetty-launcher-284-thread-2) [    ] o.e.j.u.s.S.config No Client EndPointIdentificationAlgorithm configured for SslContextFactory@4bc7539e[provider=null,keyStore=null,trustStore=null]
   [junit4]   2> 107892 INFO  (jetty-launcher-284-thread-2) [    ] o.a.s.c.ZkContainer Zookeeper client=127.0.0.1:38935/solr
   [junit4]   2> 107899 INFO  (zkConnectionManagerCallback-328-thread-1) [    ] o.a.s.c.c.ConnectionManager zkClient has connected
   [junit4]   2> 107911 INFO  (zkConnectionManagerCallback-330-thread-1) [    ] o.a.s.c.c.ConnectionManager zkClient has connected
   [junit4]   2> 107921 WARN  (jetty-launcher-284-thread-2) [n:127.0.0.1:39442_solr    ] o.a.s.c.ZkController The _default configset could not be uploaded. Please provide 'solr.default.confdir' parameter that points to a configset intended to be the default. Current 'solr.default.confdir' value: null
   [junit4]   2> 107923 INFO  (jetty-launcher-284-thread-2) [n:127.0.0.1:39442_solr    ] o.a.s.c.c.ZkStateReader Updated live nodes from ZooKeeper... (0) -> (2)
   [junit4]   2> 107930 INFO  (jetty-launcher-284-thread-2) [n:127.0.0.1:39442_solr    ] o.a.s.c.ZkController Publish node=127.0.0.1:39442_solr as DOWN
   [junit4]   2> 107932 INFO  (jetty-launcher-284-thread-2) [n:127.0.0.1:39442_solr    ] o.a.s.c.TransientSolrCoreCacheDefault Allocating transient cache for 2147483647 transient cores
   [junit4]   2> 107932 INFO  (jetty-launcher-284-thread-2) [n:127.0.0.1:39442_solr    ] o.a.s.c.ZkController Register node as live in ZooKeeper:/live_nodes/127.0.0.1:39442_solr
   [junit4]   2> 107937 INFO  (zkCallback-297-thread-1) [    ] o.a.s.c.c.ZkStateReader Updated live nodes from ZooKeeper... (2) -> (3)
   [junit4]   2> 107937 INFO  (zkCallback-320-thread-1) [    ] o.a.s.c.c.ZkStateReader Updated live nodes from ZooKeeper... (2) -> (3)
   [junit4]   2> 107937 INFO  (zkCallback-304-thread-1) [    ] o.a.s.c.c.ZkStateReader Updated live nodes from ZooKeeper... (2) -> (3)
   [junit4]   2> 107937 INFO  (zkCallback-313-thread-1) [    ] o.a.s.c.c.ZkStateReader Updated live nodes from ZooKeeper... (2) -> (3)
   [junit4]   2> 107946 INFO  (zkCallback-329-thread-1) [    ] o.a.s.c.c.ZkStateReader Updated live nodes from ZooKeeper... (2) -> (3)
   [junit4]   2> 107971 INFO  (zkConnectionManagerCallback-337-thread-1) [    ] o.a.s.c.c.ConnectionManager zkClient has connected
   [junit4]   2> 107974 INFO  (jetty-launcher-284-thread-2) [n:127.0.0.1:39442_solr    ] o.a.s.c.c.ZkStateReader Updated live nodes from ZooKeeper... (0) -> (3)
   [junit4]   2> 107976 INFO  (jetty-launcher-284-thread-2) [n:127.0.0.1:39442_solr    ] o.a.s.c.s.i.ZkClientClusterStateProvider Cluster at 127.0.0.1:38935/solr ready
   [junit4]   2> 107977 INFO  (jetty-launcher-284-thread-2) [n:127.0.0.1:39442_solr    ] o.a.s.h.a.MetricsHistoryHandler No .system collection, keeping metrics history in memory.
   [junit4]   2> 108007 INFO  (jetty-launcher-284-thread-2) [n:127.0.0.1:39442_solr    ] o.a.s.m.r.SolrJmxReporter JMX monitoring for 'solr_39442.solr.node' (registry 'solr.node') enabled at server: com.sun.jmx.mbeanserver.JmxMBeanServer@216a2c7f
   [junit4]   2> 108024 INFO  (jetty-launcher-284-thread-2) [n:127.0.0.1:39442_solr    ] o.a.s.m.r.SolrJmxReporter JMX monitoring for 'solr_39442.solr.jvm' (registry 'solr.jvm') enabled at server: com.sun.jmx.mbeanserver.JmxMBeanServer@216a2c7f
   [junit4]   2> 108024 INFO  (jetty-launcher-284-thread-2) [n:127.0.0.1:39442_solr    ] o.a.s.m.r.SolrJmxReporter JMX monitoring for 'solr_39442.solr.jetty' (registry 'solr.jetty') enabled at server: com.sun.jmx.mbeanserver.JmxMBeanServer@216a2c7f
   [junit4]   2> 108026 INFO  (jetty-launcher-284-thread-2) [n:127.0.0.1:39442_solr    ] o.a.s.c.CorePropertiesLocator Found 0 core definitions underneath /x1/jenkins/jenkins-slave/workspace/Lucene-Solr-Tests-master/solr/build/solr-solrj/test/J2/temp/solr.client.solrj.impl.CloudSolrClientTest_659674499DEA19FB-001/tempDir-001/node2/.
   [junit4]   2> 108097 INFO  (zkConnectionManagerCallback-343-thread-1) [    ] o.a.s.c.c.ConnectionManager zkClient has connected
   [junit4]   2> 108103 INFO  (TEST-CloudSolrClientTest.testCollectionDoesntExist-seed#[659674499DEA19FB]) [    ] o.a.s.c.c.ZkStateReader Updated live nodes from ZooKeeper... (0) -> (3)
   [junit4]   2> 108108 INFO  (TEST-CloudSolrClientTest.testCollectionDoesntExist-seed#[659674499DEA19FB]) [    ] o.a.s.c.s.i.ZkClientClusterStateProvider Cluster at 127.0.0.1:38935/solr ready
   [junit4]   2> 108330 INFO  (qtp1753611081-822) [n:127.0.0.1:38774_solr    ] o.a.s.h.a.CollectionsHandler Invoked Collection Action :clusterstatus with params action=CLUSTERSTATUS&wt=javabin&version=2 and sendToOCPQueue=true
   [junit4]   2> 108336 INFO  (qtp1753611081-822) [n:127.0.0.1:38774_solr    ] o.a.s.s.HttpSolrCall [admin] webapp=null path=/admin/collections params={action=CLUSTERSTATUS&wt=javabin&version=2} status=0 QTime=6
   [junit4]   2> 108344 INFO  (jetty-closer-345-thread-1) [    ] o.a.s.c.CoreContainer Shutting down CoreContainer instance=1270195707
   [junit4]   2> 108344 INFO  (jetty-closer-345-thread-1) [    ] o.a.s.c.ZkController Remove node as live in ZooKeeper:/live_nodes/127.0.0.1:38774_solr
   [junit4]   2> 108345 INFO  (jetty-closer-345-thread-2) [    ] o.a.s.c.CoreContainer Shutting down CoreContainer instance=1180003161
   [junit4]   2> 108345 INFO  (jetty-closer-345-thread-2) [    ] o.a.s.c.ZkController Remove node as live in ZooKeeper:/live_nodes/127.0.0.1:45538_solr
   [junit4]   2> 108345 INFO  (jetty-closer-345-thread-1) [    ] o.a.s.c.CoreContainer Publish this node as DOWN...
   [junit4]   2> 108345 INFO  (jetty-closer-345-thread-1) [    ] o.a.s.c.ZkController Publish node=127.0.0.1:38774_solr as DOWN
   [junit4]   2> 108346 INFO  (jetty-closer-345-thread-2) [    ] o.a.s.c.CoreContainer Publish this node as DOWN...
   [junit4]   2> 108346 INFO  (jetty-closer-345-thread-2) [    ] o.a.s.c.ZkController Publish node=127.0.0.1:45538_solr as DOWN
   [junit4]   2> 108354 INFO  (jetty-closer-345-thread-1) [    ] o.a.s.c.TransientSolrCoreCacheDefault Allocating transient cache for 2147483647 transient cores
   [junit4]   2> 108355 INFO  (jetty-closer-345-thread-2) [    ] o.a.s.m.SolrMetricManager Closing metric reporters for registry=solr.node, tag=null
   [junit4]   2> 108356 INFO  (jetty-closer-345-thread-2) [    ] o.a.s.m.r.SolrJmxReporter Closing reporter [org.apache.solr.metrics.reporters.SolrJmxReporter@104cc128: rootName = solr_45538, domain = solr.node, service url = null, agent id = null] for registry solr.node / com.codahale.metrics.MetricRegistry@7093589
   [junit4]   2> 108356 INFO  (jetty-closer-345-thread-1) [    ] o.a.s.m.SolrMetricManager Closing metric reporters for registry=solr.node, tag=null
   [junit4]   2> 108356 INFO  (jetty-closer-345-thread-1) [    ] o.a.s.m.r.SolrJmxReporter Closing reporter [org.apache.solr.metrics.reporters.SolrJmxReporter@33868db7: rootName = solr_38774, domain = solr.node, service url = null, agent id = null] for registry solr.node / com.codahale.metrics.MetricRegistry@400d0fcb
   [junit4]   2> 108362 INFO  (jetty-closer-345-thread-3) [    ] o.a.s.c.CoreContainer Shutting down CoreContainer instance=1233198605
   [junit4]   2> 108362 INFO  (jetty-closer-345-thread-3) [    ] o.a.s.c.ZkController Remove node as live in ZooKeeper:/live_nodes/127.0.0.1:39442_solr
   [junit4]   2> 108364 INFO  (jetty-closer-345-thread-3) [    ] o.a.s.c.CoreContainer Publish this node as DOWN...
   [junit4]   2> 108364 INFO  (jetty-closer-345-thread-3) [    ] o.a.s.c.ZkController Publish node=127.0.0.1:39442_solr as DOWN
   [junit4]   2> 108368 INFO  (jetty-closer-345-thread-3) [    ] o.a.s.m.SolrMetricManager Closing metric reporters for registry=solr.node, tag=null
   [junit4]   2> 108369 INFO  (jetty-closer-345-thread-3) [    ] o.a.s.m.r.SolrJmxReporter Closing reporter [org.apache.solr.metrics.reporters.SolrJmxReporter@4b99b86: rootName = solr_39442, domain = solr.node, service url = null, agent id = null] for registry solr.node / com.codahale.metrics.MetricRegistry@37678871
   [junit4]   2> 108393 INFO  (jetty-closer-345-thread-2) [    ] o.a.s.m.SolrMetricManager Closing metric reporters for registry=solr.jvm, tag=null
   [junit4]   2> 108393 INFO  (jetty-closer-345-thread-2) [    ] o.a.s.m.r.SolrJmxReporter Closing reporter [org.apache.solr.metrics.reporters.SolrJmxReporter@b514da8: rootName = solr_45538, domain = solr.jvm, service url = null, agent id = null] for registry solr.jvm / com.codahale.metrics.MetricRegistry@5ee3ec6
   [junit4]   2> 108398 INFO  (jetty-closer-345-thread-2) [    ] o.a.s.m.SolrMetricManager Closing metric reporters for registry=solr.jetty, tag=null
   [junit4]   2> 108398 INFO  (jetty-closer-345-thread-2) [    ] o.a.s.m.r.SolrJmxReporter Closing reporter [org.apache.solr.metrics.reporters.SolrJmxReporter@4ac9fc36: rootName = solr_45538, domain = solr.jetty, service url = null, agent id = null] for registry solr.jetty / com.codahale.metrics.MetricRegistry@a6c4c4e
   [junit4]   2> 108398 INFO  (jetty-closer-345-thread-1) [    ] o.a.s.m.SolrMetricManager Closing metric reporters for registry=solr.jvm, tag=null
   [junit4]   2> 108398 INFO  (jetty-closer-345-thread-1) [    ] o.a.s.m.r.SolrJmxReporter Closing reporter [org.apache.solr.metrics.reporters.SolrJmxReporter@32bec746: rootName = solr_38774, domain = solr.jvm, service url = null, agent id = null] for registry solr.jvm / com.codahale.metrics.MetricRegistry@5ee3ec6
   [junit4]   2> 108399 INFO  (jetty-closer-345-thread-2) [    ] o.a.s.m.SolrMetricManager Closing metric reporters for registry=solr.cluster, tag=null
   [junit4]   1> Done close org.apache.solr.common.util.ExecutorUtil$MDCAwareThreadPoolExecutor@53749914[Terminated, pool size = 0, active threads = 0, queued tasks = 0, completed tasks = 2]
   [junit4]   2> 108403 INFO  (zkCallback-297-thread-1) [    ] o.a.s.c.c.ZkStateReader Updated live nodes from ZooKeeper... (3) -> (2)
   [junit4]   2> 108426 INFO  (jetty-closer-345-thread-1) [    ] o.a.s.m.SolrMetricManager Closing metric reporters for registry=solr.jetty, tag=null
   [junit4]   2> 108426 INFO  (jetty-closer-345-thread-1) [    ] o.a.s.m.r.SolrJmxReporter Closing reporter [org.apache.solr.metrics.reporters.SolrJmxReporter@3e970d48: rootName = solr_38774, domain = solr.jetty, service url = null, agent id = null] for registry solr.jetty / com.codahale.metrics.MetricRegistry@a6c4c4e
   [junit4]   2> 108426 INFO  (jetty-closer-345-thread-1) [    ] o.a.s.m.SolrMetricManager Closing metric reporters for registry=solr.cluster, tag=null
   [junit4]   2> 108430 INFO  (closeThreadPool-353-thread-2) [    ] o.a.s.c.Overseer Overseer (id=72722028796313607-127.0.0.1:38774_solr-n_0000000000) closing
   [junit4]   2> 108433 INFO  (zkCallback-304-thread-1) [    ] o.a.s.c.c.ZkStateReader Updated live nodes from ZooKeeper... (3) -> (2)
   [junit4]   2> 108433 INFO  (jetty-closer-345-thread-3) [    ] o.a.s.m.SolrMetricManager Closing metric reporters for registry=solr.jvm, tag=null
   [junit4]   2> 108433 INFO  (jetty-closer-345-thread-3) [    ] o.a.s.m.r.SolrJmxReporter Closing reporter [org.apache.solr.metrics.reporters.SolrJmxReporter@20088fbe: rootName = solr_39442, domain = solr.jvm, service url = null, agent id = null] for registry solr.jvm / com.codahale.metrics.MetricRegistry@5ee3ec6
   [junit4]   2> 108434 INFO  (OverseerAutoScalingTriggerThread-72722028796313607-127.0.0.1:38774_solr-n_0000000000) [    ] o.a.s.c.a.OverseerTriggerThread OverseerTriggerThread woken up but we are closed, exiting.
   [junit4]   2> 108434 INFO  (OverseerStateUpdate-72722028796313607-127.0.0.1:38774_solr-n_0000000000) [n:127.0.0.1:38774_solr    ] o.a.s.c.Overseer Overseer Loop exiting : 127.0.0.1:38774_solr
   [junit4]   1> Done close org.apache.solr.common.util.ExecutorUtil$MDCAwareThreadPoolExecutor@622926c9[Terminated, pool size = 0, active threads = 0, queued tasks = 0, completed tasks = 2]
   [junit4]   1> Done close org.apache.solr.common.util.ExecutorUtil$MDCAwareThreadPoolExecutor@7c79d85[Terminated, pool size = 0, active threads = 0, queued tasks = 0, completed tasks = 2]
   [junit4]   2> 108440 INFO  (zkCallback-329-thread-2) [    ] o.a.s.c.c.ZkStateReader Updated live nodes from ZooKeeper... (3) -> (2)
   [junit4]   2> 108442 WARN  (NIOServerCxn.Factory:0.0.0.0/0.0.0.0:0) [    ] o.a.z.s.NIOServerCnxn Unable to read additional data from client sessionid 0x1025c4cc5c00007, likely client has closed socket
   [junit4]   2> 108447 INFO  (zkCallback-304-thread-1) [    ] o.a.s.c.c.ZkStateReader Updated live nodes from ZooKeeper... (2) -> (1)
   [junit4]   2> 108447 INFO  (closeThreadPool-353-thread-1) [    ] o.a.s.c.Overseer Overseer (id=72722028796313607-127.0.0.1:38774_solr-n_0000000000) closing
   [junit4]   2> 108447 INFO  (jetty-closer-345-thread-1) [    ] o.a.s.c.Overseer Overseer (id=72722028796313607-127.0.0.1:38774_solr-n_0000000000) closing
   [junit4]   2> 108448 INFO  (zkCallback-336-thread-1) [    ] o.a.s.c.c.ZkStateReader Updated live nodes from ZooKeeper... (3) -> (1)
   [junit4]   1> Done close org.apache.solr.common.util.ExecutorUtil$MDCAwareThreadPoolExecutor@73ff37cb[Terminated, pool size = 0, active threads = 0, queued tasks = 0, completed tasks = 2]
   [junit4]   2> 108450 INFO  (jetty-closer-345-thread-3) [    ] o.a.s.m.SolrMetricManager Closing metric reporters for registry=solr.jetty, tag=null
   [junit4]   2> 108450 INFO  (jetty-closer-345-thread-3) [    ] o.a.s.m.r.SolrJmxReporter Closing reporter [org.apache.solr.metrics.reporters.SolrJmxReporter@28286f8a: rootName = solr_39442, domain = solr.jetty, service url = null, agent id = null] for registry solr.jetty / com.codahale.metrics.MetricRegistry@a6c4c4e
   [junit4]   2> 108451 INFO  (jetty-closer-345-thread-3) [    ] o.a.s.m.SolrMetricManager Closing metric reporters for registry=solr.cluster, tag=null
   [junit4]   2> 108451 INFO  (jetty-closer-345-thread-2) [    ] o.e.j.s.AbstractConnector Stopped ServerConnector@4a51a584{SSL,[ssl, http/1.1]}{127.0.0.1:0}
   [junit4]   2> 108452 INFO  (jetty-closer-345-thread-2) [    ] o.e.j.s.h.ContextHandler Stopped o.e.j.s.ServletContextHandler@459392a0{/solr,null,UNAVAILABLE}
   [junit4]   2> 108452 INFO  (jetty-closer-345-thread-2) [    ] o.e.j.s.session node0 Stopped scavenging
   [junit4]   2> 108452 INFO  (zkCallback-329-thread-1) [    ] o.a.s.c.c.ZkStateReader Updated live nodes from ZooKeeper... (2) -> (1)
   [junit4]   2> 108453 INFO  (zkCallback-329-thread-3) [    ] o.a.s.c.OverseerElectionContext I am going to be the leader 127.0.0.1:39442_solr
   [junit4]   2> 108454 INFO  (jetty-closer-345-thread-1) [    ] o.e.j.s.AbstractConnector Stopped ServerConnector@6559d091{SSL,[ssl, http/1.1]}{127.0.0.1:0}
   [junit4]   2> 108455 INFO  (jetty-closer-345-thread-1) [    ] o.e.j.s.h.ContextHandler Stopped o.e.j.s.ServletContextHandler@47d4dc19{/solr,null,UNAVAILABLE}
   [junit4]   2> 108455 INFO  (jetty-closer-345-thread-1) [    ] o.e.j.s.session node0 Stopped scavenging
   [junit4]   1> Done close org.apache.solr.common.util.ExecutorUtil$MDCAwareThreadPoolExecutor@1a306ec9[Terminated, pool size = 0, active threads = 0, queued tasks = 0, completed tasks = 2]
   [junit4]   1> Done close org.apache.solr.common.util.ExecutorUtil$MDCAwareThreadPoolExecutor@298c3529[Terminated, pool size = 0, active threads = 0, queued tasks = 0, completed tasks = 2]
   [junit4]   2> 108489 INFO  (jetty-closer-345-thread-3) [    ] o.e.j.s.AbstractConnector Stopped ServerConnector@63fb5aa1{SSL,[ssl, http/1.1]}{127.0.0.1:0}
   [junit4]   2> 108489 INFO  (jetty-closer-345-thread-3) [    ] o.e.j.s.h.ContextHandler Stopped o.e.j.s.ServletContextHandler@7a02cdf9{/solr,null,UNAVAILABLE}
   [junit4]   2> 108489 INFO  (jetty-closer-345-thread-3) [    ] o.e.j.s.session node0 Stopped scavenging
   [junit4]   2> 108495 INFO  (TEST-CloudSolrClientTest.testCollectionDoesntExist-seed#[659674499DEA19FB]) [    ] o.a.s.c.ZkTestServer Shutting down ZkTestServer.
   [junit4]   2> 108498 WARN  (ZkTestServer Run Thread) [    ] o.a.s.c.ZkTestServer Watch limit violations: 
   [junit4]   2> Maximum concurrent create/delete watches above limit:
   [junit4]   2> 
   [junit4]   2> 	7	/solr/aliases.json
   [junit4]   2> 	3	/solr/security.json
   [junit4]   2> 
   [junit4]   2> Maximum concurrent data watches above limit:
   [junit4]   2> 
   [junit4]   2> 	7	/solr/clusterstate.json
   [junit4]   2> 	7	/solr/clusterprops.json
   [junit4]   2> 	2	/solr/overseer_elect/election/72722028796313607-127.0.0.1:38774_solr-n_0000000000
   [junit4]   2> 
   [junit4]   2> Maximum concurrent children watches above limit:
   [junit4]   2> 
   [junit4]   2> 	7	/solr/live_nodes
   [junit4]   2> 	7	/solr/collections
   [junit4]   2> 
   [junit4]   2> 108500 INFO  (TEST-CloudSolrClientTest.testCollectionDoesntExist-seed#[659674499DEA19FB]) [    ] o.a.s.c.ZkTestServer parse host and port list: 127.0.0.1:38935
   [junit4]   2> 108500 INFO  (TEST-CloudSolrClientTest.testCollectionDoesntExist-seed#[659674499DEA19FB]) [    ] o.a.s.c.ZkTestServer connecting to 127.0.0.1 38935
   [junit4]   2> 108501 INFO  (TEST-CloudSolrClientTest.testCollectionDoesntExist-seed#[659674499DEA19FB]) [    ] o.a.s.SolrTestCaseJ4 ###Ending testCollectionDoesntExist
   [junit4]   2> 108506 INFO  (TEST-CloudSolrClientTest.preferReplicaTypesTest-seed#[659674499DEA19FB]) [    ] o.a.s.SolrTestCaseJ4 ###Starting preferReplicaTypesTest
   [junit4]   2> 108507 INFO  (TEST-CloudSolrClientTest.preferReplicaTypesTest-seed#[659674499DEA19FB]) [    ] o.a.s.c.MiniSolrCloudCluster Starting cluster of 3 servers in /x1/jenkins/jenkins-slave/workspace/Lucene-Solr-Tests-master/solr/build/solr-solrj/test/J2/temp/solr.client.solrj.impl.CloudSolrClientTest_659674499DEA19FB-001/tempDir-002
   [junit4]   2> 108507 INFO  (TEST-CloudSolrClientTest.preferReplicaTypesTest-seed#[659674499DEA19FB]) [    ] o.a.s.c.ZkTestServer STARTING ZK TEST SERVER
   [junit4]   2> 108507 INFO  (ZkTestServer Run Thread) [    ] o.a.s.c.ZkTestServer client port:0.0.0.0/0.0.0.0:0
   [junit4]   2> 108507 INFO  (ZkTestServer Run Thread) [    ] o.a.s.c.ZkTestServer Starting server
   [junit4]   2> 108607 INFO  (TEST-CloudSolrClientTest.preferReplicaTypesTest-seed#[659674499DEA19FB]) [    ] o.a.s.c.ZkTestServer start zk server on port:37906
   [junit4]   2> 108608 INFO  (TEST-CloudSolrClientTest.preferReplicaTypesTest-seed#[659674499DEA19FB]) [    ] o.a.s.c.ZkTestServer parse host and port list: 127.0.0.1:37906
   [junit4]   2> 108608 INFO  (TEST-CloudSolrClientTest.preferReplicaTypesTest-seed#[659674499DEA19FB]) [    ] o.a.s.c.ZkTestServer connecting to 127.0.0.1 37906
   [junit4]   2> 108617 INFO  (zkConnectionManagerCallback-356-thread-1) [    ] o.a.s.c.c.ConnectionManager zkClient has connected
   [junit4]   2> 108620 INFO  (zkConnectionManagerCallback-358-thread-1) [    ] o.a.s.c.c.ConnectionManager zkClient has connected
   [junit4]   2> 108624 INFO  (zkConnectionManagerCallback-360-thread-1) [    ] o.a.s.c.c.ConnectionManager zkClient has connected
   [junit4]   2> 108630 WARN  (jetty-launcher-361-thread-1) [    ] o.e.j.s.AbstractConnector Ignoring deprecated socket close linger time
   [junit4]   2> 108630 WARN  (jetty-launcher-361-thread-3) [    ] o.e.j.s.AbstractConnector Ignoring deprecated socket close linger time
   [junit4]   2> 108630 INFO  (jetty-launcher-361-thread-1) [    ] o.a.s.c.s.e.JettySolrRunner Start Jetty (original configured port=0)
   [junit4]   2> 108630 INFO  (jetty-launcher-361-thread-1) [    ] o.a.s.c.s.e.JettySolrRunner Trying to start Jetty on port 0 try number 1 ...
   [junit4]   2> 108630 INFO  (jetty-launcher-361-thread-3) [    ] o.a.s.c.s.e.JettySolrRunner Start Jetty (original configured port=0)
   [junit4]   2> 108630 INFO  (jetty-launcher-361-thread-3) [    ] o.a.s.c.s.e.JettySolrRunner Trying to start Jetty on port 0 try number 1 ...
   [junit4]   2> 108630 INFO  (jetty-launcher-361-thread-1) [    ] o.e.j.s.Server jetty-9.4.14.v20181114; built: 2018-11-14T21:20:31.478Z; git: c4550056e785fb5665914545889f21dc136ad9e6; jvm 1.8.0_191-b12
   [junit4]   2> 108630 INFO  (jetty-launcher-361-thread-3) [    ] o.e.j.s.Server jetty-9.4.14.v20181114; built: 2018-11-14T21:20:31.478Z; git: c4550056e785fb5665914545889f21dc136ad9e6; jvm 1.8.0_191-b12
   [junit4]   2> 108632 INFO  (jetty-launcher-361-thread-1) [    ] o.e.j.s.session DefaultSessionIdManager workerName=node0
   [junit4]   2> 108632 INFO  (jetty-launcher-361-thread-1) [    ] o.e.j.s.session No SessionScavenger set, using defaults
   [junit4]   2> 108632 INFO  (jetty-launcher-361-thread-1) [    ] o.e.j.s.session node0 Scavenging every 600000ms
   [junit4]   2> 108632 WARN  (jetty-launcher-361-thread-2) [    ] o.e.j.s.AbstractConnector Ignoring deprecated socket close linger time
   [junit4]   2> 108632 INFO  (jetty-launcher-361-thread-2) [    ] o.a.s.c.s.e.JettySolrRunner Start Jetty (original configured port=0)
   [junit4]   2> 108632 INFO  (jetty-launcher-361-thread-1) [    ] o.e.j.s.h.ContextHandler Started o.e.j.s.ServletContextHandler@721858f0{/solr,null,AVAILABLE}
   [junit4]   2> 108632 INFO  (jetty-launcher-361-thread-2) [    ] o.a.s.c.s.e.JettySolrRunner Trying to start Jetty on port 0 try number 1 ...
   [junit4]   2> 108633 INFO  (jetty-launcher-361-thread-2) [    ] o.e.j.s.Server jetty-9.4.14.v20181114; built: 2018-11-14T21:20:31.478Z; git: c4550056e785fb5665914545889f21dc136ad9e6; jvm 1.8.0_191-b12
   [junit4]   2> 108633 WARN  (jetty-launcher-361-thread-1) [    ] o.e.j.u.s.S.config No Client EndPointIdentificationAlgorithm configured for SslContextFactory@66c4115e[provider=null,keyStore=null,trustStore=null]
   [junit4]   2> 108635 INFO  (jetty-launcher-361-thread-2) [    ] o.e.j.s.session DefaultSessionIdManager workerName=node0
   [junit4]   2> 108635 INFO  (jetty-launcher-361-thread-2) [    ] o.e.j.s.session No SessionScavenger set, using defaults
   [junit4]   2> 108635 INFO  (jetty-launcher-361-thread-2) [    ] o.e.j.s.session node0 Scavenging every 660000ms
   [junit4]   2> 108636 INFO  (jetty-launcher-361-thread-2) [    ] o.e.j.s.h.ContextHandler Started o.e.j.s.ServletContextHandler@77fc4c2{/solr,null,AVAILABLE}
   [junit4]   2> 108636 WARN  (jetty-launcher-361-thread-2) [    ] o.e.j.u.s.S.config No Client EndPointIdentificationAlgorithm configured for SslContextFactory@60f88cc5[provider=null,keyStore=null,trustStore=null]
   [junit4]   2> 108637 INFO  (jetty-launcher-361-thread-1) [    ] o.e.j.s.AbstractConnector Started ServerConnector@e6b4762{SSL,[ssl, http/1.1]}{127.0.0.1:42016}
   [junit4]   2> 108637 INFO  (jetty-launcher-361-thread-1) [    ] o.e.j.s.Server Started @108702ms
   [junit4]   2> 108637 INFO  (jetty-launcher-361-thread-1) [    ] o.a.s.c.s.e.JettySolrRunner Jetty properties: {hostContext=/solr, hostPort=42016}
   [junit4]   2> 108638 ERROR (jetty-launcher-361-thread-1) [    ] o.a.s.u.StartupLoggingUtils Missing Java Option solr.log.dir. Logging may be missing or incomplete.
   [junit4]   2> 108638 INFO  (jetty-launcher-361-thread-1) [    ] o.a.s.s.SolrDispatchFilter Using logger factory org.apache.logging.slf4j.Log4jLoggerFactory
   [junit4]   2> 108638 INFO  (jetty-launcher-361-thread-1) [    ] o.a.s.s.SolrDispatchFilter  ___      _       Welcome to Apache Solr? version 9.0.0
   [junit4]   2> 108638 INFO  (jetty-launcher-361-thread-1) [    ] o.a.s.s.SolrDispatchFilter / __| ___| |_ _   Starting in cloud mode on port null
   [junit4]   2> 108638 INFO  (jetty-launcher-361-thread-1) [    ] o.a.s.s.SolrDispatchFilter \__ \/ _ \ | '_|  Install dir: null
   [junit4]   2> 108638 INFO  (jetty-launcher-361-thread-1) [    ] o.a.s.s.SolrDispatchFilter |___/\___/_|_|    Start time: 2019-02-01T06:48:29.849Z
   [junit4]   2> 108639 INFO  (jetty-launcher-361-thread-3) [    ] o.e.j.s.session DefaultSessionIdManager workerName=node0
   [junit4]   2> 108639 INFO  (jetty-launcher-361-thread-3) [    ] o.e.j.s.session No SessionScavenger set, using defaults
   [junit4]   2> 108639 INFO  (jetty-launcher-361-thread-3) [    ] o.e.j.s.session node0 Scavenging every 660000ms
   [junit4]   2> 108639 INFO  (jetty-launcher-361-thread-2) [    ] o.e.j.s.AbstractConnector Started ServerConnector@69c37da6{SSL,[ssl, http/1.1]}{127.0.0.1:46688}
   [junit4]   2> 108640 INFO  (jetty-launcher-361-thread-2) [    ] o.e.j.s.Server Started @108704ms
   [junit4]   2> 108640 INFO  (jetty-launcher-361-thread-2) [    ] o.a.s.c.s.e.JettySolrRunner Jetty properties: {hostContext=/solr, hostPort=46688}
   [junit4]   2> 108640 ERROR (jetty-launcher-361-thread-2) [    ] o.a.s.u.StartupLoggingUtils Missing Java Option solr.log.dir. Logging may be missing or incomplete.
   [junit4]   2> 108640 INFO  (jetty-launcher-361-thread-2) [    ] o.a.s.s.SolrDispatchFilter Using logger factory org.apache.logging.slf4j.Log4jLoggerFactory
   [junit4]   2> 108640 INFO  (jetty-launcher-361-thread-2) [    ] o.a.s.s.SolrDispatchFilter  ___      _       Welcome to Apache Solr? version 9.0.0
   [junit4]   2> 108640 INFO  (jetty-launcher-361-thread-2) [    ] o.a.s.s.SolrDispatchFilter / __| ___| |_ _   Starting in cloud mode on port null
   [junit4]   2> 108640 INFO  (jetty-launcher-361-thread-2) [    ] o.a.s.s.SolrDispatchFilter \__ \/ _ \ | '_|  Install dir: null
   [junit4]   2> 108640 INFO  (jetty-launcher-361-thread-2) [    ] o.a.s.s.SolrDispatchFilter |___/\___/_|_|    Start time: 2019-02-01T06:48:29.851Z
   [junit4]   2> 108642 INFO  (jetty-launcher-361-thread-3) [    ] o.e.j.s.h.ContextHandler Started o.e.j.s.ServletContextHandler@4d8fa0f9{/solr,null,AVAILABLE}
   [junit4]   2> 108642 WARN  (jetty-launcher-361-thread-3) [    ] o.e.j.u.s.S.config No Client EndPointIdentificationAlgorithm configured for SslContextFactory@5a9ff06c[provider=null,keyStore=null,trustStore=null]
   [junit4]   2> 108643 INFO  (jetty-launcher-361-thread-3) [    ] o.e.j.s.AbstractConnector Started ServerConnector@6976d31{SSL,[ssl, http/1.1]}{127.0.0.1:34000}
   [junit4]   2> 108643 INFO  (jetty-launcher-361-thread-3) [    ] o.e.j.s.Server Started @108707ms
   [junit4]   2> 108643 INFO  (jetty-launcher-361-thread-3) [    ] o.a.s.c.s.e.JettySolrRunner Jetty properties: {hostContext=/solr, hostPort=34000}
   [junit4]   2> 108643 ERROR (jetty-launcher-361-thread-3) [    ] o.a.s.u.StartupLoggingUtils Missing Java Option solr.log.dir. Logging may be missing or incomplete.
   [junit4]   2> 108643 INFO  (jetty-launcher-361-thread-3) [    ] o.a.s.s.SolrDispatchFilter Using logger factory org.apache.logging.slf4j.Log4jLoggerFactory
   [junit4]   2> 108643 INFO  (jetty-launcher-361-thread-3) [    ] o.a.s.s.SolrDispatchFilter  ___      _       Welcome to Apache Solr? version 9.0.0
   [junit4]   2> 108643 INFO  (jetty-launcher-361-thread-3) [    ] o.a.s.s.SolrDispatchFilter / __| ___| |_ _   Starting in cloud mode on port null
   [junit4]   2> 108644 INFO  (jetty-launcher-361-thread-3) [    ] o.a.s.s.SolrDispatchFilter \__ \/ _ \ | '_|  Install dir: null
   [junit4]   2> 108644 INFO  (jetty-launcher-361-thread-3) [    ] o.a.s.s.SolrDispatchFilter |___/\___/_|_|    Start time: 2019-02-01T06:48:29.855Z
   [junit4]   2> 108651 INFO  (zkConnectionManagerCallback-365-thread-1) [    ] o.a.s.c.c.ConnectionManager zkClient has connected
   [junit4]   2> 108651 INFO  (zkConnectionManagerCallback-367-thread-1) [    ] o.a.s.c.c.ConnectionManager zkClient has connected
   [junit4]   2> 108652 INFO  (jetty-launcher-361-thread-2) [    ] o.a.s.s.SolrDispatchFilter solr.xml found in ZooKeeper. Loading...
   [junit4]   2> 108653 INFO  (zkConnectionManagerCallback-363-thread-1) [    ] o.a.s.c.c.ConnectionManager zkClient has connected
   [junit4]   2> 108660 INFO  (jetty-launcher-361-thread-1) [    ] o.a.s.s.SolrDispatchFilter solr.xml found in ZooKeeper. Loading...
   [junit4]   2> 108674 INFO  (jetty-launcher-361-thread-3) [    ] o.a.s.s.SolrDispatchFilter solr.xml found in ZooKeeper. Loading...
   [junit4]   2> 108886 INFO  (jetty-launcher-361-thread-2) [    ] o.a.s.h.c.HttpShardHandlerFactory Host whitelist initialized: WhitelistHostChecker [whitelistHosts=null, whitelistHostCheckingEnabled=true]
   [junit4]   2> 108887 WARN  (jetty-launcher-361-thread-2) [    ] o.a.s.c.s.i.Http2SolrClient Create Http2SolrClient with HTTP/1.1 transport since Java 8 or lower versions does not support SSL + HTTP/2
   [junit4]   2> 108914 WARN  (jetty-launcher-361-thread-2) [    ] o.e.j.u.s.S.config No Client EndPointIdentificationAlgorithm configured for SslContextFactory@3e589620[provider=null,keyStore=null,trustStore=null]
   [junit4]   2> 108926 WARN  (jetty-launcher-361-thread-2) [    ] o.a.s.c.s.i.Http2SolrClient Create Http2SolrClient with HTTP/1.1 transport since Java 8 or lower versions does not support SSL + HTTP/2
   [junit4]   2> 108928 WARN  (jetty-launcher-361-thread-2) [    ] o.e.j.u.s.S.config No Client EndPointIdentificationAlgorithm configured for SslContextFactory@1e1e9cea[provider=null,keyStore=null,trustStore=null]
   [junit4]   2> 108930 INFO  (jetty-launcher-361-thread-2) [    ] o.a.s.c.ZkContainer Zookeeper client=127.0.0.1:37906/solr
   [junit4]   2> 108933 INFO  (zkConnectionManagerCallback-373-thread-1) [    ] o.a.s.c.c.ConnectionManager zkClient has connected
   [junit4]   2> 108938 INFO  (zkConnectionManagerCallback-375-thread-1) [    ] o.a.s.c.c.ConnectionManager zkClient has connected
   [junit4]   2> 108959 WARN  (jetty-launcher-361-thread-2) [n:127.0.0.1:46688_solr    ] o.a.s.c.ZkController The _default configset could not be uploaded. Please provide 'solr.default.confdir' parameter that points to a configset intended to be the default. Current 'solr.default.confdir' value: null
   [junit4]   2> 108970 INFO  (jetty-launcher-361-thread-2) [n:127.0.0.1:46688_solr    ] o.a.s.c.OverseerElectionContext I am going to be the leader 127.0.0.1:46688_solr
   [junit4]   2> 108971 INFO  (jetty-launcher-361-thread-2) [n:127.0.0.1:46688_solr    ] o.a.s.c.Overseer Overseer (id=72722028911001607-127.0.0.1:46688_solr-n_0000000000) starting
   [junit4]   2> 108983 INFO  (zkConnectionManagerCallback-382-thread-1) [    ] o.a.s.c.c.ConnectionManager zkClient has connected
   [junit4]   2> 108987 INFO  (jetty-launcher-361-thread-2) [n:127.0.0.1:46688_solr    ] o.a.s.c.s.i.ZkClientClusterStateProvider Cluster at 127.0.0.1:37906/solr ready
   [junit4]   2> 108989 INFO  (OverseerStateUpdate-72722028911001607-127.0.0.1:46688_solr-n_0000000000) [n:127.0.0.1:46688_solr    ] o.a.s.c.Overseer Starting to work on the main queue : 127.0.0.1:46688_solr
   [junit4]   2> 108997 INFO  (jetty-launcher-361-thread-2) [n:127.0.0.1:46688_solr    ] o.a.s.c.ZkController Register node as live in ZooKeeper:/live_nodes/127.0.0.1:46688_solr
   [junit4]   2> 109011 INFO  (zkCallback-374-thread-1) [    ] o.a.s.c.c.ZkStateReader Updated live nodes from ZooKeeper... (0) -> (1)
   [junit4]   2> 109011 INFO  (zkCallback-381-thread-1) [    ] o.a.s.c.c.ZkStateReader Updated live nodes from ZooKeeper... (0) -> (1)
   [junit4]   2> 109045 INFO  (jetty-launcher-361-thread-1) [    ] o.a.s.h.c.HttpShardHandlerFactory Host whitelist initialized: WhitelistHostChecker [whitelistHosts=null, whitelistHostCheckingEnabled=true]
   [junit4]   2> 109046 WARN  (jetty-launcher-361-thread-1) [    ] o.a.s.c.s.i.Http2SolrClient Create Http2SolrClient with HTTP/1.1 transport since Java 8 or lower versions does not support SSL + HTTP/2
   [junit4]   2> 109063 WARN  (jetty-launcher-361-thread-1) [    ] o.e.j.u.s.S.config No Client EndPointIdentificationAlgorithm configured for SslContextFactory@384cd292[provider=null,keyStore=null,trustStore=null]
   [junit4]   2> 109067 INFO  (jetty-launcher-361-thread-2) [n:127.0.0.1:46688_solr    ] o.a.s.h.a.MetricsHistoryHandler No .system collection, keeping metrics history in memory.
   [junit4]   2> 109070 WARN  (jetty-launcher-361-thread-1) [    ] o.a.s.c.s.i.Http2SolrClient Create Http2SolrClient with HTTP/1.1 transport since Java 8 or lower versions does not support SSL + HTTP/2
   [junit4]   2> 109072 WARN  (jetty-launcher-361-thread-1) [    ] o.e.j.u.s.S.config No Client EndPointIdentificationAlgorithm configured for SslContextFactory@1808894c[provider=null,keyStore=null,trustStore=null]
   [junit4]   2> 109073 INFO  (jetty-launcher-361-thread-1) [    ] o.a.s.c.ZkContainer Zookeeper client=127.0.0.1:37906/solr
   [junit4]   2> 109085 INFO  (zkConnectionManagerCallback-389-thread-1) [    ] o.a.s.c.c.ConnectionManager zkClient has connected
   [junit4]   2> 109118 INFO  (zkConnectionManagerCallback-391-thread-1) [    ] o.a.s.c.c.ConnectionManager zkClient has connected
   [junit4]   2> 109128 WARN  (jetty-launcher-361-thread-1) [n:127.0.0.1:42016_solr    ] o.a.s.c.ZkController The _default configset could not be uploaded. Please provide 'solr.default.confdir' parameter that points to a configset intended to be the default. Current 'solr.default.confdir' value: null
   [junit4]   2> 109131 INFO  (jetty-launcher-361-thread-1) [n:127.0.0.1:42016_solr    ] o.a.s.c.c.ZkStateReader Updated live nodes from ZooKeeper... (0) -> (1)
   [junit4]   2> 109138 INFO  (jetty-launcher-361-thread-1) [n:127.0.0.1:42016_solr    ] o.a.s.c.ZkController Publish node=127.0.0.1:42016_solr as DOWN
   [junit4]   2> 109140 INFO  (jetty-launcher-361-thread-1) [n:127.0.0.1:42016_solr    ] o.a.s.c.TransientSolrCoreCacheDefault Allocating transient cache for 2147483647 transient cores
   [junit4]   2> 109140 INFO  (jetty-launcher-361-thread-1) [n:127.0.0.1:42016_solr    ] o.a.s.c.ZkController Register node as live in ZooKeeper:/live_nodes/127.0.0.1:42016_solr
   [junit4]   2> 109143 INFO  (zkCallback-374-thread-1) [    ] o.a.s.c.c.ZkStateReader Updated live nodes from ZooKeeper... (1) -> (2)
   [junit4]   2> 109178 INFO  (zkCallback-381-thread-1) [    ] o.a.s.c.c.ZkStateReader Updated live nodes from ZooKeeper... (1) -> (2)
   [junit4]   2> 109178 INFO  (zkCallback-390-thread-1) [    ] o.a.s.c.c.ZkStateReader Updated live nodes from ZooKeeper... (1) -> (2)
   [junit4]   2> 109189 INFO  (jetty-launcher-361-thread-2) [n:127.0.0.1:46688_solr    ] o.a.s.m.r.SolrJmxReporter JMX monitoring for 'solr_46688.solr.node' (registry 'solr.node') enabled at server: com.sun.jmx.mbeanserver.JmxMBeanServer@216a2c7f
   [junit4]   2> 109208 INFO  (jetty-launcher-361-thread-2) [n:127.0.0.1:46688_solr    ] o.a.s.m.r.SolrJmxReporter JMX monitoring for 'solr_46688.solr.jvm' (registry 'solr.jvm') enabled at server: com.sun.jmx.mbeanserver.JmxMBeanServer@216a2c7f
   [junit4]   2> 109216 INFO  (jetty-launcher-361-thread-2) [n:127.0.0.1:46688_solr    ] o.a.s.m.r.SolrJmxReporter JMX monitoring for 'solr_46688.solr.jetty' (registry 'solr.jetty') enabled at server: com.sun.jmx.mbeanserver.JmxMBeanServer@216a2c7f
   [junit4]   2> 109218 INFO  (jetty-launcher-361-thread-3) [    ] o.a.s.h.c.HttpShardHandlerFactory Host whitelist initialized: WhitelistHostChecker [whitelistHosts=null, whitelistHostCheckingEnabled=true]
   [junit4]   2> 109218 INFO  (jetty-launcher-361-thread-2) [n:127.0.0.1:46688_solr    ] o.a.s.c.CorePropertiesLocator Found 0 core definitions underneath /x1/jenkins/jenkins-slave/workspace/Lucene-Solr-Tests-master/solr/build/solr-solrj/test/J2/temp/solr.client.solrj.impl.CloudSolrClientTest_659674499DEA19FB-001/tempDir-002/node2/.
   [junit4]   2> 109219 WARN  (jetty-launcher-361-thread-3) [    ] o.a.s.c.s.i.Http2SolrClient Create Http2SolrClient with HTTP/1.1 transport since Java 8 or lower versions does not support SSL + HTTP/2
   [junit4]   2> 109226 WARN  (jetty-launcher-361-thread-3) [    ] o.e.j.u.s.S.config No Client EndPointIdentificationAlgorithm configured for SslContextFactory@1b3c23d6[provider=null,keyStore=null,trustStore=null]
   [junit4]   2> 109230 INFO  (zkConnectionManagerCallback-398-thread-1) [    ] o.a.s.c.c.ConnectionManager zkClient has connected
   [junit4]   2> 109231 WARN  (jetty-launcher-361-thread-3) [    ] o.a.s.c.s.i.Http2SolrClient Create Http2SolrClient with HTTP/1.1 transport since Java 8 or lower versions does not support SSL + HTTP/2
   [junit4]   2> 109233 WARN  (jetty-launcher-361-thread-3) [    ] o.e.j.u.s.S.config No Client EndPointIdentificationAlgorithm configured for SslContextFactory@62a79eb5[provider=null,keyStore=null,trustStore=null]
   [junit4]   2> 109239 INFO  (jetty-launcher-361-thread-3) [    ] o.a.s.c.ZkContainer Zookeeper client=127.0.0.1:37906/solr
   [junit4]   2> 109243 INFO  (jetty-launcher-361-thread-1) [n:127.0.0.1:42016_solr    ] o.a.s.c.c.ZkStateReader Updated live nodes from ZooKeeper... (0) -> (2)
   [junit4]   2> 109245 INFO  (jetty-launcher-361-thread-1) [n:127.0.0.1:42016_solr    ] o.a.s.c.s.i.ZkClientClusterStateProvider Cluster at 127.0.0.1:37906/solr ready
   [junit4]   2> 109250 INFO  (jetty-launcher-361-thread-1) [n:127.0.0.1:42016_solr    ] o.a.s.h.a.MetricsHistoryHandler No .system collection, keeping metrics history in memory.
   [junit4]   2> 109250 INFO  (zkConnectionManagerCallback-404-thread-1) [    ] o.a.s.c.c.ConnectionManager zkClient has connected
   [junit4]   2> 109290 INFO  (zkConnectionManagerCallback-407-thread-1) [    ] o.a.s.c.c.ConnectionManager zkClient has connected
   [junit4]   2> 109297 WARN  (jetty-launcher-361-thread-3) [n:127.0.0.1:34000_solr    ] o.a.s.c.ZkController The _default configset could not be uploaded. Please provide 'solr.default.confdir' parameter that points to a configset intended to be the default. Current 'solr.default.confdir' value: null
   [junit4]   2> 109298 INFO  (jetty-launcher-361-thread-3) [n:127.0.0.1:34000_solr    ] o.a.s.c.c.ZkStateReader Updated live nodes from ZooKeeper... (0) -> (2)
   [junit4]   2> 109303 INFO  (jetty-launcher-361-thread-3) [n:127.0.0.1:34000_solr    ] o.a.s.c.ZkController Publish node=127.0.0.1:34000_solr as DOWN
   [junit4]   2> 109304 INFO  (jetty-launcher-361-thread-3) [n:127.0.0.1:34000_solr    ] o.a.s.c.TransientSolrCoreCacheDefault Allocating transient cache for 2147483647 transient cores
   [junit4]   2> 109305 INFO  (jetty-launcher-361-thread-3) [n:127.0.0.1:34000_solr    ] o.a.s.c.ZkController Register node as live in ZooKeeper:/live_nodes/127.0.0.1:34000_solr
   [junit4]   2> 109307 INFO  (zkCallback-381-thread-1) [    ] o.a.s.c.c.ZkStateReader Updated live nodes from ZooKeeper... (2) -> (3)
   [junit4]   2> 109307 INFO  (zkCallback-374-thread-1) [    ] o.a.s.c.c.ZkStateReader Updated live nodes from ZooKeeper... (2) -> (3)
   [junit4]   2> 109310 INFO  (jetty-launcher-361-thread-1) [n:127.0.0.1:42016_solr    ] o.a.s.m.r.SolrJmxReporter JMX monitoring for 'solr_42016.solr.node' (registry 'solr.node') enabled at server: com.sun.jmx.mbeanserver.JmxMBeanServer@216a2c7f
   [junit4]   2> 109324 INFO  (jetty-launcher-361-thread-1) [n:127.0.0.1:42016_solr    ] o.a.s.m.r.SolrJmxReporter JMX monitoring for 'solr_42016.solr.jvm' (registry 'solr.jvm') enabled at server: com.sun.jmx.mbeanserver.JmxMBeanServer@216a2c7f
   [junit4]   2> 109324 INFO  (jetty-launcher-361-thread-1) [n:127.0.0.1:42016_solr    ] o.a.s.m.r.SolrJmxReporter JMX monitoring for 'solr_42016.solr.jetty' (registry 'solr.jetty') enabled at server: com.sun.jmx.mbeanserver.JmxMBeanServer@216a2c7f
   [junit4]   2> 109326 INFO  (zkCallback-390-thread-1) [    ] o.a.s.c.c.ZkStateReader Updated live nodes from ZooKeeper... (2) -> (3)
   [junit4]   2> 109327 INFO  (jetty-launcher-361-thread-1) [n:127.0.0.1:42016_solr    ] o.a.s.c.CorePropertiesLocator Found 0 core definitions underneath /x1/jenkins/jenkins-slave/workspace/Lucene-Solr-Tests-master/solr/build/solr-solrj/test/J2/temp/solr.client.solrj.impl.CloudSolrClientTest_659674499DEA19FB-001/tempDir-002/node1/.
   [junit4]   2> 109327 INFO  (zkCallback-406-thread-1) [    ] o.a.s.c.c.ZkStateReader Updated live nodes from ZooKeeper... (2) -> (3)
   [junit4]   2> 109328 INFO  (zkCallback-397-thread-1) [    ] o.a.s.c.c.ZkStateReader Updated live nodes from ZooKeeper... (2) -> (3)
   [junit4]   2> 109354 INFO  (zkConnectionManagerCallback-414-thread-1) [    ] o.a.s.c.c.ConnectionManager zkClient has connected
   [junit4]   2> 109356 INFO  (jetty-launcher-361-thread-3) [n:127.0.0.1:34000_solr    ] o.a.s.c.c.ZkStateReader Updated live nodes from ZooKeeper... (0) -> (3)
   [junit4]   2> 109357 INFO  (jetty-launcher-361-thread-3) [n:127.0.0.1:34000_solr    ] o.a.s.c.s.i.ZkClientClusterStateProvider Cluster at 127.0.0.1:37906/solr ready
   [junit4]   2> 109374 INFO  (jetty-launcher-361-thread-3) [n:127.0.0.1:34000_solr    ] o.a.s.h.a.MetricsHistoryHandler No .system collection, keeping metrics history in memory.
   [junit4]   2> 109466 INFO  (jetty-launcher-361-thread-3) [n:127.0.0.1:34000_solr    ] o.a.s.m.r.SolrJmxReporter JMX monitoring for 'solr_34000.solr.node' (registry 'solr.node') enabled at server: com.sun.jmx.mbeanserver.JmxMBeanServer@216a2c7f
   [junit4]   2> 109489 INFO  (jetty-launcher-361-thread-3) [n:127.0.0.1:34000_solr    ] o.a.s.m.r.SolrJmxReporter JMX monitoring for 'solr_34000.solr.jvm' (registry 'solr.jvm') enabled at server: com.sun.jmx.mbeanserver.JmxMBeanServer@216a2c7f
   [junit4]   2> 109489 INFO  (jetty-launcher-361-thread-3) [n:127.0.0.1:34000_solr    ] o.a.s.m.r.SolrJmxReporter JMX monitoring for 'solr_34000.solr.jetty' (registry 'solr.jetty') enabled at server: com.sun.jmx.mbeanserver.JmxMBeanServer@216a2c7f
   [junit4]   2> 109491 INFO  (jetty-launcher-361-thread-3) [n:127.0.0.1:34000_solr    ] o.a.s.c.CorePropertiesLocator Found 0 core definitions underneath /x1/jenkins/jenkins-slave/workspace/Lucene-Solr-Tests-master/solr/build/solr-solrj/test/J2/temp/solr.client.solrj.impl.CloudSolrClientTest_659674499DEA19FB-001/tempDir-002/node3/.
   [junit4]   2> 109560 INFO  (zkConnectionManagerCallback-420-thread-1) [    ] o.a.s.c.c.ConnectionManager zkClient has connected
   [junit4]   2> 109562 INFO  (TEST-CloudSolrClientTest.preferReplicaTypesTest-seed#[659674499DEA19FB]) [    ] o.a.s.c.c.ZkStateReader Updated live nodes from ZooKeeper... (0) -> (3)
   [junit4]   2> 109564 INFO  (TEST-CloudSolrClientTest.preferReplicaTypesTest-seed#[659674499DEA19FB]) [    ] o.a.s.c.s.i.ZkClientClusterStateProvider Cluster at 127.0.0.1:37906/solr ready
   [junit4]   2> 109604 INFO  (qtp590888771-979) [n:127.0.0.1:46688_solr    ] o.a.s.h.a.CollectionsHandler Invoked Collection Action :clusterstatus with params action=CLUSTERSTATUS&wt=javabin&version=2 and sendToOCPQueue=true
   [junit4]   2> 109606 INFO  (qtp590888771-979) [n:127.0.0.1:46688_solr    ] o.a.s.s.HttpSolrCall [admin] webapp=null path=/admin/collections params={action=CLUSTERSTATUS&wt=javabin&version=2} status=0 QTime=2
   [junit4]   2> 109812 INFO  (qtp590888771-979) [n:127.0.0.1:46688_solr    ] o.a.s.h.a.CollectionsHandler Invoked Collection Action :create with params pullReplicas=1&async=6e10cb44-2e30-494e-9891-024278b7b7f8&collection.configName=conf&maxShardsPerNode=3&name=replicaTypesTestColl&nrtReplicas=1&action=CREATE&numShards=3&tlogReplicas=1&wt=javabin&version=2 and sendToOCPQueue=true
   [junit4]   2> 109821 INFO  (qtp590888771-979) [n:127.0.0.1:46688_solr    ] o.a.s.s.HttpSolrCall [admin] webapp=null path=/admin/collections params={pullReplicas=1&async=6e10cb44-2e30-494e-9891-024278b7b7f8&collection.configName=conf&maxShardsPerNode=3&name=replicaTypesTestColl&nrtReplicas=1&action=CREATE&numShards=3&tlogReplicas=1&wt=javabin&version=2} status=0 QTime=9
   [junit4]   2> 109826 INFO  (qtp590888771-980) [n:127.0.0.1:46688_solr    ] o.a.s.h.a.CollectionsHandler Invoked Collection Action :requeststatus with params requestid=6e10cb44-2e30-494e-9891-024278b7b7f8&action=REQUESTSTATUS&wt=javabin&version=2 and sendToOCPQueue=true
   [junit4]   2> 109830 INFO  (qtp590888771-980) [n:127.0.0.1:46688_solr    ] o.a.s.s.HttpSolrCall [admin] webapp=null path=/admin/collections params={requestid=6e10cb44-2e30-494e-9891-024278b7b7f8&action=REQUESTSTATUS&wt=javabin&version=2} status=0 QTime=3
   [junit4]   2> 109836 INFO  (OverseerThreadFactory-167-thread-1-processing-n:127.0.0.1:46688_solr) [n:127.0.0.1:46688_solr    ] o.a.s.c.a.c.CreateCollectionCmd Create collection replicaTypesTestColl
   [junit4]   2> 109978 INFO  (qtp590888771-979) [n:127.0.0.1:46688_solr    ] o.a.s.s.HttpSolrCall [admin] webapp=null path=/admin/metrics params={prefix=CONTAINER.fs.usableSpace,CONTAINER.fs.totalSpace,CORE.coreName&wt=javabin&version=2&group=solr.node,solr.core} status=0 QTime=1
   [junit4]   2> 109982 INFO  (qtp590888771-980) [n:127.0.0.1:46688_solr    ] o.a.s.s.HttpSolrCall [admin] webapp=null path=/admin/metrics params={prefix=CONTAINER.fs.usableSpace,CONTAINER.fs.totalSpace,CORE.coreName&wt=javabin&version=2&group=solr.node,solr.core} status=0 QTime=1
   [junit4]   2> 109986 INFO  (qtp590888771-980) [n:127.0.0.1:46688_solr    ] o.a.s.s.HttpSolrCall [admin] webapp=null path=/admin/metrics params={prefix=CONTAINER.fs.usableSpace,CONTAINER.fs.totalSpace,CORE.coreName&wt=javabin&version=2&group=solr.node,solr.core} status=0 QTime=1
   [junit4]   2> 109990 INFO  (qtp590888771-981) [n:127.0.0.1:46688_solr    ] o.a.s.s.HttpSolrCall [admin] webapp=null path=/admin/metrics params={prefix=CONTAINER.fs.usableSpace,CONTAINER.fs.totalSpace,CORE.coreName&wt=javabin&version=2&group=solr.node,solr.core} status=0 QTime=1
   [junit4]   2> 109994 INFO  (qtp590888771-982) [n:127.0.0.1:46688_solr    ] o.a.s.s.HttpSolrCall [admin] webapp=null path=/admin/metrics params={prefix=CONTAINER.fs.usableSpace,CONTAINER.fs.totalSpace,CORE.coreName&wt=javabin&version=2&group=solr.node,solr.core} status=0 QTime=0
   [junit4]   2> 110052 INFO  (qtp1043846631-985) [n:127.0.0.1:34000_solr    ] o.a.s.s.HttpSolrCall [admin] webapp=null path=/admin/metrics params={prefix=CONTAINER.fs.usableSpace,CONTAINER.fs.totalSpace,CORE.coreName&wt=javabin&version=2&group=solr.node,solr.core} status=0 QTime=2
   [junit4]   2> 110069 INFO  (qtp1043846631-986) [n:127.0.0.1:34000_solr    ] o.a.s.s.HttpSolrCall [admin] webapp=null path=/admin/metrics params={prefix=CONTAINER.fs.usableSpace,CONTAINER.fs.totalSpace,CORE.coreName&wt=javabin&version=2&group=solr.node,solr.core} status=0 QTime=1
   [junit4]   2> 110073 INFO  (qtp1043846631-976) [n:127.0.0.1:34000_solr    ] o.a.s.s.HttpSolrCall [admin] webapp=null path=/admin/metrics params={prefix=CONTAINER.fs.usableSpace,CONTAINER.fs.totalSpace,CORE.coreName&wt=javabin&version=2&group=solr.node,solr.core} status=0 QTime=1
   [junit4]   2> 110078 INFO  (qtp1043846631-974) [n:127.0.0.1:34000_solr    ] o.a.s.s.HttpSolrCall [admin] webapp=null path=/admin/metrics params={prefix=CONTAINER.fs.usableSpace,CONTAINER.fs.totalSpace,CORE.coreName&wt=javabin&version=2&group=solr.node,solr.core} status=0 QTime=1
   [junit4]   2> 110084 INFO  (qtp1043846631-984) [n:127.0.0.1:34000_solr    ] o.a.s.s.HttpSolrCall [admin] webapp=null path=/admin/metrics params={prefix=CONTAINER.fs.usableSpace,CONTAINER.fs.totalSpace,CORE.coreName&wt=javabin&version=2&group=solr.node,solr.core} status=0 QTime=1
   [junit4]   2> 110150 INFO  (qtp483452933-966) [n:127.0.0.1:42016_solr    ] o.a.s.s.HttpSolrCall [admin] webapp=null path=/admin/metrics params={prefix=CONTAINER.fs.usableSpace,CONTAINER.fs.totalSpace,CORE.coreName&wt=javabin&version=2&group=solr.node,solr.core} status=0 QTime=1
   [junit4]   2> 110190 INFO  (qtp483452933-966) [n:127.0.0.1:42016_solr    ] o.a.s.s.HttpSolrCall [admin] webapp=null path=/admin/metrics params={prefix=CONTAINER.fs.usableSpace,CONTAINER.fs.totalSpace,CORE.coreName&wt=javabin&version=2&group=solr.node,solr.core} status=0 QTime=38
   [junit4]   2> 110194 INFO  (qtp483452933-966) [n:127.0.0.1:42016_solr    ] o.a.s.s.HttpSolrCall [admin] webapp=null path=/admin/metrics params={prefix=CONTAINER.fs.usableSpace,CONTAINER.fs.totalSpace,CORE.coreName&wt=javabin&version=2&group=solr.node,solr.core} status=0 QTime=1
   [junit4]   2> 110218 INFO  (qtp483452933-966) [n:127.0.0.1:42016_solr    ] o.a.s.s.HttpSolrCall [admin] webapp=null path=/admin/metrics params={prefix=CONTAINER.fs.usableSpace,CONTAINER.fs.totalSpace,CORE.coreName&wt=javabin&version=2&group=solr.node,solr.core} status=0 QTime=15
   [junit4]   2> 110229 INFO  (qtp483452933-966) [n:127.0.0.1:42016_solr    ] o.a.s.s.HttpSolrCall [admin] webapp=null path=/admin/metrics params={prefix=CONTAINER.fs.usableSpace,CONTAINER.fs.totalSpace,CORE.coreName&wt=javabin&version=2&group=solr.node,solr.core} status=0 QTime=1
   [junit4]   2> 110263 INFO  (OverseerStateUpdate-72722028911001607-127.0.0.1:46688_solr-n_0000000000) [n:127.0.0.1:46688_solr    ] o.a.s.c.o.SliceMutator createReplica() {
   [junit4]   2>   "operation":"ADDREPLICA",
   [junit4]   2>   "collection":"replicaTypesTestColl",
   [junit4]   2>   "shard":"shard1",
   [junit4]   2>   "core":"replicaTypesTestColl_shard1_replica_n1",
   [junit4]   2>   "state":"down",
   [junit4]   2>   "base_url":"https://127.0.0.1:42016/solr",
   [junit4]   2>   "type":"NRT",
   [junit4]   2>   "waitForFinalState":"false"} 
   [junit4]   2> 110283 INFO  (OverseerStateUpdate-72722028911001607-127.0.0.1:46688_solr-n_0000000000) [n:127.0.0.1:46688_solr    ] o.a.s.c.o.SliceMutator createReplica() {
   [junit4]   2>   "operation":"ADDREPLICA",
   [junit4]   2>   "collection":"replicaTypesTestColl",
   [junit4]   2>   "shard":"shard1",
   [junit4]   2>   "core":"replicaTypesTestColl_shard1_replica_t3",
   [junit4]   2>   "state":"down",
   [junit4]   2>   "base_url":"https://127.0.0.1:34000/solr",
   [junit4]   2>   "type":"TLOG",
   [junit4]   2>   "waitForFinalState":"false"} 
   [junit4]   2> 110291 INFO  (OverseerStateUpdate-72722028911001607-127.0.0.1:46688_solr-n_0000000000) [n:127.0.0.1:46688_solr    ] o.a.s.c.o.SliceMutator createReplica() {
   [junit4]   2>   "operation":"ADDREPLICA",
   [junit4]   2>   "collection":"replicaTypesTestColl",
   [junit4]   2>   "shard":"shard1",
   [junit4]   2>   "core":"replicaTypesTestColl_shard1_replica_p5",
   [junit4]   2>   "state":"down",
   [junit4]   2>   "base_url":"https://127.0.0.1:46688/solr",
   [junit4]   2>   "type":"PULL",
   [junit4]   2>   "waitForFinalState":"false"} 
   [junit4]   2> 110296 INFO  (OverseerStateUpdate-72722028911001607-127.0.0.1:46688_solr-n_0000000000) [n:127.0.0.1:46688_solr    ] o.a.s.c.o.SliceMutator createReplica() {
   [junit4]   2>   "operation":"ADDREPLICA",
   [junit4]   2>   "collection":"replicaTypesTestColl",
   [junit4]   2>   "shard":"shard2",
   [junit4]   2>   "core":"replicaTypesTestColl_shard2_replica_n7",
   [junit4]   2>   "state":"down",
   [junit4]   2>   "base_url":"https://127.0.0.1:46688/solr",
   [junit4]   2>   "type":"NRT",
   [junit4]   2>   "waitForFinalState":"false"} 
   [junit4]   2> 110308 INFO  (OverseerStateUpdate-72722028911001607-127.0.0.1:46688_solr-n_0000000000) [n:127.0.0.1:46688_solr    ] o.a.s.c.o.SliceMutator createReplica() {
   [junit4]   2>   "operation":"ADDREPLICA",
   [junit4]   2>   "collection":"replicaTypesTestColl",
   [junit4]   2>   "shard":"shard2",
   [junit4]   2>   "core":"replicaTypesTestColl_shard2_replica_t9",
   [junit4]   2>   "state":"down",
   [junit4]   2>   "base_url":"https://127.0.0.1:34000/solr",
   [junit4]   2>   "type":"TLOG",
   [junit4]   2>   "waitForFinalState":"false"} 
   [junit4]   2> 110316 INFO  (OverseerStateUpdate-72722028911001607-127.0.0.1:46688_solr-n_0000000000) [n:127.0.0.1:46688_solr    ] o.a.s.c.o.SliceMutator createReplica() {
   [junit4]   2>   "operation":"ADDREPLICA",
   [junit4]   2>   "collection":"replicaTypesTestColl",
   [junit4]   2>   "shard":"shard2",
   [junit4]   2>   "core":"replicaTypesTestColl_shard2_replica_p11",
   [junit4]   2>   "state":"down",
   [junit4]   2>   "base_url":"https://127.0.0.1:42016/solr",
   [junit4]   2>   "type":"PULL",
   [junit4]   2>   "waitForFinalState":"false"} 
   [junit4]   2> 110334 INFO  (OverseerStateUpdate-72722028911001607-127.0.0.1:46688_solr-n_0000000000) [n:127.0.0.1:46688_solr    ] o.a.s.c.o.SliceMutator createReplica() {
   [junit4]   2>   "operation":"ADDREPLICA",
   [junit4]   2>   "collection":"replicaTypesTestColl",
   [junit4]   2>   "shard":"shard3",
   [junit4]   2>   "core":"replicaTypesTestColl_shard3_replica_n13",
   [junit4]   2>   "state":"down",
   [junit4]   2>   "base_url":"https://127.0.0.1:42016/solr",
   [junit4]   2>   "type":"NRT",
   [junit4]   2>   "waitForFinalState":"false"} 
   [junit4]   2> 110339 INFO  (OverseerStateUpdate-72722028911001607-127.0.0.1:46688_solr-n_0000000000) [n:127.0.0.1:46688_solr    ] o.a.s.c.o.SliceMutator createReplica() {
   [junit4]   2>   "operation":"ADDREPLICA",
   [junit4]   2>   "collection":"replicaTypesTestColl",
   [junit4]   2>   "shard":"shard3",
   [junit4]   2>   "core":"replicaTypesTestColl_shard3_replica_t14",
   [junit4]   2>   "state":"down",
   [junit4]   2>   "base_url":"https://127.0.0.1:34000/solr",
   [junit4]   2>   "type":"TLOG",
   [junit4]   2>   "waitForFinalState":"false"} 
   [junit4]   2> 110350 INFO  (OverseerStateUpdate-72722028911001607-127.0.0.1:46688_solr-n_0000000000) [n:127.0.0.1:46688_solr    ] o.a.s.c.o.SliceMutator createReplica() {
   [junit4]   2>   "operation":"ADDREPLICA",
   [junit4]   2>   "collection":"replicaTypesTestColl",
   [junit4]   2>   "shard":"shard3",
   [junit4]   2>   "core":"replicaTypesTestColl_shard3_replica_p16",
   [junit4]   2>   "state":"down",
   [junit4]   2>   "base_url":"https://127.0.0.1:46688/solr",
   [junit4]   2>   "type":"PULL",
   [junit4]   2>   "waitForFinalState":"false"} 
   [junit4]   2> 110638 INFO  (qtp1043846631-984) [n:127.0.0.1:34000_solr    x:replicaTypesTestColl_shard2_replica_t9] o.a.s.s.HttpSolrCall [admin] webapp=null path=/admin/cores params={qt=/admin/cores&collection.configName=conf&newCollection=true&collection=replicaTypesTestColl&version=2&replicaType=TLOG&async=6e10cb44-2e30-494e-9891-024278b7b7f810138473370368410&coreNodeName=core_node10&name=replicaTypesTestColl_shard2_replica_t9&action=CREATE&numShards=3&shard=shard2&wt=javabin} status=0 QTime=11
   [junit4]   2> 110650 INFO  (qtp590888771-982) [n:127.0.0.1:46688_solr    x:replicaTypesTestColl_shard1_replica_p5] o.a.s.s.HttpSolrCall [admin] webapp=null path=/admin/cores params={qt=/admin/cores&collection.configName=conf&newCollection=true&collection=replicaTypesTestColl&version=2&replicaType=PULL&async=6e10cb44-2e30-494e-9891-024278b7b7f810138473352385438&coreNodeName=core_node6&name=replicaTypesTestColl_shard1_replica_p5&action=CREATE&numShards=3&shard=shard1&wt=javabin} status=0 QTime=19
   [junit4]   2> 110650 INFO  (parallelCoreAdminExecutor-182-thread-1-processing-n:127.0.0.1:34000_solr x:replicaTypesTestColl_shard2_replica_t9 6e10cb44-2e30-494e-9891-024278b7b7f810138473370368410 CREATE) [n:127.0.0.1:34000_solr    x:replicaTypesTestColl_shard2_replica_t9] o.a.s.h.a.CoreAdminOperation core create command qt=/admin/cores&collection.configName=conf&newCollection=true&collection=replicaTypesTestColl&version=2&replicaType=TLOG&async=6e10cb44-2e30-494e-9891-024278b7b7f810138473370368410&coreNodeName=core_node10&name=replicaTypesTestColl_shard2_replica_t9&action=CREATE&numShards=3&shard=shard2&wt=javabin
   [junit4]   2> 110651 INFO  (parallelCoreAdminExecutor-171-thread-1-processing-n:127.0.0.1:46688_solr x:replicaTypesTestColl_shard1_replica_p5 6e10cb44-2e30-494e-9891-024278b7b7f810138473352385438 CREATE) [n:127.0.0.1:46688_solr    x:replicaTypesTestColl_shard1_replica_p5] o.a.s.h.a.CoreAdminOperation core create command qt=/admin/cores&collection.configName=conf&newCollection=true&collection=replicaTypesTestColl&version=2&replicaType=PULL&async=6e10cb44-2e30-494e-9891-024278b7b7f810138473352385438&coreNodeName=core_node6&name=replicaTypesTestColl_shard1_replica_p5&action=CREATE&numShards=3&shard=shard1&wt=javabin
   [junit4]   2> 110654 INFO  (parallelCoreAdminExecutor-171-thread-1-processing-n:127.0.0.1:46688_solr x:replicaTypesTestColl_shard1_replica_p5 6e

[...truncated too long message...]

wed-ivy-version:

ivy-fail:

ivy-fail:

ivy-configure:
[ivy:configure] :: loading settings :: file = /x1/jenkins/jenkins-slave/workspace/Lucene-Solr-Tests-master/lucene/top-level-ivy-settings.xml

resolve:

ivy-availability-check:
[loadresource] Do not set property disallowed.ivy.jars.list as its length is 0.

-ivy-fail-disallowed-ivy-version:

ivy-fail:

ivy-configure:
[ivy:configure] :: loading settings :: file = /x1/jenkins/jenkins-slave/workspace/Lucene-Solr-Tests-master/lucene/top-level-ivy-settings.xml

resolve:

ivy-availability-check:
[loadresource] Do not set property disallowed.ivy.jars.list as its length is 0.

-ivy-fail-disallowed-ivy-version:

ivy-fail:

ivy-fail:

ivy-configure:
[ivy:configure] :: loading settings :: file = /x1/jenkins/jenkins-slave/workspace/Lucene-Solr-Tests-master/lucene/top-level-ivy-settings.xml

resolve:

ivy-availability-check:
[loadresource] Do not set property disallowed.ivy.jars.list as its length is 0.

-ivy-fail-disallowed-ivy-version:

ivy-fail:

ivy-configure:
[ivy:configure] :: loading settings :: file = /x1/jenkins/jenkins-slave/workspace/Lucene-Solr-Tests-master/lucene/top-level-ivy-settings.xml

resolve:

ivy-availability-check:
[loadresource] Do not set property disallowed.ivy.jars.list as its length is 0.

-ivy-fail-disallowed-ivy-version:

ivy-fail:

ivy-fail:

ivy-configure:
[ivy:configure] :: loading settings :: file = /x1/jenkins/jenkins-slave/workspace/Lucene-Solr-Tests-master/lucene/top-level-ivy-settings.xml

resolve:

ivy-availability-check:
[loadresource] Do not set property disallowed.ivy.jars.list as its length is 0.

-ivy-fail-disallowed-ivy-version:

ivy-fail:

ivy-fail:

ivy-configure:
[ivy:configure] :: loading settings :: file = /x1/jenkins/jenkins-slave/workspace/Lucene-Solr-Tests-master/lucene/top-level-ivy-settings.xml

resolve:

ivy-availability-check:
[loadresource] Do not set property disallowed.ivy.jars.list as its length is 0.

-ivy-fail-disallowed-ivy-version:

ivy-fail:

ivy-fail:

ivy-configure:
[ivy:configure] :: loading settings :: file = /x1/jenkins/jenkins-slave/workspace/Lucene-Solr-Tests-master/lucene/top-level-ivy-settings.xml

resolve:

ivy-availability-check:
[loadresource] Do not set property disallowed.ivy.jars.list as its length is 0.

-ivy-fail-disallowed-ivy-version:

ivy-fail:

ivy-fail:

ivy-configure:
[ivy:configure] :: loading settings :: file = /x1/jenkins/jenkins-slave/workspace/Lucene-Solr-Tests-master/lucene/top-level-ivy-settings.xml

resolve:

ivy-availability-check:
[loadresource] Do not set property disallowed.ivy.jars.list as its length is 0.

-ivy-fail-disallowed-ivy-version:

ivy-fail:

ivy-fail:

ivy-configure:
[ivy:configure] :: loading settings :: file = /x1/jenkins/jenkins-slave/workspace/Lucene-Solr-Tests-master/lucene/top-level-ivy-settings.xml

resolve:

ivy-availability-check:
[loadresource] Do not set property disallowed.ivy.jars.list as its length is 0.

-ivy-fail-disallowed-ivy-version:

ivy-fail:

ivy-fail:

ivy-configure:
[ivy:configure] :: loading settings :: file = /x1/jenkins/jenkins-slave/workspace/Lucene-Solr-Tests-master/lucene/top-level-ivy-settings.xml

resolve:

ivy-availability-check:
[loadresource] Do not set property disallowed.ivy.jars.list as its length is 0.

-ivy-fail-disallowed-ivy-version:

ivy-fail:

ivy-fail:

ivy-configure:
[ivy:configure] :: loading settings :: file = /x1/jenkins/jenkins-slave/workspace/Lucene-Solr-Tests-master/lucene/top-level-ivy-settings.xml

resolve:

ivy-availability-check:
[loadresource] Do not set property disallowed.ivy.jars.list as its length is 0.

-ivy-fail-disallowed-ivy-version:

ivy-fail:

ivy-fail:

ivy-configure:
[ivy:configure] :: loading settings :: file = /x1/jenkins/jenkins-slave/workspace/Lucene-Solr-Tests-master/lucene/top-level-ivy-settings.xml

resolve:

ivy-availability-check:
[loadresource] Do not set property disallowed.ivy.jars.list as its length is 0.

-ivy-fail-disallowed-ivy-version:

ivy-fail:

ivy-fail:

ivy-configure:
[ivy:configure] :: loading settings :: file = /x1/jenkins/jenkins-slave/workspace/Lucene-Solr-Tests-master/lucene/top-level-ivy-settings.xml

resolve:

ivy-availability-check:
[loadresource] Do not set property disallowed.ivy.jars.list as its length is 0.

-ivy-fail-disallowed-ivy-version:

ivy-fail:

ivy-fail:

ivy-configure:
[ivy:configure] :: loading settings :: file = /x1/jenkins/jenkins-slave/workspace/Lucene-Solr-Tests-master/lucene/top-level-ivy-settings.xml

resolve:

jar-checksums:
    [mkdir] Created dir: /x1/jenkins/jenkins-slave/workspace/Lucene-Solr-Tests-master/solr/null1480156793
     [copy] Copying 257 files to /x1/jenkins/jenkins-slave/workspace/Lucene-Solr-Tests-master/solr/null1480156793
   [delete] Deleting directory /x1/jenkins/jenkins-slave/workspace/Lucene-Solr-Tests-master/solr/null1480156793

check-working-copy:
[ivy:cachepath] :: resolving dependencies :: org.eclipse.jgit#org.eclipse.jgit-caller;working
[ivy:cachepath] 	confs: [default]
[ivy:cachepath] 	found org.eclipse.jgit#org.eclipse.jgit;4.6.0.201612231935-r in public
[ivy:cachepath] 	found com.jcraft#jsch;0.1.53 in public
[ivy:cachepath] 	found com.googlecode.javaewah#JavaEWAH;1.1.6 in public
[ivy:cachepath] 	found org.apache.httpcomponents#httpclient;4.3.6 in public
[ivy:cachepath] 	found org.apache.httpcomponents#httpcore;4.3.3 in public
[ivy:cachepath] 	found commons-logging#commons-logging;1.1.3 in public
[ivy:cachepath] 	found commons-codec#commons-codec;1.6 in public
[ivy:cachepath] 	found org.slf4j#slf4j-api;1.7.2 in public
[ivy:cachepath] :: resolution report :: resolve 56ms :: artifacts dl 2ms
	---------------------------------------------------------------------
	|                  |            modules            ||   artifacts   |
	|       conf       | number| search|dwnlded|evicted|| number|dwnlded|
	---------------------------------------------------------------------
	|      default     |   8   |   0   |   0   |   0   ||   8   |   0   |
	---------------------------------------------------------------------
[wc-checker] Initializing working copy...
[wc-checker] SLF4J: Failed to load class "org.slf4j.impl.StaticLoggerBinder".
[wc-checker] SLF4J: Defaulting to no-operation (NOP) logger implementation
[wc-checker] SLF4J: See http://www.slf4j.org/codes.html#StaticLoggerBinder for further details.
[wc-checker] Checking working copy status...

-jenkins-base:

BUILD SUCCESSFUL
Total time: 107 minutes 28 seconds
Archiving artifacts
java.lang.InterruptedException: no matches found within 10000
	at hudson.FilePath$ValidateAntFileMask.hasMatch(FilePath.java:2847)
	at hudson.FilePath$ValidateAntFileMask.invoke(FilePath.java:2726)
	at hudson.FilePath$ValidateAntFileMask.invoke(FilePath.java:2707)
	at hudson.FilePath$FileCallableWrapper.call(FilePath.java:3086)
Also:   hudson.remoting.Channel$CallSiteStackTrace: Remote call to lucene
		at hudson.remoting.Channel.attachCallSiteStackTrace(Channel.java:1741)
		at hudson.remoting.UserRequest$ExceptionResponse.retrieve(UserRequest.java:357)
		at hudson.remoting.Channel.call(Channel.java:955)
		at hudson.FilePath.act(FilePath.java:1072)
		at hudson.FilePath.act(FilePath.java:1061)
		at hudson.FilePath.validateAntFileMask(FilePath.java:2705)
		at hudson.tasks.ArtifactArchiver.perform(ArtifactArchiver.java:243)
		at hudson.tasks.BuildStepCompatibilityLayer.perform(BuildStepCompatibilityLayer.java:81)
		at hudson.tasks.BuildStepMonitor$1.perform(BuildStepMonitor.java:20)
		at hudson.model.AbstractBuild$AbstractBuildExecution.perform(AbstractBuild.java:744)
		at hudson.model.AbstractBuild$AbstractBuildExecution.performAllBuildSteps(AbstractBuild.java:690)
		at hudson.model.Build$BuildExecution.post2(Build.java:186)
		at hudson.model.AbstractBuild$AbstractBuildExecution.post(AbstractBuild.java:635)
		at hudson.model.Run.execute(Run.java:1835)
		at hudson.model.FreeStyleBuild.run(FreeStyleBuild.java:43)
		at hudson.model.ResourceController.execute(ResourceController.java:97)
		at hudson.model.Executor.run(Executor.java:429)
Caused: hudson.FilePath$TunneledInterruptedException
	at hudson.FilePath$FileCallableWrapper.call(FilePath.java:3088)
	at hudson.remoting.UserRequest.perform(UserRequest.java:212)
	at hudson.remoting.UserRequest.perform(UserRequest.java:54)
	at hudson.remoting.Request$2.run(Request.java:369)
	at hudson.remoting.InterceptingExecutorService$1.call(InterceptingExecutorService.java:72)
	at java.util.concurrent.FutureTask.run(FutureTask.java:266)
	at java.util.concurrent.ThreadPoolExecutor.runWorker(ThreadPoolExecutor.java:1142)
	at java.util.concurrent.ThreadPoolExecutor$Worker.run(ThreadPoolExecutor.java:617)
	at java.lang.Thread.run(Thread.java:748)
Caused: java.lang.InterruptedException: java.lang.InterruptedException: no matches found within 10000
	at hudson.FilePath.act(FilePath.java:1074)
	at hudson.FilePath.act(FilePath.java:1061)
	at hudson.FilePath.validateAntFileMask(FilePath.java:2705)
	at hudson.tasks.ArtifactArchiver.perform(ArtifactArchiver.java:243)
	at hudson.tasks.BuildStepCompatibilityLayer.perform(BuildStepCompatibilityLayer.java:81)
	at hudson.tasks.BuildStepMonitor$1.perform(BuildStepMonitor.java:20)
	at hudson.model.AbstractBuild$AbstractBuildExecution.perform(AbstractBuild.java:744)
	at hudson.model.AbstractBuild$AbstractBuildExecution.performAllBuildSteps(AbstractBuild.java:690)
	at hudson.model.Build$BuildExecution.post2(Build.java:186)
	at hudson.model.AbstractBuild$AbstractBuildExecution.post(AbstractBuild.java:635)
	at hudson.model.Run.execute(Run.java:1835)
	at hudson.model.FreeStyleBuild.run(FreeStyleBuild.java:43)
	at hudson.model.ResourceController.execute(ResourceController.java:97)
	at hudson.model.Executor.run(Executor.java:429)
No artifacts found that match the file pattern "**/*.events,heapdumps/**,**/hs_err_pid*". Configuration error?
Recording test results
Build step 'Publish JUnit test result report' changed build result to UNSTABLE
Email was triggered for: Unstable (Test Failures)
Sending email for trigger: Unstable (Test Failures)

Mime
View raw message