lucene-dev mailing list archives

Site index · List index
Message view « Date » · « Thread »
Top « Date » · « Thread »
From Apache Jenkins Server <jenk...@builds.apache.org>
Subject [JENKINS] Lucene-Solr-BadApples-Tests-7.x - Build # 281 - Unstable
Date Mon, 04 Feb 2019 04:08:28 GMT
Build: https://builds.apache.org/job/Lucene-Solr-BadApples-Tests-7.x/281/

2 tests failed.
FAILED:  org.apache.solr.handler.TestReplicationHandler.testFetchIndexShouldReportErrorsWhenTheyOccur

Error Message:
Timeout occured while waiting response from server at: http://127.0.0.1:39372/solr/collection1

Stack Trace:
org.apache.solr.client.solrj.SolrServerException: Timeout occured while waiting response from server at: http://127.0.0.1:39372/solr/collection1
	at __randomizedtesting.SeedInfo.seed([CB0076101F69D5D7:1F6AEBD869BCFAFB]:0)
	at org.apache.solr.client.solrj.impl.HttpSolrClient.executeMethod(HttpSolrClient.java:654)
	at org.apache.solr.client.solrj.impl.HttpSolrClient.request(HttpSolrClient.java:255)
	at org.apache.solr.client.solrj.impl.HttpSolrClient.request(HttpSolrClient.java:244)
	at org.apache.solr.client.solrj.SolrRequest.process(SolrRequest.java:194)
	at org.apache.solr.client.solrj.SolrClient.query(SolrClient.java:983)
	at org.apache.solr.client.solrj.SolrClient.query(SolrClient.java:998)
	at org.apache.solr.handler.TestReplicationHandler.testFetchIndexShouldReportErrorsWhenTheyOccur(TestReplicationHandler.java:1523)
	at sun.reflect.NativeMethodAccessorImpl.invoke0(Native Method)
	at sun.reflect.NativeMethodAccessorImpl.invoke(NativeMethodAccessorImpl.java:62)
	at sun.reflect.DelegatingMethodAccessorImpl.invoke(DelegatingMethodAccessorImpl.java:43)
	at java.lang.reflect.Method.invoke(Method.java:498)
	at com.carrotsearch.randomizedtesting.RandomizedRunner.invoke(RandomizedRunner.java:1750)
	at com.carrotsearch.randomizedtesting.RandomizedRunner$8.evaluate(RandomizedRunner.java:938)
	at com.carrotsearch.randomizedtesting.RandomizedRunner$9.evaluate(RandomizedRunner.java:974)
	at com.carrotsearch.randomizedtesting.RandomizedRunner$10.evaluate(RandomizedRunner.java:988)
	at com.carrotsearch.randomizedtesting.rules.SystemPropertiesRestoreRule$1.evaluate(SystemPropertiesRestoreRule.java:57)
	at org.apache.lucene.util.TestRuleSetupTeardownChained$1.evaluate(TestRuleSetupTeardownChained.java:49)
	at org.apache.lucene.util.AbstractBeforeAfterRule$1.evaluate(AbstractBeforeAfterRule.java:45)
	at org.apache.lucene.util.TestRuleThreadAndTestName$1.evaluate(TestRuleThreadAndTestName.java:48)
	at org.apache.lucene.util.TestRuleIgnoreAfterMaxFailures$1.evaluate(TestRuleIgnoreAfterMaxFailures.java:64)
	at org.apache.lucene.util.TestRuleMarkFailure$1.evaluate(TestRuleMarkFailure.java:47)
	at com.carrotsearch.randomizedtesting.rules.StatementAdapter.evaluate(StatementAdapter.java:36)
	at com.carrotsearch.randomizedtesting.ThreadLeakControl$StatementRunner.run(ThreadLeakControl.java:368)
	at com.carrotsearch.randomizedtesting.ThreadLeakControl.forkTimeoutingTask(ThreadLeakControl.java:817)
	at com.carrotsearch.randomizedtesting.ThreadLeakControl$3.evaluate(ThreadLeakControl.java:468)
	at com.carrotsearch.randomizedtesting.RandomizedRunner.runSingleTest(RandomizedRunner.java:947)
	at com.carrotsearch.randomizedtesting.RandomizedRunner$5.evaluate(RandomizedRunner.java:832)
	at com.carrotsearch.randomizedtesting.RandomizedRunner$6.evaluate(RandomizedRunner.java:883)
	at com.carrotsearch.randomizedtesting.RandomizedRunner$7.evaluate(RandomizedRunner.java:894)
	at com.carrotsearch.randomizedtesting.rules.StatementAdapter.evaluate(StatementAdapter.java:36)
	at com.carrotsearch.randomizedtesting.rules.SystemPropertiesRestoreRule$1.evaluate(SystemPropertiesRestoreRule.java:57)
	at org.apache.lucene.util.AbstractBeforeAfterRule$1.evaluate(AbstractBeforeAfterRule.java:45)
	at com.carrotsearch.randomizedtesting.rules.StatementAdapter.evaluate(StatementAdapter.java:36)
	at org.apache.lucene.util.TestRuleStoreClassName$1.evaluate(TestRuleStoreClassName.java:41)
	at com.carrotsearch.randomizedtesting.rules.NoShadowingOrOverridesOnMethodsRule$1.evaluate(NoShadowingOrOverridesOnMethodsRule.java:40)
	at com.carrotsearch.randomizedtesting.rules.NoShadowingOrOverridesOnMethodsRule$1.evaluate(NoShadowingOrOverridesOnMethodsRule.java:40)
	at com.carrotsearch.randomizedtesting.rules.StatementAdapter.evaluate(StatementAdapter.java:36)
	at com.carrotsearch.randomizedtesting.rules.StatementAdapter.evaluate(StatementAdapter.java:36)
	at com.carrotsearch.randomizedtesting.rules.StatementAdapter.evaluate(StatementAdapter.java:36)
	at org.apache.lucene.util.TestRuleAssertionsRequired$1.evaluate(TestRuleAssertionsRequired.java:53)
	at org.apache.lucene.util.TestRuleMarkFailure$1.evaluate(TestRuleMarkFailure.java:47)
	at org.apache.lucene.util.TestRuleIgnoreAfterMaxFailures$1.evaluate(TestRuleIgnoreAfterMaxFailures.java:64)
	at org.apache.lucene.util.TestRuleIgnoreTestSuites$1.evaluate(TestRuleIgnoreTestSuites.java:54)
	at com.carrotsearch.randomizedtesting.rules.StatementAdapter.evaluate(StatementAdapter.java:36)
	at com.carrotsearch.randomizedtesting.ThreadLeakControl$StatementRunner.run(ThreadLeakControl.java:368)
	at java.lang.Thread.run(Thread.java:748)
Caused by: java.net.SocketTimeoutException: Read timed out
	at java.net.SocketInputStream.socketRead0(Native Method)
	at java.net.SocketInputStream.socketRead(SocketInputStream.java:116)
	at java.net.SocketInputStream.read(SocketInputStream.java:171)
	at java.net.SocketInputStream.read(SocketInputStream.java:141)
	at org.apache.http.impl.io.SessionInputBufferImpl.streamRead(SessionInputBufferImpl.java:137)
	at org.apache.http.impl.io.SessionInputBufferImpl.fillBuffer(SessionInputBufferImpl.java:153)
	at org.apache.http.impl.io.SessionInputBufferImpl.readLine(SessionInputBufferImpl.java:282)
	at org.apache.http.impl.conn.DefaultHttpResponseParser.parseHead(DefaultHttpResponseParser.java:138)
	at org.apache.http.impl.conn.DefaultHttpResponseParser.parseHead(DefaultHttpResponseParser.java:56)
	at org.apache.http.impl.io.AbstractMessageParser.parse(AbstractMessageParser.java:259)
	at org.apache.http.impl.DefaultBHttpClientConnection.receiveResponseHeader(DefaultBHttpClientConnection.java:163)
	at org.apache.http.impl.conn.CPoolProxy.receiveResponseHeader(CPoolProxy.java:165)
	at org.apache.http.protocol.HttpRequestExecutor.doReceiveResponse(HttpRequestExecutor.java:273)
	at org.apache.http.protocol.HttpRequestExecutor.execute(HttpRequestExecutor.java:125)
	at org.apache.http.impl.execchain.MainClientExec.execute(MainClientExec.java:272)
	at org.apache.http.impl.execchain.ProtocolExec.execute(ProtocolExec.java:185)
	at org.apache.http.impl.execchain.RetryExec.execute(RetryExec.java:89)
	at org.apache.http.impl.execchain.RedirectExec.execute(RedirectExec.java:110)
	at org.apache.http.impl.client.InternalHttpClient.doExecute(InternalHttpClient.java:185)
	at org.apache.http.impl.client.CloseableHttpClient.execute(CloseableHttpClient.java:83)
	at org.apache.http.impl.client.CloseableHttpClient.execute(CloseableHttpClient.java:56)
	at org.apache.solr.client.solrj.impl.HttpSolrClient.executeMethod(HttpSolrClient.java:542)
	... 45 more


FAILED:  org.apache.solr.update.SoftAutoCommitTest.testSoftAndHardCommitMaxTimeMixedAdds

Error Message:
hard529 was before searcher529: 31582923741692496 !<= 31582923725506211

Stack Trace:
java.lang.AssertionError: hard529 was before searcher529: 31582923741692496 !<= 31582923725506211
	at __randomizedtesting.SeedInfo.seed([CB0076101F69D5D7:9AD48F90AE1AE570]:0)
	at org.junit.Assert.fail(Assert.java:88)
	at org.junit.Assert.assertTrue(Assert.java:41)
	at org.apache.solr.update.SoftAutoCommitTest.doTestSoftAndHardCommitMaxTimeMixedAdds(SoftAutoCommitTest.java:245)
	at org.apache.solr.update.SoftAutoCommitTest.testSoftAndHardCommitMaxTimeMixedAdds(SoftAutoCommitTest.java:168)
	at sun.reflect.NativeMethodAccessorImpl.invoke0(Native Method)
	at sun.reflect.NativeMethodAccessorImpl.invoke(NativeMethodAccessorImpl.java:62)
	at sun.reflect.DelegatingMethodAccessorImpl.invoke(DelegatingMethodAccessorImpl.java:43)
	at java.lang.reflect.Method.invoke(Method.java:498)
	at com.carrotsearch.randomizedtesting.RandomizedRunner.invoke(RandomizedRunner.java:1750)
	at com.carrotsearch.randomizedtesting.RandomizedRunner$8.evaluate(RandomizedRunner.java:938)
	at com.carrotsearch.randomizedtesting.RandomizedRunner$9.evaluate(RandomizedRunner.java:974)
	at com.carrotsearch.randomizedtesting.RandomizedRunner$10.evaluate(RandomizedRunner.java:988)
	at com.carrotsearch.randomizedtesting.rules.SystemPropertiesRestoreRule$1.evaluate(SystemPropertiesRestoreRule.java:57)
	at org.apache.lucene.util.TestRuleSetupTeardownChained$1.evaluate(TestRuleSetupTeardownChained.java:49)
	at org.apache.lucene.util.AbstractBeforeAfterRule$1.evaluate(AbstractBeforeAfterRule.java:45)
	at org.apache.lucene.util.TestRuleThreadAndTestName$1.evaluate(TestRuleThreadAndTestName.java:48)
	at org.apache.lucene.util.TestRuleIgnoreAfterMaxFailures$1.evaluate(TestRuleIgnoreAfterMaxFailures.java:64)
	at org.apache.lucene.util.TestRuleMarkFailure$1.evaluate(TestRuleMarkFailure.java:47)
	at com.carrotsearch.randomizedtesting.rules.StatementAdapter.evaluate(StatementAdapter.java:36)
	at com.carrotsearch.randomizedtesting.ThreadLeakControl$StatementRunner.run(ThreadLeakControl.java:368)
	at com.carrotsearch.randomizedtesting.ThreadLeakControl.forkTimeoutingTask(ThreadLeakControl.java:817)
	at com.carrotsearch.randomizedtesting.ThreadLeakControl$3.evaluate(ThreadLeakControl.java:468)
	at com.carrotsearch.randomizedtesting.RandomizedRunner.runSingleTest(RandomizedRunner.java:947)
	at com.carrotsearch.randomizedtesting.RandomizedRunner$5.evaluate(RandomizedRunner.java:832)
	at com.carrotsearch.randomizedtesting.RandomizedRunner$6.evaluate(RandomizedRunner.java:883)
	at com.carrotsearch.randomizedtesting.RandomizedRunner$7.evaluate(RandomizedRunner.java:894)
	at com.carrotsearch.randomizedtesting.rules.StatementAdapter.evaluate(StatementAdapter.java:36)
	at com.carrotsearch.randomizedtesting.rules.SystemPropertiesRestoreRule$1.evaluate(SystemPropertiesRestoreRule.java:57)
	at org.apache.lucene.util.AbstractBeforeAfterRule$1.evaluate(AbstractBeforeAfterRule.java:45)
	at com.carrotsearch.randomizedtesting.rules.StatementAdapter.evaluate(StatementAdapter.java:36)
	at org.apache.lucene.util.TestRuleStoreClassName$1.evaluate(TestRuleStoreClassName.java:41)
	at com.carrotsearch.randomizedtesting.rules.NoShadowingOrOverridesOnMethodsRule$1.evaluate(NoShadowingOrOverridesOnMethodsRule.java:40)
	at com.carrotsearch.randomizedtesting.rules.NoShadowingOrOverridesOnMethodsRule$1.evaluate(NoShadowingOrOverridesOnMethodsRule.java:40)
	at com.carrotsearch.randomizedtesting.rules.StatementAdapter.evaluate(StatementAdapter.java:36)
	at com.carrotsearch.randomizedtesting.rules.StatementAdapter.evaluate(StatementAdapter.java:36)
	at com.carrotsearch.randomizedtesting.rules.StatementAdapter.evaluate(StatementAdapter.java:36)
	at org.apache.lucene.util.TestRuleAssertionsRequired$1.evaluate(TestRuleAssertionsRequired.java:53)
	at org.apache.lucene.util.TestRuleMarkFailure$1.evaluate(TestRuleMarkFailure.java:47)
	at org.apache.lucene.util.TestRuleIgnoreAfterMaxFailures$1.evaluate(TestRuleIgnoreAfterMaxFailures.java:64)
	at org.apache.lucene.util.TestRuleIgnoreTestSuites$1.evaluate(TestRuleIgnoreTestSuites.java:54)
	at com.carrotsearch.randomizedtesting.rules.StatementAdapter.evaluate(StatementAdapter.java:36)
	at com.carrotsearch.randomizedtesting.ThreadLeakControl$StatementRunner.run(ThreadLeakControl.java:368)
	at java.lang.Thread.run(Thread.java:748)




Build Log:
[...truncated 12700 lines...]
   [junit4] Suite: org.apache.solr.update.SoftAutoCommitTest
   [junit4]   2> Creating dataDir: /home/jenkins/jenkins-slave/workspace/Lucene-Solr-BadApples-Tests-7.x/solr/build/solr-core/test/J0/temp/solr.update.SoftAutoCommitTest_CB0076101F69D5D7-001/init-core-data-001
   [junit4]   2> 203535 WARN  (SUITE-SoftAutoCommitTest-seed#[CB0076101F69D5D7]-worker) [    ] o.a.s.SolrTestCaseJ4 startTrackingSearchers: numOpens=64 numCloses=64
   [junit4]   2> 203535 INFO  (SUITE-SoftAutoCommitTest-seed#[CB0076101F69D5D7]-worker) [    ] o.a.s.SolrTestCaseJ4 Using TrieFields (NUMERIC_POINTS_SYSPROP=false) w/NUMERIC_DOCVALUES_SYSPROP=true
   [junit4]   2> 203537 INFO  (SUITE-SoftAutoCommitTest-seed#[CB0076101F69D5D7]-worker) [    ] o.a.s.SolrTestCaseJ4 Randomized ssl (false) and clientAuth (true) via: @org.apache.solr.util.RandomizeSSL(reason=, ssl=NaN, value=NaN, clientAuth=NaN)
   [junit4]   2> 203537 INFO  (SUITE-SoftAutoCommitTest-seed#[CB0076101F69D5D7]-worker) [    ] o.a.s.SolrTestCaseJ4 SecureRandom sanity checks: test.solr.allowed.securerandom=null & java.security.egd=file:/dev/./urandom
   [junit4]   2> 203537 INFO  (SUITE-SoftAutoCommitTest-seed#[CB0076101F69D5D7]-worker) [    ] o.a.s.SolrTestCaseJ4 ####initCore
   [junit4]   2> 203538 INFO  (SUITE-SoftAutoCommitTest-seed#[CB0076101F69D5D7]-worker) [    ] o.a.s.c.SolrResourceLoader [null] Added 2 libs to classloader, from paths: [/home/jenkins/jenkins-slave/workspace/Lucene-Solr-BadApples-Tests-7.x/solr/core/src/test-files/solr/collection1/lib, /home/jenkins/jenkins-slave/workspace/Lucene-Solr-BadApples-Tests-7.x/solr/core/src/test-files/solr/collection1/lib/classes]
   [junit4]   2> 203810 INFO  (SUITE-SoftAutoCommitTest-seed#[CB0076101F69D5D7]-worker) [    ] o.a.s.c.SolrConfig Using Lucene MatchVersion: 7.8.0
   [junit4]   2> 203892 INFO  (SUITE-SoftAutoCommitTest-seed#[CB0076101F69D5D7]-worker) [    ] o.a.s.s.IndexSchema [null] Schema name=test
   [junit4]   2> 204231 INFO  (SUITE-SoftAutoCommitTest-seed#[CB0076101F69D5D7]-worker) [    ] o.a.s.s.IndexSchema Loaded schema test/1.0 with uniqueid field id
   [junit4]   2> 204494 INFO  (SUITE-SoftAutoCommitTest-seed#[CB0076101F69D5D7]-worker) [    ] o.a.s.h.c.HttpShardHandlerFactory Host whitelist initialized: WhitelistHostChecker [whitelistHosts=null, whitelistHostCheckingEnabled=true]
   [junit4]   2> 204579 INFO  (SUITE-SoftAutoCommitTest-seed#[CB0076101F69D5D7]-worker) [    ] o.a.s.c.TransientSolrCoreCacheDefault Allocating transient cache for 2147483647 transient cores
   [junit4]   2> 204579 INFO  (SUITE-SoftAutoCommitTest-seed#[CB0076101F69D5D7]-worker) [    ] o.a.s.h.a.MetricsHistoryHandler No .system collection, keeping metrics history in memory.
   [junit4]   2> 204625 INFO  (SUITE-SoftAutoCommitTest-seed#[CB0076101F69D5D7]-worker) [    ] o.a.s.m.r.SolrJmxReporter JMX monitoring for 'solr.node' (registry 'solr.node') enabled at server: com.sun.jmx.mbeanserver.JmxMBeanServer@78d67309
   [junit4]   2> 204644 INFO  (SUITE-SoftAutoCommitTest-seed#[CB0076101F69D5D7]-worker) [    ] o.a.s.m.r.SolrJmxReporter JMX monitoring for 'solr.jvm' (registry 'solr.jvm') enabled at server: com.sun.jmx.mbeanserver.JmxMBeanServer@78d67309
   [junit4]   2> 204644 INFO  (SUITE-SoftAutoCommitTest-seed#[CB0076101F69D5D7]-worker) [    ] o.a.s.m.r.SolrJmxReporter JMX monitoring for 'solr.jetty' (registry 'solr.jetty') enabled at server: com.sun.jmx.mbeanserver.JmxMBeanServer@78d67309
   [junit4]   2> 204655 INFO  (coreLoadExecutor-446-thread-1) [    x:collection1] o.a.s.c.SolrResourceLoader [null] Added 2 libs to classloader, from paths: [/home/jenkins/jenkins-slave/workspace/Lucene-Solr-BadApples-Tests-7.x/solr/core/src/test-files/solr/collection1/lib, /home/jenkins/jenkins-slave/workspace/Lucene-Solr-BadApples-Tests-7.x/solr/core/src/test-files/solr/collection1/lib/classes]
   [junit4]   2> 204840 INFO  (coreLoadExecutor-446-thread-1) [    x:collection1] o.a.s.c.SolrConfig Using Lucene MatchVersion: 7.8.0
   [junit4]   2> 204928 INFO  (coreLoadExecutor-446-thread-1) [    x:collection1] o.a.s.s.IndexSchema [collection1] Schema name=test
   [junit4]   2> 205715 INFO  (coreLoadExecutor-446-thread-1) [    x:collection1] o.a.s.s.IndexSchema Loaded schema test/1.0 with uniqueid field id
   [junit4]   2> 205805 INFO  (coreLoadExecutor-446-thread-1) [    x:collection1] o.a.s.c.CoreContainer Creating SolrCore 'collection1' using configuration from instancedir /home/jenkins/jenkins-slave/workspace/Lucene-Solr-BadApples-Tests-7.x/solr/core/src/test-files/solr/collection1, trusted=true
   [junit4]   2> 205823 INFO  (coreLoadExecutor-446-thread-1) [    x:collection1] o.a.s.m.r.SolrJmxReporter JMX monitoring for 'solr.core.collection1' (registry 'solr.core.collection1') enabled at server: com.sun.jmx.mbeanserver.JmxMBeanServer@78d67309
   [junit4]   2> 205823 INFO  (coreLoadExecutor-446-thread-1) [    x:collection1] o.a.s.c.SolrCore [[collection1] ] Opening new SolrCore at [/home/jenkins/jenkins-slave/workspace/Lucene-Solr-BadApples-Tests-7.x/solr/core/src/test-files/solr/collection1], dataDir=[/home/jenkins/jenkins-slave/workspace/Lucene-Solr-BadApples-Tests-7.x/solr/build/solr-core/test/J0/temp/solr.update.SoftAutoCommitTest_CB0076101F69D5D7-001/init-core-data-001/]
   [junit4]   2> 205825 INFO  (coreLoadExecutor-446-thread-1) [    x:collection1] o.a.s.u.RandomMergePolicy RandomMergePolicy wrapping class org.apache.lucene.index.LogDocMergePolicy: [LogDocMergePolicy: minMergeSize=1000, mergeFactor=13, maxMergeSize=9223372036854775807, maxMergeSizeForForcedMerge=9223372036854775807, calibrateSizeByDeletes=false, maxMergeDocs=2147483647, maxCFSSegmentSizeMB=8.796093022207999E12, noCFSRatio=0.5942371900973762]
   [junit4]   2> 206036 INFO  (coreLoadExecutor-446-thread-1) [    x:collection1] o.a.s.u.UpdateHandler Using UpdateLog implementation: org.apache.solr.update.UpdateLog
   [junit4]   2> 206036 INFO  (coreLoadExecutor-446-thread-1) [    x:collection1] o.a.s.u.UpdateLog Initializing UpdateLog: dataDir= defaultSyncLevel=FLUSH numRecordsToKeep=100 maxNumLogsToKeep=10 numVersionBuckets=65536
   [junit4]   2> 206133 INFO  (coreLoadExecutor-446-thread-1) [    x:collection1] o.a.s.u.CommitTracker Hard AutoCommit: disabled
   [junit4]   2> 206133 INFO  (coreLoadExecutor-446-thread-1) [    x:collection1] o.a.s.u.CommitTracker Soft AutoCommit: disabled
   [junit4]   2> 206136 INFO  (coreLoadExecutor-446-thread-1) [    x:collection1] o.a.s.u.RandomMergePolicy RandomMergePolicy wrapping class org.apache.lucene.index.MockRandomMergePolicy: org.apache.lucene.index.MockRandomMergePolicy@6e107439
   [junit4]   2> 206137 INFO  (coreLoadExecutor-446-thread-1) [    x:collection1] o.a.s.s.SolrIndexSearcher Opening [Searcher@51b7fc73[collection1] main]
   [junit4]   2> 206137 INFO  (coreLoadExecutor-446-thread-1) [    x:collection1] o.a.s.h.c.SpellCheckComponent Initializing spell checkers
   [junit4]   2> 206171 INFO  (coreLoadExecutor-446-thread-1) [    x:collection1] o.a.s.s.DirectSolrSpellChecker init: {name=direct,classname=DirectSolrSpellChecker,field=lowerfilt,minQueryLength=3}
   [junit4]   2> 206327 INFO  (coreLoadExecutor-446-thread-1) [    x:collection1] o.a.s.h.ReplicationHandler Commits will be reserved for 10000ms.
   [junit4]   2> 206328 INFO  (coreLoadExecutor-446-thread-1) [    x:collection1] o.a.s.u.UpdateLog Could not find max version in index or recent updates, using new clock 1624501662720720896
   [junit4]   2> 206363 INFO  (searcherExecutor-447-thread-1-processing-x:collection1) [    x:collection1] o.a.s.h.c.SpellCheckComponent Loading spell index for spellchecker: default
   [junit4]   2> 206363 INFO  (searcherExecutor-447-thread-1-processing-x:collection1) [    x:collection1] o.a.s.h.c.SpellCheckComponent Loading spell index for spellchecker: direct
   [junit4]   2> 206363 INFO  (searcherExecutor-447-thread-1-processing-x:collection1) [    x:collection1] o.a.s.h.c.SpellCheckComponent Loading spell index for spellchecker: wordbreak
   [junit4]   2> 206363 INFO  (searcherExecutor-447-thread-1-processing-x:collection1) [    x:collection1] o.a.s.h.c.SpellCheckComponent Loading spell index for spellchecker: multipleFields
   [junit4]   2> 206363 INFO  (searcherExecutor-447-thread-1-processing-x:collection1) [    x:collection1] o.a.s.h.c.SpellCheckComponent Loading spell index for spellchecker: jarowinkler
   [junit4]   2> 206364 INFO  (searcherExecutor-447-thread-1-processing-x:collection1) [    x:collection1] o.a.s.h.c.SpellCheckComponent Loading spell index for spellchecker: external
   [junit4]   2> 206364 INFO  (searcherExecutor-447-thread-1-processing-x:collection1) [    x:collection1] o.a.s.h.c.SpellCheckComponent Loading spell index for spellchecker: freq
   [junit4]   2> 206364 INFO  (searcherExecutor-447-thread-1-processing-x:collection1) [    x:collection1] o.a.s.h.c.SpellCheckComponent Loading spell index for spellchecker: fqcn
   [junit4]   2> 206364 INFO  (searcherExecutor-447-thread-1-processing-x:collection1) [    x:collection1] o.a.s.h.c.SpellCheckComponent Loading spell index for spellchecker: perDict
   [junit4]   2> 206383 INFO  (SUITE-SoftAutoCommitTest-seed#[CB0076101F69D5D7]-worker) [    ] o.a.s.SolrTestCaseJ4 ####initCore end
   [junit4]   2> 206418 INFO  (searcherExecutor-447-thread-1-processing-x:collection1) [    x:collection1] o.a.s.c.SolrCore [collection1] Registered new searcher Searcher@51b7fc73[collection1] main{ExitableDirectoryReader(UninvertingDirectoryReader())}
   [junit4]   2> 206419 INFO  (TEST-SoftAutoCommitTest.testSoftAndHardCommitMaxTimeMixedAdds-seed#[CB0076101F69D5D7]) [    ] o.a.s.SolrTestCaseJ4 ###Starting testSoftAndHardCommitMaxTimeMixedAdds
   [junit4]   2> 215058 INFO  (TEST-SoftAutoCommitTest.testSoftAndHardCommitMaxTimeMixedAdds-seed#[CB0076101F69D5D7]) [    ] o.a.s.u.p.LogUpdateProcessorFactory [collection1]  webapp=null path=null params={}{add=[529 (1624501671655636992)]} 0 209
   [junit4]   2> 215508 INFO  (commitScheduler-451-thread-1) [    ] o.a.s.u.DirectUpdateHandler2 start commit{,optimize=false,openSearcher=true,waitSearcher=true,expungeDeletes=false,softCommit=true,prepareCommit=false}
   [junit4]   2> 216229 INFO  (commitScheduler-450-thread-1) [    ] o.a.s.u.DirectUpdateHandler2 start commit{,optimize=false,openSearcher=false,waitSearcher=true,expungeDeletes=false,softCommit=false,prepareCommit=false}
   [junit4]   2> 216396 INFO  (commitScheduler-451-thread-1) [    ] o.a.s.s.SolrIndexSearcher Opening [Searcher@2ba3bd95[collection1] main]
   [junit4]   2> 216396 INFO  (commitScheduler-450-thread-1) [    ] o.a.s.u.SolrIndexWriter Calling setCommitData with IW:org.apache.solr.update.SolrIndexWriter@c0c92c9 commitCommandVersion:0
   [junit4]   2> 216420 INFO  (commitScheduler-450-thread-1) [    ] o.a.s.s.SolrIndexSearcher Opening [Searcher@22749745[collection1] realtime]
   [junit4]   2> 216421 INFO  (commitScheduler-450-thread-1) [    ] o.a.s.u.DirectUpdateHandler2 end_commit_flush
   [junit4]   2> 216421 INFO  (commitScheduler-451-thread-1) [    ] o.a.s.u.DirectUpdateHandler2 end_commit_flush
   [junit4]   2> 216452 INFO  (searcherExecutor-447-thread-1) [    ] o.a.s.c.SolrCore [collection1] Registered new searcher Searcher@2ba3bd95[collection1] main{ExitableDirectoryReader(UninvertingDirectoryReader(Uninverting(_0(7.8.0):c1:[diagnostics={os=Linux, java.vendor=Oracle Corporation, java.version=1.8.0_191, java.vm.version=25.191-b12, lucene.version=7.8.0, os.arch=amd64, java.runtime.version=1.8.0_191-b12, source=flush, os.version=4.4.0-112-generic, timestamp=1549245522504}]:[attributes={Lucene50StoredFieldsFormat.mode=BEST_SPEED}])))}
   [junit4]   2> 216517 INFO  (TEST-SoftAutoCommitTest.testSoftAndHardCommitMaxTimeMixedAdds-seed#[CB0076101F69D5D7]) [    ] o.a.s.u.p.LogUpdateProcessorFactory [collection1]  webapp=null path=null params={}{add=[530 (1624501673321824256)]} 0 78
   [junit4]   2> 216526 INFO  (TEST-SoftAutoCommitTest.testSoftAndHardCommitMaxTimeMixedAdds-seed#[CB0076101F69D5D7]) [    ] o.a.s.SolrTestCaseJ4 ###Ending testSoftAndHardCommitMaxTimeMixedAdds
   [junit4]   2> NOTE: reproduce with: ant test  -Dtestcase=SoftAutoCommitTest -Dtests.method=testSoftAndHardCommitMaxTimeMixedAdds -Dtests.seed=CB0076101F69D5D7 -Dtests.multiplier=2 -Dtests.slow=true -Dtests.badapples=true -Dtests.locale=es-BO -Dtests.timezone=MST7MDT -Dtests.asserts=true -Dtests.file.encoding=US-ASCII
   [junit4] FAILURE 10.2s J0 | SoftAutoCommitTest.testSoftAndHardCommitMaxTimeMixedAdds <<<
   [junit4]    > Throwable #1: java.lang.AssertionError: hard529 was before searcher529: 31582923741692496 !<= 31582923725506211
   [junit4]    > 	at __randomizedtesting.SeedInfo.seed([CB0076101F69D5D7:9AD48F90AE1AE570]:0)
   [junit4]    > 	at org.apache.solr.update.SoftAutoCommitTest.doTestSoftAndHardCommitMaxTimeMixedAdds(SoftAutoCommitTest.java:245)
   [junit4]    > 	at org.apache.solr.update.SoftAutoCommitTest.testSoftAndHardCommitMaxTimeMixedAdds(SoftAutoCommitTest.java:168)
   [junit4]    > 	at java.lang.Thread.run(Thread.java:748)
   [junit4]   2> 216771 INFO  (TEST-SoftAutoCommitTest.testHardCommitWithinAndSoftCommitMaxTimeMixedAdds-seed#[CB0076101F69D5D7]) [    ] o.a.s.SolrTestCaseJ4 ###Starting testHardCommitWithinAndSoftCommitMaxTimeMixedAdds
   [junit4]   2> 216973 INFO  (commitScheduler-451-thread-2) [    ] o.a.s.u.DirectUpdateHandler2 start commit{,optimize=false,openSearcher=true,waitSearcher=true,expungeDeletes=false,softCommit=true,prepareCommit=false}
   [junit4]   2> 217339 INFO  (commitScheduler-451-thread-2) [    ] o.a.s.s.SolrIndexSearcher Opening [Searcher@3970d617[collection1] main]
   [junit4]   2> 217340 INFO  (commitScheduler-451-thread-2) [    ] o.a.s.u.DirectUpdateHandler2 end_commit_flush
   [junit4]   2> 217342 INFO  (searcherExecutor-447-thread-1) [    ] o.a.s.c.SolrCore [collection1] Registered new searcher Searcher@3970d617[collection1] main{ExitableDirectoryReader(UninvertingDirectoryReader(Uninverting(_0(7.8.0):c1:[diagnostics={os=Linux, java.vendor=Oracle Corporation, java.version=1.8.0_191, java.vm.version=25.191-b12, lucene.version=7.8.0, os.arch=amd64, java.runtime.version=1.8.0_191-b12, source=flush, os.version=4.4.0-112-generic, timestamp=1549245522504}]:[attributes={Lucene50StoredFieldsFormat.mode=BEST_SPEED}]) Uninverting(_1(7.8.0):c1:[diagnostics={os=Linux, java.vendor=Oracle Corporation, java.version=1.8.0_191, java.vm.version=25.191-b12, lucene.version=7.8.0, os.arch=amd64, java.runtime.version=1.8.0_191-b12, source=flush, os.version=4.4.0-112-generic, timestamp=1549245523475}]:[attributes={Lucene50StoredFieldsFormat.mode=BEST_SPEED}])))}
   [junit4]   2> 217710 INFO  (commitScheduler-450-thread-2) [    ] o.a.s.u.DirectUpdateHandler2 start commit{,optimize=false,openSearcher=false,waitSearcher=true,expungeDeletes=false,softCommit=false,prepareCommit=false}
   [junit4]   2> 217710 INFO  (commitScheduler-450-thread-2) [    ] o.a.s.u.SolrIndexWriter Calling setCommitData with IW:org.apache.solr.update.SolrIndexWriter@c0c92c9 commitCommandVersion:0
   [junit4]   2> 217726 INFO  (commitScheduler-450-thread-2) [    ] o.a.s.s.SolrIndexSearcher Opening [Searcher@62eeda4b[collection1] realtime]
   [junit4]   2> 217728 INFO  (commitScheduler-450-thread-2) [    ] o.a.s.u.DirectUpdateHandler2 end_commit_flush
   [junit4]   2> 217777 INFO  (TEST-SoftAutoCommitTest.testHardCommitWithinAndSoftCommitMaxTimeMixedAdds-seed#[CB0076101F69D5D7]) [    ] o.a.s.u.p.LogUpdateProcessorFactory [collection1]  webapp=null path=null params={}{add=[529 (1624501674671341568)]} 0 51
   [junit4]   2> 218246 INFO  (commitScheduler-451-thread-3) [    ] o.a.s.u.DirectUpdateHandler2 start commit{,optimize=false,openSearcher=true,waitSearcher=true,expungeDeletes=false,softCommit=true,prepareCommit=false}
   [junit4]   2> 218699 INFO  (commitScheduler-451-thread-3) [    ] o.a.s.s.SolrIndexSearcher Opening [Searcher@19464514[collection1] main]
   [junit4]   2> 218717 INFO  (commitScheduler-451-thread-3) [    ] o.a.s.u.DirectUpdateHandler2 end_commit_flush
   [junit4]   2> 218718 INFO  (searcherExecutor-447-thread-1) [    ] o.a.s.c.SolrCore [collection1] Registered new searcher Searcher@19464514[collection1] main{ExitableDirectoryReader(UninvertingDirectoryReader(Uninverting(_1(7.8.0):c1:[diagnostics={os=Linux, java.vendor=Oracle Corporation, java.version=1.8.0_191, java.vm.version=25.191-b12, lucene.version=7.8.0, os.arch=amd64, java.runtime.version=1.8.0_191-b12, source=flush, os.version=4.4.0-112-generic, timestamp=1549245523475}]:[attributes={Lucene50StoredFieldsFormat.mode=BEST_SPEED}]) Uninverting(_2(7.8.0):c1:[diagnostics={os=Linux, java.vendor=Oracle Corporation, java.version=1.8.0_191, java.vm.version=25.191-b12, lucene.version=7.8.0, os.arch=amd64, java.runtime.version=1.8.0_191-b12, source=flush, os.version=4.4.0-112-generic, timestamp=1549245525030}]:[attributes={Lucene50StoredFieldsFormat.mode=BEST_SPEED}])))}
   [junit4]   2> 218956 INFO  (commitScheduler-450-thread-3) [    ] o.a.s.u.DirectUpdateHandler2 start commit{,optimize=false,openSearcher=false,waitSearcher=true,expungeDeletes=false,softCommit=false,prepareCommit=false}
   [junit4]   2> 218956 INFO  (commitScheduler-450-thread-3) [    ] o.a.s.u.SolrIndexWriter Calling setCommitData with IW:org.apache.solr.update.SolrIndexWriter@c0c92c9 commitCommandVersion:0
   [junit4]   2> 218958 INFO  (commitScheduler-450-thread-3) [    ] o.a.s.s.SolrIndexSearcher Opening [Searcher@1fb2339d[collection1] realtime]
   [junit4]   2> 218958 INFO  (commitScheduler-450-thread-3) [    ] o.a.s.u.DirectUpdateHandler2 end_commit_flush
   [junit4]   2> 219061 INFO  (TEST-SoftAutoCommitTest.testHardCommitWithinAndSoftCommitMaxTimeMixedAdds-seed#[CB0076101F69D5D7]) [    ] o.a.s.u.p.LogUpdateProcessorFactory [collection1]  webapp=null path=null params={}{add=[530 (1624501675996741632)]} 0 77
   [junit4]   2> 219537 INFO  (commitScheduler-451-thread-4) [    ] o.a.s.u.DirectUpdateHandler2 start commit{,optimize=false,openSearcher=true,waitSearcher=true,expungeDeletes=false,softCommit=true,prepareCommit=false}
   [junit4]   2> 219961 INFO  (commitScheduler-451-thread-4) [    ] o.a.s.s.SolrIndexSearcher Opening [Searcher@4584ecde[collection1] main]
   [junit4]   2> 219961 INFO  (commitScheduler-451-thread-4) [    ] o.a.s.u.DirectUpdateHandler2 end_commit_flush
   [junit4]   2> 219963 INFO  (searcherExecutor-447-thread-1) [    ] o.a.s.c.SolrCore [collection1] Registered new searcher Searcher@4584ecde[collection1] main{ExitableDirectoryReader(UninvertingDirectoryReader(Uninverting(_2(7.8.0):c1:[diagnostics={os=Linux, java.vendor=Oracle Corporation, java.version=1.8.0_191, java.vm.version=25.191-b12, lucene.version=7.8.0, os.arch=amd64, java.runtime.version=1.8.0_191-b12, source=flush, os.version=4.4.0-112-generic, timestamp=1549245525030}]:[attributes={Lucene50StoredFieldsFormat.mode=BEST_SPEED}]) Uninverting(_3(7.8.0):c1:[diagnostics={os=Linux, java.vendor=Oracle Corporation, java.version=1.8.0_191, java.vm.version=25.191-b12, lucene.version=7.8.0, os.arch=amd64, java.runtime.version=1.8.0_191-b12, source=flush, os.version=4.4.0-112-generic, timestamp=1549245526182}]:[attributes={Lucene50StoredFieldsFormat.mode=BEST_SPEED}])))}
   [junit4]   2> 220293 INFO  (commitScheduler-450-thread-4) [    ] o.a.s.u.DirectUpdateHandler2 start commit{,optimize=false,openSearcher=false,waitSearcher=true,expungeDeletes=false,softCommit=false,prepareCommit=false}
   [junit4]   2> 220293 INFO  (commitScheduler-450-thread-4) [    ] o.a.s.u.SolrIndexWriter Calling setCommitData with IW:org.apache.solr.update.SolrIndexWriter@c0c92c9 commitCommandVersion:0
   [junit4]   2> 220341 INFO  (commitScheduler-450-thread-4) [    ] o.a.s.s.SolrIndexSearcher Opening [Searcher@23a663e7[collection1] realtime]
   [junit4]   2> 220346 INFO  (commitScheduler-450-thread-4) [    ] o.a.s.u.DirectUpdateHandler2 end_commit_flush
   [junit4]   2> 221316 INFO  (TEST-SoftAutoCommitTest.testHardCommitWithinAndSoftCommitMaxTimeMixedAdds-seed#[CB0076101F69D5D7]) [    ] o.a.s.SolrTestCaseJ4 ###Ending testHardCommitWithinAndSoftCommitMaxTimeMixedAdds
   [junit4]   2> 221319 INFO  (TEST-SoftAutoCommitTest.testSoftCommitWithinAndHardCommitMaxTimeMixedAdds-seed#[CB0076101F69D5D7]) [    ] o.a.s.SolrTestCaseJ4 ###Starting testSoftCommitWithinAndHardCommitMaxTimeMixedAdds
   [junit4]   2> 229744 INFO  (TEST-SoftAutoCommitTest.testSoftCommitWithinAndHardCommitMaxTimeMixedAdds-seed#[CB0076101F69D5D7]) [    ] o.a.s.u.p.LogUpdateProcessorFactory [collection1]  webapp=null path=null params={}{add=[529 (1624501687251107840)]} 0 22
   [junit4]   2> 230248 INFO  (commitScheduler-451-thread-5) [    ] o.a.s.u.DirectUpdateHandler2 start commit{,optimize=false,openSearcher=true,waitSearcher=true,expungeDeletes=false,softCommit=true,prepareCommit=false}
   [junit4]   2> 230481 INFO  (commitScheduler-451-thread-5) [    ] o.a.s.s.SolrIndexSearcher Opening [Searcher@431a5bea[collection1] main]
   [junit4]   2> 230481 INFO  (commitScheduler-451-thread-5) [    ] o.a.s.u.DirectUpdateHandler2 end_commit_flush
   [junit4]   2> 230514 INFO  (searcherExecutor-447-thread-1) [    ] o.a.s.c.SolrCore [collection1] Registered new searcher Searcher@431a5bea[collection1] main{ExitableDirectoryReader(UninvertingDirectoryReader(Uninverting(_5(7.8.0):c2/1:[diagnostics={os=Linux, java.vendor=Oracle Corporation, java.version=1.8.0_191, java.vm.version=25.191-b12, lucene.version=7.8.0, mergeMaxNumSegments=-1, os.arch=amd64, java.runtime.version=1.8.0_191-b12, source=merge, mergeFactor=2, os.version=4.4.0-112-generic, timestamp=1549245527037}]:[attributes={Lucene50StoredFieldsFormat.mode=BEST_SPEED}]) Uninverting(_6(7.8.0):c1:[diagnostics={os=Linux, java.vendor=Oracle Corporation, java.version=1.8.0_191, java.vm.version=25.191-b12, lucene.version=7.8.0, os.arch=amd64, java.runtime.version=1.8.0_191-b12, source=flush, os.version=4.4.0-112-generic, timestamp=1549245536761}]:[attributes={Lucene50StoredFieldsFormat.mode=BEST_SPEED}])))}
   [junit4]   2> 230944 INFO  (commitScheduler-450-thread-5) [    ] o.a.s.u.DirectUpdateHandler2 start commit{,optimize=false,openSearcher=false,waitSearcher=true,expungeDeletes=false,softCommit=false,prepareCommit=false}
   [junit4]   2> 230945 INFO  (commitScheduler-450-thread-5) [    ] o.a.s.u.SolrIndexWriter Calling setCommitData with IW:org.apache.solr.update.SolrIndexWriter@c0c92c9 commitCommandVersion:0
   [junit4]   2> 230984 INFO  (TEST-SoftAutoCommitTest.testSoftCommitWithinAndHardCommitMaxTimeMixedAdds-seed#[CB0076101F69D5D7]) [    ] o.a.s.u.p.LogUpdateProcessorFactory [collection1]  webapp=null path=null params={}{add=[530 (1624501688571265024)]} 0 3
   [junit4]   2> 231071 INFO  (commitScheduler-450-thread-5) [    ] o.a.s.s.SolrIndexSearcher Opening [Searcher@610ca542[collection1] realtime]
   [junit4]   2> 231107 INFO  (commitScheduler-450-thread-5) [    ] o.a.s.u.DirectUpdateHandler2 end_commit_flush
   [junit4]   2> 231528 INFO  (commitScheduler-451-thread-6) [    ] o.a.s.u.DirectUpdateHandler2 start commit{,optimize=false,openSearcher=true,waitSearcher=true,expungeDeletes=false,softCommit=true,prepareCommit=false}
   [junit4]   2> 231795 INFO  (commitScheduler-451-thread-6) [    ] o.a.s.s.SolrIndexSearcher Opening [Searcher@bb677ca[collection1] main]
   [junit4]   2> 231796 INFO  (commitScheduler-451-thread-6) [    ] o.a.s.u.DirectUpdateHandler2 end_commit_flush
   [junit4]   2> 231797 INFO  (searcherExecutor-447-thread-1) [    ] o.a.s.c.SolrCore [collection1] Registered new searcher Searcher@bb677ca[collection1] main{ExitableDirectoryReader(UninvertingDirectoryReader(Uninverting(_6(7.8.0):c1:[diagnostics={os=Linux, java.vendor=Oracle Corporation, java.version=1.8.0_191, java.vm.version=25.191-b12, lucene.version=7.8.0, os.arch=amd64, java.runtime.version=1.8.0_191-b12, source=flush, os.version=4.4.0-112-generic, timestamp=1549245536761}]:[attributes={Lucene50StoredFieldsFormat.mode=BEST_SPEED}]) Uninverting(_7(7.8.0):c1:[diagnostics={os=Linux, java.vendor=Oracle Corporation, java.version=1.8.0_191, java.vm.version=25.191-b12, lucene.version=7.8.0, os.arch=amd64, java.runtime.version=1.8.0_191-b12, source=flush, os.version=4.4.0-112-generic, timestamp=1549245538120}]:[attributes={Lucene50StoredFieldsFormat.mode=BEST_SPEED}])))}
   [junit4]   2> 232183 INFO  (commitScheduler-450-thread-5) [    ] o.a.s.u.DirectUpdateHandler2 start commit{,optimize=false,openSearcher=false,waitSearcher=true,expungeDeletes=false,softCommit=false,prepareCommit=false}
   [junit4]   2> 232183 INFO  (commitScheduler-450-thread-5) [    ] o.a.s.u.SolrIndexWriter Calling setCommitData with IW:org.apache.solr.update.SolrIndexWriter@c0c92c9 commitCommandVersion:0
   [junit4]   2> 232185 INFO  (commitScheduler-450-thread-5) [    ] o.a.s.s.SolrIndexSearcher Opening [Searcher@6b9f9c47[collection1] realtime]
   [junit4]   2> 232185 INFO  (commitScheduler-450-thread-5) [    ] o.a.s.u.DirectUpdateHandler2 end_commit_flush
   [junit4]   2> 233185 INFO  (TEST-SoftAutoCommitTest.testSoftCommitWithinAndHardCommitMaxTimeMixedAdds-seed#[CB0076101F69D5D7]) [    ] o.a.s.SolrTestCaseJ4 ###Ending testSoftCommitWithinAndHardCommitMaxTimeMixedAdds
   [junit4]   2> 233188 INFO  (TEST-SoftAutoCommitTest.testHardCommitWithinAndSoftCommitMaxTimeRapidAdds-seed#[CB0076101F69D5D7]) [    ] o.a.s.SolrTestCaseJ4 ###Starting testHardCommitWithinAndSoftCommitMaxTimeRapidAdds
   [junit4]   2> 238212 INFO  (TEST-SoftAutoCommitTest.testHardCommitWithinAndSoftCommitMaxTimeRapidAdds-seed#[CB0076101F69D5D7]) [    ] o.a.s.u.p.LogUpdateProcessorFactory [collection1]  webapp=null path=null params={}{add=[5000 (1624501696128352256)]} 0 23
   [junit4]   2> 238214 INFO  (TEST-SoftAutoCommitTest.testHardCommitWithinAndSoftCommitMaxTimeRapidAdds-seed#[CB0076101F69D5D7]) [    ] o.a.s.u.p.LogUpdateProcessorFactory [collection1]  webapp=null path=null params={}{add=[5001 (1624501696154566656)]} 0 1
   [junit4]   2> 238232 INFO  (TEST-SoftAutoCommitTest.testHardCommitWithinAndSoftCommitMaxTimeRapidAdds-seed#[CB0076101F69D5D7]) [    ] o.a.s.u.p.LogUpdateProcessorFactory [collection1]  webapp=null path=null params={}{add=[5002 (1624501696155615232)]} 0 17
   [junit4]   2> 238285 INFO  (TEST-SoftAutoCommitTest.testHardCommitWithinAndSoftCommitMaxTimeRapidAdds-seed#[CB0076101F69D5D7]) [    ] o.a.s.u.p.LogUpdateProcessorFactory [collection1]  webapp=null path=null params={}{add=[5003 (1624501696211189760)]} 0 18
   [junit4]   2> 238286 INFO  (TEST-SoftAutoCommitTest.testHardCommitWithinAndSoftCommitMaxTimeRapidAdds-seed#[CB0076101F69D5D7]) [    ] o.a.s.u.p.LogUpdateProcessorFactory [collection1]  webapp=null path=null params={}{add=[5004 (1624501696231112704)]} 0 0
   [junit4]   2> 238287 INFO  (TEST-SoftAutoCommitTest.testHardCommitWithinAndSoftCommitMaxTimeRapidAdds-seed#[CB0076101F69D5D7]) [    ] o.a.s.u.SoftAutoCommitTest maxTimeMillis: 31582945592337388ns - 31582945493442958ns == 98ms
   [junit4]   2> 238287 INFO  (TEST-SoftAutoCommitTest.testHardCommitWithinAndSoftCommitMaxTimeRapidAdds-seed#[CB0076101F69D5D7]) [    ] o.a.s.u.SoftAutoCommitTest maxExpectedSoft=1
   [junit4]   2> 238287 INFO  (TEST-SoftAutoCommitTest.testHardCommitWithinAndSoftCommitMaxTimeRapidAdds-seed#[CB0076101F69D5D7]) [    ] o.a.s.u.SoftAutoCommitTest maxExpectedHard=1
   [junit4]   2> 238706 INFO  (commitScheduler-451-thread-7) [    ] o.a.s.u.DirectUpdateHandler2 start commit{,optimize=false,openSearcher=true,waitSearcher=true,expungeDeletes=false,softCommit=true,prepareCommit=false}
   [junit4]   2> 238886 INFO  (commitScheduler-451-thread-7) [    ] o.a.s.s.SolrIndexSearcher Opening [Searcher@78d5b854[collection1] main]
   [junit4]   2> 238887 INFO  (commitScheduler-451-thread-7) [    ] o.a.s.u.DirectUpdateHandler2 end_commit_flush
   [junit4]   2> 238890 INFO  (searcherExecutor-447-thread-1) [    ] o.a.s.c.SolrCore [collection1] Registered new searcher Searcher@78d5b854[collection1] main{ExitableDirectoryReader(UninvertingDirectoryReader(Uninverting(_6(7.8.0):c1:[diagnostics={os=Linux, java.vendor=Oracle Corporation, java.version=1.8.0_191, java.vm.version=25.191-b12, lucene.version=7.8.0, os.arch=amd64, java.runtime.version=1.8.0_191-b12, source=flush, os.version=4.4.0-112-generic, timestamp=1549245536761}]:[attributes={Lucene50StoredFieldsFormat.mode=BEST_SPEED}]) Uninverting(_7(7.8.0):c1:[diagnostics={os=Linux, java.vendor=Oracle Corporation, java.version=1.8.0_191, java.vm.version=25.191-b12, lucene.version=7.8.0, os.arch=amd64, java.runtime.version=1.8.0_191-b12, source=flush, os.version=4.4.0-112-generic, timestamp=1549245538120}]:[attributes={Lucene50StoredFieldsFormat.mode=BEST_SPEED}]) Uninverting(_8(7.8.0):c5:[diagnostics={os=Linux, java.vendor=Oracle Corporation, java.version=1.8.0_191, java.vm.version=25.191-b12, lucene.version=7.8.0, os.arch=amd64, java.runtime.version=1.8.0_191-b12, source=flush, os.version=4.4.0-112-generic, timestamp=1549245545239}]:[attributes={Lucene50StoredFieldsFormat.mode=BEST_SPEED}])))}
   [junit4]   2> 239403 INFO  (commitScheduler-450-thread-6) [    ] o.a.s.u.DirectUpdateHandler2 start commit{,optimize=false,openSearcher=false,waitSearcher=true,expungeDeletes=false,softCommit=false,prepareCommit=false}
   [junit4]   2> 239403 INFO  (commitScheduler-450-thread-6) [    ] o.a.s.u.SolrIndexWriter Calling setCommitData with IW:org.apache.solr.update.SolrIndexWriter@c0c92c9 commitCommandVersion:0
   [junit4]   2> 239456 INFO  (commitScheduler-450-thread-6) [    ] o.a.s.s.SolrIndexSearcher Opening [Searcher@28b8d7ee[collection1] realtime]
   [junit4]   2> 239484 INFO  (commitScheduler-450-thread-6) [    ] o.a.s.u.DirectUpdateHandler2 end_commit_flush
   [junit4]   2> 245007 INFO  (TEST-SoftAutoCommitTest.testHardCommitWithinAndSoftCommitMaxTimeRapidAdds-seed#[CB0076101F69D5D7]) [    ] o.a.s.SolrTestCaseJ4 ###Ending testHardCommitWithinAndSoftCommitMaxTimeRapidAdds
   [junit4]   2> 245009 INFO  (TEST-SoftAutoCommitTest.testSoftCommitWithinAndHardCommitMaxTimeDelete-seed#[CB0076101F69D5D7]) [    ] o.a.s.SolrTestCaseJ4 ###Starting testSoftCommitWithinAndHardCommitMaxTimeDelete
   [junit4]   2> 250087 INFO  (TEST-SoftAutoCommitTest.testSoftCommitWithinAndHardCommitMaxTimeDelete-seed#[CB0076101F69D5D7]) [    ] o.a.s.u.p.LogUpdateProcessorFactory [collection1]  webapp=null path=null params={}{add=[529 (1624501708530909184)]} 0 72
   [junit4]   2> 250088 INFO  (TEST-SoftAutoCommitTest.testSoftCommitWithinAndHardCommitMaxTimeDelete-seed#[CB0076101F69D5D7]) [    ] o.a.s.u.DirectUpdateHandler2 start commit{_version_=1624501708606406656,optimize=false,openSearcher=true,waitSearcher=true,expungeDeletes=false,softCommit=false,prepareCommit=false}
   [junit4]   2> 250088 INFO  (TEST-SoftAutoCommitTest.testSoftCommitWithinAndHardCommitMaxTimeDelete-seed#[CB0076101F69D5D7]) [    ] o.a.s.u.SolrIndexWriter Calling setCommitData with IW:org.apache.solr.update.SolrIndexWriter@c0c92c9 commitCommandVersion:1624501708606406656
   [junit4]   2> 250418 INFO  (TEST-SoftAutoCommitTest.testSoftCommitWithinAndHardCommitMaxTimeDelete-seed#[CB0076101F69D5D7]) [    ] o.a.s.s.SolrIndexSearcher Opening [Searcher@3a866928[collection1] main]
   [junit4]   2> 250418 INFO  (TEST-SoftAutoCommitTest.testSoftCommitWithinAndHardCommitMaxTimeDelete-seed#[CB0076101F69D5D7]) [    ] o.a.s.u.DirectUpdateHandler2 end_commit_flush
   [junit4]   2> 250650 INFO  (searcherExecutor-447-thread-1) [    ] o.a.s.c.SolrCore [collection1] Registered new searcher Searcher@3a866928[collection1] main{ExitableDirectoryReader(UninvertingDirectoryReader(Uninverting(_7(7.8.0):c1:[diagnostics={os=Linux, java.vendor=Oracle Corporation, java.version=1.8.0_191, java.vm.version=25.191-b12, lucene.version=7.8.0, os.arch=amd64, java.runtime.version=1.8.0_191-b12, source=flush, os.version=4.4.0-112-generic, timestamp=1549245538120}]:[attributes={Lucene50StoredFieldsFormat.mode=BEST_SPEED}]) Uninverting(_8(7.8.0):c5:[diagnostics={os=Linux, java.vendor=Oracle Corporation, java.version=1.8.0_191, java.vm.version=25.191-b12, lucene.version=7.8.0, os.arch=amd64, java.runtime.version=1.8.0_191-b12, source=flush, os.version=4.4.0-112-generic, timestamp=1549245545239}]:[attributes={Lucene50StoredFieldsFormat.mode=BEST_SPEED}]) Uninverting(_9(7.8.0):c1:[diagnostics={os=Linux, java.vendor=Oracle Corporation, java.version=1.8.0_191, java.vm.version=25.191-b12, lucene.version=7.8.0, os.arch=amd64, java.runtime.version=1.8.0_191-b12, source=flush, os.version=4.4.0-112-generic, timestamp=1549245556459}]:[attributes={Lucene50StoredFieldsFormat.mode=BEST_SPEED}])))}
   [junit4]   2> 250724 INFO  (TEST-SoftAutoCommitTest.testSoftCommitWithinAndHardCommitMaxTimeDelete-seed#[CB0076101F69D5D7]) [    ] o.a.s.u.p.LogUpdateProcessorFactory [collection1]  webapp=null path=null params={}{commit=} 0 635
   [junit4]   2> 250760 INFO  (TEST-SoftAutoCommitTest.testSoftCommitWithinAndHardCommitMaxTimeDelete-seed#[CB0076101F69D5D7]) [    ] o.a.s.u.p.LogUpdateProcessorFactory [collection1]  webapp=null path=null params={}{delete=[529 (-1624501709274349568)]} 0 35
   [junit4]   2> 251250 INFO  (commitScheduler-451-thread-9) [    ] o.a.s.u.DirectUpdateHandler2 start commit{,optimize=false,openSearcher=true,waitSearcher=true,expungeDeletes=false,softCommit=true,prepareCommit=false}
   [junit4]   2> 251274 INFO  (commitScheduler-451-thread-9) [    ] o.a.s.s.SolrIndexSearcher Opening [Searcher@2ab5af7d[collection1] main]
   [junit4]   2> 251287 INFO  (commitScheduler-451-thread-9) [    ] o.a.s.u.DirectUpdateHandler2 end_commit_flush
   [junit4]   2> 251288 INFO  (searcherExecutor-447-thread-1) [    ] o.a.s.c.SolrCore [collection1] Registered new searcher Searcher@2ab5af7d[collection1] main{ExitableDirectoryReader(UninvertingDirectoryReader(Uninverting(_a(7.8.0):c2/1:[diagnostics={os=Linux, java.vendor=Oracle Corporation, java.version=1.8.0_191, java.vm.version=25.191-b12, lucene.version=7.8.0, mergeMaxNumSegments=-1, os.arch=amd64, java.runtime.version=1.8.0_191-b12, source=merge, mergeFactor=2, os.version=4.4.0-112-generic, timestamp=1549245556909}]:[attributes={Lucene50StoredFieldsFormat.mode=BEST_SPEED}]) Uninverting(_8(7.8.0):c5:[diagnostics={os=Linux, java.vendor=Oracle Corporation, java.version=1.8.0_191, java.vm.version=25.191-b12, lucene.version=7.8.0, os.arch=amd64, java.runtime.version=1.8.0_191-b12, source=flush, os.version=4.4.0-112-generic, timestamp=1549245545239}]:[attributes={Lucene50StoredFieldsFormat.mode=BEST_SPEED}])))}
   [junit4]   2> 251345 INFO  (TEST-SoftAutoCommitTest.testSoftCommitWithinAndHardCommitMaxTimeDelete-seed#[CB0076101F69D5D7]) [    ] o.a.s.u.p.LogUpdateProcessorFactory [collection1]  webapp=null path=null params={}{add=[550 (1624501709867843584)]} 0 53
   [junit4]   2> 251882 INFO  (commitScheduler-451-thread-9) [    ] o.a.s.u.DirectUpdateHandler2 start commit{,optimize=false,openSearcher=true,waitSearcher=true,expungeDeletes=false,softCommit=true,prepareCommit=false}
   [junit4]   2> 251964 INFO  (commitScheduler-450-thread-7) [    ] o.a.s.u.DirectUpdateHandler2 start commit{,optimize=false,openSearcher=false,waitSearcher=true,expungeDeletes=false,softCommit=false,prepareCommit=false}
   [junit4]   2> 252002 INFO  (commitScheduler-451-thread-9) [    ] o.a.s.s.SolrIndexSearcher Opening [Searcher@7066bed9[collection1] main]
   [junit4]   2> 252002 INFO  (commitScheduler-451-thread-9) [    ] o.a.s.u.DirectUpdateHandler2 end_commit_flush
   [junit4]   2> 252018 INFO  (searcherExecutor-447-thread-1) [    ] o.a.s.c.SolrCore [collection1] Registered new searcher Searcher@7066bed9[collection1] main{ExitableDirectoryReader(UninvertingDirectoryReader(Uninverting(_a(7.8.0):c2/1:[diagnostics={os=Linux, java.vendor=Oracle Corporation, java.version=1.8.0_191, java.vm.version=25.191-b12, lucene.version=7.8.0, mergeMaxNumSegments=-1, os.arch=amd64, java.runtime.version=1.8.0_191-b12, source=merge, mergeFactor=2, os.version=4.4.0-112-generic, timestamp=1549245556909}]:[attributes={Lucene50StoredFieldsFormat.mode=BEST_SPEED}]) Uninverting(_8(7.8.0):c5:[diagnostics={os=Linux, java.vendor=Oracle Corporation, java.version=1.8.0_191, java.vm.version=25.191-b12, lucene.version=7.8.0, os.arch=amd64, java.runtime.version=1.8.0_191-b12, source=flush, os.version=4.4.0-112-generic, timestamp=1549245545239}]:[attributes={Lucene50StoredFieldsFormat.mode=BEST_SPEED}]) Uninverting(_b(7.8.0):c1:[diagnostics={os=Linux, java.vendor=Oracle Corporation, java.version=1.8.0_191, java.vm.version=25.191-b12, lucene.version=7.8.0, os.arch=amd64, java.runtime.version=1.8.0_191-b12, source=flush, os.version=4.4.0-112-generic, timestamp=1549245558347}]:[attributes={Lucene50StoredFieldsFormat.mode=BEST_SPEED}])))}
   [junit4]   2> 252018 INFO  (commitScheduler-450-thread-7) [    ] o.a.s.u.SolrIndexWriter Calling setCommitData with IW:org.apache.solr.update.SolrIndexWriter@c0c92c9 commitCommandVersion:0
   [junit4]   2> 252034 INFO  (commitScheduler-450-thread-7) [    ] o.a.s.s.SolrIndexSearcher Opening [Searcher@40e474e3[collection1] realtime]
   [junit4]   2> 252097 INFO  (commitScheduler-450-thread-7) [    ] o.a.s.u.DirectUpdateHandler2 end_commit_flush
   [junit4]   2> 258097 INFO  (TEST-SoftAutoCommitTest.testSoftCommitWithinAndHardCommitMaxTimeDelete-seed#[CB0076101F69D5D7]) [    ] o.a.s.SolrTestCaseJ4 ###Ending testSoftCommitWithinAndHardCommitMaxTimeDelete
   [junit4]   2> 258114 INFO  (TEST-SoftAutoCommitTest.testSoftAndHardCommitMaxDocs-seed#[CB0076101F69D5D7]) [    ] o.a.s.SolrTestCaseJ4 ###Starting testSoftAndHardCommitMaxDocs
   [junit4]   2> 266120 INFO  (TEST-SoftAutoCommitTest.testSoftAndHardCommitMaxDocs-seed#[CB0076101F69D5D7]) [    ] o.a.s.u.p.LogUpdateProcessorFactory [collection1]  webapp=null path=null params={}{add=[8000 (1624501725415079936)]} 0 2
   [junit4]   2> 266121 INFO  (TEST-SoftAutoCommitTest.testSoftAndHardCommitMaxDocs-seed#[CB0076101F69D5D7]) [    ] o.a.s.u.p.LogUpdateProcessorFactory [collection1]  webapp=null path=null params={}{add=[8001 (1624501725418225664)]} 0 0
   [junit4]   2> 266171 INFO  (TEST-SoftAutoCommitTest.testSoftAndHardCommitMaxDocs-seed#[CB0076101F69D5D7]) [    ] o.a.s.u.p.LogUpdateProcessorFactory [collection1]  webapp=null path=null params={}{add=[8002 (1624501725432905728)]} 0 49
   [junit4]   2> 266188 INFO  (TEST-SoftAutoCommitTest.testSoftAndHardCommitMaxDocs-seed#[CB0076101F69D5D7]) [    ] o.a.s.u.p.LogUpdateProcessorFactory [collection1]  webapp=null path=null params={}{add=[8003 (1624501725487431680)]} 0 1
   [junit4]   2> 266190 INFO  (TEST-SoftAutoCommitTest.testSoftAndHardCommitMaxDocs-seed#[CB0076101F69D5D7]) [    ] o.a.s.u.p.LogUpdateProcessorFactory [collection1]  webapp=null path=null params={}{add=[8004 (1624501725489528832)]} 0 1
   [junit4]   2> 266300 INFO  (TEST-SoftAutoCommitTest.testSoftAndHardCommitMaxDocs-seed#[CB0076101F69D5D7]) [    ] o.a.s.u.p.LogUpdateProcessorFactory [collection1]  webapp=null path=null params={}{add=[8005 (1624501725490577408)]} 0 110
   [junit4]   2> 266302 INFO  (TEST-SoftAutoCommitTest.testSoftAndHardCommitMaxDocs-seed#[CB0076101F69D5D7]) [    ] o.a.s.u.p.LogUpdateProcessorFactory [collection1]  webapp=null path=null params={}{add=[8006 (1624501725606969344)]} 0 0
   [junit4]   2> 266316 INFO  (commitScheduler-451-thread-10) [    ] o.a.s.u.DirectUpdateHandler2 start commit{,optimize=false,openSearcher=true,waitSearcher=true,expungeDeletes=false,softCommit=true,prepareCommit=false}
   [junit4]   2> 266337 INFO  (TEST-SoftAutoCommitTest.testSoftAndHardCommitMaxDocs-seed#[CB0076101F69D5D7]) [    ] o.a.s.u.p.LogUpdateProcessorFactory [collection1]  webapp=null path=null params={}{add=[8007 (1624501725608017920)]} 0 34
   [junit4]   2> 266354 INFO  (commitScheduler-450-thread-8) [    ] o.a.s.u.DirectUpdateHandler2 start commit{,optimize=false,openSearcher=false,waitSearcher=true,expungeDeletes=false,softCommit=false,prepareCommit=false}
   [junit4]   2> 266429 INFO  (commitScheduler-451-thread-10) [    ] o.a.s.s.SolrIndexSearcher Opening [Searcher@251d9d60[collection1] main]
   [junit4]   2> 266444 INFO  (searcherExecutor-447-thread-1) [    ] o.a.s.c.SolrCore [collection1] Registered new searcher Searcher@251d9d60[collection1] main{ExitableDirectoryReader(UninvertingDirectoryReader(Uninverting(_a(7.8.0):c2/1:[diagnostics={os=Linux, java.vendor=Oracle Corporation, java.version=1.8.0_191, java.vm.version=25.191-b12, lucene.version=7.8.0, mergeMaxNumSegments=-1, os.arch=amd64, java.runtime.version=1.8.0_191-b12, source=merge, mergeFactor=2, os.version=4.4.0-112-generic, timestamp=1549245556909}]:[attributes={Lucene50StoredFieldsFormat.mode=BEST_SPEED}]:delGen=1) Uninverting(_8(7.8.0):c5:[diagnostics={os=Linux, java.vendor=Oracle Corporation, java.version=1.8.0_191, java.vm.version=25.191-b12, lucene.version=7.8.0, os.arch=amd64, java.runtime.version=1.8.0_191-b12, source=flush, os.version=4.4.0-112-generic, timestamp=1549245545239}]:[attributes={Lucene50StoredFieldsFormat.mode=BEST_SPEED}]) Uninverting(_b(7.8.0):c1:[diagnostics={os=Linux, java.vendor=Oracle Corporation, java.version=1.8.0_191, java.vm.version=25.191-b12, lucene.version=7.8.0, os.arch=amd64, java.runtime.version=1.8.0_191-b12, source=flush, os.version=4.4.0-112-generic, timestamp=1549245558347}]:[attributes={Lucene50StoredFieldsFormat.mode=BEST_SPEED}]) Uninverting(_c(7.8.0):c8:[diagnostics={os=Linux, java.vendor=Oracle Corporation, java.version=1.8.0_191, java.vm.version=25.191-b12, lucene.version=7.8.0, os.arch=amd64, java.runtime.version=1.8.0_191-b12, source=flush, os.version=4.4.0-112-generic, timestamp=1549245572794}]:[attributes={Lucene50StoredFieldsFormat.mode=BEST_SPEED}])))}
   [junit4]   2> 266444 INFO  (commitScheduler-450-thread-8) [    ] o.a.s.u.SolrIndexWriter Calling setCommitData with IW:org.apache.solr.update.SolrIndexWriter@c0c92c9 commitCommandVersion:0
   [junit4]   2> 266445 INFO  (commitScheduler-451-thread-10) [    ] o.a.s.u.DirectUpdateHandler2 end_commit_flush
   [junit4]   2> 266446 INFO  (commitScheduler-450-thread-8) [    ] o.a.s.s.SolrIndexSearcher Opening [Searcher@31208417[collection1] realtime]
   [junit4]   2> 266464 INFO  (commitScheduler-450-thread-8) [    ] o.a.s.u.DirectUpdateHandler2 end_commit_flush
   [junit4]   2> 267447 INFO  (TEST-SoftAutoCommitTest.testSoftAndHardCommitMaxDocs-seed#[CB0076101F69D5D7]) [    ] o.a.s.SolrTestCaseJ4 ###Ending testSoftAndHardCommitMaxDocs
   [junit4]   2> 267500 INFO  (TEST-SoftAutoCommitTest.testHardCommitWithinAndSoftCommitMaxTimeDelete-seed#[CB0076101F69D5D7]) [    ] o.a.s.SolrTestCaseJ4 ###Starting testHardCommitWithinAndSoftCommitMaxTimeDelete
   [junit4]   2> 272535 INFO  (TEST-SoftAutoCommitTest.testHardCommitWithinAndSoftCommitMaxTimeDelete-seed#[CB0076101F69D5D7]) [    ] o.a.s.u.p.LogUpdateProcessorFactory [collection1]  webapp=null path=null params={}{add=[529 (1624501732114432000)]} 0 28
   [junit4]   2> 272536 INFO  (TEST-SoftAutoCommitTest.testHardCommitWithinAndSoftCommitMaxTimeDelete-seed#[CB0076101F69D5D7]) [    ] o.a.s.u.DirectUpdateHandler2 start commit{_version_=1624501732144840704,optimize=false,openSearcher=true,waitSearcher=true,expungeDeletes=false,softCommit=false,prepareCommit=false}
   [junit4]   2> 272536 INFO  (TEST-SoftAutoCommitTest.testHardCommitWithinAndSoftCommitMaxTimeDelete-seed#[CB0076101F69D5D7]) [    ] o.a.s.u.SolrIndexWriter Calling setCommitData with IW:org.apache.solr.update.SolrIndexWriter@c0c92c9 commitCommandVersion:1624501732144840704
   [junit4]   2> 272927 INFO  (TEST-SoftAutoCommitTest.testHardCommitWithinAndSoftCommitMaxTimeDelete-seed#[CB0076101F69D5D7]) [    ] o.a.s.s.SolrIndexSearcher Opening [Searcher@3ea843ad[collection1] main]
   [junit4]   2> 272947 INFO  (searcherExecutor-447-thread-1) [    ] o.a.s.c.SolrCore [collection1] Registered new searcher Searcher@3ea843ad[collection1] main{ExitableDirectoryReader(UninvertingDirectoryReader(Uninverting(_a(7.8.0):c2/1:[diagnostics={os=Linux, java.vendor=Oracle Corporation, java.version=1.8.0_191, java.vm.version=25.191-b12, lucene.version=7.8.0, mergeMaxNumSegments=-1, os.arch=amd64, java.runtime.version=1.8.0_191-b12, source=merge, mergeFactor=2, os.version=4.4.0-112-generic, timestamp=1549245556909}]:[attributes={Lucene50StoredFieldsFormat.mode=BEST_SPEED}]:delGen=1) Uninverting(_8(7.8.0):c5:[diagnostics={os=Linux, java.vendor=Oracle Corporation, java.version=1.8.0_191, java.vm.version=25.191-b12, lucene.version=7.8.0, os.arch=amd64, java.runtime.version=1.8.0_191-b12, source=flush, os.version=4.4.0-112-generic, timestamp=1549245545239}]:[attributes={Lucene50StoredFieldsFormat.mode=BEST_SPEED}]) Uninverting(_b(7.8.0):c1:[diagnostics={os=Linux, java.vendor=Oracle Corporation, java.version=1.8.0_191, java.vm.version=25.191-b12, lucene.version=7.8.0, os.arch=amd64, java.runtime.version=1.8.0_191-b12, source=flush, os.version=4.4.0-112-generic, timestamp=1549245558347}]:[attributes={Lucene50StoredFieldsFormat.mode=BEST_SPEED}]) Uninverting(_c(7.8.0):c8:[diagnostics={os=Linux, java.vendor=Oracle Corporation, java.version=1.8.0_191, java.vm.version=25.191-b12, lucene.version=7.8.0, os.arch=amd64, java.runtime.version=1.8.0_191-b12, source=flush, os.version=4.4.0-112-generic, timestamp=1549245572794}]:[attributes={Lucene50StoredFieldsFormat.mode=BEST_SPEED}]) Uninverting(_d(7.8.0):c1:[diagnostics={os=Linux, java.vendor=Oracle Corporation, java.version=1.8.0_191, java.vm.version=25.191-b12, lucene.version=7.8.0, os.arch=amd64, java.runtime.version=1.8.0_191-b12, source=flush, os.version=4.4.0-112-generic, timestamp=1549245579061}]:[attributes={Lucene50StoredFieldsFormat.mode=BEST_SPEED}])))}
   [junit4]   2> 272947 INFO  (TEST-SoftAutoCommitTest.testHardCommitWithinAndSoftCommitMaxTimeDelete-seed#[CB0076101F69D5D7]) [    ] o.a.s.u.DirectUpdateHandler2 end_commit_flush
   [junit4]   2> 272947 INFO  (TEST-SoftAutoCommitTest.testHardCommitWithinAndSoftCommitMaxTimeDelete-seed#[CB0076101F69D5D7]) [    ] o.a.s.u.p.LogUpdateProcessorFactory [collection1]  webapp=null path=null params={}{commit=} 0 411
   [junit4]   2> 273046 INFO  (TEST-SoftAutoCommitTest.testHardCommitWithinAndSoftCommitMaxTimeDelete-seed#[CB0076101F69D5D7]) [    ] o.a.s.u.p.LogUpdateProcessorFactory [collection1]  webapp=null path=null params={}{delete=[529 (-1624501732611457024)]} 0 98
   [junit4]   2> 273540 INFO  (commitScheduler-451-thread-12) [    ] o.a.s.u.DirectUpdateHandler2 start commit{,optimize=false,openSearcher=true,waitSearcher=true,expungeDeletes=false,softCommit=true,prepareCommit=false}
   [junit4]   2> 273597 INFO  (commitScheduler-451-thread-12) [    ] o.a.s.s.SolrIndexSearcher Opening [Searcher@5119ebad[collection1] main]
   [junit4]   2> 273598 INFO  (commitScheduler-451-thread-12) [    ] o.a.s.u.DirectUpdateHandler2 end_commit_flush
   [junit4]   2> 273602 INFO  (searcherExecutor-447-thread-1) [    ] o.a.s.c.SolrCore [collection1] Registered new searcher Searcher@5119ebad[collection1] main{ExitableDirectoryReader(UninvertingDirectoryReader(Uninverting(_a(7.8.0):c2/1:[diagnostics={os=Linux, java.vendor=Oracle Corporation, java.version=1.8.0_191, java.vm.version=25.191-b12, lucene.version=7.8.0, mergeMaxNumSegments=-1, os.arch=amd64, java.runtime.version=1.8.0_191-b12, source=merge, mergeFactor=2, os.version=4.4.0-112-generic, timestamp=1549245556909}]:[attributes={Lucene50StoredFieldsFormat.mode=BEST_SPEED}]:delGen=1) Uninverting(_8(7.8.0):c5:[diagnostics={os=Linux, java.vendor=Oracle Corporation, java.version=1.8.0_191, java.vm.version=25.191-b12, lucene.version=7.8.0, os.arch=amd64, java.runtime.version=1.8.0_191-b12, source=flush, os.version=4.4.0-112-generic, timestamp=1549245545239}]:[attributes={Lucene50StoredFieldsFormat.mode=BEST_SPEED}]) Uninverting(_b(7.8.0):c1:[diagnostics={os=Linux, java.vendor=Oracle Corporation, java.version=1.8.0_191, java.vm.version=25.191-b12, lucene.version=7.8.0, os.arch=amd64, java.runtime.version=1.8.0_191-b12, source=flush, os.version=4.4.0-112-generic, timestamp=1549245558347}]:[attributes={Lucene50StoredFieldsFormat.mode=BEST_SPEED}]) Uninverting(_c(7.8.0):c8:[diagnostics={os=Linux, java.vendor=Oracle Corporation, java.version=1.8.0_191, java.vm.version=25.191-b12, lucene.version=7.8.0, os.arch=amd64, java.runtime.version=1.8.0_191-b12, source=flush, os.version=4.4.0-112-generic, timestamp=1549245572794}]:[attributes={Lucene50StoredFieldsFormat.mode=BEST_SPEED}])))}
   [junit4]   2> 273616 INFO  (TEST-SoftAutoCommitTest.testHardCommitWithinAndSoftCommitMaxTimeDelete-seed#[CB0076101F69D5D7]) [    ] o.a.s.u.p.LogUpdateProcessorFactory [collection1]  webapp=null path=null params={}{add=[550 (1624501733274157056)]} 0 3
   [junit4]   2> 274156 INFO  (commitScheduler-451-thread-12) [    ] o.a.s.u.DirectUpdateHandler2 start commit{,optimize=false,openSearcher=true,waitSearcher=true,expungeDeletes=false,softCommit=true,prepareCommit=false}
   [junit4]   2> 274229 INFO  (commitScheduler-450-thread-9) [    ] o.a.s.u.DirectUpdateHandler2 start commit{,optimize=false,openSearcher=false,waitSearcher=true,expungeDeletes=false,softCommit=false,prepareCommit=false}
   [junit4]   2> 274282 INFO  (commitScheduler-451-thread-12) [    ] o.a.s.s.SolrIndexSearcher Opening [Searcher@1cd65f98[collection1] main]
   [junit4]   2> 274283 INFO  (commitScheduler-450-thread-9) [    ] o.a.s.u.SolrIndexWriter Calling setCommitData with IW:org.apache.solr.update.SolrIndexWriter@c0c92c9 commitCommandVersion:0
   [junit4]   2> 274319 INFO  (commitScheduler-451-thread-12) [    ] o.a.s.u.DirectUpdateHandler2 end_commit_flush
   [junit4]   2> 274341 INFO  (searcherExecutor-447-thread-1) [    ] o.a.s.c.SolrCore [collection1] Registered new searcher Searcher@1cd65f98[collection1] main{ExitableDirectoryReader(UninvertingDirectoryReader(Uninverting(_a(7.8.0):c2/1:[diagnostics={os=Linux, java.vendor=Oracle Corporation, java.version=1.8.0_191, java.vm.version=25.191-b12, lucene.version=7.8.0, mergeMaxNumSegments=-1, os.arch=amd64, java.runtime.version=1.8.0_191-b12, source=merge, mergeFactor=2, os.version=4.4.0-112-generic, timestamp=1549245556909}]:[attributes={Lucene50StoredFieldsFormat.mode=BEST_SPEED}]:delGen=1) Uninverting(_8(7.8.0):c5:[diagnostics={os=Linux, java.vendor=Oracle Corporation, java.version=1.8.0_191, java.vm.version=25.191-b12, lucene.version=7.8.0, os.arch=amd64, java.runtime.version=1.8.0_191-b12, source=flush, os.version=4.4.0-112-generic, timestamp=1549245545239}]:[attributes={Lucene50StoredFieldsFormat.mode=BEST_SPEED}]) Uninverting(_c(7.8.0):c8:[diagnostics={os=Linux, java.vendor=Oracle Corporation, java.version=1.8.0_191, java.vm.version=25.191-b12, lucene.version=7.8.0, os.arch=amd64, java.runtime.version=1.8.0_191-b12, source=flush, os.version=4.4.0-112-generic, timestamp=1549245572794}]:[attributes={Lucene50StoredFieldsFormat.mode=BEST_SPEED}]) Uninverting(_e(7.8.0):c1:[diagnostics={os=Linux, java.vendor=Oracle Corporation, java.version=1.8.0_191, java.vm.version=25.191-b12, lucene.version=7.8.0, os.arch=amd64, java.runtime.version=1.8.0_191-b12, source=flush, os.version=4.4.0-112-generic, timestamp=1549245580600}]:[attributes={Lucene50StoredFieldsFormat.mode=BEST_SPEED}])))}
   [junit4]   2> 274350 INFO  (commitScheduler-450-thread-9) [    ] o.a.s.s.SolrIndexSearcher Opening [Searcher@444205a6[collection1] realtime]
   [junit4]   2> 274391 INFO  (commitScheduler-450-thread-9) [    ] o.a.s.u.DirectUpdateHandler2 end_commit_flush
   [junit4]   2> 280330 INFO  (TEST-SoftAutoCommitTest.testHardCommitWithinAndSoftCommitMaxTimeDelete-seed#[CB0076101F69D5D7]) [    ] o.a.s.SolrTestCaseJ4 ###Ending testHardCommitWithinAndSoftCommitMaxTimeDelete
   [junit4]   2> 280350 INFO  (TEST-SoftAutoCommitTest.testSoftAndHardCommitMaxTimeRapidAdds-seed#[CB0076101F69D5D7]) [    ] o.a.s.SolrTestCaseJ4 ###Starting testSoftAndHardCommitMaxTimeRapidAdds
   [junit4]   2> 285438 INFO  (TEST-SoftAutoCommitTest.testSoftAndHardCommitMaxTimeRapidAdds-seed#[CB0076101F69D5D7]) [    ] o.a.s.u.p.LogUpdateProcessorFactory [collection1]  webapp=null path=null params={}{add=[5000 (1624501745601216512)]} 0 68
   [junit4]   2> 285439 INFO  (TEST-SoftAutoCommitTest.testSoftAndHardCommitMaxTimeRapidAdds-seed#[CB0076101F69D5D7]) [    ] o.a.s.u.p.LogUpdateProcessorFactory [collection1]  webapp=null path=null params={}{add=[5001 (1624501745674616832)]} 0 0
   [junit4]   2> 285440 INFO  (TEST-SoftAutoCommitTest.testSoftAndHardCommitMaxTimeRapidAdds-seed#[CB0076101F69D5D7]) [    ] o.a.s.u.p.LogUpdateProcessorFactory [collection1]  webapp=null path=null params={}{add=[5002 (1624501745675665408)]} 0 0
   [junit4]   2> 285441 INFO  (TEST-SoftAutoCommitTest.testSoftAndHardCommitMaxTimeRapidAdds-seed#[CB0076101F69D5D7]) [    ] o.a.s.u.p.LogUpdateProcessorFactory [collection1]  webapp=null path=null params={}{add=[5003 (1624501745676713984)]} 0 0
   [junit4]   2> 285500 INFO  (TEST-SoftAutoCommitTest.testSoftAndHardCommitMaxTimeRapidAdds-seed#[CB0076101F69D5D7]) [    ] o.a.s.u.p.LogUpdateProcessorFactory [collection1]  webapp=null path=null params={}{add=[5004 (1624501745737531392)]} 0 1
   [junit4]   2> 285500 INFO  (TEST-SoftAutoCommitTest.testSoftAndHardCommitMaxTimeRapidAdds-seed#[CB0076101F69D5D7]) [    ] o.a.s.u.SoftAutoCommitTest maxTimeMillis: 31582992805671264ns - 31582992674493050ns == 131ms
   [junit4]   2> 285500 INFO  (TEST-SoftAutoCommitTest.testSoftAndHardCommitMaxTimeRapidAdds-seed#[CB0076101F69D5D7]) [    ] o.a.s.u.SoftAutoCommitTest maxExpectedSoft=1
   [junit4]   2> 285500 INFO  (TEST-SoftAutoCommitTest.testSoftAndHardCommitMaxTimeRapidAdds-seed#[CB0076101F69D5D7]) [    ] o.a.s.u.SoftAutoCommitTest maxExpectedHard=1
   [junit4]   2> 285912 INFO  (commitScheduler-451-thread-13) [    ] o.a.s.u.DirectUpdateHandler2 start commit{,optimize=false,openSearcher=true,waitSearcher=true,expungeDeletes=false,softCommit=true,prepareCommit=false}
   [junit4]   2> 286147 INFO  (commitScheduler-451-thread-13) [    ] o.a.s.s.SolrIndexSearcher Opening [Searcher@64cf34ea[collection1] main]
   [junit4]   2> 286148 INFO  (commitScheduler-451-thread-13) [    ] o.a.s.u.DirectUpdateHandler2 end_commit_flush
   [junit4]   2> 286157 INFO  (searcherExecutor-447-thread-1) [    ] o.a.s.c.SolrCore [collection1] Registered new searcher Searcher@64cf34ea[collection1] main{ExitableDirectoryReader(UninvertingDirectoryReader(Uninverting(_a(7.8.0):c2/1:[diagnostics={os=Linux, java.vendor=Oracle Corporation, java.version=1.8.0_191, java.vm.version=25.191-b12, lucene.version=7.8.0, mergeMaxNumSegments=-1, os.arch=amd64, java.runtime.version=1.8.0_191-b12, source=merge, mergeFactor=2, os.version=4.4.0-112-generic, timestamp=1549245556909}]:[attributes={Lucene50StoredFieldsFormat.mode=BEST_SPEED}]:delGen=1) Uninverting(_c(7.8.0):c8:[diagnostics={os=Linux, java.vendor=Oracle Corporation, java.version=1.8.0_191, java.vm.version=25.191-b12, lucene.version=7.8.0, os.arch=amd64, java.runtime.version=1.8.0_191-b12, source=flush, os.version=4.4.0-112-generic, timestamp=1549245572794}]:[attributes={Lucene50StoredFieldsFormat.mode=BEST_SPEED}]) Uninverting(_e(7.8.0):c1:[diagnostics={os=Linux, java.vendor=Oracle Corporation, java.version=1.8.0_191, java.vm.version=25.191-b12, lucene.version=7.8.0, os.arch=amd64, java.runtime.version=1.8.0_191-b12, source=flush, os.version=4.4.0-112-generic, timestamp=1549245580600}]:[attributes={Lucene50StoredFieldsFormat.mode=BEST_SPEED}]) Uninverting(_f(7.8.0):c5:[diagnostics={os=Linux, java.vendor=Oracle Corporation, java.version=1.8.0_191, java.vm.version=25.191-b12, lucene.version=7.8.0, os.arch=amd64, java.runtime.version=1.8.0_191-b12, source=flush, os.version=4.4.0-112-generic, timestamp=1549245592500}]:[attributes={Lucene50StoredFieldsFormat.mode=BEST_SPEED}])))}
   [junit4]   2> 286605 INFO  (commitScheduler-450-thread-10) [    ] o.a.s.u.DirectUpdateHandler2 start commit{,optimize=false,openSearcher=false,waitSearcher=true,expungeDeletes=false,softCommit=false,prepareCommit=false}
   [junit4]   2> 286605 INFO  (commitScheduler-450-thread-10) [    ] o.a.s.u.SolrIndexWriter Calling setCommitData with IW:org.apache.solr.update.SolrIndexWriter@c0c92c9 commitCommandVersion:0
   [junit4]   2> 286606 INFO  (commitScheduler-450-thread-10) [    ] o.a.s.s.SolrIndexSearcher Opening [Searcher@7cf67908[collection1] realtime]
   [junit4]   2> 286607 INFO  (commitScheduler-450-thread-10) [    ] o.a.s.u.DirectUpdateHandler2 end_commit_flush
   [junit4]   2> 292273 INFO  (TEST-SoftAutoCommitTest.testSoftAndHardCommitMaxTimeRapidAdds-seed#[CB0076101F69D5D7]) [    ] o.a.s.SolrTestCaseJ4 ###Ending testSoftAndHardCommitMaxTimeRapidAdds
   [junit4]   2> 292290 INFO  (TEST-SoftAutoCommitTest.testSoftCommitWithinAndHardCommitMaxTimeRapidAdds-seed#[CB0076101F69D5D7]) [    ] o.a.s.SolrTestCaseJ4 ###Starting testSoftCommitWithinAndHardCommitMaxTimeRapidAdds
   [junit4]   2> 297406 INFO  (TEST-SoftAutoCommitTest.testSoftCommitWithinAndHardCommitMaxTimeRapidAdds-seed#[CB0076101F69D5D7]) [    ] o.a.s.u.p.LogUpdateProcessorFactory [collection1]  webapp=null path=null params={}{add=[5000 (1624501758109679616)]} 0 109
   [junit4]   2> 297408 INFO  (TEST-SoftAutoCommitTest.testSoftCommitWithinAndHardCommitMaxTimeRapidAdds-seed#[CB0076101F69D5D7]) [    ] o.a.s.u.p.LogUpdateProcessorFactory [collection1]  webapp=null path=null params={}{add=[5001 (1624501758223974400)]} 0 0
   [junit4]   2> 297409 INFO  (TEST-SoftAutoCommitTest.testSoftCommitWithinAndHardCommitMaxTimeRapidAdds-seed#[CB0076101F69D5D7]) [    ] o.a.s.u.p.LogUpdateProcessorFactory [collection1]  webapp=null path=null params={}{add=[5002 (1624501758225022976)]} 0 0
   [junit4]   2> 297410 INFO  (TEST-SoftAutoCommitTest.testSoftCommitWithinAndHardCommitMaxTimeRapidAdds-seed#[CB0076101F69D5D7]) [    ] o.a.s.u.p.LogUpdateProcessorFactory [collection1]  webapp=null path=null params={}{add=[5003 (1624501758226071552)]} 0 0
   [junit4]   2> 297582 INFO  (TEST-SoftAutoCommitTest.testSoftCommitWithinAndHardCommitMaxTimeRapidAdds-seed#[CB0076101F69D5D7]) [    ] o.a.s.u.p.LogUpdateProcessorFactory [collection1]  webapp=null path=null params={}{add=[5004 (1624501758320443392)]} 0 86
   [junit4]   2> 297582 INFO  (TEST-SoftAutoCommitTest.testSoftCommitWithinAndHardCommitMaxTimeRapidAdds-seed#[CB0076101F69D5D7]) [    ] o.a.s.u.SoftAutoCommitTest maxTimeMillis: 31583004887631302ns - 31583004602591930ns == 285ms
   [junit4]   2> 297582 INFO  (TEST-SoftAutoCommitTest.testSoftCommitWithinAndHardCommitMaxTimeRapidAdds-seed#[CB0076101F69D5D7]) [    ] o.a.s.u.SoftAutoCommitTest maxExpectedSoft=1
   [junit4]   2> 297582 INFO  (TEST-SoftAutoCommitTest.testSoftCommitWithinAndHardCommitMaxTimeRapidAdds-seed#[CB0076101F69D5D7]) [    ] o.a.s.u.SoftAutoCommitTest maxExpectedHard=1
   [junit4]   2> 297896 INFO  (commitScheduler-451-thread-14) [    ] o.a.s.u.DirectUpdateHandler2 start commit{,optimize=false,openSearcher=true,waitSearcher=true,expungeDeletes=false,softCommit=true,prepareCommit=false}
   [junit4]   2> 298248 INFO  (commitScheduler-451-thread-14) [    ] o.a.s.s.SolrIndexSearcher Opening [Searcher@5d01c6ce[collection1] main]
   [junit4]   2> 298261 INFO  (commitScheduler-451-thread-14) [    ] o.a.s.u.DirectUpdateHandler2 end_commit_flush
   [junit4]   2> 298263 INFO  (searcherExecutor-447-thread-1) [    ] o.a.s.c.SolrCore [collection1] Registered new searcher Searcher@5d01c6ce[collection1] main{ExitableDirectoryReader(UninvertingDirectoryReader(Uninverting(_a(7.8.0):c2/1:[diagnostics={os=Linux, java.vendor=Oracle Corporation, java.version=1.8.0_191, java.vm.version=25.191-b12, lucene.version=7.8.0, mergeMaxNumSegments=-1, os.arch=amd64, java.runtime.version=1.8.0_191-b12, source=merge, mergeFactor=2, os.version=4.4.0-112-generic, timestamp=1549245556909}]:[attributes={Lucene50StoredFieldsFormat.mode=BEST_SPEED}]:delGen=1) Uninverting(_c(7.8.0):c8:[diagnostics={os=Linux, java.vendor=Oracle Corporation, java.version=1.8.0_191, java.vm.version=25.191-b12, lucene.version=7.8.0, os.arch=amd64, java.runtime.version=1.8.0_191-b12, source=flush, os.version=4.4.0-112-generic, timestamp=1549245572794}]:[attributes={Lucene50StoredFieldsFormat.mode=BEST_SPEED}]) Uninverting(_e(7.8.0):c1:[diagnostics={os=Linux, java.vendor=Oracle Corporation, java.version=1.8.0_191, java.vm.version=25.191-b12, lucene.version=7.8.0, os.arch=amd64, java.runtime.version=1.8.0_191-b12, source=flush, os.version=4.4.0-112-generic, timestamp=1549245580600}]:[attributes={Lucene50StoredFieldsFormat.mode=BEST_SPEED}]) Uninverting(_g(7.8.0):c5:[diagnostics={os=Linux, java.vendor=Oracle Corporation, java.version=1.8.0_191, java.vm.version=25.191-b12, lucene.version=7.8.0, os.arch=amd64, java.runtime.version=1.8.0_191-b12, source=flush, os.version=4.4.0-112-generic, timestamp=1549245604559}]:[attributes={Lucene50StoredFieldsFormat.mode=BEST_SPEED}])))}
   [junit4]   2> 298516 INFO  (commitScheduler-450-thread-11) [    ] o.a.s.u.DirectUpdateHandler2 start commit{,optimize=false,openSearcher=false,waitSearcher=true,expungeDeletes=false,softCommit=false,prepareCommit=false}
   [junit4]   2> 298516 INFO  (commitScheduler-450-thread-11) [    ] o.a.s.u.SolrIndexWriter Calling setCommitData with IW:org.apache.solr.update.SolrIndexWriter@c0c92c9 commitCommandVersion:0
   [junit4]   2> 298537 INFO  (commitScheduler-450-thread-11) [    ] o.a.s.s.SolrIndexSearcher Opening [Searcher@17614ee5[collection1] realtime]
   [junit4]   2> 298576 INFO  (commitScheduler-450-thread-11) [    ] o.a.s.u.DirectUpdateHandler2 end_commit_flush
   [junit4]   2> 304406 INFO  (TEST-SoftAutoCommitTest.testSoftCommitWithinAndHardCommitMaxTimeRapidAdds-seed#[CB0076101F69D5D7]) [    ] o.a.s.SolrTestCaseJ4 ###Ending testSoftCommitWithinAndHardCommitMaxTimeRapidAdds
   [junit4]   2> 304409 INFO  (TEST-SoftAutoCommitTest.testSoftAndHardCommitMaxTimeDelete-seed#[CB0076101F69D5D7]) [    ] o.a.s.SolrTestCaseJ4 ###Starting testSoftAndHardCommitMaxTimeDelete
   [junit4]   2> 309443 INFO  (TEST-SoftAutoCommitTest.testSoftAndHardCommitMaxTimeDelete-seed#[CB0076101F69D5D7]) [    ] o.a.s.u.p.LogUpdateProcessorFactory [collection1]  webapp=null path=null params={}{add=[529 (1624501770815275008)]} 0 27
   [junit4]   2> 309443 INFO  (TEST-SoftAutoCommitTest.testSoftAndHardCommitMaxTimeDelete-seed#[CB0076101F69D5D7]) [    ] o.a.s.u.DirectUpdateHandler2 start commit{_version_=1624501770844635136,optimize=false,openSearcher=true,waitSearcher=true,expungeDeletes=false,softCommit=false,prepareCommit=false}
   [junit4]   2> 309444 INFO  (TEST-SoftAutoCommitTest.testSoftAndHardCommitMaxTimeDelete-seed#[CB0076101F69D5D7]) [    ] o.a.s.u.SolrIndexWriter Calling setCommitData with IW:org.apache.solr.update.SolrIndexWriter@c0c92c9 commitCommandVersion:1624501770844635136
   [junit4]   2> 309449 INFO  (TEST-SoftAutoCommitTest.testSoftAndHardCommitMaxTimeDelete-seed#[CB0076101F69D5D7]) [    ] o.a.s.s.SolrIndexSearcher Opening [Searcher@6dc5ba2d[collection1] main]
   [junit4]   2> 309450 INFO  (TEST-SoftAutoCommitTest.testSoftAndHardCommitMaxTimeDelete-seed#[CB0076101F69D5D7]) [    ] o.a.s.u.DirectUpdateHandler2 end_commit_flush
   [junit4]   2> 309452 INFO  (searcherExecutor-447-thread-1) [    ] o.a.s.c.SolrCore [collection1] Registered new searcher Searcher@6dc5ba2d[collection1] main{ExitableDirectoryReader(UninvertingDirectoryReader(Uninverting(_a(7.8.0):c2/1:[diagnostics={os=Linux, java.vendor=Oracle Corporation, java.version=1.8.0_191, java.vm.version=25.191-b12, lucene.version=7.8.0, mergeMaxNumSegments=-1, os.arch=amd64, java.runtime.version=1.8.0_191-b12, source=merge, mergeFactor=2, os.version=4.4.0-112-generic, timestamp=1549245556909}]:[attributes={Lucene50StoredFieldsFormat.mode=BEST_SPEED}]:delGen=1) Uninverting(_c(7.8.0):c8:[diagnostics={os=Linux, java.vendor=Oracle Corporation, java.version=1.8.0_191, java.vm.version=25.191-b12, lucene.version=7.8.0, os.arch=amd64, java.runtime.version=1.8.0_191-b12, source=flush, os.version=4.4.0-112-generic, timestamp=1549245572794}]:[attributes={Lucene50StoredFieldsFormat.mode=BEST_SPEED}]) Uninverting(_e(7.8.0):c1:[diagnostics={os=Linux, java.vendor=Oracle Corporation, java.version=1.8.0_191, java.vm.version=25.191-b12, lucene.version=7.8.0, os.arch=amd64, java.runtime.version=1.8.0_191-b12, source=flush, os.version=4.4.0-112-generic, timestamp=1549245580600}]:[attributes={Lucene50StoredFieldsFormat.mode=BEST_SPEED}]) Uninverting(_g(7.8.0):c5:[diagnostics={os=Linux, java.vendor=Oracle Corporation, java.version=1.8.0_191, java.vm.version=25.191-b12, lucene.version=7.8.0, os.arch=amd64, java.runtime.version=1.8.0_191-b12, source=flush, os.version=4.4.0-112-generic, timestamp=1549245604559}]:[attributes={Lucene50StoredFieldsFormat.mode=BEST_SPEED}]) Uninverting(_h(7.8.0):c1:[diagnostics={os=Linux, java.vendor=Oracle Corporation, java.version=1.8.0_191, java.vm.version=25.191-b12, lucene.version=7.8.0, os.arch=amd64, java.runtime.version=1.8.0_191-b12, source=flush, os.version=4.4.0-112-generic, timestamp=1549245615814}]:[attributes={Lucene50StoredFieldsFormat.mode=BEST_SPEED}])))}
   [junit4]   2> 309454 INFO  (TEST-SoftAutoCommitTest.testSoftAndHardCommitMaxTimeDelete-seed#[CB0076101F69D5D7]) [    ] o.a.s.u.p.LogUpdateProcessorFactory [collection1]  webapp=null path=null params={}{commit=} 0 10
   [junit4]   2> 309457 INFO  (TEST-SoftAutoCommitTest.testSoftAndHardCommitMaxTimeDelete-seed#[CB0076101F69D5D7]) [    ] o.a.s.u.p.LogUpdateProcessorFactory [collection1]  webapp=null path=null params={}{delete=[529 (-1624501770856169472)]} 0 2
   [junit4]   2> 309957 INFO  (commitScheduler-451-thread-15) [    ] o.a.s.u.DirectUpdateHandler2 start commit{,optimize=false,openSearcher=true,waitSearcher=true,expungeDeletes=false,softCommit=true,prepareCommit=false}
   [junit4]   2> 309973 INFO  (commitScheduler-451-thread-15) [    ] o.a.s.s.SolrIndexSearcher Opening [Searcher@3aa826c6[collection1] main]
   [junit4]   2> 309975 INFO  (searcherExecutor-447-thread-1) [    ] o.a.s.c.SolrCore [collection1] Registered new searcher Searcher@3aa826c6[collection1] main{ExitableDirectoryReader(UninvertingDirectoryReader(Uninverting(_a(7.8.0):c2/1:[diagnostics={os=Linux, java.vendor=Oracle Corporation, java.version=1.8.0_191, java.vm.version=25.191-b12, lucene.version=7.8.0, mergeMaxNumSegments=-1, os.arch=amd64, java.runtime.version=1.8.0_191-b12, source=merge, mergeFactor=2, os.version=4.4.0-112-generic, timestamp=1549245556909}]:[attributes={Lucene50StoredFieldsFormat.mode=BEST_SPEED}]:delGen=1) Uninverting(_c(7.8.0):c8:[diagnostics={os=Linux, java.vendor=Oracle Corporation, java.version=1.8.0_191, java.vm.version=25.191-b12, lucene.version=7.8.0, os.arch=amd64, java.runtime.version=1.8.0_191-b12, source=flush, os.version=4.4.0-112-generic, timestamp=1549245572794}]:[attributes={Lucene50StoredFieldsFormat.mode=BEST_SPEED}]) Uninverting(_e(7.8.0):c1:[diagnostics={os=Linux, java.vendor=Oracle Corporation, java.version=1.8.0_191, java.vm.version=25.191-b12, lucene.version=7.8.0, os.arch=amd64, java.runtime.version=1.8.0_191-b12, source=flush, os.version=4.4.0-112-generic, timestamp=1549245580600}]:[attributes={Lucene50StoredFieldsFormat.mode=BEST_SPEED}]) Uninverting(_g(7.8.0):c5:[diagnostics={os=Linux, java.vendor=Oracle Corporation, java.version=1.8.0_191, java.vm.version=25.191-b12, lucene.version=7.8.0, os.arch=amd64, java.runtime.version=1.8.0_191-b12, source=flush, os.version=4.4.0-112-generic, timestamp=1549245604559}]:[attributes={Lucene50StoredFieldsFormat.mode=BEST_SPEED}])))}
   [junit4]   2> 309979 INFO  (commitScheduler-451-thread-15) [    ] o.a.s.u.DirectUpdateHandler2 end_commit_flush
   [junit4]   2> 309987 INFO  (TEST-SoftAutoCommitTest.testSoftAndHardCommitMaxTimeDelete-seed#[CB0076101F69D5D7]) [    ] o.a.s.u.p.LogUpdateProcessorFactory [collection1]  webapp=null path=null params={}{add=[550 (1624501771406671872)]} 0 7
   [junit4]   2> 310481 INFO  (commitScheduler-451-thread-16) [    ] o.a.s.u.DirectUpdateHandler2 start commit{,optimize=false,openSearcher=true,waitSearcher=true,expungeDeletes=false,softCommit=true,prepareCommit=false}
   [junit4]   2> 310539 INFO  (commitScheduler-451-thread-16) [    ] o.a.s.s.SolrIndexSearcher Opening [Searcher@26f72089[collection1] main]
   [junit4]   2> 310539 INFO  (commitScheduler-451-thread-16) [    ] o.a.s.u.DirectUpdateHandler2 end_commit_flush
   [junit4]   2> 311234 INFO  (commitScheduler-450-thread-12) [    ] o.a.s.u.DirectUpdateHandler2 start commit{,optimize=false,openSearcher=false,waitSearcher=true,expungeDeletes=false,softCommit=false,prepareCommit=false}
   [junit4]   2> 311235 INFO  (commitScheduler-450-thread-12) [    ] o.a.s.u.SolrIndexWriter Calling setCommitData with IW:org.apache.solr.update.SolrIndexWriter@c0c92c9 commitCommandVersion:0
   [junit4]   2> 311235 INFO  (searcherExecutor-447-thread-1) [    ] o.a.s.c.SolrCore [collection1] Registered new searcher Searcher@26f72089[collection1] main{ExitableDirectoryReader(UninvertingDirectoryReader(Uninverting(_a(7.8.0):c2/1:[diagnostics={os=Linux, java.vendor=Oracle Corporation, java.version=1.8.0_191, java.vm.version=25.191-b12, lucene.version=7.8.0, mergeMaxNumSegments=-1, os.arch=amd64, java.runtime.version=1.8.0_191-b12, source=merge, mergeFactor=2, os.version=4.4.0-112-generic, timestamp=1549245556909}]:[attributes={Lucene50StoredFieldsFormat.mode=BEST_SPEED}]:delGen=1) Uninverting(_c(7.8.0):c8:[diagnostics={os=Linux, java.vendor=Oracle Corporation, java.version=1.8.0_191, java.vm.version=25.191-b12, lucene.version=7.8.0, os.arch=amd64, java.runtime.version=1.8.0_191-b12, source=flush, os.version=4.4.0-112-generic, timestamp=1549245572794}]:[attributes={Lucene50StoredFieldsFormat.mode=BEST_SPEED}]) Uninverting(_g(7.8.0):c5:[diagnostics={os=Linux, java.vendor=Oracle Corporation, java.version=1.8.0_191, java.vm.version=25.191-b12, lucene.version=7.8.0, os.arch=amd64, java.runtime.version=1.8.0_191-b12, source=flush, os.version=4.4.0-112-generic, timestamp=1549245604559}]:[attributes={Lucene50StoredFieldsFormat.mode=BEST_SPEED}]) Uninverting(_i(7.8.0):c1:[diagnostics={os=Linux, java.vendor=Oracle Corporation, java.version=1.8.0_191, java.vm.version=25.191-b12, lucene.version=7.8.0, os.arch=amd64, java.runtime.version=1.8.0_191-b12, source=flush, os.version=4.4.0-112-generic, timestamp=1549245616856}]:[attributes={Lucene50StoredFieldsFormat.mode=BEST_SPEED}])))}
   [junit4]   2> 311237 INFO  (commitScheduler-450-thread-12) [    ] o.a.s.s.SolrIndexSearcher Opening [Searcher@5195ac3a[collection1] realtime]
   [junit4]   2> 311239 INFO  (commitScheduler-450-thread-12) [    ] o.a.s.u.DirectUpdateHandler2 end_commit_flush
   [junit4]   2> 317237 INFO  (TEST-SoftAutoCommitTest.testSoftAndHardCommitMaxTimeDelete-seed#[CB0076101F69D5D7]) [    ] o.a.s.SolrTestCaseJ4 ###Ending testSoftAndHardCommitMaxTimeDelete
   [junit4]   2> 317238 INFO  (SUITE-SoftAutoCommitTest-seed#[CB0076101F69D5D7]-worker) [    ] o.a.s.SolrTestCaseJ4 ###deleteCore
   [junit4]   2> 317238 INFO  (SUITE-SoftAutoCommitTest-seed#[CB0076101F69D5D7]-worker) [    ] o.a.s.c.CoreContainer Shutting down CoreContainer instance=1520564134
   [junit4]   2> 317255 INFO  (coreCloseExecutor-452-thread-1) [    x:collection1] o.a.s.c.SolrCore [collection1]  CLOSING SolrCore org.apache.solr.core.SolrCore@54e185ab
   [junit4]   2> 317255 INFO  (coreCloseExecutor-452-thread-1) [    x:collection1] o.a.s.m.SolrMetricManager Closing metric reporters for registry=solr.core.collection1, tag=54e185ab
   [junit4]   2> 317255 INFO  (coreCloseExecutor-452-thread-1) [    x:collection1] o.a.s.m.r.SolrJmxReporter Closing reporter [org.apache.solr.metrics.reporters.SolrJmxReporter@6e6440b5: rootName = null, domain = solr.core.collection1, service url = null, agent id = null] for registry solr.core.collection1 / com.codahale.metrics.MetricRegistry@3f2af4ef
   [junit4]   2> 317285 INFO  (SUITE-SoftAutoCommitTest-seed#[CB0076101F69D5D7]-worker) [    ] o.a.s.m.SolrMetricManager Closing metric reporters for registry=solr.node, tag=null
   [junit4]   2> 317285 INFO  (SUITE-SoftAutoCommitTest-seed#[CB0076101F69D5D7]-worker) [    ] o.a.s.m.r.SolrJmxReporter Closing reporter [org.apache.solr.metrics.reporters.SolrJmxReporter@19a687c4: rootName = null, domain = solr.node, service url = null, agent id = null] for registry solr.node / com.codahale.metrics.MetricRegistry@10ecd665
   [junit4]   2> 317288 INFO  (SUITE-SoftAutoCommitTest-seed#[CB0076101F69D5D7]-worker) [    ] o.a.s.m.SolrMetricManager Closing metric reporters for registry=solr.jvm, tag=null
   [junit4]   2> 317289 INFO  (SUITE-SoftAutoCommitTest-seed#[CB0076101F69D5D7]-worker) [    ] o.a.s.m.r.SolrJmxReporter Closing reporter [org.apache.solr.metrics.reporters.SolrJmxReporter@36ed537d: rootName = null, domain = solr.jvm, service url = null, agent id = null] for registry solr.jvm / com.codahale.metrics.MetricRegistry@4c73f7fd
   [junit4]   2> 317290 INFO  (SUITE-SoftAutoCommitTest-seed#[CB0076101F69D5D7]-worker) [    ] o.a.s.m.SolrMetricManager Closing metric reporters for registry=solr.jetty, tag=null
   [junit4]   2> 317290 INFO  (SUITE-SoftAutoCommitTest-seed#[CB0076101F69D5D7]-worker) [    ] o.a.s.m.r.SolrJmxReporter Closing reporter [org.apache.solr.metrics.reporters.SolrJmxReporter@668321a6: rootName = null, domain = solr.jetty, service url = null, agent id = null] for registry solr.jetty / com.codahale.metrics.MetricRegistry@7df569d2
   [junit4]   2> NOTE: leaving temporary files on disk at: /home/jenkins/jenkins-slave/workspace/Lucene-Solr-BadApples-Tests-7.x/solr/build/solr-core/test/J0/temp/solr.update.SoftAutoCommitTest_CB0076101F69D5D7-001
   [junit4]   2> NOTE: test params are: codec=Asserting(Lucene70): {range_facet_l_dv=PostingsFormat(name=LuceneVarGapDocFreqInterval), multiDefault=PostingsFormat(name=LuceneVarGapFixedInterval), subject=PostingsFormat(name=LuceneVarGapFixedInterval), intDefault=PostingsFormat(name=LuceneFixedGap), id_i1=PostingsFormat(name=LuceneFixedGap), id=PostingsFormat(name=LuceneVarGapDocFreqInterval), range_facet_i_dv=PostingsFormat(name=LuceneVarGapFixedInterval), text=TestBloomFilteredLucenePostings(BloomFilteringPostingsFormat(Lucene50(blocksize=128))), range_facet_l=PostingsFormat(name=LuceneVarGapFixedInterval), timestamp=PostingsFormat(name=LuceneVarGapFixedInterval)}, docValues:{range_facet_l_dv=DocValuesFormat(name=Lucene70), _version_=DocValuesFormat(name=Asserting), subject=DocValuesFormat(name=Direct), multiDefault=DocValuesFormat(name=Direct), intDefault=DocValuesFormat(name=Asserting), id_i1=DocValuesFormat(name=Asserting), range_facet_i_dv=DocValuesFormat(name=Direct), id=DocValuesFormat(name=Lucene70), text=DocValuesFormat(name=Memory), intDvoDefault=DocValuesFormat(name=Lucene70), range_facet_l=DocValuesFormat(name=Direct), timestamp=DocValuesFormat(name=Direct)}, maxPointsInLeafNode=1793, maxMBSortInHeap=6.797100019222248, sim=RandomSimilarity(queryNorm=false): {}, locale=es-BO, timezone=MST7MDT
   [junit4]   2> NOTE: Linux 4.4.0-112-generic amd64/Oracle Corporation 1.8.0_191 (64-bit)/cpus=4,threads=1,free=328181528,total=461897728
   [junit4]   2> NOTE: All tests run in this JVM: [TestDynamicFieldResource, RemoteQueryErrorTest, NoCacheHeaderTest, TermVectorComponentDistributedTest, WordBreakSolrSpellCheckerTest, TestDocSet, TestCryptoKeys, SoftAutoCommitTest]
   [junit4] Completed [43/838 (1!)] on J0 in 114.07s, 10 tests, 1 failure <<< FAILURES!

[...truncated 2085 lines...]
   [junit4] Suite: org.apache.solr.handler.TestReplicationHandler
   [junit4]   2> Creating dataDir: /home/jenkins/jenkins-slave/workspace/Lucene-Solr-BadApples-Tests-7.x/solr/build/solr-core/test/J1/temp/solr.handler.TestReplicationHandler_CB0076101F69D5D7-001/init-core-data-001
   [junit4]   2> 3929139 WARN  (SUITE-TestReplicationHandler-seed#[CB0076101F69D5D7]-worker) [    ] o.a.s.SolrTestCaseJ4 startTrackingSearchers: numOpens=13 numCloses=13
   [junit4]   2> 3929139 INFO  (SUITE-TestReplicationHandler-seed#[CB0076101F69D5D7]-worker) [    ] o.a.s.SolrTestCaseJ4 Using PointFields (NUMERIC_POINTS_SYSPROP=true) w/NUMERIC_DOCVALUES_SYSPROP=false
   [junit4]   2> 3929140 INFO  (SUITE-TestReplicationHandler-seed#[CB0076101F69D5D7]-worker) [    ] o.a.s.SolrTestCaseJ4 Randomized ssl (false) and clientAuth (false) via: @org.apache.solr.SolrTestCaseJ4$SuppressSSL(bugUrl=None)
   [junit4]   2> 3929140 INFO  (SUITE-TestReplicationHandler-seed#[CB0076101F69D5D7]-worker) [    ] o.a.s.SolrTestCaseJ4 SecureRandom sanity checks: test.solr.allowed.securerandom=null & java.security.egd=file:/dev/./urandom
   [junit4]   2> 3929143 INFO  (TEST-TestReplicationHandler.doTestIndexFetchOnMasterRestart-seed#[CB0076101F69D5D7]) [    ] o.a.s.SolrTestCaseJ4 ###Starting doTestIndexFetchOnMasterRestart
   [junit4]   2> 3929143 INFO  (TEST-TestReplicationHandler.doTestIndexFetchOnMasterRestart-seed#[CB0076101F69D5D7]) [    ] o.a.s.SolrTestCaseJ4 Writing core.properties file to /home/jenkins/jenkins-slave/workspace/Lucene-Solr-BadApples-Tests-7.x/solr/build/solr-core/test/J1/temp/solr.handler.TestReplicationHandler_CB0076101F69D5D7-001/solr-instance-001/collection1
   [junit4]   2> 3929146 WARN  (TEST-TestReplicationHandler.doTestIndexFetchOnMasterRestart-seed#[CB0076101F69D5D7]) [    ] o.e.j.s.AbstractConnector Ignoring deprecated socket close linger time
   [junit4]   2> 3929146 INFO  (TEST-TestReplicationHandler.doTestIndexFetchOnMasterRestart-seed#[CB0076101F69D5D7]) [    ] o.a.s.c.s.e.JettySolrRunner Start Jetty (original configured port=0)
   [junit4]   2> 3929146 INFO  (TEST-TestReplicationHandler.doTestIndexFetchOnMasterRestart-seed#[CB0076101F69D5D7]) [    ] o.a.s.c.s.e.JettySolrRunner Trying to start Jetty on port 0 try number 1 ...
   [junit4]   2> 3929146 INFO  (TEST-TestReplicationHandler.doTestIndexFetchOnMasterRestart-seed#[CB0076101F69D5D7]) [    ] o.e.j.s.Server jetty-9.4.14.v20181114; built: 2018-11-14T21:20:31.478Z; git: c4550056e785fb5665914545889f21dc136ad9e6; jvm 1.8.0_191-b12
   [junit4]   2> 3929163 INFO  (TEST-TestReplicationHandler.doTestIndexFetchOnMasterRestart-seed#[CB0076101F69D5D7]) [    ] o.e.j.s.session DefaultSessionIdManager workerName=node0
   [junit4]   2> 3929163 INFO  (TEST-TestReplicationHandler.doTestIndexFetchOnMasterRestart-seed#[CB0076101F69D5D7]) [    ] o.e.j.s.session No SessionScavenger set, using defaults
   [junit4]   2> 3929163 INFO  (TEST-TestReplicationHandler.doTestIndexFetchOnMasterRestart-seed#[CB0076101F69D5D7]) [    ] o.e.j.s.session node0 Scavenging every 600000ms
   [junit4]   2> 3929164 INFO  (TEST-TestReplicationHandler.doTestIndexFetchOnMasterRestart-seed#[CB0076101F69D5D7]) [    ] o.e.j.s.h.ContextHandler Started o.e.j.s.ServletContextHandler@2d4816b2{/solr,null,AVAILABLE}
   [junit4]   2> 3929176 INFO  (TEST-TestReplicationHandler.doTestIndexFetchOnMasterRestart-seed#[CB0076101F69D5D7]) [    ] o.e.j.s.AbstractConnector Started ServerConnector@5ad1bb71{HTTP/1.1,[http/1.1]}{127.0.0.1:37358}
   [junit4]   2> 3929176 INFO  (TEST-TestReplicationHandler.doTestIndexFetchOnMasterRestart-seed#[CB0076101

[...truncated too long message...]

Apples-Tests-7.x/lucene/top-level-ivy-settings.xml

resolve:

ivy-availability-check:
[loadresource] Do not set property disallowed.ivy.jars.list as its length is 0.

-ivy-fail-disallowed-ivy-version:

ivy-fail:

ivy-configure:
[ivy:configure] :: loading settings :: file = /home/jenkins/jenkins-slave/workspace/Lucene-Solr-BadApples-Tests-7.x/lucene/top-level-ivy-settings.xml

resolve:

ivy-availability-check:
[loadresource] Do not set property disallowed.ivy.jars.list as its length is 0.

-ivy-fail-disallowed-ivy-version:

ivy-fail:

ivy-fail:

ivy-configure:
[ivy:configure] :: loading settings :: file = /home/jenkins/jenkins-slave/workspace/Lucene-Solr-BadApples-Tests-7.x/lucene/top-level-ivy-settings.xml

resolve:

ivy-availability-check:
[loadresource] Do not set property disallowed.ivy.jars.list as its length is 0.

-ivy-fail-disallowed-ivy-version:

ivy-fail:

ivy-configure:
[ivy:configure] :: loading settings :: file = /home/jenkins/jenkins-slave/workspace/Lucene-Solr-BadApples-Tests-7.x/lucene/top-level-ivy-settings.xml

resolve:

ivy-availability-check:
[loadresource] Do not set property disallowed.ivy.jars.list as its length is 0.

-ivy-fail-disallowed-ivy-version:

ivy-fail:

ivy-fail:

ivy-configure:
[ivy:configure] :: loading settings :: file = /home/jenkins/jenkins-slave/workspace/Lucene-Solr-BadApples-Tests-7.x/lucene/top-level-ivy-settings.xml

resolve:

ivy-availability-check:
[loadresource] Do not set property disallowed.ivy.jars.list as its length is 0.

-ivy-fail-disallowed-ivy-version:

ivy-fail:

ivy-fail:

ivy-configure:
[ivy:configure] :: loading settings :: file = /home/jenkins/jenkins-slave/workspace/Lucene-Solr-BadApples-Tests-7.x/lucene/top-level-ivy-settings.xml

resolve:

ivy-availability-check:
[loadresource] Do not set property disallowed.ivy.jars.list as its length is 0.

-ivy-fail-disallowed-ivy-version:

ivy-fail:

ivy-fail:

ivy-configure:
[ivy:configure] :: loading settings :: file = /home/jenkins/jenkins-slave/workspace/Lucene-Solr-BadApples-Tests-7.x/lucene/top-level-ivy-settings.xml

resolve:

ivy-availability-check:
[loadresource] Do not set property disallowed.ivy.jars.list as its length is 0.

-ivy-fail-disallowed-ivy-version:

ivy-fail:

ivy-fail:

ivy-configure:
[ivy:configure] :: loading settings :: file = /home/jenkins/jenkins-slave/workspace/Lucene-Solr-BadApples-Tests-7.x/lucene/top-level-ivy-settings.xml

resolve:

ivy-availability-check:
[loadresource] Do not set property disallowed.ivy.jars.list as its length is 0.

-ivy-fail-disallowed-ivy-version:

ivy-fail:

ivy-fail:

ivy-configure:
[ivy:configure] :: loading settings :: file = /home/jenkins/jenkins-slave/workspace/Lucene-Solr-BadApples-Tests-7.x/lucene/top-level-ivy-settings.xml

resolve:

ivy-availability-check:
[loadresource] Do not set property disallowed.ivy.jars.list as its length is 0.

-ivy-fail-disallowed-ivy-version:

ivy-fail:

ivy-fail:

ivy-configure:
[ivy:configure] :: loading settings :: file = /home/jenkins/jenkins-slave/workspace/Lucene-Solr-BadApples-Tests-7.x/lucene/top-level-ivy-settings.xml

resolve:

ivy-availability-check:
[loadresource] Do not set property disallowed.ivy.jars.list as its length is 0.

-ivy-fail-disallowed-ivy-version:

ivy-fail:

ivy-fail:

ivy-configure:
[ivy:configure] :: loading settings :: file = /home/jenkins/jenkins-slave/workspace/Lucene-Solr-BadApples-Tests-7.x/lucene/top-level-ivy-settings.xml

resolve:

ivy-availability-check:
[loadresource] Do not set property disallowed.ivy.jars.list as its length is 0.

-ivy-fail-disallowed-ivy-version:

ivy-fail:

ivy-fail:

ivy-configure:
[ivy:configure] :: loading settings :: file = /home/jenkins/jenkins-slave/workspace/Lucene-Solr-BadApples-Tests-7.x/lucene/top-level-ivy-settings.xml

resolve:

ivy-availability-check:
[loadresource] Do not set property disallowed.ivy.jars.list as its length is 0.

-ivy-fail-disallowed-ivy-version:

ivy-fail:

ivy-fail:

ivy-configure:
[ivy:configure] :: loading settings :: file = /home/jenkins/jenkins-slave/workspace/Lucene-Solr-BadApples-Tests-7.x/lucene/top-level-ivy-settings.xml

resolve:

ivy-availability-check:
[loadresource] Do not set property disallowed.ivy.jars.list as its length is 0.

-ivy-fail-disallowed-ivy-version:

ivy-fail:

ivy-fail:

ivy-configure:
[ivy:configure] :: loading settings :: file = /home/jenkins/jenkins-slave/workspace/Lucene-Solr-BadApples-Tests-7.x/lucene/top-level-ivy-settings.xml

resolve:

jar-checksums:
    [mkdir] Created dir: /home/jenkins/jenkins-slave/workspace/Lucene-Solr-BadApples-Tests-7.x/solr/null1962282094
     [copy] Copying 242 files to /home/jenkins/jenkins-slave/workspace/Lucene-Solr-BadApples-Tests-7.x/solr/null1962282094
   [delete] Deleting directory /home/jenkins/jenkins-slave/workspace/Lucene-Solr-BadApples-Tests-7.x/solr/null1962282094

check-working-copy:
[ivy:cachepath] :: resolving dependencies :: org.eclipse.jgit#org.eclipse.jgit-caller;working
[ivy:cachepath] 	confs: [default]
[ivy:cachepath] 	found org.eclipse.jgit#org.eclipse.jgit;4.6.0.201612231935-r in public
[ivy:cachepath] 	found com.jcraft#jsch;0.1.53 in public
[ivy:cachepath] 	found com.googlecode.javaewah#JavaEWAH;1.1.6 in public
[ivy:cachepath] 	found org.apache.httpcomponents#httpclient;4.3.6 in public
[ivy:cachepath] 	found org.apache.httpcomponents#httpcore;4.3.3 in public
[ivy:cachepath] 	found commons-logging#commons-logging;1.1.3 in public
[ivy:cachepath] 	found commons-codec#commons-codec;1.6 in public
[ivy:cachepath] 	found org.slf4j#slf4j-api;1.7.2 in public
[ivy:cachepath] :: resolution report :: resolve 193ms :: artifacts dl 3ms
	---------------------------------------------------------------------
	|                  |            modules            ||   artifacts   |
	|       conf       | number| search|dwnlded|evicted|| number|dwnlded|
	---------------------------------------------------------------------
	|      default     |   8   |   0   |   0   |   0   ||   8   |   0   |
	---------------------------------------------------------------------
[wc-checker] Initializing working copy...
[wc-checker] SLF4J: Failed to load class "org.slf4j.impl.StaticLoggerBinder".
[wc-checker] SLF4J: Defaulting to no-operation (NOP) logger implementation
[wc-checker] SLF4J: See http://www.slf4j.org/codes.html#StaticLoggerBinder for further details.
[wc-checker] Checking working copy status...

-jenkins-base:

BUILD SUCCESSFUL
Total time: 211 minutes 6 seconds
Archiving artifacts
java.lang.InterruptedException: no matches found within 10000
	at hudson.FilePath$ValidateAntFileMask.hasMatch(FilePath.java:2847)
	at hudson.FilePath$ValidateAntFileMask.invoke(FilePath.java:2726)
	at hudson.FilePath$ValidateAntFileMask.invoke(FilePath.java:2707)
	at hudson.FilePath$FileCallableWrapper.call(FilePath.java:3086)
Also:   hudson.remoting.Channel$CallSiteStackTrace: Remote call to lucene2
		at hudson.remoting.Channel.attachCallSiteStackTrace(Channel.java:1741)
		at hudson.remoting.UserRequest$ExceptionResponse.retrieve(UserRequest.java:357)
		at hudson.remoting.Channel.call(Channel.java:955)
		at hudson.FilePath.act(FilePath.java:1072)
		at hudson.FilePath.act(FilePath.java:1061)
		at hudson.FilePath.validateAntFileMask(FilePath.java:2705)
		at hudson.tasks.ArtifactArchiver.perform(ArtifactArchiver.java:243)
		at hudson.tasks.BuildStepCompatibilityLayer.perform(BuildStepCompatibilityLayer.java:81)
		at hudson.tasks.BuildStepMonitor$1.perform(BuildStepMonitor.java:20)
		at hudson.model.AbstractBuild$AbstractBuildExecution.perform(AbstractBuild.java:744)
		at hudson.model.AbstractBuild$AbstractBuildExecution.performAllBuildSteps(AbstractBuild.java:690)
		at hudson.model.Build$BuildExecution.post2(Build.java:186)
		at hudson.model.AbstractBuild$AbstractBuildExecution.post(AbstractBuild.java:635)
		at hudson.model.Run.execute(Run.java:1835)
		at hudson.model.FreeStyleBuild.run(FreeStyleBuild.java:43)
		at hudson.model.ResourceController.execute(ResourceController.java:97)
		at hudson.model.Executor.run(Executor.java:429)
Caused: hudson.FilePath$TunneledInterruptedException
	at hudson.FilePath$FileCallableWrapper.call(FilePath.java:3088)
	at hudson.remoting.UserRequest.perform(UserRequest.java:212)
	at hudson.remoting.UserRequest.perform(UserRequest.java:54)
	at hudson.remoting.Request$2.run(Request.java:369)
	at hudson.remoting.InterceptingExecutorService$1.call(InterceptingExecutorService.java:72)
	at java.util.concurrent.FutureTask.run(FutureTask.java:266)
	at java.util.concurrent.ThreadPoolExecutor.runWorker(ThreadPoolExecutor.java:1142)
	at java.util.concurrent.ThreadPoolExecutor$Worker.run(ThreadPoolExecutor.java:617)
	at java.lang.Thread.run(Thread.java:748)
Caused: java.lang.InterruptedException: java.lang.InterruptedException: no matches found within 10000
	at hudson.FilePath.act(FilePath.java:1074)
	at hudson.FilePath.act(FilePath.java:1061)
	at hudson.FilePath.validateAntFileMask(FilePath.java:2705)
	at hudson.tasks.ArtifactArchiver.perform(ArtifactArchiver.java:243)
	at hudson.tasks.BuildStepCompatibilityLayer.perform(BuildStepCompatibilityLayer.java:81)
	at hudson.tasks.BuildStepMonitor$1.perform(BuildStepMonitor.java:20)
	at hudson.model.AbstractBuild$AbstractBuildExecution.perform(AbstractBuild.java:744)
	at hudson.model.AbstractBuild$AbstractBuildExecution.performAllBuildSteps(AbstractBuild.java:690)
	at hudson.model.Build$BuildExecution.post2(Build.java:186)
	at hudson.model.AbstractBuild$AbstractBuildExecution.post(AbstractBuild.java:635)
	at hudson.model.Run.execute(Run.java:1835)
	at hudson.model.FreeStyleBuild.run(FreeStyleBuild.java:43)
	at hudson.model.ResourceController.execute(ResourceController.java:97)
	at hudson.model.Executor.run(Executor.java:429)
No artifacts found that match the file pattern "**/*.events,heapdumps/**,**/hs_err_pid*". Configuration error?
Recording test results
Build step 'Publish JUnit test result report' changed build result to UNSTABLE
Email was triggered for: Unstable (Test Failures)
Sending email for trigger: Unstable (Test Failures)

Mime
View raw message