lucene-dev mailing list archives

Site index · List index
Message view « Date » · « Thread »
Top « Date » · « Thread »
From Apache Jenkins Server <jenk...@builds.apache.org>
Subject [JENKINS] Lucene-Solr-NightlyTests-7.7 - Build # 4 - Unstable
Date Tue, 05 Feb 2019 02:07:41 GMT
Build: https://builds.apache.org/job/Lucene-Solr-NightlyTests-7.7/4/

3 tests failed.
FAILED:  junit.framework.TestSuite.org.apache.solr.cloud.autoscaling.ExecutePlanActionTest

Error Message:
ObjectTracker found 2 object(s) that were not released!!! [ZkStateReader, SolrZkClient] org.apache.solr.common.util.ObjectReleaseTracker$ObjectTrackerException: org.apache.solr.common.cloud.ZkStateReader  at org.apache.solr.common.util.ObjectReleaseTracker.track(ObjectReleaseTracker.java:42)  at org.apache.solr.common.cloud.ZkStateReader.<init>(ZkStateReader.java:328)  at org.apache.solr.client.solrj.impl.ZkClientClusterStateProvider.connect(ZkClientClusterStateProvider.java:160)  at org.apache.solr.client.solrj.impl.CloudSolrClient.connect(CloudSolrClient.java:399)  at org.apache.solr.client.solrj.impl.CloudSolrClient.requestWithRetryOnStaleState(CloudSolrClient.java:827)  at org.apache.solr.client.solrj.impl.CloudSolrClient.request(CloudSolrClient.java:817)  at org.apache.solr.client.solrj.SolrRequest.process(SolrRequest.java:194)  at org.apache.solr.client.solrj.SolrRequest.process(SolrRequest.java:211)  at org.apache.solr.client.solrj.impl.SolrClientCloudManager.request(SolrClientCloudManager.java:115)  at org.apache.solr.cloud.autoscaling.ExecutePlanAction.waitForTaskToFinish(ExecutePlanAction.java:132)  at org.apache.solr.cloud.autoscaling.ExecutePlanAction.process(ExecutePlanAction.java:85)  at org.apache.solr.cloud.autoscaling.ScheduledTriggers.lambda$null$3(ScheduledTriggers.java:325)  at java.util.concurrent.Executors$RunnableAdapter.call(Executors.java:511)  at java.util.concurrent.FutureTask.run(FutureTask.java:266)  at org.apache.solr.common.util.ExecutorUtil$MDCAwareThreadPoolExecutor.lambda$execute$0(ExecutorUtil.java:209)  at java.util.concurrent.ThreadPoolExecutor.runWorker(ThreadPoolExecutor.java:1149)  at java.util.concurrent.ThreadPoolExecutor$Worker.run(ThreadPoolExecutor.java:624)  at java.lang.Thread.run(Thread.java:748)  org.apache.solr.common.util.ObjectReleaseTracker$ObjectTrackerException: org.apache.solr.common.cloud.SolrZkClient  at org.apache.solr.common.util.ObjectReleaseTracker.track(ObjectReleaseTracker.java:42)  at org.apache.solr.common.cloud.SolrZkClient.<init>(SolrZkClient.java:203)  at org.apache.solr.common.cloud.SolrZkClient.<init>(SolrZkClient.java:126)  at org.apache.solr.common.cloud.SolrZkClient.<init>(SolrZkClient.java:116)  at org.apache.solr.common.cloud.ZkStateReader.<init>(ZkStateReader.java:306)  at org.apache.solr.client.solrj.impl.ZkClientClusterStateProvider.connect(ZkClientClusterStateProvider.java:160)  at org.apache.solr.client.solrj.impl.CloudSolrClient.connect(CloudSolrClient.java:399)  at org.apache.solr.client.solrj.impl.CloudSolrClient.requestWithRetryOnStaleState(CloudSolrClient.java:827)  at org.apache.solr.client.solrj.impl.CloudSolrClient.request(CloudSolrClient.java:817)  at org.apache.solr.client.solrj.SolrRequest.process(SolrRequest.java:194)  at org.apache.solr.client.solrj.SolrRequest.process(SolrRequest.java:211)  at org.apache.solr.client.solrj.impl.SolrClientCloudManager.request(SolrClientCloudManager.java:115)  at org.apache.solr.cloud.autoscaling.ExecutePlanAction.waitForTaskToFinish(ExecutePlanAction.java:132)  at org.apache.solr.cloud.autoscaling.ExecutePlanAction.process(ExecutePlanAction.java:85)  at org.apache.solr.cloud.autoscaling.ScheduledTriggers.lambda$null$3(ScheduledTriggers.java:325)  at java.util.concurrent.Executors$RunnableAdapter.call(Executors.java:511)  at java.util.concurrent.FutureTask.run(FutureTask.java:266)  at org.apache.solr.common.util.ExecutorUtil$MDCAwareThreadPoolExecutor.lambda$execute$0(ExecutorUtil.java:209)  at java.util.concurrent.ThreadPoolExecutor.runWorker(ThreadPoolExecutor.java:1149)  at java.util.concurrent.ThreadPoolExecutor$Worker.run(ThreadPoolExecutor.java:624)  at java.lang.Thread.run(Thread.java:748)   expected null, but was:<ObjectTracker found 2 object(s) that were not released!!! [ZkStateReader, SolrZkClient] org.apache.solr.common.util.ObjectReleaseTracker$ObjectTrackerException: org.apache.solr.common.cloud.ZkStateReader  at org.apache.solr.common.util.ObjectReleaseTracker.track(ObjectReleaseTracker.java:42)  at org.apache.solr.common.cloud.ZkStateReader.<init>(ZkStateReader.java:328)  at org.apache.solr.client.solrj.impl.ZkClientClusterStateProvider.connect(ZkClientClusterStateProvider.java:160)  at org.apache.solr.client.solrj.impl.CloudSolrClient.connect(CloudSolrClient.java:399)  at org.apache.solr.client.solrj.impl.CloudSolrClient.requestWithRetryOnStaleState(CloudSolrClient.java:827)  at org.apache.solr.client.solrj.impl.CloudSolrClient.request(CloudSolrClient.java:817)  at org.apache.solr.client.solrj.SolrRequest.process(SolrRequest.java:194)  at org.apache.solr.client.solrj.SolrRequest.process(SolrRequest.java:211)  at org.apache.solr.client.solrj.impl.SolrClientCloudManager.request(SolrClientCloudManager.java:115)  at org.apache.solr.cloud.autoscaling.ExecutePlanAction.waitForTaskToFinish(ExecutePlanAction.java:132)  at org.apache.solr.cloud.autoscaling.ExecutePlanAction.process(ExecutePlanAction.java:85)  at org.apache.solr.cloud.autoscaling.ScheduledTriggers.lambda$null$3(ScheduledTriggers.java:325)  at java.util.concurrent.Executors$RunnableAdapter.call(Executors.java:511)  at java.util.concurrent.FutureTask.run(FutureTask.java:266)  at org.apache.solr.common.util.ExecutorUtil$MDCAwareThreadPoolExecutor.lambda$execute$0(ExecutorUtil.java:209)  at java.util.concurrent.ThreadPoolExecutor.runWorker(ThreadPoolExecutor.java:1149)  at java.util.concurrent.ThreadPoolExecutor$Worker.run(ThreadPoolExecutor.java:624)  at java.lang.Thread.run(Thread.java:748)  org.apache.solr.common.util.ObjectReleaseTracker$ObjectTrackerException: org.apache.solr.common.cloud.SolrZkClient  at org.apache.solr.common.util.ObjectReleaseTracker.track(ObjectReleaseTracker.java:42)  at org.apache.solr.common.cloud.SolrZkClient.<init>(SolrZkClient.java:203)  at org.apache.solr.common.cloud.SolrZkClient.<init>(SolrZkClient.java:126)  at org.apache.solr.common.cloud.SolrZkClient.<init>(SolrZkClient.java:116)  at org.apache.solr.common.cloud.ZkStateReader.<init>(ZkStateReader.java:306)  at org.apache.solr.client.solrj.impl.ZkClientClusterStateProvider.connect(ZkClientClusterStateProvider.java:160)  at org.apache.solr.client.solrj.impl.CloudSolrClient.connect(CloudSolrClient.java:399)  at org.apache.solr.client.solrj.impl.CloudSolrClient.requestWithRetryOnStaleState(CloudSolrClient.java:827)  at org.apache.solr.client.solrj.impl.CloudSolrClient.request(CloudSolrClient.java:817)  at org.apache.solr.client.solrj.SolrRequest.process(SolrRequest.java:194)  at org.apache.solr.client.solrj.SolrRequest.process(SolrRequest.java:211)  at org.apache.solr.client.solrj.impl.SolrClientCloudManager.request(SolrClientCloudManager.java:115)  at org.apache.solr.cloud.autoscaling.ExecutePlanAction.waitForTaskToFinish(ExecutePlanAction.java:132)  at org.apache.solr.cloud.autoscaling.ExecutePlanAction.process(ExecutePlanAction.java:85)  at org.apache.solr.cloud.autoscaling.ScheduledTriggers.lambda$null$3(ScheduledTriggers.java:325)  at java.util.concurrent.Executors$RunnableAdapter.call(Executors.java:511)  at java.util.concurrent.FutureTask.run(FutureTask.java:266)  at org.apache.solr.common.util.ExecutorUtil$MDCAwareThreadPoolExecutor.lambda$execute$0(ExecutorUtil.java:209)  at java.util.concurrent.ThreadPoolExecutor.runWorker(ThreadPoolExecutor.java:1149)  at java.util.concurrent.ThreadPoolExecutor$Worker.run(ThreadPoolExecutor.java:624)  at java.lang.Thread.run(Thread.java:748)  >

Stack Trace:
java.lang.AssertionError: ObjectTracker found 2 object(s) that were not released!!! [ZkStateReader, SolrZkClient]
org.apache.solr.common.util.ObjectReleaseTracker$ObjectTrackerException: org.apache.solr.common.cloud.ZkStateReader
	at org.apache.solr.common.util.ObjectReleaseTracker.track(ObjectReleaseTracker.java:42)
	at org.apache.solr.common.cloud.ZkStateReader.<init>(ZkStateReader.java:328)
	at org.apache.solr.client.solrj.impl.ZkClientClusterStateProvider.connect(ZkClientClusterStateProvider.java:160)
	at org.apache.solr.client.solrj.impl.CloudSolrClient.connect(CloudSolrClient.java:399)
	at org.apache.solr.client.solrj.impl.CloudSolrClient.requestWithRetryOnStaleState(CloudSolrClient.java:827)
	at org.apache.solr.client.solrj.impl.CloudSolrClient.request(CloudSolrClient.java:817)
	at org.apache.solr.client.solrj.SolrRequest.process(SolrRequest.java:194)
	at org.apache.solr.client.solrj.SolrRequest.process(SolrRequest.java:211)
	at org.apache.solr.client.solrj.impl.SolrClientCloudManager.request(SolrClientCloudManager.java:115)
	at org.apache.solr.cloud.autoscaling.ExecutePlanAction.waitForTaskToFinish(ExecutePlanAction.java:132)
	at org.apache.solr.cloud.autoscaling.ExecutePlanAction.process(ExecutePlanAction.java:85)
	at org.apache.solr.cloud.autoscaling.ScheduledTriggers.lambda$null$3(ScheduledTriggers.java:325)
	at java.util.concurrent.Executors$RunnableAdapter.call(Executors.java:511)
	at java.util.concurrent.FutureTask.run(FutureTask.java:266)
	at org.apache.solr.common.util.ExecutorUtil$MDCAwareThreadPoolExecutor.lambda$execute$0(ExecutorUtil.java:209)
	at java.util.concurrent.ThreadPoolExecutor.runWorker(ThreadPoolExecutor.java:1149)
	at java.util.concurrent.ThreadPoolExecutor$Worker.run(ThreadPoolExecutor.java:624)
	at java.lang.Thread.run(Thread.java:748)

org.apache.solr.common.util.ObjectReleaseTracker$ObjectTrackerException: org.apache.solr.common.cloud.SolrZkClient
	at org.apache.solr.common.util.ObjectReleaseTracker.track(ObjectReleaseTracker.java:42)
	at org.apache.solr.common.cloud.SolrZkClient.<init>(SolrZkClient.java:203)
	at org.apache.solr.common.cloud.SolrZkClient.<init>(SolrZkClient.java:126)
	at org.apache.solr.common.cloud.SolrZkClient.<init>(SolrZkClient.java:116)
	at org.apache.solr.common.cloud.ZkStateReader.<init>(ZkStateReader.java:306)
	at org.apache.solr.client.solrj.impl.ZkClientClusterStateProvider.connect(ZkClientClusterStateProvider.java:160)
	at org.apache.solr.client.solrj.impl.CloudSolrClient.connect(CloudSolrClient.java:399)
	at org.apache.solr.client.solrj.impl.CloudSolrClient.requestWithRetryOnStaleState(CloudSolrClient.java:827)
	at org.apache.solr.client.solrj.impl.CloudSolrClient.request(CloudSolrClient.java:817)
	at org.apache.solr.client.solrj.SolrRequest.process(SolrRequest.java:194)
	at org.apache.solr.client.solrj.SolrRequest.process(SolrRequest.java:211)
	at org.apache.solr.client.solrj.impl.SolrClientCloudManager.request(SolrClientCloudManager.java:115)
	at org.apache.solr.cloud.autoscaling.ExecutePlanAction.waitForTaskToFinish(ExecutePlanAction.java:132)
	at org.apache.solr.cloud.autoscaling.ExecutePlanAction.process(ExecutePlanAction.java:85)
	at org.apache.solr.cloud.autoscaling.ScheduledTriggers.lambda$null$3(ScheduledTriggers.java:325)
	at java.util.concurrent.Executors$RunnableAdapter.call(Executors.java:511)
	at java.util.concurrent.FutureTask.run(FutureTask.java:266)
	at org.apache.solr.common.util.ExecutorUtil$MDCAwareThreadPoolExecutor.lambda$execute$0(ExecutorUtil.java:209)
	at java.util.concurrent.ThreadPoolExecutor.runWorker(ThreadPoolExecutor.java:1149)
	at java.util.concurrent.ThreadPoolExecutor$Worker.run(ThreadPoolExecutor.java:624)
	at java.lang.Thread.run(Thread.java:748)

 expected null, but was:<ObjectTracker found 2 object(s) that were not released!!! [ZkStateReader, SolrZkClient]
org.apache.solr.common.util.ObjectReleaseTracker$ObjectTrackerException: org.apache.solr.common.cloud.ZkStateReader
	at org.apache.solr.common.util.ObjectReleaseTracker.track(ObjectReleaseTracker.java:42)
	at org.apache.solr.common.cloud.ZkStateReader.<init>(ZkStateReader.java:328)
	at org.apache.solr.client.solrj.impl.ZkClientClusterStateProvider.connect(ZkClientClusterStateProvider.java:160)
	at org.apache.solr.client.solrj.impl.CloudSolrClient.connect(CloudSolrClient.java:399)
	at org.apache.solr.client.solrj.impl.CloudSolrClient.requestWithRetryOnStaleState(CloudSolrClient.java:827)
	at org.apache.solr.client.solrj.impl.CloudSolrClient.request(CloudSolrClient.java:817)
	at org.apache.solr.client.solrj.SolrRequest.process(SolrRequest.java:194)
	at org.apache.solr.client.solrj.SolrRequest.process(SolrRequest.java:211)
	at org.apache.solr.client.solrj.impl.SolrClientCloudManager.request(SolrClientCloudManager.java:115)
	at org.apache.solr.cloud.autoscaling.ExecutePlanAction.waitForTaskToFinish(ExecutePlanAction.java:132)
	at org.apache.solr.cloud.autoscaling.ExecutePlanAction.process(ExecutePlanAction.java:85)
	at org.apache.solr.cloud.autoscaling.ScheduledTriggers.lambda$null$3(ScheduledTriggers.java:325)
	at java.util.concurrent.Executors$RunnableAdapter.call(Executors.java:511)
	at java.util.concurrent.FutureTask.run(FutureTask.java:266)
	at org.apache.solr.common.util.ExecutorUtil$MDCAwareThreadPoolExecutor.lambda$execute$0(ExecutorUtil.java:209)
	at java.util.concurrent.ThreadPoolExecutor.runWorker(ThreadPoolExecutor.java:1149)
	at java.util.concurrent.ThreadPoolExecutor$Worker.run(ThreadPoolExecutor.java:624)
	at java.lang.Thread.run(Thread.java:748)

org.apache.solr.common.util.ObjectReleaseTracker$ObjectTrackerException: org.apache.solr.common.cloud.SolrZkClient
	at org.apache.solr.common.util.ObjectReleaseTracker.track(ObjectReleaseTracker.java:42)
	at org.apache.solr.common.cloud.SolrZkClient.<init>(SolrZkClient.java:203)
	at org.apache.solr.common.cloud.SolrZkClient.<init>(SolrZkClient.java:126)
	at org.apache.solr.common.cloud.SolrZkClient.<init>(SolrZkClient.java:116)
	at org.apache.solr.common.cloud.ZkStateReader.<init>(ZkStateReader.java:306)
	at org.apache.solr.client.solrj.impl.ZkClientClusterStateProvider.connect(ZkClientClusterStateProvider.java:160)
	at org.apache.solr.client.solrj.impl.CloudSolrClient.connect(CloudSolrClient.java:399)
	at org.apache.solr.client.solrj.impl.CloudSolrClient.requestWithRetryOnStaleState(CloudSolrClient.java:827)
	at org.apache.solr.client.solrj.impl.CloudSolrClient.request(CloudSolrClient.java:817)
	at org.apache.solr.client.solrj.SolrRequest.process(SolrRequest.java:194)
	at org.apache.solr.client.solrj.SolrRequest.process(SolrRequest.java:211)
	at org.apache.solr.client.solrj.impl.SolrClientCloudManager.request(SolrClientCloudManager.java:115)
	at org.apache.solr.cloud.autoscaling.ExecutePlanAction.waitForTaskToFinish(ExecutePlanAction.java:132)
	at org.apache.solr.cloud.autoscaling.ExecutePlanAction.process(ExecutePlanAction.java:85)
	at org.apache.solr.cloud.autoscaling.ScheduledTriggers.lambda$null$3(ScheduledTriggers.java:325)
	at java.util.concurrent.Executors$RunnableAdapter.call(Executors.java:511)
	at java.util.concurrent.FutureTask.run(FutureTask.java:266)
	at org.apache.solr.common.util.ExecutorUtil$MDCAwareThreadPoolExecutor.lambda$execute$0(ExecutorUtil.java:209)
	at java.util.concurrent.ThreadPoolExecutor.runWorker(ThreadPoolExecutor.java:1149)
	at java.util.concurrent.ThreadPoolExecutor$Worker.run(ThreadPoolExecutor.java:624)
	at java.lang.Thread.run(Thread.java:748)

>
	at __randomizedtesting.SeedInfo.seed([8F5C272E3D15FD9]:0)
	at org.junit.Assert.fail(Assert.java:88)
	at org.junit.Assert.failNotNull(Assert.java:755)
	at org.junit.Assert.assertNull(Assert.java:737)
	at org.apache.solr.SolrTestCaseJ4.teardownTestCases(SolrTestCaseJ4.java:320)
	at sun.reflect.GeneratedMethodAccessor40.invoke(Unknown Source)
	at sun.reflect.DelegatingMethodAccessorImpl.invoke(DelegatingMethodAccessorImpl.java:43)
	at java.lang.reflect.Method.invoke(Method.java:498)
	at com.carrotsearch.randomizedtesting.RandomizedRunner.invoke(RandomizedRunner.java:1750)
	at com.carrotsearch.randomizedtesting.RandomizedRunner$7.evaluate(RandomizedRunner.java:901)
	at com.carrotsearch.randomizedtesting.rules.StatementAdapter.evaluate(StatementAdapter.java:36)
	at com.carrotsearch.randomizedtesting.rules.SystemPropertiesRestoreRule$1.evaluate(SystemPropertiesRestoreRule.java:57)
	at org.apache.lucene.util.AbstractBeforeAfterRule$1.evaluate(AbstractBeforeAfterRule.java:45)
	at com.carrotsearch.randomizedtesting.rules.StatementAdapter.evaluate(StatementAdapter.java:36)
	at org.apache.lucene.util.TestRuleStoreClassName$1.evaluate(TestRuleStoreClassName.java:41)
	at com.carrotsearch.randomizedtesting.rules.NoShadowingOrOverridesOnMethodsRule$1.evaluate(NoShadowingOrOverridesOnMethodsRule.java:40)
	at com.carrotsearch.randomizedtesting.rules.NoShadowingOrOverridesOnMethodsRule$1.evaluate(NoShadowingOrOverridesOnMethodsRule.java:40)
	at com.carrotsearch.randomizedtesting.rules.StatementAdapter.evaluate(StatementAdapter.java:36)
	at com.carrotsearch.randomizedtesting.rules.StatementAdapter.evaluate(StatementAdapter.java:36)
	at com.carrotsearch.randomizedtesting.rules.StatementAdapter.evaluate(StatementAdapter.java:36)
	at org.apache.lucene.util.TestRuleAssertionsRequired$1.evaluate(TestRuleAssertionsRequired.java:53)
	at org.apache.lucene.util.TestRuleMarkFailure$1.evaluate(TestRuleMarkFailure.java:47)
	at org.apache.lucene.util.TestRuleIgnoreAfterMaxFailures$1.evaluate(TestRuleIgnoreAfterMaxFailures.java:64)
	at org.apache.lucene.util.TestRuleIgnoreTestSuites$1.evaluate(TestRuleIgnoreTestSuites.java:54)
	at com.carrotsearch.randomizedtesting.rules.StatementAdapter.evaluate(StatementAdapter.java:36)
	at com.carrotsearch.randomizedtesting.ThreadLeakControl$StatementRunner.run(ThreadLeakControl.java:368)
	at java.lang.Thread.run(Thread.java:748)


FAILED:  junit.framework.TestSuite.org.apache.solr.cloud.autoscaling.ExecutePlanActionTest

Error Message:
3 threads leaked from SUITE scope at org.apache.solr.cloud.autoscaling.ExecutePlanActionTest:     1) Thread[id=17160, name=AutoscalingActionExecutor-1402-thread-1-EventThread, state=WAITING, group=TGRP-ExecutePlanActionTest]         at sun.misc.Unsafe.park(Native Method)         at java.util.concurrent.locks.LockSupport.park(LockSupport.java:175)         at java.util.concurrent.locks.AbstractQueuedSynchronizer$ConditionObject.await(AbstractQueuedSynchronizer.java:2039)         at java.util.concurrent.LinkedBlockingQueue.take(LinkedBlockingQueue.java:442)         at org.apache.zookeeper.ClientCnxn$EventThread.run(ClientCnxn.java:504)    2) Thread[id=17161, name=zkConnectionManagerCallback-5989-thread-1, state=WAITING, group=TGRP-ExecutePlanActionTest]         at sun.misc.Unsafe.park(Native Method)         at java.util.concurrent.locks.LockSupport.park(LockSupport.java:175)         at java.util.concurrent.locks.AbstractQueuedSynchronizer$ConditionObject.await(AbstractQueuedSynchronizer.java:2039)         at java.util.concurrent.LinkedBlockingQueue.take(LinkedBlockingQueue.java:442)         at java.util.concurrent.ThreadPoolExecutor.getTask(ThreadPoolExecutor.java:1074)         at java.util.concurrent.ThreadPoolExecutor.runWorker(ThreadPoolExecutor.java:1134)         at java.util.concurrent.ThreadPoolExecutor$Worker.run(ThreadPoolExecutor.java:624)         at java.lang.Thread.run(Thread.java:748)    3) Thread[id=17159, name=AutoscalingActionExecutor-1402-thread-1-SendThread(localhost:45250), state=TIMED_WAITING, group=TGRP-ExecutePlanActionTest]         at java.lang.Thread.sleep(Native Method)         at org.apache.zookeeper.client.StaticHostProvider.next(StaticHostProvider.java:152)         at org.apache.zookeeper.ClientCnxn$SendThread.run(ClientCnxn.java:1062)

Stack Trace:
com.carrotsearch.randomizedtesting.ThreadLeakError: 3 threads leaked from SUITE scope at org.apache.solr.cloud.autoscaling.ExecutePlanActionTest: 
   1) Thread[id=17160, name=AutoscalingActionExecutor-1402-thread-1-EventThread, state=WAITING, group=TGRP-ExecutePlanActionTest]
        at sun.misc.Unsafe.park(Native Method)
        at java.util.concurrent.locks.LockSupport.park(LockSupport.java:175)
        at java.util.concurrent.locks.AbstractQueuedSynchronizer$ConditionObject.await(AbstractQueuedSynchronizer.java:2039)
        at java.util.concurrent.LinkedBlockingQueue.take(LinkedBlockingQueue.java:442)
        at org.apache.zookeeper.ClientCnxn$EventThread.run(ClientCnxn.java:504)
   2) Thread[id=17161, name=zkConnectionManagerCallback-5989-thread-1, state=WAITING, group=TGRP-ExecutePlanActionTest]
        at sun.misc.Unsafe.park(Native Method)
        at java.util.concurrent.locks.LockSupport.park(LockSupport.java:175)
        at java.util.concurrent.locks.AbstractQueuedSynchronizer$ConditionObject.await(AbstractQueuedSynchronizer.java:2039)
        at java.util.concurrent.LinkedBlockingQueue.take(LinkedBlockingQueue.java:442)
        at java.util.concurrent.ThreadPoolExecutor.getTask(ThreadPoolExecutor.java:1074)
        at java.util.concurrent.ThreadPoolExecutor.runWorker(ThreadPoolExecutor.java:1134)
        at java.util.concurrent.ThreadPoolExecutor$Worker.run(ThreadPoolExecutor.java:624)
        at java.lang.Thread.run(Thread.java:748)
   3) Thread[id=17159, name=AutoscalingActionExecutor-1402-thread-1-SendThread(localhost:45250), state=TIMED_WAITING, group=TGRP-ExecutePlanActionTest]
        at java.lang.Thread.sleep(Native Method)
        at org.apache.zookeeper.client.StaticHostProvider.next(StaticHostProvider.java:152)
        at org.apache.zookeeper.ClientCnxn$SendThread.run(ClientCnxn.java:1062)
	at __randomizedtesting.SeedInfo.seed([8F5C272E3D15FD9]:0)


FAILED:  junit.framework.TestSuite.org.apache.solr.cloud.autoscaling.ExecutePlanActionTest

Error Message:
There are still zombie threads that couldn't be terminated:    1) Thread[id=17161, name=zkConnectionManagerCallback-5989-thread-1, state=WAITING, group=TGRP-ExecutePlanActionTest]         at sun.misc.Unsafe.park(Native Method)         at java.util.concurrent.locks.LockSupport.park(LockSupport.java:175)         at java.util.concurrent.locks.AbstractQueuedSynchronizer$ConditionObject.await(AbstractQueuedSynchronizer.java:2039)         at java.util.concurrent.LinkedBlockingQueue.take(LinkedBlockingQueue.java:442)         at java.util.concurrent.ThreadPoolExecutor.getTask(ThreadPoolExecutor.java:1074)         at java.util.concurrent.ThreadPoolExecutor.runWorker(ThreadPoolExecutor.java:1134)         at java.util.concurrent.ThreadPoolExecutor$Worker.run(ThreadPoolExecutor.java:624)         at java.lang.Thread.run(Thread.java:748)    2) Thread[id=17159, name=AutoscalingActionExecutor-1402-thread-1-SendThread(localhost:45250), state=TIMED_WAITING, group=TGRP-ExecutePlanActionTest]         at java.lang.Thread.sleep(Native Method)         at org.apache.zookeeper.client.StaticHostProvider.next(StaticHostProvider.java:152)         at org.apache.zookeeper.ClientCnxn$SendThread.run(ClientCnxn.java:1062)

Stack Trace:
com.carrotsearch.randomizedtesting.ThreadLeakError: There are still zombie threads that couldn't be terminated:
   1) Thread[id=17161, name=zkConnectionManagerCallback-5989-thread-1, state=WAITING, group=TGRP-ExecutePlanActionTest]
        at sun.misc.Unsafe.park(Native Method)
        at java.util.concurrent.locks.LockSupport.park(LockSupport.java:175)
        at java.util.concurrent.locks.AbstractQueuedSynchronizer$ConditionObject.await(AbstractQueuedSynchronizer.java:2039)
        at java.util.concurrent.LinkedBlockingQueue.take(LinkedBlockingQueue.java:442)
        at java.util.concurrent.ThreadPoolExecutor.getTask(ThreadPoolExecutor.java:1074)
        at java.util.concurrent.ThreadPoolExecutor.runWorker(ThreadPoolExecutor.java:1134)
        at java.util.concurrent.ThreadPoolExecutor$Worker.run(ThreadPoolExecutor.java:624)
        at java.lang.Thread.run(Thread.java:748)
   2) Thread[id=17159, name=AutoscalingActionExecutor-1402-thread-1-SendThread(localhost:45250), state=TIMED_WAITING, group=TGRP-ExecutePlanActionTest]
        at java.lang.Thread.sleep(Native Method)
        at org.apache.zookeeper.client.StaticHostProvider.next(StaticHostProvider.java:152)
        at org.apache.zookeeper.ClientCnxn$SendThread.run(ClientCnxn.java:1062)
	at __randomizedtesting.SeedInfo.seed([8F5C272E3D15FD9]:0)




Build Log:
[...truncated 13472 lines...]
   [junit4] Suite: org.apache.solr.cloud.autoscaling.ExecutePlanActionTest
   [junit4]   2> Creating dataDir: /x1/jenkins/jenkins-slave/workspace/Lucene-Solr-NightlyTests-7.7/checkout/solr/build/solr-core/test/J1/temp/solr.cloud.autoscaling.ExecutePlanActionTest_8F5C272E3D15FD9-001/init-core-data-001
   [junit4]   2> 622932 WARN  (SUITE-ExecutePlanActionTest-seed#[8F5C272E3D15FD9]-worker) [    ] o.a.s.SolrTestCaseJ4 startTrackingSearchers: numOpens=169 numCloses=169
   [junit4]   2> 622932 INFO  (SUITE-ExecutePlanActionTest-seed#[8F5C272E3D15FD9]-worker) [    ] o.a.s.SolrTestCaseJ4 Using TrieFields (NUMERIC_POINTS_SYSPROP=false) w/NUMERIC_DOCVALUES_SYSPROP=false
   [junit4]   2> 622935 INFO  (SUITE-ExecutePlanActionTest-seed#[8F5C272E3D15FD9]-worker) [    ] o.a.s.SolrTestCaseJ4 Randomized ssl (false) and clientAuth (false) via: @org.apache.solr.util.RandomizeSSL(reason=, ssl=NaN, value=NaN, clientAuth=NaN)
   [junit4]   2> 622935 INFO  (SUITE-ExecutePlanActionTest-seed#[8F5C272E3D15FD9]-worker) [    ] o.a.s.SolrTestCaseJ4 SecureRandom sanity checks: test.solr.allowed.securerandom=null & java.security.egd=file:/dev/./urandom
   [junit4]   2> 622942 INFO  (TEST-ExecutePlanActionTest.testExecute-seed#[8F5C272E3D15FD9]) [    ] o.a.s.SolrTestCaseJ4 ###Starting testExecute
   [junit4]   2> 622942 INFO  (TEST-ExecutePlanActionTest.testExecute-seed#[8F5C272E3D15FD9]) [    ] o.a.s.c.MiniSolrCloudCluster Starting cluster of 2 servers in /x1/jenkins/jenkins-slave/workspace/Lucene-Solr-NightlyTests-7.7/checkout/solr/build/solr-core/test/J1/temp/solr.cloud.autoscaling.ExecutePlanActionTest_8F5C272E3D15FD9-001/tempDir-001
   [junit4]   2> 622943 INFO  (TEST-ExecutePlanActionTest.testExecute-seed#[8F5C272E3D15FD9]) [    ] o.a.s.c.ZkTestServer STARTING ZK TEST SERVER
   [junit4]   2> 622945 INFO  (ZkTestServer Run Thread) [    ] o.a.s.c.ZkTestServer client port:0.0.0.0/0.0.0.0:0
   [junit4]   2> 622945 INFO  (ZkTestServer Run Thread) [    ] o.a.s.c.ZkTestServer Starting server
   [junit4]   2> 623045 INFO  (TEST-ExecutePlanActionTest.testExecute-seed#[8F5C272E3D15FD9]) [    ] o.a.s.c.ZkTestServer start zk server on port:37328
   [junit4]   2> 623045 INFO  (TEST-ExecutePlanActionTest.testExecute-seed#[8F5C272E3D15FD9]) [    ] o.a.s.c.ZkTestServer parse host and port list: 127.0.0.1:37328
   [junit4]   2> 623045 INFO  (TEST-ExecutePlanActionTest.testExecute-seed#[8F5C272E3D15FD9]) [    ] o.a.s.c.ZkTestServer connecting to 127.0.0.1 37328
   [junit4]   2> 623058 INFO  (zkConnectionManagerCallback-5883-thread-1) [    ] o.a.s.c.c.ConnectionManager zkClient has connected
   [junit4]   2> 623069 INFO  (zkConnectionManagerCallback-5885-thread-1) [    ] o.a.s.c.c.ConnectionManager zkClient has connected
   [junit4]   2> 623071 INFO  (zkConnectionManagerCallback-5887-thread-1) [    ] o.a.s.c.c.ConnectionManager zkClient has connected
   [junit4]   2> 623075 WARN  (jetty-launcher-5888-thread-1) [    ] o.e.j.s.AbstractConnector Ignoring deprecated socket close linger time
   [junit4]   2> 623076 INFO  (jetty-launcher-5888-thread-1) [    ] o.a.s.c.s.e.JettySolrRunner Start Jetty (original configured port=0)
   [junit4]   2> 623076 INFO  (jetty-launcher-5888-thread-1) [    ] o.a.s.c.s.e.JettySolrRunner Trying to start Jetty on port 0 try number 1 ...
   [junit4]   2> 623076 INFO  (jetty-launcher-5888-thread-1) [    ] o.e.j.s.Server jetty-9.4.14.v20181114; built: 2018-11-14T21:20:31.478Z; git: c4550056e785fb5665914545889f21dc136ad9e6; jvm 1.8.0_191-b12
   [junit4]   2> 623077 WARN  (jetty-launcher-5888-thread-2) [    ] o.e.j.s.AbstractConnector Ignoring deprecated socket close linger time
   [junit4]   2> 623077 INFO  (jetty-launcher-5888-thread-2) [    ] o.a.s.c.s.e.JettySolrRunner Start Jetty (original configured port=0)
   [junit4]   2> 623077 INFO  (jetty-launcher-5888-thread-2) [    ] o.a.s.c.s.e.JettySolrRunner Trying to start Jetty on port 0 try number 1 ...
   [junit4]   2> 623077 INFO  (jetty-launcher-5888-thread-2) [    ] o.e.j.s.Server jetty-9.4.14.v20181114; built: 2018-11-14T21:20:31.478Z; git: c4550056e785fb5665914545889f21dc136ad9e6; jvm 1.8.0_191-b12
   [junit4]   2> 623080 INFO  (jetty-launcher-5888-thread-1) [    ] o.e.j.s.session DefaultSessionIdManager workerName=node0
   [junit4]   2> 623080 INFO  (jetty-launcher-5888-thread-1) [    ] o.e.j.s.session No SessionScavenger set, using defaults
   [junit4]   2> 623080 INFO  (jetty-launcher-5888-thread-1) [    ] o.e.j.s.session node0 Scavenging every 660000ms
   [junit4]   2> 623082 INFO  (jetty-launcher-5888-thread-1) [    ] o.e.j.s.h.ContextHandler Started o.e.j.s.ServletContextHandler@1dc7333e{/solr,null,AVAILABLE}
   [junit4]   2> 623147 INFO  (jetty-launcher-5888-thread-2) [    ] o.e.j.s.session DefaultSessionIdManager workerName=node0
   [junit4]   2> 623147 INFO  (jetty-launcher-5888-thread-2) [    ] o.e.j.s.session No SessionScavenger set, using defaults
   [junit4]   2> 623147 INFO  (jetty-launcher-5888-thread-2) [    ] o.e.j.s.session node0 Scavenging every 600000ms
   [junit4]   2> 623154 INFO  (jetty-launcher-5888-thread-2) [    ] o.e.j.s.h.ContextHandler Started o.e.j.s.ServletContextHandler@23931dc{/solr,null,AVAILABLE}
   [junit4]   2> 623171 INFO  (jetty-launcher-5888-thread-2) [    ] o.e.j.s.AbstractConnector Started ServerConnector@1ed43aec{HTTP/1.1,[http/1.1]}{127.0.0.1:39797}
   [junit4]   2> 623171 INFO  (jetty-launcher-5888-thread-2) [    ] o.e.j.s.Server Started @623246ms
   [junit4]   2> 623171 INFO  (jetty-launcher-5888-thread-2) [    ] o.a.s.c.s.e.JettySolrRunner Jetty properties: {hostContext=/solr, hostPort=39797}
   [junit4]   2> 623172 ERROR (jetty-launcher-5888-thread-2) [    ] o.a.s.u.StartupLoggingUtils Missing Java Option solr.log.dir. Logging may be missing or incomplete.
   [junit4]   2> 623172 INFO  (jetty-launcher-5888-thread-2) [    ] o.a.s.s.SolrDispatchFilter Using logger factory org.apache.logging.slf4j.Log4jLoggerFactory
   [junit4]   2> 623172 INFO  (jetty-launcher-5888-thread-2) [    ] o.a.s.s.SolrDispatchFilter  ___      _       Welcome to Apache Solr? version 7.7.0
   [junit4]   2> 623173 INFO  (jetty-launcher-5888-thread-2) [    ] o.a.s.s.SolrDispatchFilter / __| ___| |_ _   Starting in cloud mode on port null
   [junit4]   2> 623173 INFO  (jetty-launcher-5888-thread-2) [    ] o.a.s.s.SolrDispatchFilter \__ \/ _ \ | '_|  Install dir: null
   [junit4]   2> 623173 INFO  (jetty-launcher-5888-thread-2) [    ] o.a.s.s.SolrDispatchFilter |___/\___/_|_|    Start time: 2019-02-05T01:16:34.499Z
   [junit4]   2> 623174 INFO  (jetty-launcher-5888-thread-1) [    ] o.e.j.s.AbstractConnector Started ServerConnector@589de973{HTTP/1.1,[http/1.1]}{127.0.0.1:40619}
   [junit4]   2> 623175 INFO  (jetty-launcher-5888-thread-1) [    ] o.e.j.s.Server Started @623249ms
   [junit4]   2> 623175 INFO  (jetty-launcher-5888-thread-1) [    ] o.a.s.c.s.e.JettySolrRunner Jetty properties: {hostContext=/solr, hostPort=40619}
   [junit4]   2> 623175 ERROR (jetty-launcher-5888-thread-1) [    ] o.a.s.u.StartupLoggingUtils Missing Java Option solr.log.dir. Logging may be missing or incomplete.
   [junit4]   2> 623175 INFO  (jetty-launcher-5888-thread-1) [    ] o.a.s.s.SolrDispatchFilter Using logger factory org.apache.logging.slf4j.Log4jLoggerFactory
   [junit4]   2> 623175 INFO  (jetty-launcher-5888-thread-1) [    ] o.a.s.s.SolrDispatchFilter  ___      _       Welcome to Apache Solr? version 7.7.0
   [junit4]   2> 623175 INFO  (jetty-launcher-5888-thread-1) [    ] o.a.s.s.SolrDispatchFilter / __| ___| |_ _   Starting in cloud mode on port null
   [junit4]   2> 623175 INFO  (jetty-launcher-5888-thread-1) [    ] o.a.s.s.SolrDispatchFilter \__ \/ _ \ | '_|  Install dir: null
   [junit4]   2> 623175 INFO  (jetty-launcher-5888-thread-1) [    ] o.a.s.s.SolrDispatchFilter |___/\___/_|_|    Start time: 2019-02-05T01:16:34.501Z
   [junit4]   2> 623185 INFO  (zkConnectionManagerCallback-5892-thread-1) [    ] o.a.s.c.c.ConnectionManager zkClient has connected
   [junit4]   2> 623186 INFO  (jetty-launcher-5888-thread-1) [    ] o.a.s.s.SolrDispatchFilter solr.xml found in ZooKeeper. Loading...
   [junit4]   2> 623194 INFO  (zkConnectionManagerCallback-5890-thread-1) [    ] o.a.s.c.c.ConnectionManager zkClient has connected
   [junit4]   2> 623195 INFO  (jetty-launcher-5888-thread-2) [    ] o.a.s.s.SolrDispatchFilter solr.xml found in ZooKeeper. Loading...
   [junit4]   2> 623641 INFO  (jetty-launcher-5888-thread-1) [    ] o.a.s.h.c.HttpShardHandlerFactory Host whitelist initialized: WhitelistHostChecker [whitelistHosts=null, whitelistHostCheckingEnabled=true]
   [junit4]   2> 623649 INFO  (jetty-launcher-5888-thread-1) [    ] o.a.s.c.ZkContainer Zookeeper client=127.0.0.1:37328/solr
   [junit4]   2> 623652 INFO  (zkConnectionManagerCallback-5896-thread-1) [    ] o.a.s.c.c.ConnectionManager zkClient has connected
   [junit4]   2> 623662 INFO  (zkConnectionManagerCallback-5898-thread-1) [    ] o.a.s.c.c.ConnectionManager zkClient has connected
   [junit4]   2> 623668 INFO  (jetty-launcher-5888-thread-2) [    ] o.a.s.h.c.HttpShardHandlerFactory Host whitelist initialized: WhitelistHostChecker [whitelistHosts=null, whitelistHostCheckingEnabled=true]
   [junit4]   2> 623675 INFO  (jetty-launcher-5888-thread-2) [    ] o.a.s.c.ZkContainer Zookeeper client=127.0.0.1:37328/solr
   [junit4]   2> 623715 INFO  (zkConnectionManagerCallback-5904-thread-1) [    ] o.a.s.c.c.ConnectionManager zkClient has connected
   [junit4]   2> 623731 WARN  (NIOServerCxn.Factory:0.0.0.0/0.0.0.0:0) [    ] o.a.z.s.NIOServerCnxn Unable to read additional data from client sessionid 0x1026fb659dc0007, likely client has closed socket
   [junit4]   2> 623758 INFO  (zkConnectionManagerCallback-5906-thread-1) [    ] o.a.s.c.c.ConnectionManager zkClient has connected
   [junit4]   2> 623801 INFO  (jetty-launcher-5888-thread-2) [n:127.0.0.1:39797_solr    ] o.a.s.c.OverseerElectionContext I am going to be the leader 127.0.0.1:39797_solr
   [junit4]   2> 623803 INFO  (jetty-launcher-5888-thread-2) [n:127.0.0.1:39797_solr    ] o.a.s.c.Overseer Overseer (id=72743372973670408-127.0.0.1:39797_solr-n_0000000000) starting
   [junit4]   2> 623825 INFO  (zkConnectionManagerCallback-5913-thread-1) [    ] o.a.s.c.c.ConnectionManager zkClient has connected
   [junit4]   2> 623831 INFO  (jetty-launcher-5888-thread-2) [n:127.0.0.1:39797_solr    ] o.a.s.c.s.i.ZkClientClusterStateProvider Cluster at 127.0.0.1:37328/solr ready
   [junit4]   2> 623833 INFO  (OverseerStateUpdate-72743372973670408-127.0.0.1:39797_solr-n_0000000000) [n:127.0.0.1:39797_solr    ] o.a.s.c.Overseer Starting to work on the main queue : 127.0.0.1:39797_solr
   [junit4]   2> 623835 INFO  (jetty-launcher-5888-thread-2) [n:127.0.0.1:39797_solr    ] o.a.s.c.ZkController Register node as live in ZooKeeper:/live_nodes/127.0.0.1:39797_solr
   [junit4]   2> 623841 INFO  (zkCallback-5905-thread-1) [    ] o.a.s.c.c.ZkStateReader Updated live nodes from ZooKeeper... (0) -> (1)
   [junit4]   2> 623859 DEBUG (OverseerAutoScalingTriggerThread-72743372973670408-127.0.0.1:39797_solr-n_0000000000) [    ] o.a.s.c.a.OverseerTriggerThread Adding .auto_add_replicas and .scheduled_maintenance triggers
   [junit4]   2> 623876 DEBUG (OverseerAutoScalingTriggerThread-72743372973670408-127.0.0.1:39797_solr-n_0000000000) [    ] o.a.s.c.a.OverseerTriggerThread Refreshing /autoscaling.json with znode version 1
   [junit4]   2> 623878 DEBUG (OverseerAutoScalingTriggerThread-72743372973670408-127.0.0.1:39797_solr-n_0000000000) [    ] o.a.s.c.a.OverseerTriggerThread Current znodeVersion 1, lastZnodeVersion 0
   [junit4]   2> 623878 DEBUG (OverseerAutoScalingTriggerThread-72743372973670408-127.0.0.1:39797_solr-n_0000000000) [    ] o.a.s.c.a.OverseerTriggerThread Processed trigger updates upto znodeVersion 1
   [junit4]   2> 623883 INFO  (zkCallback-5912-thread-1) [    ] o.a.s.c.c.ZkStateReader Updated live nodes from ZooKeeper... (0) -> (1)
   [junit4]   2> 623898 DEBUG (OverseerAutoScalingTriggerThread-72743372973670408-127.0.0.1:39797_solr-n_0000000000) [    ] o.a.s.c.a.NodeLostTrigger NodeLostTrigger .auto_add_replicas - Initial livenodes: [127.0.0.1:39797_solr]
   [junit4]   2> 623908 INFO  (jetty-launcher-5888-thread-1) [n:127.0.0.1:40619_solr    ] o.a.s.c.c.ZkStateReader Updated live nodes from ZooKeeper... (0) -> (1)
   [junit4]   2> 623915 INFO  (jetty-launcher-5888-thread-1) [n:127.0.0.1:40619_solr    ] o.a.s.c.ZkController Publish node=127.0.0.1:40619_solr as DOWN
   [junit4]   2> 623915 DEBUG (ScheduledTrigger-1361-thread-1) [    ] o.a.s.c.a.NodeLostTrigger Running NodeLostTrigger: .auto_add_replicas with currently live nodes: 1 and last live nodes: 1
   [junit4]   2> 623916 DEBUG (OverseerAutoScalingTriggerThread-72743372973670408-127.0.0.1:39797_solr-n_0000000000) [    ] o.a.s.c.a.OverseerTriggerThread -- cleaning old nodeLost / nodeAdded markers
   [junit4]   2> 623917 DEBUG (OverseerAutoScalingTriggerThread-72743372973670408-127.0.0.1:39797_solr-n_0000000000) [    ] o.a.s.c.a.OverseerTriggerThread Current znodeVersion 1, lastZnodeVersion 1
   [junit4]   2> 623917 INFO  (jetty-launcher-5888-thread-1) [n:127.0.0.1:40619_solr    ] o.a.s.c.TransientSolrCoreCacheDefault Allocating transient cache for 2147483647 transient cores
   [junit4]   2> 623917 INFO  (jetty-launcher-5888-thread-1) [n:127.0.0.1:40619_solr    ] o.a.s.c.ZkController Register node as live in ZooKeeper:/live_nodes/127.0.0.1:40619_solr
   [junit4]   2> 623919 INFO  (zkCallback-5905-thread-1) [    ] o.a.s.c.c.ZkStateReader Updated live nodes from ZooKeeper... (1) -> (2)
   [junit4]   2> 623928 INFO  (zkCallback-5912-thread-1) [    ] o.a.s.c.c.ZkStateReader Updated live nodes from ZooKeeper... (1) -> (2)
   [junit4]   2> 623935 INFO  (zkCallback-5897-thread-1) [    ] o.a.s.c.c.ZkStateReader Updated live nodes from ZooKeeper... (1) -> (2)
   [junit4]   2> 623937 INFO  (jetty-launcher-5888-thread-2) [n:127.0.0.1:39797_solr    ] o.a.s.h.a.MetricsHistoryHandler No .system collection, keeping metrics history in memory.
   [junit4]   2> 624015 INFO  (zkConnectionManagerCallback-5919-thread-1) [    ] o.a.s.c.c.ConnectionManager zkClient has connected
   [junit4]   2> 624017 INFO  (jetty-launcher-5888-thread-1) [n:127.0.0.1:40619_solr    ] o.a.s.c.c.ZkStateReader Updated live nodes from ZooKeeper... (0) -> (2)
   [junit4]   2> 624018 INFO  (jetty-launcher-5888-thread-1) [n:127.0.0.1:40619_solr    ] o.a.s.c.s.i.ZkClientClusterStateProvider Cluster at 127.0.0.1:37328/solr ready
   [junit4]   2> 624039 INFO  (jetty-launcher-5888-thread-2) [n:127.0.0.1:39797_solr    ] o.a.s.m.r.SolrJmxReporter JMX monitoring for 'solr_39797.solr.node' (registry 'solr.node') enabled at server: com.sun.jmx.mbeanserver.JmxMBeanServer@10d9ea0
   [junit4]   2> 624042 INFO  (jetty-launcher-5888-thread-1) [n:127.0.0.1:40619_solr    ] o.a.s.h.a.MetricsHistoryHandler No .system collection, keeping metrics history in memory.
   [junit4]   2> 624101 INFO  (jetty-launcher-5888-thread-2) [n:127.0.0.1:39797_solr    ] o.a.s.m.r.SolrJmxReporter JMX monitoring for 'solr_39797.solr.jvm' (registry 'solr.jvm') enabled at server: com.sun.jmx.mbeanserver.JmxMBeanServer@10d9ea0
   [junit4]   2> 624101 INFO  (jetty-launcher-5888-thread-2) [n:127.0.0.1:39797_solr    ] o.a.s.m.r.SolrJmxReporter JMX monitoring for 'solr_39797.solr.jetty' (registry 'solr.jetty') enabled at server: com.sun.jmx.mbeanserver.JmxMBeanServer@10d9ea0
   [junit4]   2> 624103 INFO  (jetty-launcher-5888-thread-2) [n:127.0.0.1:39797_solr    ] o.a.s.c.CorePropertiesLocator Found 0 core definitions underneath /x1/jenkins/jenkins-slave/workspace/Lucene-Solr-NightlyTests-7.7/checkout/solr/build/solr-core/test/J1/temp/solr.cloud.autoscaling.ExecutePlanActionTest_8F5C272E3D15FD9-001/tempDir-001/node2/.
   [junit4]   2> 624104 INFO  (jetty-launcher-5888-thread-1) [n:127.0.0.1:40619_solr    ] o.a.s.m.r.SolrJmxReporter JMX monitoring for 'solr_40619.solr.node' (registry 'solr.node') enabled at server: com.sun.jmx.mbeanserver.JmxMBeanServer@10d9ea0
   [junit4]   2> 624164 INFO  (jetty-launcher-5888-thread-1) [n:127.0.0.1:40619_solr    ] o.a.s.m.r.SolrJmxReporter JMX monitoring for 'solr_40619.solr.jvm' (registry 'solr.jvm') enabled at server: com.sun.jmx.mbeanserver.JmxMBeanServer@10d9ea0
   [junit4]   2> 624166 INFO  (jetty-launcher-5888-thread-1) [n:127.0.0.1:40619_solr    ] o.a.s.m.r.SolrJmxReporter JMX monitoring for 'solr_40619.solr.jetty' (registry 'solr.jetty') enabled at server: com.sun.jmx.mbeanserver.JmxMBeanServer@10d9ea0
   [junit4]   2> 624168 INFO  (jetty-launcher-5888-thread-1) [n:127.0.0.1:40619_solr    ] o.a.s.c.CorePropertiesLocator Found 0 core definitions underneath /x1/jenkins/jenkins-slave/workspace/Lucene-Solr-NightlyTests-7.7/checkout/solr/build/solr-core/test/J1/temp/solr.cloud.autoscaling.ExecutePlanActionTest_8F5C272E3D15FD9-001/tempDir-001/node1/.
   [junit4]   2> 624259 INFO  (zkConnectionManagerCallback-5925-thread-1) [    ] o.a.s.c.c.ConnectionManager zkClient has connected
   [junit4]   2> 624261 INFO  (TEST-ExecutePlanActionTest.testExecute-seed#[8F5C272E3D15FD9]) [    ] o.a.s.c.c.ZkStateReader Updated live nodes from ZooKeeper... (0) -> (2)
   [junit4]   2> 624262 INFO  (TEST-ExecutePlanActionTest.testExecute-seed#[8F5C272E3D15FD9]) [    ] o.a.s.c.s.i.ZkClientClusterStateProvider Cluster at 127.0.0.1:37328/solr ready
   [junit4]   2> 624266 DEBUG (zkCallback-5912-thread-1) [    ] o.a.s.c.a.OverseerTriggerThread Refreshing /autoscaling.json with znode version 2
   [junit4]   2> 624267 DEBUG (OverseerAutoScalingTriggerThread-72743372973670408-127.0.0.1:39797_solr-n_0000000000) [    ] o.a.s.c.a.OverseerTriggerThread Processed trigger updates upto znodeVersion 2
   [junit4]   2> 624269 INFO  (qtp2109600101-16890) [n:127.0.0.1:40619_solr    ] o.a.s.h.a.CollectionsHandler Invoked Collection Action :create with params collection.configName=conf&maxShardsPerNode=1&name=testExecute&nrtReplicas=2&action=CREATE&numShards=1&wt=javabin&version=2 and sendToOCPQueue=true
   [junit4]   2> 624273 DEBUG (OverseerAutoScalingTriggerThread-72743372973670408-127.0.0.1:39797_solr-n_0000000000) [    ] o.a.s.c.a.OverseerTriggerThread -- cleaning old nodeLost / nodeAdded markers
   [junit4]   2> 624274 DEBUG (OverseerAutoScalingTriggerThread-72743372973670408-127.0.0.1:39797_solr-n_0000000000) [    ] o.a.s.c.a.OverseerTriggerThread Current znodeVersion 2, lastZnodeVersion 2
   [junit4]   2> 624291 INFO  (OverseerThreadFactory-1363-thread-1-processing-n:127.0.0.1:39797_solr) [n:127.0.0.1:39797_solr    ] o.a.s.c.a.c.CreateCollectionCmd Create collection testExecute
   [junit4]   2> 624410 INFO  (qtp2109600101-16891) [n:127.0.0.1:40619_solr    ] o.a.s.s.HttpSolrCall [admin] webapp=null path=/admin/metrics params={prefix=CONTAINER.fs.usableSpace,CONTAINER.fs.totalSpace,CORE.coreName&wt=javabin&version=2&group=solr.node,solr.core} status=0 QTime=1
   [junit4]   2> 624411 INFO  (qtp2109600101-16892) [n:127.0.0.1:40619_solr    ] o.a.s.s.HttpSolrCall [admin] webapp=null path=/admin/metrics params={prefix=CONTAINER.fs.usableSpace,CONTAINER.fs.totalSpace,CORE.coreName&wt=javabin&version=2&group=solr.node,solr.core} status=0 QTime=0
   [junit4]   2> 624412 INFO  (qtp2109600101-16886) [n:127.0.0.1:40619_solr    ] o.a.s.s.HttpSolrCall [admin] webapp=null path=/admin/metrics params={prefix=CONTAINER.fs.usableSpace,CONTAINER.fs.totalSpace,CORE.coreName&wt=javabin&version=2&group=solr.node,solr.core} status=0 QTime=0
   [junit4]   2> 624413 INFO  (qtp2109600101-16888) [n:127.0.0.1:40619_solr    ] o.a.s.s.HttpSolrCall [admin] webapp=null path=/admin/metrics params={prefix=CONTAINER.fs.usableSpace,CONTAINER.fs.totalSpace,CORE.coreName&wt=javabin&version=2&group=solr.node,solr.core} status=0 QTime=0
   [junit4]   2> 624414 INFO  (qtp2109600101-16891) [n:127.0.0.1:40619_solr    ] o.a.s.s.HttpSolrCall [admin] webapp=null path=/admin/metrics params={prefix=CONTAINER.fs.usableSpace,CONTAINER.fs.totalSpace,CORE.coreName&wt=javabin&version=2&group=solr.node,solr.core} status=0 QTime=0
   [junit4]   2> 624424 INFO  (qtp633396651-16897) [n:127.0.0.1:39797_solr    ] o.a.s.s.HttpSolrCall [admin] webapp=null path=/admin/metrics params={prefix=CONTAINER.fs.usableSpace,CONTAINER.fs.totalSpace,CORE.coreName&wt=javabin&version=2&group=solr.node,solr.core} status=0 QTime=1
   [junit4]   2> 624425 INFO  (qtp633396651-16898) [n:127.0.0.1:39797_solr    ] o.a.s.s.HttpSolrCall [admin] webapp=null path=/admin/metrics params={prefix=CONTAINER.fs.usableSpace,CONTAINER.fs.totalSpace,CORE.coreName&wt=javabin&version=2&group=solr.node,solr.core} status=0 QTime=0
   [junit4]   2> 624427 INFO  (qtp633396651-16899) [n:127.0.0.1:39797_solr    ] o.a.s.s.HttpSolrCall [admin] webapp=null path=/admin/metrics params={prefix=CONTAINER.fs.usableSpace,CONTAINER.fs.totalSpace,CORE.coreName&wt=javabin&version=2&group=solr.node,solr.core} status=0 QTime=0
   [junit4]   2> 624428 INFO  (qtp633396651-16887) [n:127.0.0.1:39797_solr    ] o.a.s.s.HttpSolrCall [admin] webapp=null path=/admin/metrics params={prefix=CONTAINER.fs.usableSpace,CONTAINER.fs.totalSpace,CORE.coreName&wt=javabin&version=2&group=solr.node,solr.core} status=0 QTime=0
   [junit4]   2> 624429 INFO  (qtp633396651-16896) [n:127.0.0.1:39797_solr    ] o.a.s.s.HttpSolrCall [admin] webapp=null path=/admin/metrics params={prefix=CONTAINER.fs.usableSpace,CONTAINER.fs.totalSpace,CORE.coreName&wt=javabin&version=2&group=solr.node,solr.core} status=0 QTime=0
   [junit4]   2> 624434 INFO  (OverseerStateUpdate-72743372973670408-127.0.0.1:39797_solr-n_0000000000) [n:127.0.0.1:39797_solr    ] o.a.s.c.o.SliceMutator createReplica() {
   [junit4]   2>   "operation":"ADDREPLICA",
   [junit4]   2>   "collection":"testExecute",
   [junit4]   2>   "shard":"shard1",
   [junit4]   2>   "core":"testExecute_shard1_replica_n1",
   [junit4]   2>   "state":"down",
   [junit4]   2>   "base_url":"http://127.0.0.1:39797/solr",
   [junit4]   2>   "type":"NRT",
   [junit4]   2>   "waitForFinalState":"false"} 
   [junit4]   2> 624437 INFO  (OverseerStateUpdate-72743372973670408-127.0.0.1:39797_solr-n_0000000000) [n:127.0.0.1:39797_solr    ] o.a.s.c.o.SliceMutator createReplica() {
   [junit4]   2>   "operation":"ADDREPLICA",
   [junit4]   2>   "collection":"testExecute",
   [junit4]   2>   "shard":"shard1",
   [junit4]   2>   "core":"testExecute_shard1_replica_n2",
   [junit4]   2>   "state":"down",
   [junit4]   2>   "base_url":"http://127.0.0.1:40619/solr",
   [junit4]   2>   "type":"NRT",
   [junit4]   2>   "waitForFinalState":"false"} 
   [junit4]   2> 624642 INFO  (qtp633396651-16897) [n:127.0.0.1:39797_solr    x:testExecute_shard1_replica_n1] o.a.s.h.a.CoreAdminOperation core create command qt=/admin/cores&coreNodeName=core_node3&collection.configName=conf&newCollection=true&name=testExecute_shard1_replica_n1&action=CREATE&numShards=1&collection=testExecute&shard=shard1&wt=javabin&version=2&replicaType=NRT
   [junit4]   2> 624642 INFO  (qtp2109600101-16892) [n:127.0.0.1:40619_solr    x:testExecute_shard1_replica_n2] o.a.s.h.a.CoreAdminOperation core create command qt=/admin/cores&coreNodeName=core_node4&collection.configName=conf&newCollection=true&name=testExecute_shard1_replica_n2&action=CREATE&numShards=1&collection=testExecute&shard=shard1&wt=javabin&version=2&replicaType=NRT
   [junit4]   2> 624643 INFO  (qtp633396651-16897) [n:127.0.0.1:39797_solr    x:testExecute_shard1_replica_n1] o.a.s.c.TransientSolrCoreCacheDefault Allocating transient cache for 2147483647 transient cores
   [junit4]   2> 625680 INFO  (qtp633396651-16897) [n:127.0.0.1:39797_solr c:testExecute s:shard1 r:core_node3 x:testExecute_shard1_replica_n1] o.a.s.c.SolrConfig Using Lucene MatchVersion: 7.7.0
   [junit4]   2> 625690 INFO  (qtp2109600101-16892) [n:127.0.0.1:40619_solr c:testExecute s:shard1 r:core_node4 x:testExecute_shard1_replica_n2] o.a.s.c.SolrConfig Using Lucene MatchVersion: 7.7.0
   [junit4]   2> 625715 INFO  (qtp633396651-16897) [n:127.0.0.1:39797_solr c:testExecute s:shard1 r:core_node3 x:testExecute_shard1_replica_n1] o.a.s.s.IndexSchema [testExecute_shard1_replica_n1] Schema name=minimal
   [junit4]   2> 625720 INFO  (qtp2109600101-16892) [n:127.0.0.1:40619_solr c:testExecute s:shard1 r:core_node4 x:testExecute_shard1_replica_n2] o.a.s.s.IndexSchema [testExecute_shard1_replica_n2] Schema name=minimal
   [junit4]   2> 625744 INFO  (qtp2109600101-16892) [n:127.0.0.1:40619_solr c:testExecute s:shard1 r:core_node4 x:testExecute_shard1_replica_n2] o.a.s.s.IndexSchema Loaded schema minimal/1.1 with uniqueid field id
   [junit4]   2> 625744 INFO  (qtp2109600101-16892) [n:127.0.0.1:40619_solr c:testExecute s:shard1 r:core_node4 x:testExecute_shard1_replica_n2] o.a.s.c.CoreContainer Creating SolrCore 'testExecute_shard1_replica_n2' using configuration from collection testExecute, trusted=true
   [junit4]   2> 625745 INFO  (qtp2109600101-16892) [n:127.0.0.1:40619_solr c:testExecute s:shard1 r:core_node4 x:testExecute_shard1_replica_n2] o.a.s.m.r.SolrJmxReporter JMX monitoring for 'solr_40619.solr.core.testExecute.shard1.replica_n2' (registry 'solr.core.testExecute.shard1.replica_n2') enabled at server: com.sun.jmx.mbeanserver.JmxMBeanServer@10d9ea0
   [junit4]   2> 625745 INFO  (qtp2109600101-16892) [n:127.0.0.1:40619_solr c:testExecute s:shard1 r:core_node4 x:testExecute_shard1_replica_n2] o.a.s.c.SolrCore [[testExecute_shard1_replica_n2] ] Opening new SolrCore at [/x1/jenkins/jenkins-slave/workspace/Lucene-Solr-NightlyTests-7.7/checkout/solr/build/solr-core/test/J1/temp/solr.cloud.autoscaling.ExecutePlanActionTest_8F5C272E3D15FD9-001/tempDir-001/node1/testExecute_shard1_replica_n2], dataDir=[/x1/jenkins/jenkins-slave/workspace/Lucene-Solr-NightlyTests-7.7/checkout/solr/build/solr-core/test/J1/temp/solr.cloud.autoscaling.ExecutePlanActionTest_8F5C272E3D15FD9-001/tempDir-001/node1/./testExecute_shard1_replica_n2/data/]
   [junit4]   2> 625747 INFO  (qtp633396651-16897) [n:127.0.0.1:39797_solr c:testExecute s:shard1 r:core_node3 x:testExecute_shard1_replica_n1] o.a.s.s.IndexSchema Loaded schema minimal/1.1 with uniqueid field id
   [junit4]   2> 625747 INFO  (qtp633396651-16897) [n:127.0.0.1:39797_solr c:testExecute s:shard1 r:core_node3 x:testExecute_shard1_replica_n1] o.a.s.c.CoreContainer Creating SolrCore 'testExecute_shard1_replica_n1' using configuration from collection testExecute, trusted=true
   [junit4]   2> 625748 INFO  (qtp633396651-16897) [n:127.0.0.1:39797_solr c:testExecute s:shard1 r:core_node3 x:testExecute_shard1_replica_n1] o.a.s.m.r.SolrJmxReporter JMX monitoring for 'solr_39797.solr.core.testExecute.shard1.replica_n1' (registry 'solr.core.testExecute.shard1.replica_n1') enabled at server: com.sun.jmx.mbeanserver.JmxMBeanServer@10d9ea0
   [junit4]   2> 625748 INFO  (qtp633396651-16897) [n:127.0.0.1:39797_solr c:testExecute s:shard1 r:core_node3 x:testExecute_shard1_replica_n1] o.a.s.c.SolrCore [[testExecute_shard1_replica_n1] ] Opening new SolrCore at [/x1/jenkins/jenkins-slave/workspace/Lucene-Solr-NightlyTests-7.7/checkout/solr/build/solr-core/test/J1/temp/solr.cloud.autoscaling.ExecutePlanActionTest_8F5C272E3D15FD9-001/tempDir-001/node2/testExecute_shard1_replica_n1], dataDir=[/x1/jenkins/jenkins-slave/workspace/Lucene-Solr-NightlyTests-7.7/checkout/solr/build/solr-core/test/J1/temp/solr.cloud.autoscaling.ExecutePlanActionTest_8F5C272E3D15FD9-001/tempDir-001/node2/./testExecute_shard1_replica_n1/data/]
   [junit4]   2> 626031 INFO  (qtp633396651-16897) [n:127.0.0.1:39797_solr c:testExecute s:shard1 r:core_node3 x:testExecute_shard1_replica_n1] o.a.s.u.UpdateHandler Using UpdateLog implementation: org.apache.solr.update.UpdateLog
   [junit4]   2> 626031 INFO  (qtp633396651-16897) [n:127.0.0.1:39797_solr c:testExecute s:shard1 r:core_node3 x:testExecute_shard1_replica_n1] o.a.s.u.UpdateLog Initializing UpdateLog: dataDir=null defaultSyncLevel=FLUSH numRecordsToKeep=100 maxNumLogsToKeep=10 numVersionBuckets=65536
   [junit4]   2> 626036 INFO  (qtp633396651-16897) [n:127.0.0.1:39797_solr c:testExecute s:shard1 r:core_node3 x:testExecute_shard1_replica_n1] o.a.s.u.CommitTracker Hard AutoCommit: disabled
   [junit4]   2> 626037 INFO  (qtp633396651-16897) [n:127.0.0.1:39797_solr c:testExecute s:shard1 r:core_node3 x:testExecute_shard1_replica_n1] o.a.s.u.CommitTracker Soft AutoCommit: disabled
   [junit4]   2> 626055 INFO  (qtp633396651-16897) [n:127.0.0.1:39797_solr c:testExecute s:shard1 r:core_node3 x:testExecute_shard1_replica_n1] o.a.s.s.SolrIndexSearcher Opening [Searcher@440ae179[testExecute_shard1_replica_n1] main]
   [junit4]   2> 626057 INFO  (qtp633396651-16897) [n:127.0.0.1:39797_solr c:testExecute s:shard1 r:core_node3 x:testExecute_shard1_replica_n1] o.a.s.r.ManagedResourceStorage Configured ZooKeeperStorageIO with znodeBase: /configs/conf
   [junit4]   2> 626057 INFO  (qtp633396651-16897) [n:127.0.0.1:39797_solr c:testExecute s:shard1 r:core_node3 x:testExecute_shard1_replica_n1] o.a.s.r.ManagedResourceStorage Loaded null at path _rest_managed.json using ZooKeeperStorageIO:path=/configs/conf
   [junit4]   2> 626058 INFO  (qtp633396651-16897) [n:127.0.0.1:39797_solr c:testExecute s:shard1 r:core_node3 x:testExecute_shard1_replica_n1] o.a.s.h.ReplicationHandler Commits will be reserved for 10000ms.
   [junit4]   2> 626059 INFO  (qtp633396651-16897) [n:127.0.0.1:39797_solr c:testExecute s:shard1 r:core_node3 x:testExecute_shard1_replica_n1] o.a.s.u.UpdateLog Could not find max version in index or recent updates, using new clock 1624589622192373760
   [junit4]   2> 626061 INFO  (qtp2109600101-16892) [n:127.0.0.1:40619_solr c:testExecute s:shard1 r:core_node4 x:testExecute_shard1_replica_n2] o.a.s.u.UpdateHandler Using UpdateLog implementation: org.apache.solr.update.UpdateLog
   [junit4]   2> 626061 INFO  (qtp2109600101-16892) [n:127.0.0.1:40619_solr c:testExecute s:shard1 r:core_node4 x:testExecute_shard1_replica_n2] o.a.s.u.UpdateLog Initializing UpdateLog: dataDir=null defaultSyncLevel=FLUSH numRecordsToKeep=100 maxNumLogsToKeep=10 numVersionBuckets=65536
   [junit4]   2> 626065 INFO  (qtp2109600101-16892) [n:127.0.0.1:40619_solr c:testExecute s:shard1 r:core_node4 x:testExecute_shard1_replica_n2] o.a.s.u.CommitTracker Hard AutoCommit: disabled
   [junit4]   2> 626065 INFO  (qtp2109600101-16892) [n:127.0.0.1:40619_solr c:testExecute s:shard1 r:core_node4 x:testExecute_shard1_replica_n2] o.a.s.u.CommitTracker Soft AutoCommit: disabled
   [junit4]   2> 626068 INFO  (searcherExecutor-1373-thread-1-processing-n:127.0.0.1:39797_solr x:testExecute_shard1_replica_n1 c:testExecute s:shard1 r:core_node3) [n:127.0.0.1:39797_solr c:testExecute s:shard1 r:core_node3 x:testExecute_shard1_replica_n1] o.a.s.c.SolrCore [testExecute_shard1_replica_n1] Registered new searcher Searcher@440ae179[testExecute_shard1_replica_n1] main{ExitableDirectoryReader(UninvertingDirectoryReader())}
   [junit4]   2> 626074 INFO  (qtp2109600101-16892) [n:127.0.0.1:40619_solr c:testExecute s:shard1 r:core_node4 x:testExecute_shard1_replica_n2] o.a.s.s.SolrIndexSearcher Opening [Searcher@485cedc[testExecute_shard1_replica_n2] main]
   [junit4]   2> 626077 INFO  (qtp2109600101-16892) [n:127.0.0.1:40619_solr c:testExecute s:shard1 r:core_node4 x:testExecute_shard1_replica_n2] o.a.s.r.ManagedResourceStorage Configured ZooKeeperStorageIO with znodeBase: /configs/conf
   [junit4]   2> 626078 INFO  (qtp2109600101-16892) [n:127.0.0.1:40619_solr c:testExecute s:shard1 r:core_node4 x:testExecute_shard1_replica_n2] o.a.s.r.ManagedResourceStorage Loaded null at path _rest_managed.json using ZooKeeperStorageIO:path=/configs/conf
   [junit4]   2> 626078 INFO  (qtp633396651-16897) [n:127.0.0.1:39797_solr c:testExecute s:shard1 r:core_node3 x:testExecute_shard1_replica_n1] o.a.s.c.ZkShardTerms Successful update of terms at /collections/testExecute/terms/shard1 to Terms{values={core_node3=0}, version=0}
   [junit4]   2> 626079 INFO  (qtp633396651-16897) [n:127.0.0.1:39797_solr c:testExecute s:shard1 r:core_node3 x:testExecute_shard1_replica_n1] o.a.s.c.ShardLeaderElectionContextBase make sure parent is created /collections/testExecute/leaders/shard1
   [junit4]   2> 626080 INFO  (qtp2109600101-16892) [n:127.0.0.1:40619_solr c:testExecute s:shard1 r:core_node4 x:testExecute_shard1_replica_n2] o.a.s.h.ReplicationHandler Commits will be reserved for 10000ms.
   [junit4]   2> 626080 INFO  (qtp2109600101-16892) [n:127.0.0.1:40619_solr c:testExecute s:shard1 r:core_node4 x:testExecute_shard1_replica_n2] o.a.s.u.UpdateLog Could not find max version in index or recent updates, using new clock 1624589622214393856
   [junit4]   2> 626086 INFO  (searcherExecutor-1372-thread-1-processing-n:127.0.0.1:40619_solr x:testExecute_shard1_replica_n2 c:testExecute s:shard1 r:core_node4) [n:127.0.0.1:40619_solr c:testExecute s:shard1 r:core_node4 x:testExecute_shard1_replica_n2] o.a.s.c.SolrCore [testExecute_shard1_replica_n2] Registered new searcher Searcher@485cedc[testExecute_shard1_replica_n2] main{ExitableDirectoryReader(UninvertingDirectoryReader())}
   [junit4]   2> 626093 INFO  (qtp633396651-16897) [n:127.0.0.1:39797_solr c:testExecute s:shard1 r:core_node3 x:testExecute_shard1_replica_n1] o.a.s.c.ShardLeaderElectionContext Waiting until we see more replicas up for shard shard1: total=2 found=1 timeoutin=9999ms
   [junit4]   2> 626095 INFO  (qtp2109600101-16892) [n:127.0.0.1:40619_solr c:testExecute s:shard1 r:core_node4 x:testExecute_shard1_replica_n2] o.a.s.c.ZkShardTerms Successful update of terms at /collections/testExecute/terms/shard1 to Terms{values={core_node3=0, core_node4=0}, version=1}
   [junit4]   2> 626095 INFO  (qtp2109600101-16892) [n:127.0.0.1:40619_solr c:testExecute s:shard1 r:core_node4 x:testExecute_shard1_replica_n2] o.a.s.c.ShardLeaderElectionContextBase make sure parent is created /collections/testExecute/leaders/shard1
   [junit4]   2> 626594 INFO  (qtp633396651-16897) [n:127.0.0.1:39797_solr c:testExecute s:shard1 r:core_node3 x:testExecute_shard1_replica_n1] o.a.s.c.ShardLeaderElectionContext Enough replicas found to continue.
   [junit4]   2> 626595 INFO  (qtp633396651-16897) [n:127.0.0.1:39797_solr c:testExecute s:shard1 r:core_node3 x:testExecute_shard1_replica_n1] o.a.s.c.ShardLeaderElectionContext I may be the new leader - try and sync
   [junit4]   2> 626595 INFO  (qtp633396651-16897) [n:127.0.0.1:39797_solr c:testExecute s:shard1 r:core_node3 x:testExecute_shard1_replica_n1] o.a.s.c.SyncStrategy Sync replicas to http://127.0.0.1:39797/solr/testExecute_shard1_replica_n1/
   [junit4]   2> 626595 INFO  (qtp633396651-16897) [n:127.0.0.1:39797_solr c:testExecute s:shard1 r:core_node3 x:testExecute_shard1_replica_n1] o.a.s.u.PeerSync PeerSync: core=testExecute_shard1_replica_n1 url=http://127.0.0.1:39797/solr START replicas=[http://127.0.0.1:40619/solr/testExecute_shard1_replica_n2/] nUpdates=100
   [junit4]   2> 626607 INFO  (qtp633396651-16897) [n:127.0.0.1:39797_solr c:testExecute s:shard1 r:core_node3 x:testExecute_shard1_replica_n1] o.a.s.u.PeerSync PeerSync: core=testExecute_shard1_replica_n1 url=http://127.0.0.1:39797/solr DONE.  We have no versions.  sync failed.
   [junit4]   2> 626609 INFO  (qtp2109600101-16888) [n:127.0.0.1:40619_solr c:testExecute s:shard1 r:core_node4 x:testExecute_shard1_replica_n2] o.a.s.c.S.Request [testExecute_shard1_replica_n2]  webapp=/solr path=/get params={distrib=false&qt=/get&fingerprint=false&getVersions=100&wt=javabin&version=2} status=0 QTime=1
   [junit4]   2> 626612 INFO  (qtp633396651-16897) [n:127.0.0.1:39797_solr c:testExecute s:shard1 r:core_node3 x:testExecute_shard1_replica_n1] o.a.s.c.SyncStrategy Leader's attempt to sync with shard failed, moving to the next candidate
   [junit4]   2> 626612 INFO  (qtp633396651-16897) [n:127.0.0.1:39797_solr c:testExecute s:shard1 r:core_node3 x:testExecute_shard1_replica_n1] o.a.s.c.ShardLeaderElectionContext We failed sync, but we have no versions - we can't sync in that case - we were active before, so become leader anyway
   [junit4]   2> 626612 INFO  (qtp633396651-16897) [n:127.0.0.1:39797_solr c:testExecute s:shard1 r:core_node3 x:testExecute_shard1_replica_n1] o.a.s.c.ShardLeaderElectionContext Found all replicas participating in election, clear LIR
   [junit4]   2> 626612 INFO  (qtp633396651-16897) [n:127.0.0.1:39797_solr c:testExecute s:shard1 r:core_node3 x:testExecute_shard1_replica_n1] o.a.s.c.ShardLeaderElectionContextBase Creating leader registration node /collections/testExecute/leaders/shard1/leader after winning as /collections/testExecute/leader_elect/shard1/election/72743372973670408-core_node3-n_0000000000
   [junit4]   2> 626614 INFO  (qtp633396651-16897) [n:127.0.0.1:39797_solr c:testExecute s:shard1 r:core_node3 x:testExecute_shard1_replica_n1] o.a.s.c.ShardLeaderElectionContext I am the new leader: http://127.0.0.1:39797/solr/testExecute_shard1_replica_n1/ shard1
   [junit4]   2> 626718 INFO  (zkCallback-5905-thread-2) [    ] o.a.s.c.c.ZkStateReader A cluster state change: [WatchedEvent state:SyncConnected type:NodeDataChanged path:/collections/testExecute/state.json] for collection [testExecute] has occurred - updating... (live nodes size: [2])
   [junit4]   2> 626720 INFO  (qtp633396651-16897) [n:127.0.0.1:39797_solr c:testExecute s:shard1 r:core_node3 x:testExecute_shard1_replica_n1] o.a.s.c.ZkController I am the leader, no recovery necessary
   [junit4]   2> 626723 INFO  (qtp633396651-16897) [n:127.0.0.1:39797_solr c:testExecute s:shard1 r:core_node3 x:testExecute_shard1_replica_n1] o.a.s.s.HttpSolrCall [admin] webapp=null path=/admin/cores params={qt=/admin/cores&coreNodeName=core_node3&collection.configName=conf&newCollection=true&name=testExecute_shard1_replica_n1&action=CREATE&numShards=1&collection=testExecute&shard=shard1&wt=javabin&version=2&replicaType=NRT} status=0 QTime=2081
   [junit4]   2> 626839 INFO  (zkCallback-5905-thread-2) [    ] o.a.s.c.c.ZkStateReader A cluster state change: [WatchedEvent state:SyncConnected type:NodeDataChanged path:/collections/testExecute/state.json] for collection [testExecute] has occurred - updating... (live nodes size: [2])
   [junit4]   2> 626839 INFO  (zkCallback-5905-thread-1) [    ] o.a.s.c.c.ZkStateReader A cluster state change: [WatchedEvent state:SyncConnected type:NodeDataChanged path:/collections/testExecute/state.json] for collection [testExecute] has occurred - updating... (live nodes size: [2])
   [junit4]   2> 627111 INFO  (qtp2109600101-16892) [n:127.0.0.1:40619_solr c:testExecute s:shard1 r:core_node4 x:testExecute_shard1_replica_n2] o.a.s.s.HttpSolrCall [admin] webapp=null path=/admin/cores params={qt=/admin/cores&coreNodeName=core_node4&collection.configName=conf&newCollection=true&name=testExecute_shard1_replica_n2&action=CREATE&numShards=1&collection=testExecute&shard=shard1&wt=javabin&version=2&replicaType=NRT} status=0 QTime=2469
   [junit4]   2> 627125 INFO  (qtp2109600101-16890) [n:127.0.0.1:40619_solr    ] o.a.s.h.a.CollectionsHandler Wait for new collection to be active for at most 45 seconds. Check all shard replicas
   [junit4]   2> 627215 INFO  (zkCallback-5905-thread-2) [    ] o.a.s.c.c.ZkStateReader A cluster state change: [WatchedEvent state:SyncConnected type:NodeDataChanged path:/collections/testExecute/state.json] for collection [testExecute] has occurred - updating... (live nodes size: [2])
   [junit4]   2> 627215 INFO  (zkCallback-5897-thread-1) [    ] o.a.s.c.c.ZkStateReader A cluster state change: [WatchedEvent state:SyncConnected type:NodeDataChanged path:/collections/testExecute/state.json] for collection [testExecute] has occurred - updating... (live nodes size: [2])
   [junit4]   2> 627215 INFO  (zkCallback-5905-thread-3) [    ] o.a.s.c.c.ZkStateReader A cluster state change: [WatchedEvent state:SyncConnected type:NodeDataChanged path:/collections/testExecute/state.json] for collection [testExecute] has occurred - updating... (live nodes size: [2])
   [junit4]   2> 627216 INFO  (qtp2109600101-16890) [n:127.0.0.1:40619_solr    ] o.a.s.s.HttpSolrCall [admin] webapp=null path=/admin/collections params={collection.configName=conf&maxShardsPerNode=1&name=testExecute&nrtReplicas=2&action=CREATE&numShards=1&wt=javabin&version=2} status=0 QTime=2947
   [junit4]   2> 627232 INFO  (zkCallback-5897-thread-2) [    ] o.a.s.c.c.ZkStateReader A cluster state change: [WatchedEvent state:SyncConnected type:NodeDataChanged path:/collections/testExecute/state.json] for collection [testExecute] has occurred - updating... (live nodes size: [2])
   [junit4]   2> 627233 INFO  (watches-5922-thread-1) [    ] o.a.s.c.SolrCloudTestCase active replica count: 2 expected replica count: 2
   [junit4]   2> 627245 INFO  (TEST-ExecutePlanActionTest.testExecute-seed#[8F5C272E3D15FD9]) [    ] o.a.s.c.SolrCloudTestCase active replica count: 2 expected replica count: 2
   [junit4]   2> 627250 DEBUG (TEST-ExecutePlanActionTest.testExecute-seed#[8F5C272E3D15FD9]) [    ] o.a.s.c.a.ExecutePlanAction -- processing event: {
   [junit4]   2>   "id":"252d19351f25c9T9fe1pvduif5vebsfctmdqimub",
   [junit4]   2>   "source":"mock_trigger_name",
   [junit4]   2>   "eventTime":10464160426960329,
   [junit4]   2>   "eventType":"NODELOST",
   [junit4]   2>   "properties":{
   [junit4]   2>     "eventTimes":[10464160426960329],
   [junit4]   2>     "preferredOperation":"movereplica",
   [junit4]   2>     "nodeNames":["127.0.0.1:40619_solr"]}} with context properties: {operations=[{
   [junit4]   2>   "class":"org.apache.solr.client.solrj.request.CollectionAdminRequest$MoveReplica",
   [junit4]   2>   "method":"GET",
   [junit4]   2>   "params.action":"MOVEREPLICA",
   [junit4]   2>   "params.collection":"testExecute",
   [junit4]   2>   "params.targetNode":"127.0.0.1:39797_solr",
   [junit4]   2>   "params.inPlaceMove":"true",
   [junit4]   2>   "params.replica":"core_node4"}, {
   [junit4]   2>   "class":"org.apache.solr.cloud.autoscaling.ExecutePlanActionTest$1",
   [junit4]   2>   "method":"GET",
   [junit4]   2>   "params.action":"OVERSEERSTATUS"}]}
   [junit4]   2> 627251 DEBUG (TEST-ExecutePlanActionTest.testExecute-seed#[8F5C272E3D15FD9]) [    ] o.a.s.c.a.ExecutePlanAction Executing operation: action=MOVEREPLICA&collection=testExecute&targetNode=127.0.0.1:39797_solr&inPlaceMove=true&replica=core_node4
   [junit4]   2> 627259 INFO  (qtp2109600101-16891) [n:127.0.0.1:40619_solr    ] o.a.s.h.a.CollectionsHandler Invoked Collection Action :movereplica with params async=mock_trigger_name/252d19351f25c9T9fe1pvduif5vebsfctmdqimub/0&replica=core_node4&action=MOVEREPLICA&collection=testExecute&waitForFinalState=true&targetNode=127.0.0.1:39797_solr&wt=javabin&version=2&inPlaceMove=true and sendToOCPQueue=true
   [junit4]   2> 627265 INFO  (qtp2109600101-16891) [n:127.0.0.1:40619_solr c:testExecute   ] o.a.s.s.HttpSolrCall [admin] webapp=null path=/admin/collections params={async=mock_trigger_name/252d19351f25c9T9fe1pvduif5vebsfctmdqimub/0&replica=core_node4&action=MOVEREPLICA&collection=testExecute&waitForFinalState=true&targetNode=127.0.0.1:39797_solr&wt=javabin&version=2&inPlaceMove=true} status=0 QTime=6
   [junit4]   2> 627267 INFO  (qtp2109600101-16886) [n:127.0.0.1:40619_solr    ] o.a.s.h.a.CollectionsHandler Invoked Collection Action :requeststatus with params requestid=mock_trigger_name/252d19351f25c9T9fe1pvduif5vebsfctmdqimub/0&action=REQUESTSTATUS&wt=javabin&version=2 and sendToOCPQueue=true
   [junit4]   2> 627270 INFO  (qtp2109600101-16886) [n:127.0.0.1:40619_solr    ] o.a.s.s.HttpSolrCall [admin] webapp=null path=/admin/collections params={requestid=mock_trigger_name/252d19351f25c9T9fe1pvduif5vebsfctmdqimub/0&action=REQUESTSTATUS&wt=javabin&version=2} status=0 QTime=2
   [junit4]   2> 627275 INFO  (OverseerCollectionConfigSetProcessor-72743372973670408-127.0.0.1:39797_solr-n_0000000000) [n:127.0.0.1:39797_solr    ] o.a.s.c.OverseerTaskQueue Response ZK path: /overseer/collection-queue-work/qnr-0000000000 doesn't exist.  Requestor may have disconnected from ZooKeeper
   [junit4]   2> 627275 INFO  (OverseerThreadFactory-1363-thread-2-processing-n:127.0.0.1:39797_solr) [n:127.0.0.1:39797_solr c:testExecute  r:core_node4 ] o.a.s.c.a.c.MoveReplicaCmd Replica will be moved to node 127.0.0.1:39797_solr: core_node4:{"core":"testExecute_shard1_replica_n2","base_url":"http://127.0.0.1:40619/solr","node_name":"127.0.0.1:40619_solr","state":"active","type":"NRT","force_set_state":"false"}
   [junit4]   2> 627334 INFO  (qtp2109600101-16888) [n:127.0.0.1:40619_solr    ] o.a.s.s.HttpSolrCall [admin] webapp=null path=/admin/metrics params={wt=javabin&version=2&key=solr.core.testExecute.shard1.replica_n2:INDEX.sizeInBytes} status=0 QTime=6
   [junit4]   2> 627335 INFO  (qtp2109600101-16892) [n:127.0.0.1:40619_solr    ] o.a.s.s.HttpSolrCall [admin] webapp=null path=/admin/metrics params={wt=javabin&version=2&key=solr.core.testExecute.shard1.replica_n2:INDEX.sizeInBytes} status=0 QTime=0
   [junit4]   2> 627335 INFO  (qtp2109600101-16890) [n:127.0.0.1:40619_solr    ] o.a.s.s.HttpSolrCall [admin] webapp=null path=/admin/metrics params={wt=javabin&version=2&key=solr.core.testExecute.shard1.replica_n2:INDEX.sizeInBytes} status=0 QTime=0
   [junit4]   2> 627337 INFO  (qtp2109600101-16891) [n:127.0.0.1:40619_solr    ] o.a.s.s.HttpSolrCall [admin] webapp=null path=/admin/metrics params={prefix=CONTAINER.fs.usableSpace,CONTAINER.fs.totalSpace,CORE.coreName&wt=javabin&version=2&group=solr.node,solr.core} status=0 QTime=0
   [junit4]   2> 627338 INFO  (qtp2109600101-16886) [n:127.0.0.1:40619_solr    ] o.a.s.s.HttpSolrCall [admin] webapp=null path=/admin/metrics params={prefix=CONTAINER.fs.usableSpace,CONTAINER.fs.totalSpace,CORE.coreName&wt=javabin&version=2&group=solr.node,solr.core} status=0 QTime=0
   [junit4]   2> 627339 INFO  (qtp2109600101-16888) [n:127.0.0.1:40619_solr    ] o.a.s.s.HttpSolrCall [admin] webapp=null path=/admin/metrics params={prefix=CONTAINER.fs.usableSpace,CONTAINER.fs.totalSpace,CORE.coreName&wt=javabin&version=2&group=solr.node,solr.core} status=0 QTime=0
   [junit4]   2> 627340 INFO  (qtp2109600101-16892) [n:127.0.0.1:40619_solr    ] o.a.s.s.HttpSolrCall [admin] webapp=null path=/admin/metrics params={prefix=CONTAINER.fs.usableSpace,CONTAINER.fs.totalSpace,CORE.coreName&wt=javabin&version=2&group=solr.node,solr.core} status=0 QTime=0
   [junit4]   2> 627341 INFO  (qtp2109600101-16890) [n:127.0.0.1:40619_solr    ] o.a.s.s.HttpSolrCall [admin] webapp=null path=/admin/metrics params={prefix=CONTAINER.fs.usableSpace,CONTAINER.fs.totalSpace,CORE.coreName&wt=javabin&version=2&group=solr.node,solr.core} status=0 QTime=0
   [junit4]   2> 627343 INFO  (qtp633396651-16898) [n:127.0.0.1:39797_solr    ] o.a.s.s.HttpSolrCall [admin] webapp=null path=/admin/metrics params={wt=javabin&version=2&key=solr.core.testExecute.shard1.replica_n1:INDEX.sizeInBytes} status=0 QTime=1
   [junit4]   2> 627355 INFO  (qtp633396651-16899) [n:127.0.0.1:39797_solr    ] o.a.s.s.HttpSolrCall [admin] webapp=null path=/admin/metrics params={wt=javabin&version=2&key=solr.core.testExecute.shard1.replica_n1:INDEX.sizeInBytes} status=0 QTime=11
   [junit4]   2> 627356 INFO  (qtp633396651-16887) [n:127.0.0.1:39797_solr    ] o.a.s.s.HttpSolrCall [admin] webapp=null path=/admin/metrics params={wt=javabin&version=2&key=solr.core.testExecute.shard1.replica_n1:INDEX.sizeInBytes} status=0 QTime=0
   [junit4]   2> 627360 INFO  (qtp633396651-16896) [n:127.0.0.1:39797_solr    ] o.a.s.s.HttpSolrCall [admin] webapp=null path=/admin/metrics params={prefix=CONTAINER.fs.usableSpace,CONTAINER.fs.totalSpace,CORE.coreName&wt=javabin&version=2&group=solr.node,solr.core} status=0 QTime=1
   [junit4]   2> 627362 INFO  (qtp633396651-16897) [n:127.0.0.1:39797_solr    ] o.a.s.s.HttpSolrCall [admin] webapp=null path=/admin/metrics params={prefix=CONTAINER.fs.usableSpace,CONTAINER.fs.totalSpace,CORE.coreName&wt=javabin&version=2&group=solr.node,solr.core} status=0 QTime=0
   [junit4]   2> 627366 INFO  (qtp633396651-16898) [n:127.0.0.1:39797_solr    ] o.a.s.s.HttpSolrCall [admin] webapp=null path=/admin/metrics params={prefix=CONTAINER.fs.usableSpace,CONTAINER.fs.totalSpace,CORE.coreName&wt=javabin&version=2&group=solr.node,solr.core} status=0 QTime=0
   [junit4]   2> 627367 INFO  (qtp633396651-16899) [n:127.0.0.1:39797_solr    ] o.a.s.s.HttpSolrCall [admin] webapp=null path=/admin/metrics params={prefix=CONTAINER.fs.usableSpace,CONTAINER.fs.totalSpace,CORE.coreName&wt=javabin&version=2&group=solr.node,solr.core} status=0 QTime=0
   [junit4]   2> 627372 INFO  (qtp633396651-16887) [n:127.0.0.1:39797_solr    ] o.a.s.s.HttpSolrCall [admin] webapp=null path=/admin/metrics params={prefix=CONTAINER.fs.usableSpace,CONTAINER.fs.totalSpace,CORE.coreName&wt=javabin&version=2&group=solr.node,solr.core} status=0 QTime=3
   [junit4]   2> 627385 INFO  (qtp633396651-16896) [n:127.0.0.1:39797_solr    ] o.a.s.s.HttpSolrCall [admin] webapp=null path=/admin/metrics params={wt=javabin&version=2&key=solr.core.testExecute.shard1.replica_n1:INDEX.sizeInBytes} status=0 QTime=0
   [junit4]   2> 627386 INFO  (qtp633396651-16897) [n:127.0.0.1:39797_solr    ] o.a.s.s.HttpSolrCall [admin] webapp=null path=/admin/metrics params={wt=javabin&version=2&key=solr.core.testExecute.shard1.replica_n1:INDEX.sizeInBytes} status=0 QTime=0
   [junit4]   2> 627386 INFO  (qtp633396651-16898) [n:127.0.0.1:39797_solr    ] o.a.s.s.HttpSolrCall [admin] webapp=null path=/admin/metrics params={wt=javabin&version=2&key=solr.core.testExecute.shard1.replica_n1:INDEX.sizeInBytes} status=0 QTime=0
   [junit4]   2> 627389 INFO  (OverseerThreadFactory-1363-thread-2-processing-n:127.0.0.1:39797_solr) [n:127.0.0.1:39797_solr c:testExecute  r:core_node4 ] o.a.s.c.a.c.AddReplicaCmd Node Identified 127.0.0.1:39797_solr for creating new replica of shard shard1 for collection testExecute
   [junit4]   2> 627389 INFO  (OverseerThreadFactory-1363-thread-2-processing-n:127.0.0.1:39797_solr) [n:127.0.0.1:39797_solr c:testExecute  r:core_node4 ] o.a.s.c.a.c.AddReplicaCmd Returning CreateReplica command.
   [junit4]   2> 627396 INFO  (OverseerStateUpdate-72743372973670408-127.0.0.1:39797_solr-n_0000000000) [n:127.0.0.1:39797_solr    ] o.a.s.c.o.SliceMutator createReplica() {
   [junit4]   2>   "operation":"addreplica",
   [junit4]   2>   "collection":"testExecute",
   [junit4]   2>   "shard":"shard1",
   [junit4]   2>   "core":"testExecute_shard1_replica_n5",
   [junit4]   2>   "state":"down",
   [junit4]   2>   "base_url":"http://127.0.0.1:39797/solr",
   [junit4]   2>   "node_name":"127.0.0.1:39797_solr",
   [junit4]   2>   "type":"NRT"} 
   [junit4]   2> 627508 INFO  (zkCallback-5897-thread-1) [    ] o.a.s.c.c.ZkStateReader A cluster state change: [WatchedEvent state:SyncConnected type:NodeDataChanged path:/collections/testExecute/state.json] for collection [testExecute] has occurred - updating... (live nodes size: [2])
   [junit4]   2> 627509 INFO  (zkCallback-5897-thread-2) [    ] o.a.s.c.c.ZkStateReader A cluster state change: [WatchedEvent state:SyncConnected type:NodeDataChanged path:/collections/testExecute/state.json] for collection [testExecute] has occurred - updating... (live nodes size: [2])
   [junit4]   2> 627509 INFO  (zkCallback-5905-thread-2) [    ] o.a.s.c.c.ZkStateReader A cluster state change: [WatchedEvent state:SyncConnected type:NodeDataChanged path:/collections/testExecute/state.json] for collection [testExecute] has occurred - updating... (live nodes size: [2])
   [junit4]   2> 627509 INFO  (zkCallback-5905-thread-3) [    ] o.a.s.c.c.ZkStateReader A cluster state change: [WatchedEvent state:SyncConnected type:NodeDataChanged path:/collections/testExecute/state.json] for collection [testExecute] has occurred - updating... (live nodes size: [2])
   [junit4]   2> 627600 INFO  (qtp633396651-16887) [n:127.0.0.1:39797_solr    x:testExecute_shard1_replica_n5] o.a.s.s.HttpSolrCall [admin] webapp=null path=/admin/cores params={async=mock_trigger_name/252d19351f25c9T9fe1pvduif5vebsfctmdqimub/010464160771815737&qt=/admin/cores&coreNodeName=core_node6&collection.configName=conf&name=testExecute_shard1_replica_n5&action=CREATE&collection=testExecute&shard=shard1&wt=javabin&version=2&replicaType=NRT} status=0 QTime=4
   [junit4]   2> 627602 INFO  (qtp633396651-16896) [n:127.0.0.1:39797_solr    ] o.a.s.h.a.CoreAdminOperation Checking request status for : mock_trigger_name/252d19351f25c9T9fe1pvduif5vebsfctmdqimub/010464160771815737
   [junit4]   2> 627603 INFO  (parallelCoreAdminExecutor-1364-thread-1-processing-n:127.0.0.1:39797_solr x:testExecute_shard1_replica_n5 mock_trigger_name//252d19351f25c9T9fe1pvduif5vebsfctmdqimub//010464160771815737 CREATE) [n:127.0.0.1:39797_solr    x:testExecute_shard1_replica_n5] o.a.s.h.a.CoreAdminOperation core create command async=mock_trigger_name/252d19351f25c9T9fe1pvduif5vebsfctmdqimub/010464160771815737&qt=/admin/cores&coreNodeName=core_node6&collection.configName=conf&name=testExecute_shard1_replica_n5&action=CREATE&collection=testExecute&shard=shard1&wt=javabin&version=2&replicaType=NRT
   [junit4]   2> 627605 INFO  (qtp633396651-16896) [n:127.0.0.1:39797_solr    ] o.a.s.s.HttpSolrCall [admin] webapp=null path=/admin/cores params={qt=/admin/cores&requestid=mock_trigger_name/252d19351f25c9T9fe1pvduif5vebsfctmdqimub/010464160771815737&action=REQUESTSTATUS&wt=javabin&version=2} status=0 QTime=3
   [junit4]   2> 627636 INFO  (parallelCoreAdminExecutor-1364-thread-1-processing-n:127.0.0.1:39797_solr x:testExecute_shard1_replica_n5 mock_trigger_name//252d19351f25c9T9fe1pvduif5vebsfctmdqimub//010464160771815737 CREATE) [n:127.0.0.1:39797_solr c:testExecute s:shard1 r:core_node6 x:testExecute_shard1_replica_n5] o.a.s.c.SolrConfig Using Lucene MatchVersion: 7.7.0
   [junit4]   2> 627655 INFO  (parallelCoreAdminExecutor-1364-thread-1-processing-n:127.0.0.1:39797_solr x:testExecute_shard1_replica_n5 mock_trigger_name//252d19351f25c9T9fe1pvduif5vebsfctmdqimub//010464160771815737 CREATE) [n:127.0.0.1:39797_solr c:testExecute s:shard1 r:core_node6 x:testExecute_shard1_replica_n5] o.a.s.s.IndexSchema [testExecute_shard1_replica_n5] Schema name=minimal
   [junit4]   2> 627658 INFO  (parallelCoreAdminExecutor-1364-thread-1-processing-n:127.0.0.1:39797_solr x:testExecute_shard1_replica_n5 mock_trigger_name//252d19351f25c9T9fe1pvduif5vebsfctmdqimub//010464160771815737 CREATE) [n:127.0.0.1:39797_solr c:testExecute s:shard1 r:core_node6 x:testExecute_shard1_replica_n5] o.a.s.s.IndexSchema Loaded schema minimal/1.1 with uniqueid field id
   [junit4]   2> 627658 INFO  (parallelCoreAdminExecutor-1364-thread-1-processing-n:127.0.0.1:39797_solr x:testExecute_shard1_replica_n5 mock_trigger_name//252d19351f25c9T9fe1pvduif5vebsfctmdqimub//010464160771815737 CREATE) [n:127.0.0.1:39797_solr c:testExecute s:shard1 r:core_node6 x:testExecute_shard1_replica_n5] o.a.s.c.CoreContainer Creating SolrCore 'testExecute_shard1_replica_n5' using configuration from collection testExecute, trusted=true
   [junit4]   2> 627667 INFO  (parallelCoreAdminExecutor-1364-thread-1-processing-n:127.0.0.1:39797_solr x:testExecute_shard1_replica_n5 mock_trigger_name//252d19351f25c9T9fe1pvduif5vebsfctmdqimub//010464160771815737 CREATE) [n:127.0.0.1:39797_solr c:testExecute s:shard1 r:core_node6 x:testExecute_shard1_replica_n5] o.a.s.m.r.SolrJmxReporter JMX monitoring for 'solr_39797.solr.core.testExecute.shard1.replica_n5' (registry 'solr.core.testExecute.shard1.replica_n5') enabled at server: com.sun.jmx.mbeanserver.JmxMBeanServer@10d9ea0
   [junit4]   2> 627667 INFO  (parallelCoreAdminExecutor-1364-thread-1-processing-n:127.0.0.1:39797_solr x:testExecute_shard1_replica_n5 mock_trigger_name//252d19351f25c9T9fe1pvduif5vebsfctmdqimub//010464160771815737 CREATE) [n:127.0.0.1:39797_solr c:testExecute s:shard1 r:core_node6 x:testExecute_shard1_replica_n5] o.a.s.c.SolrCore [[testExecute_shard1_replica_n5] ] Opening new SolrCore at [/x1/jenkins/jenkins-slave/workspace/Lucene-Solr-NightlyTests-7.7/checkout/solr/build/solr-core/test/J1/temp/solr.cloud.autoscaling.ExecutePlanActionTest_8F5C272E3D15FD9-001/tempDir-001/node2/testExecute_shard1_replica_n5], dataDir=[/x1/jenkins/jenkins-slave/workspace/Lucene-Solr-NightlyTests-7.7/checkout/solr/build/solr-core/test/J1/temp/solr.cloud.autoscaling.ExecutePlanActionTest_8F5C272E3D15FD9-001/tempDir-001/node2/./testExecute_shard1_replica_n5/data/]
   [junit4]   2> 627710 INFO  (zkCallback-5905-thread-3) [    ] o.a.s.c.c.ZkStateReader A cluster state change: [WatchedEvent state:SyncConnected type:NodeDataChanged path:/collections/testExecute/state.json] for collection [testExecute] has occurred - updating... (live nodes size: [2])
   [junit4]   2> 627710 INFO  (zkCallback-5897-thread-2) [    ] o.a.s.c.c.ZkStateReader A cluster state change: [WatchedEvent state:SyncConnected type:NodeDataChanged path:/collections/testExecute/state.json] for collection [testExecute] has occurred - updating... (live nodes size: [2])
   [junit4]   2> 627710 INFO  (zkCallback-5905-thread-2) [    ] o.a.s.c.c.ZkStateReader A cluster state change: [WatchedEvent state:SyncConnected type:NodeDataChanged path:/collections/testExecute/state.json] for collection [testExecute] has occurred - updating... (live nodes size: [2])
   [junit4]   2> 627710 INFO  (zkCallback-5897-thread-1) [    ] o.a.s.c.c.ZkStateReader A cluster state change: [WatchedEvent state:SyncConnected type:NodeDataChanged path:/collections/testExecute/state.json] for collection [testExecute] has occurred - updating... (live nodes size: [2])
   [junit4]   2> 627837 INFO  (parallelCoreAdminExecutor-1364-thread-1-processing-n:127.0.0.1:39797_solr x:testExecute_shard1_replica_n5 mock_trigger_name//252d19351f25c9T9fe1pvduif5vebsfctmdqimub//010464160771815737 CREATE) [n:127.0.0.1:39797_solr c:testExecute s:shard1 r:core_node6 x:testExecute_shard1_replica_n5] o.a.s.u.UpdateHandler Using UpdateLog implementation: org.apache.solr.update.UpdateLog
   [junit4]   2> 627837 INFO  (parallelCoreAdminExecutor-1364-thread-1-processing-n:127.0.0.1:39797_solr x:testExecute_shard1_replica_n5 mock_trigger_name//252d19351f25c9T9fe1pvduif5vebsfctmdqimub//010464160771815737 CREATE) [n:127.0.0.1:39797_solr c:testExecute s:shard1 r:core_node6 x:testExecute_shard1_replica_n5] o.a.s.u.UpdateLog Initializing UpdateLog: dataDir=null defaultSyncLevel=FLUSH numRecordsToKeep=100 maxNumLogsToKeep=10 numVersionBuckets=65536
   [junit4]   2> 627840 INFO  (parallelCoreAdminExecutor-1364-thread-1-processing-n:127.0.0.1:39797_solr x:testExecute_shard1_replica_n5 mock_trigger_name//252d19351f25c9T9fe1pvduif5vebsfctmdqimub//010464160771815737 CREATE) [n:127.0.0.1:39797_solr c:testExecute s:shard1 r:core_node6 x:testExecute_shard1_replica_n5] o.a.s.u.CommitTracker Hard AutoCommit: disabled
   [junit4]   2> 627840 INFO  (parallelCoreAdminExecutor-1364-thread-1-processing-n:127.0.0.1:39797_solr x:testExecute_shard1_replica_n5 mock_trigger_name//252d19351f25c9T9fe1pvduif5vebsfctmdqimub//010464160771815737 CREATE) [n:127.0.0.1:39797_solr c:testExecute s:shard1 r:core_node6 x:testExecute_shard1_replica_n5] o.a.s.u.CommitTracker Soft AutoCommit: disabled
   [junit4]   2> 627842 INFO  (parallelCoreAdminExecutor-1364-thread-1-processing-n:127.0.0.1:39797_solr x:testExecute_shard1_replica_n5 mock_trigger_name//252d19351f25c9T9fe1pvduif5vebsfctmdqimub//010464160771815737 CREATE) [n:127.0.0.1:39797_solr c:testExecute s:shard1 r:core_node6 x:testExecute_shard1_replica_n5] o.a.s.s.SolrIndexSearcher Opening [Searcher@5575c52b[testExecute_shard1_replica_n5] main]
   [junit4]   2> 627854 INFO  (parallelCoreAdminExecutor-1364-thread-1-processing-n:127.0.0.1:39797_solr x:testExecute_shard1_replica_n5 mock_trigger_name//252d19351f25c9T9fe1pvduif5vebsfctmdqimub//010464160771815737 CREATE) [n:127.0.0.1:39797_solr c:testExecute s:shard1 r:core_node6 x:testExecute_shard1_replica_n5] o.a.s.r.ManagedResourceStorage Configured ZooKeeperStorageIO with znodeBase: /configs/conf
   [junit4]   2> 627855 INFO  (parallelCoreAdminExecutor-1364-thread-1-processing-n:127.0.0.1:39797_solr x:testExecute_shard1_replica_n5 mock_trigger_name//252d19351f25c9T9fe1pvduif5vebsfctmdqimub//010464160771815737 CREATE) [n:127.0.0.1:39797_solr c:testExecute s:shard1 r:core_node6 x:testExecute_shard1_replica_n5] o.a.s.r.ManagedResourceStorage Loaded null at path _rest_managed.json using ZooKeeperStorageIO:path=/configs/conf
   [junit4]   2> 627856 INFO  (parallelCoreAdminExecutor-1364-thread-1-processing-n:127.0.0.1:39797_solr x:testExecute_shard1_replica_n5 mock_trigger_name//252d19351f25c9T9fe1pvduif5vebsfctmdqimub//010464160771815737 CREATE) [n:127.0.0.1:39797_solr c:testExecute s:shard1 r:core_node6 x:testExecute_shard1_replica_n5] o.a.s.h.ReplicationHandler Commits will be reserved for 10000ms.
   [junit4]   2> 627856 INFO  (parallelCoreAdminExecutor-1364-thread-1-processing-n:127.0.0.1:39797_solr x:testExecute_shard1_replica_n5 mock_trigger_name//252d19351f25c9T9fe1pvduif5vebsfctmdqimub//010464160771815737 CREATE) [n:127.0.0.1:39797_solr c:testExecute s:shard1 r:core_node6 x:testExecute_shard1_replica_n5] o.a.s.u.UpdateLog Could not find max version in index or recent updates, using new clock 1624589624076664832
   [junit4]   2> 627860 INFO  (searcherExecutor-1382-thread-1-processing-x:testExecute_shard1_replica_n5 mock_trigger_name//252d19351f25c9T9fe1pvduif5vebsfctmdqimub//010464160771815737 r:core_node6 CREATE n:127.0.0.1:39797_solr c:testExecute s:shard1) [n:127.0.0.1:39797_solr c:testExecute s:shard1 r:core_node6 x:testExecute_shard1_replica_n5] o.a.s.c.SolrCore [testExecute_shard1_replica_n5] Registered new searcher Searcher@5575c52b[testExecute_shard1_replica_n5] main{ExitableDirectoryReader(UninvertingDirectoryReader())}
   [junit4]   2> 627861 INFO  (parallelCoreAdminExecutor-1364-thread-1-processing-n:127.0.0.1:39797_solr x:testExecute_shard1_replica_n5 mock_trigger_name//252d19351f25c9T9fe1pvduif5vebsfctmdqimub//010464160771815737 CREATE) [n:127.0.0.1:39797_solr c:testExecute s:shard1 r:core_node6 x:testExecute_shard1_replica_n5] o.a.s.c.ZkShardTerms Successful update of terms at /collections/testExecute/terms/shard1 to Terms{values={core_node6=0, core_node3=0, core_node4=0}, version=2}
   [junit4]   2> 627862 INFO  (parallelCoreAdminExecutor-1364-thread-1-processing-n:127.0.0.1:39797_solr x:testExecute_shard1_replica_n5 mock_trigger_name//252d19351f25c9T9fe1pvduif5vebsfctmdqimub//010464160771815737 CREATE) [n:127.0.0.1:39797_solr c:testExecute s:shard1 r:core_node6 x:testExecute_shard1_replica_n5] o.a.s.c.ShardLeaderElectionContextBase make sure parent is created /collections/testExecute/leaders/shard1
   [junit4]   2> 627868 INFO  (parallelCoreAdminExecutor-1364-thread-1-processing-n:127.0.0.1:39797_solr x:testExecute_shard1_replica_n5 mock_trigger_name//252d19351f25c9T9fe1pvduif5vebsfctmdqimub//010464160771815737 CREATE) [n:127.0.0.1:39797_solr c:testExecute s:shard1 r:core_node6 x:testExecute_shard1_replica_n5] o.a.s.c.ZkController Core needs to recover:testExecute_shard1_replica_n5
   [junit4]   2> 627888 INFO  (updateExecutor-5899-thread-1-processing-x:testExecute_shard1_replica_n5 mock_trigger_name//252d19351f25c9T9fe1pvduif5vebsfctmdqimub//010464160771815737 r:core_node6 CREATE n:127.0.0.1:39797_solr c:testExecute s:shard1) [n:127.0.0.1:39797_solr c:testExecute s:shard1 r:core_node6 x:testExecute_shard1_replica_n5] o.a.s.u.DefaultSolrCoreState Running recovery
   [junit4]   2> 627888 INFO  (recoveryExecutor-5902-thread-1-processing-x:testExecute_shard1_replica_n5 mock_trigger_name//252d19351f25c9T9fe1pvduif5vebsfctmdqimub//010464160771815737 r:core_node6 CREATE n:127.0.0.1:39797_solr c:testExecute s:shard1) [n:127.0.0.1:39797_solr c:testExecute s:shard1 r:core_node6 x:testExecute_shard1_replica_n5] o.a.s.c.RecoveryStrategy Starting recovery process. recoveringAfterStartup=true
   [junit4]   2> 627889 INFO  (recoveryExecutor-5902-thread-1-processing-x:testExecute_shard1_replica_n5 mock_trigger_name//252d19351f25c9T9fe1pvduif5vebsfctmdqimub//010464160771815737 r:core_node6 CREATE n:127.0.0.1:39797_solr c:testExecute s:shard1) [n:127.0.0.1:39797_solr c:testExecute s:shard1 r:core_node6 x:testExecute_shard1_replica_n5] o.a.s.c.RecoveryStrategy startupVersions is empty
   [junit4]   2> 627890 INFO  (qtp633396651-16898) [n:127.0.0.1:39797_solr c:testExecute s:shard1 r:core_node3 x:testExecute_shard1_replica_n1] o.a.s.c.S.Request [testExecute_shard1_replica_n1]  webapp=/solr path=/admin/ping params={wt=javabin&version=2} hits=0 status=0 QTime=0
   [junit4]   2> 627890 INFO  (qtp633396651-16898) [n:127.0.0.1:39797_solr c:testExecute s:shard1 r:core_node3 x:testExecute_shard1_replica_n1] o.a.s.c.S.Request [testExecute_shard1_replica_n1]  webapp=/solr path=/admin/ping params={wt=javabin&version=2} status=0 QTime=0
   [junit4]   2> 627903 INFO  (recoveryExecutor-5902-thread-1-processing-x:testExecute_shard1_replica_n5 mock_trigger_name//252d19351f25c9T9fe1pvduif5vebsfctmdqimub//010464160771815737 r:core_node6 CREATE n:127.0.0.1:39797_solr c:testExecute s:shard1) [n:127.0.0.1:39797_solr c:testExecute s:shard1 r:core_node6 x:testExecute_shard1_replica_n5] o.a.s.c.RecoveryStrategy Begin buffering updates. core=[testExecute_shard1_replica_n5]
   [junit4]   2> 627903 INFO  (recoveryExecutor-5902-thread-1-processing-x:testExecute_shard1_replica_n5 mock_trigger_name//252d19351f25c9T9fe1pvduif5vebsfctmdqimub//010464160771815737 r:core_node6 CREATE n:127.0.0.1:39797_solr c:testExecute s:shard1) [n:127.0.0.1:39797_solr c:testExecute s:shard1 r:core_node6 x:testExecute_shard1_replica_n5] o.a.s.u.UpdateLog Starting to buffer updates. FSUpdateLog{state=ACTIVE, tlog=null}
   [junit4]   2> 627903 INFO  (recoveryExecutor-5902-thread-1-processing-x:testExecute_shard1_replica_n5 mock_trigger_name//252d19351f25c9T9fe1pvduif5vebsfctmdqimub//010464160771815737 r:core_node6 CREATE n:127.0.0.1:39797_solr c:testExecute s:shard1) [n:127.0.0.1:39797_solr c:testExecute s:shard1 r:core_node6 x:testExecute_shard1_replica_n5] o.a.s.c.RecoveryStrategy Publishing state of core [testExecute_shard1_replica_n5] as recovering, leader is [http://127.0.0.1:39797/solr/testExecute_shard1_replica_n1/] and I am [http://127.0.0.1:39797/solr/testExecute_shard1_replica_n5/]
   [junit4]   2> 627913 INFO  (recoveryExecutor-5902-thread-1-processing-x:testExecute_shard

[...truncated too long message...]

vy-availability-check:
[loadresource] Do not set property disallowed.ivy.jars.list as its length is 0.

-ivy-fail-disallowed-ivy-version:

ivy-fail:

ivy-configure:
[ivy:configure] :: loading settings :: file = /x1/jenkins/jenkins-slave/workspace/Lucene-Solr-NightlyTests-7.7/checkout/lucene/top-level-ivy-settings.xml

resolve:

ivy-availability-check:
[loadresource] Do not set property disallowed.ivy.jars.list as its length is 0.

-ivy-fail-disallowed-ivy-version:

ivy-fail:

ivy-fail:

ivy-configure:
[ivy:configure] :: loading settings :: file = /x1/jenkins/jenkins-slave/workspace/Lucene-Solr-NightlyTests-7.7/checkout/lucene/top-level-ivy-settings.xml

resolve:

ivy-availability-check:
[loadresource] Do not set property disallowed.ivy.jars.list as its length is 0.

-ivy-fail-disallowed-ivy-version:

ivy-fail:

ivy-configure:
[ivy:configure] :: loading settings :: file = /x1/jenkins/jenkins-slave/workspace/Lucene-Solr-NightlyTests-7.7/checkout/lucene/top-level-ivy-settings.xml

resolve:

ivy-availability-check:
[loadresource] Do not set property disallowed.ivy.jars.list as its length is 0.

-ivy-fail-disallowed-ivy-version:

ivy-fail:

ivy-fail:

ivy-configure:
[ivy:configure] :: loading settings :: file = /x1/jenkins/jenkins-slave/workspace/Lucene-Solr-NightlyTests-7.7/checkout/lucene/top-level-ivy-settings.xml

resolve:

ivy-availability-check:
[loadresource] Do not set property disallowed.ivy.jars.list as its length is 0.

-ivy-fail-disallowed-ivy-version:

ivy-fail:

ivy-fail:

ivy-configure:
[ivy:configure] :: loading settings :: file = /x1/jenkins/jenkins-slave/workspace/Lucene-Solr-NightlyTests-7.7/checkout/lucene/top-level-ivy-settings.xml

resolve:

ivy-availability-check:
[loadresource] Do not set property disallowed.ivy.jars.list as its length is 0.

-ivy-fail-disallowed-ivy-version:

ivy-fail:

ivy-fail:

ivy-configure:
[ivy:configure] :: loading settings :: file = /x1/jenkins/jenkins-slave/workspace/Lucene-Solr-NightlyTests-7.7/checkout/lucene/top-level-ivy-settings.xml

resolve:

ivy-availability-check:
[loadresource] Do not set property disallowed.ivy.jars.list as its length is 0.

-ivy-fail-disallowed-ivy-version:

ivy-fail:

ivy-fail:

ivy-configure:
[ivy:configure] :: loading settings :: file = /x1/jenkins/jenkins-slave/workspace/Lucene-Solr-NightlyTests-7.7/checkout/lucene/top-level-ivy-settings.xml

resolve:

ivy-availability-check:
[loadresource] Do not set property disallowed.ivy.jars.list as its length is 0.

-ivy-fail-disallowed-ivy-version:

ivy-fail:

ivy-fail:

ivy-configure:
[ivy:configure] :: loading settings :: file = /x1/jenkins/jenkins-slave/workspace/Lucene-Solr-NightlyTests-7.7/checkout/lucene/top-level-ivy-settings.xml

resolve:

ivy-availability-check:
[loadresource] Do not set property disallowed.ivy.jars.list as its length is 0.

-ivy-fail-disallowed-ivy-version:

ivy-fail:

ivy-fail:

ivy-configure:
[ivy:configure] :: loading settings :: file = /x1/jenkins/jenkins-slave/workspace/Lucene-Solr-NightlyTests-7.7/checkout/lucene/top-level-ivy-settings.xml

resolve:

ivy-availability-check:
[loadresource] Do not set property disallowed.ivy.jars.list as its length is 0.

-ivy-fail-disallowed-ivy-version:

ivy-fail:

ivy-fail:

ivy-configure:
[ivy:configure] :: loading settings :: file = /x1/jenkins/jenkins-slave/workspace/Lucene-Solr-NightlyTests-7.7/checkout/lucene/top-level-ivy-settings.xml

resolve:

ivy-availability-check:
[loadresource] Do not set property disallowed.ivy.jars.list as its length is 0.

-ivy-fail-disallowed-ivy-version:

ivy-fail:

ivy-fail:

ivy-configure:
[ivy:configure] :: loading settings :: file = /x1/jenkins/jenkins-slave/workspace/Lucene-Solr-NightlyTests-7.7/checkout/lucene/top-level-ivy-settings.xml

resolve:

ivy-availability-check:
[loadresource] Do not set property disallowed.ivy.jars.list as its length is 0.

-ivy-fail-disallowed-ivy-version:

ivy-fail:

ivy-fail:

ivy-configure:
[ivy:configure] :: loading settings :: file = /x1/jenkins/jenkins-slave/workspace/Lucene-Solr-NightlyTests-7.7/checkout/lucene/top-level-ivy-settings.xml

resolve:

ivy-availability-check:
[loadresource] Do not set property disallowed.ivy.jars.list as its length is 0.

-ivy-fail-disallowed-ivy-version:

ivy-fail:

ivy-fail:

ivy-configure:
[ivy:configure] :: loading settings :: file = /x1/jenkins/jenkins-slave/workspace/Lucene-Solr-NightlyTests-7.7/checkout/lucene/top-level-ivy-settings.xml

resolve:

jar-checksums:
    [mkdir] Created dir: /x1/jenkins/jenkins-slave/workspace/Lucene-Solr-NightlyTests-7.7/checkout/solr/null1789870163
     [copy] Copying 242 files to /x1/jenkins/jenkins-slave/workspace/Lucene-Solr-NightlyTests-7.7/checkout/solr/null1789870163
   [delete] Deleting directory /x1/jenkins/jenkins-slave/workspace/Lucene-Solr-NightlyTests-7.7/checkout/solr/null1789870163

check-working-copy:
[ivy:cachepath] :: resolving dependencies :: org.eclipse.jgit#org.eclipse.jgit-caller;working
[ivy:cachepath] 	confs: [default]
[ivy:cachepath] 	found org.eclipse.jgit#org.eclipse.jgit;4.6.0.201612231935-r in public
[ivy:cachepath] 	found com.jcraft#jsch;0.1.53 in public
[ivy:cachepath] 	found com.googlecode.javaewah#JavaEWAH;1.1.6 in public
[ivy:cachepath] 	found org.apache.httpcomponents#httpclient;4.3.6 in public
[ivy:cachepath] 	found org.apache.httpcomponents#httpcore;4.3.3 in public
[ivy:cachepath] 	found commons-logging#commons-logging;1.1.3 in public
[ivy:cachepath] 	found commons-codec#commons-codec;1.6 in public
[ivy:cachepath] 	found org.slf4j#slf4j-api;1.7.2 in public
[ivy:cachepath] :: resolution report :: resolve 65ms :: artifacts dl 6ms
	---------------------------------------------------------------------
	|                  |            modules            ||   artifacts   |
	|       conf       | number| search|dwnlded|evicted|| number|dwnlded|
	---------------------------------------------------------------------
	|      default     |   8   |   0   |   0   |   0   ||   8   |   0   |
	---------------------------------------------------------------------
[wc-checker] Initializing working copy...
[wc-checker] SLF4J: Failed to load class "org.slf4j.impl.StaticLoggerBinder".
[wc-checker] SLF4J: Defaulting to no-operation (NOP) logger implementation
[wc-checker] SLF4J: See http://www.slf4j.org/codes.html#StaticLoggerBinder for further details.
[wc-checker] Checking working copy status...

-jenkins-base:

BUILD SUCCESSFUL
Total time: 245 minutes 37 seconds
Archiving artifacts
java.lang.InterruptedException: no matches found within 10000
	at hudson.FilePath$ValidateAntFileMask.hasMatch(FilePath.java:2847)
	at hudson.FilePath$ValidateAntFileMask.invoke(FilePath.java:2726)
	at hudson.FilePath$ValidateAntFileMask.invoke(FilePath.java:2707)
	at hudson.FilePath$FileCallableWrapper.call(FilePath.java:3086)
Also:   hudson.remoting.Channel$CallSiteStackTrace: Remote call to lucene
		at hudson.remoting.Channel.attachCallSiteStackTrace(Channel.java:1741)
		at hudson.remoting.UserRequest$ExceptionResponse.retrieve(UserRequest.java:357)
		at hudson.remoting.Channel.call(Channel.java:955)
		at hudson.FilePath.act(FilePath.java:1072)
		at hudson.FilePath.act(FilePath.java:1061)
		at hudson.FilePath.validateAntFileMask(FilePath.java:2705)
		at hudson.tasks.ArtifactArchiver.perform(ArtifactArchiver.java:243)
		at hudson.tasks.BuildStepCompatibilityLayer.perform(BuildStepCompatibilityLayer.java:81)
		at hudson.tasks.BuildStepMonitor$1.perform(BuildStepMonitor.java:20)
		at hudson.model.AbstractBuild$AbstractBuildExecution.perform(AbstractBuild.java:744)
		at hudson.model.AbstractBuild$AbstractBuildExecution.performAllBuildSteps(AbstractBuild.java:690)
		at hudson.model.Build$BuildExecution.post2(Build.java:186)
		at hudson.model.AbstractBuild$AbstractBuildExecution.post(AbstractBuild.java:635)
		at hudson.model.Run.execute(Run.java:1835)
		at hudson.model.FreeStyleBuild.run(FreeStyleBuild.java:43)
		at hudson.model.ResourceController.execute(ResourceController.java:97)
		at hudson.model.Executor.run(Executor.java:429)
Caused: hudson.FilePath$TunneledInterruptedException
	at hudson.FilePath$FileCallableWrapper.call(FilePath.java:3088)
	at hudson.remoting.UserRequest.perform(UserRequest.java:212)
	at hudson.remoting.UserRequest.perform(UserRequest.java:54)
	at hudson.remoting.Request$2.run(Request.java:369)
	at hudson.remoting.InterceptingExecutorService$1.call(InterceptingExecutorService.java:72)
	at java.util.concurrent.FutureTask.run(FutureTask.java:266)
	at java.util.concurrent.ThreadPoolExecutor.runWorker(ThreadPoolExecutor.java:1142)
	at java.util.concurrent.ThreadPoolExecutor$Worker.run(ThreadPoolExecutor.java:617)
	at java.lang.Thread.run(Thread.java:748)
Caused: java.lang.InterruptedException: java.lang.InterruptedException: no matches found within 10000
	at hudson.FilePath.act(FilePath.java:1074)
	at hudson.FilePath.act(FilePath.java:1061)
	at hudson.FilePath.validateAntFileMask(FilePath.java:2705)
	at hudson.tasks.ArtifactArchiver.perform(ArtifactArchiver.java:243)
	at hudson.tasks.BuildStepCompatibilityLayer.perform(BuildStepCompatibilityLayer.java:81)
	at hudson.tasks.BuildStepMonitor$1.perform(BuildStepMonitor.java:20)
	at hudson.model.AbstractBuild$AbstractBuildExecution.perform(AbstractBuild.java:744)
	at hudson.model.AbstractBuild$AbstractBuildExecution.performAllBuildSteps(AbstractBuild.java:690)
	at hudson.model.Build$BuildExecution.post2(Build.java:186)
	at hudson.model.AbstractBuild$AbstractBuildExecution.post(AbstractBuild.java:635)
	at hudson.model.Run.execute(Run.java:1835)
	at hudson.model.FreeStyleBuild.run(FreeStyleBuild.java:43)
	at hudson.model.ResourceController.execute(ResourceController.java:97)
	at hudson.model.Executor.run(Executor.java:429)
No artifacts found that match the file pattern "**/*.events,heapdumps/**,**/hs_err_pid*". Configuration error?
Recording test results
Build step 'Publish JUnit test result report' changed build result to UNSTABLE
Email was triggered for: Unstable (Test Failures)
Sending email for trigger: Unstable (Test Failures)

Mime
View raw message