lucene-dev mailing list archives

Site index · List index
Message view « Date » · « Thread »
Top « Date » · « Thread »
From Apache Jenkins Server <jenk...@builds.apache.org>
Subject [JENKINS] Lucene-Solr-Tests-7.7 - Build # 5 - Unstable
Date Sun, 03 Feb 2019 19:01:05 GMT
Build: https://builds.apache.org/job/Lucene-Solr-Tests-7.7/5/

1 tests failed.
FAILED:  org.apache.solr.cloud.autoscaling.sim.TestSimLargeCluster.testSearchRate

Error Message:
java.util.concurrent.ConcurrentHashMap$EntryIterator@7911948c

Stack Trace:
java.lang.AssertionError: java.util.concurrent.ConcurrentHashMap$EntryIterator@7911948c
	at __randomizedtesting.SeedInfo.seed([F7E63358B916CC04:AAAE2DD176D06A4B]:0)
	at org.junit.Assert.fail(Assert.java:88)
	at org.junit.Assert.assertTrue(Assert.java:41)
	at org.junit.Assert.assertNotNull(Assert.java:712)
	at org.apache.solr.cloud.autoscaling.sim.TestSimLargeCluster.testSearchRate(TestSimLargeCluster.java:686)
	at sun.reflect.NativeMethodAccessorImpl.invoke0(Native Method)
	at sun.reflect.NativeMethodAccessorImpl.invoke(NativeMethodAccessorImpl.java:62)
	at sun.reflect.DelegatingMethodAccessorImpl.invoke(DelegatingMethodAccessorImpl.java:43)
	at java.lang.reflect.Method.invoke(Method.java:498)
	at com.carrotsearch.randomizedtesting.RandomizedRunner.invoke(RandomizedRunner.java:1750)
	at com.carrotsearch.randomizedtesting.RandomizedRunner$8.evaluate(RandomizedRunner.java:938)
	at com.carrotsearch.randomizedtesting.RandomizedRunner$9.evaluate(RandomizedRunner.java:974)
	at com.carrotsearch.randomizedtesting.RandomizedRunner$10.evaluate(RandomizedRunner.java:988)
	at com.carrotsearch.randomizedtesting.rules.SystemPropertiesRestoreRule$1.evaluate(SystemPropertiesRestoreRule.java:57)
	at org.apache.lucene.util.TestRuleSetupTeardownChained$1.evaluate(TestRuleSetupTeardownChained.java:49)
	at org.apache.lucene.util.AbstractBeforeAfterRule$1.evaluate(AbstractBeforeAfterRule.java:45)
	at org.apache.lucene.util.TestRuleThreadAndTestName$1.evaluate(TestRuleThreadAndTestName.java:48)
	at org.apache.lucene.util.TestRuleIgnoreAfterMaxFailures$1.evaluate(TestRuleIgnoreAfterMaxFailures.java:64)
	at org.apache.lucene.util.TestRuleMarkFailure$1.evaluate(TestRuleMarkFailure.java:47)
	at com.carrotsearch.randomizedtesting.rules.StatementAdapter.evaluate(StatementAdapter.java:36)
	at com.carrotsearch.randomizedtesting.ThreadLeakControl$StatementRunner.run(ThreadLeakControl.java:368)
	at com.carrotsearch.randomizedtesting.ThreadLeakControl.forkTimeoutingTask(ThreadLeakControl.java:817)
	at com.carrotsearch.randomizedtesting.ThreadLeakControl$3.evaluate(ThreadLeakControl.java:468)
	at com.carrotsearch.randomizedtesting.RandomizedRunner.runSingleTest(RandomizedRunner.java:947)
	at com.carrotsearch.randomizedtesting.RandomizedRunner$5.evaluate(RandomizedRunner.java:832)
	at com.carrotsearch.randomizedtesting.RandomizedRunner$6.evaluate(RandomizedRunner.java:883)
	at com.carrotsearch.randomizedtesting.RandomizedRunner$7.evaluate(RandomizedRunner.java:894)
	at com.carrotsearch.randomizedtesting.rules.StatementAdapter.evaluate(StatementAdapter.java:36)
	at com.carrotsearch.randomizedtesting.rules.SystemPropertiesRestoreRule$1.evaluate(SystemPropertiesRestoreRule.java:57)
	at org.apache.lucene.util.AbstractBeforeAfterRule$1.evaluate(AbstractBeforeAfterRule.java:45)
	at com.carrotsearch.randomizedtesting.rules.StatementAdapter.evaluate(StatementAdapter.java:36)
	at org.apache.lucene.util.TestRuleStoreClassName$1.evaluate(TestRuleStoreClassName.java:41)
	at com.carrotsearch.randomizedtesting.rules.NoShadowingOrOverridesOnMethodsRule$1.evaluate(NoShadowingOrOverridesOnMethodsRule.java:40)
	at com.carrotsearch.randomizedtesting.rules.NoShadowingOrOverridesOnMethodsRule$1.evaluate(NoShadowingOrOverridesOnMethodsRule.java:40)
	at com.carrotsearch.randomizedtesting.rules.StatementAdapter.evaluate(StatementAdapter.java:36)
	at com.carrotsearch.randomizedtesting.rules.StatementAdapter.evaluate(StatementAdapter.java:36)
	at com.carrotsearch.randomizedtesting.rules.StatementAdapter.evaluate(StatementAdapter.java:36)
	at org.apache.lucene.util.TestRuleAssertionsRequired$1.evaluate(TestRuleAssertionsRequired.java:53)
	at org.apache.lucene.util.TestRuleMarkFailure$1.evaluate(TestRuleMarkFailure.java:47)
	at org.apache.lucene.util.TestRuleIgnoreAfterMaxFailures$1.evaluate(TestRuleIgnoreAfterMaxFailures.java:64)
	at org.apache.lucene.util.TestRuleIgnoreTestSuites$1.evaluate(TestRuleIgnoreTestSuites.java:54)
	at com.carrotsearch.randomizedtesting.rules.StatementAdapter.evaluate(StatementAdapter.java:36)
	at com.carrotsearch.randomizedtesting.ThreadLeakControl$StatementRunner.run(ThreadLeakControl.java:368)
	at java.lang.Thread.run(Thread.java:748)




Build Log:
[...truncated 14566 lines...]
   [junit4] Suite: org.apache.solr.cloud.autoscaling.sim.TestSimLargeCluster
   [junit4]   2> 3744486 INFO  (SUITE-TestSimLargeCluster-seed#[F7E63358B916CC04]-worker) [    ] o.a.s.SolrTestCaseJ4 SecureRandom sanity checks: test.solr.allowed.securerandom=null & java.security.egd=file:/dev/./urandom
   [junit4]   2> Creating dataDir: /home/jenkins/jenkins-slave/workspace/Lucene-Solr-Tests-7.7/solr/build/solr-core/test/J2/temp/solr.cloud.autoscaling.sim.TestSimLargeCluster_F7E63358B916CC04-001/init-core-data-001
   [junit4]   2> 3744487 INFO  (SUITE-TestSimLargeCluster-seed#[F7E63358B916CC04]-worker) [    ] o.a.s.SolrTestCaseJ4 Using TrieFields (NUMERIC_POINTS_SYSPROP=false) w/NUMERIC_DOCVALUES_SYSPROP=false
   [junit4]   2> 3744504 INFO  (SUITE-TestSimLargeCluster-seed#[F7E63358B916CC04]-worker) [    ] o.a.s.SolrTestCaseJ4 Randomized ssl (true) and clientAuth (false) via: @org.apache.solr.util.RandomizeSSL(reason=, value=NaN, ssl=NaN, clientAuth=NaN)
   [junit4]   2> 3744506 INFO  (TEST-TestSimLargeCluster.testAddNode-seed#[F7E63358B916CC04]) [    ] o.a.s.SolrTestCaseJ4 ###Starting testAddNode
   [junit4]   2> 3744522 DEBUG (TEST-TestSimLargeCluster.testAddNode-seed#[F7E63358B916CC04]) [    ] o.a.s.c.a.s.SimClusterStateProvider --- new Overseer leader: 127.0.0.1:10043_solr
   [junit4]   2> 3744522 DEBUG (Simulated OverseerAutoScalingTriggerThread) [    ] o.a.s.c.a.OverseerTriggerThread Adding .auto_add_replicas and .scheduled_maintenance triggers
   [junit4]   2> 3744522 DEBUG (Simulated OverseerAutoScalingTriggerThread) [    ] o.a.s.c.a.OverseerTriggerThread Refreshing /autoscaling.json with znode version 1
   [junit4]   2> 3744523 DEBUG (Simulated OverseerAutoScalingTriggerThread) [    ] o.a.s.c.a.OverseerTriggerThread Current znodeVersion 1, lastZnodeVersion 0
   [junit4]   2> 3744523 DEBUG (Simulated OverseerAutoScalingTriggerThread) [    ] o.a.s.c.a.OverseerTriggerThread Processed trigger updates upto znodeVersion 1
   [junit4]   2> 3744523 DEBUG (TEST-TestSimLargeCluster.testAddNode-seed#[F7E63358B916CC04]) [    ] o.a.s.c.a.s.SimClusterStateProvider ** creating new collection states, currentVersion=0
   [junit4]   2> 3744523 DEBUG (TEST-TestSimLargeCluster.testAddNode-seed#[F7E63358B916CC04]) [    ] o.a.s.c.a.s.SimClusterStateProvider ** saved cluster state version 0
   [junit4]   2> 3744523 INFO  (TEST-TestSimLargeCluster.testAddNode-seed#[F7E63358B916CC04]) [    ] o.a.s.h.a.MetricsHistoryHandler No .system collection, keeping metrics history in memory.
   [junit4]   2> 3744541 DEBUG (Simulated OverseerAutoScalingTriggerThread) [    ] o.a.s.c.a.NodeLostTrigger NodeLostTrigger .auto_add_replicas - Initial livenodes: [127.0.0.1:10052_solr, 127.0.0.1:10043_solr, 127.0.0.1:10045_solr, 127.0.0.1:10049_solr, 127.0.0.1:10050_solr, 127.0.0.1:10046_solr, 127.0.0.1:10047_solr, 127.0.0.1:10044_solr, 127.0.0.1:10051_solr, 127.0.0.1:10053_solr, 127.0.0.1:10048_solr]
   [junit4]   2> 3744541 DEBUG (Simulated OverseerAutoScalingTriggerThread) [    ] o.a.s.c.a.OverseerTriggerThread -- cleaning old nodeLost / nodeAdded markers
   [junit4]   2> 3744541 DEBUG (Simulated OverseerAutoScalingTriggerThread) [    ] o.a.s.c.a.OverseerTriggerThread Current znodeVersion 1, lastZnodeVersion 1
   [junit4]   2> 3744541 DEBUG (ScheduledTrigger-10210-thread-2) [    ] o.a.s.c.a.NodeLostTrigger Running NodeLostTrigger: .auto_add_replicas with currently live nodes: 11 and last live nodes: 11
   [junit4]   2> 3744552 DEBUG (ScheduledTrigger-10210-thread-1) [    ] o.a.s.c.a.NodeLostTrigger Running NodeLostTrigger: .auto_add_replicas with currently live nodes: 11 and last live nodes: 11
   [junit4]   2> 3744580 DEBUG (ScheduledTrigger-10210-thread-4) [    ] o.a.s.c.a.NodeLostTrigger Running NodeLostTrigger: .auto_add_replicas with currently live nodes: 100 and last live nodes: 11
   [junit4]   2> 3744605 DEBUG (ScheduledTrigger-10210-thread-2) [    ] o.a.s.c.a.NodeLostTrigger Running NodeLostTrigger: .auto_add_replicas with currently live nodes: 100 and last live nodes: 100
   [junit4]   2> 3744605 DEBUG (simCloudManagerPool-10209-thread-2) [    ] o.a.s.c.a.AutoScalingHandler Verified autoscaling configuration
   [junit4]   2> 3744605 DEBUG (simCloudManagerPool-10209-thread-2) [    ] o.a.s.c.a.OverseerTriggerThread Refreshing /autoscaling.json with znode version 2
   [junit4]   2> 3744606 DEBUG (Simulated OverseerAutoScalingTriggerThread) [    ] o.a.s.c.a.OverseerTriggerThread Processed trigger updates upto znodeVersion 2
   [junit4]   2> 3744607 DEBUG (Simulated OverseerAutoScalingTriggerThread) [    ] o.a.s.c.a.OverseerTriggerThread -- cleaning old nodeLost / nodeAdded markers
   [junit4]   2> 3744607 DEBUG (Simulated OverseerAutoScalingTriggerThread) [    ] o.a.s.c.a.OverseerTriggerThread Current znodeVersion 2, lastZnodeVersion 2
   [junit4]   2> 3744621 DEBUG (ScheduledTrigger-10210-thread-4) [    ] o.a.s.c.a.NodeLostTrigger Running NodeLostTrigger: .auto_add_replicas with currently live nodes: 100 and last live nodes: 100
   [junit4]   2> 3744646 DEBUG (simCloudManagerPool-10209-thread-4) [    ] o.a.s.c.a.AutoScalingHandler Verified autoscaling configuration
   [junit4]   2> 3744647 DEBUG (simCloudManagerPool-10209-thread-4) [    ] o.a.s.c.a.OverseerTriggerThread Refreshing /autoscaling.json with znode version 3
   [junit4]   2> 3744648 DEBUG (Simulated OverseerAutoScalingTriggerThread) [    ] o.a.s.c.a.OverseerTriggerThread Processed trigger updates upto znodeVersion 3
   [junit4]   2> 3744648 DEBUG (Simulated OverseerAutoScalingTriggerThread) [    ] o.a.s.c.a.OverseerTriggerThread -- cleaning old nodeLost / nodeAdded markers
   [junit4]   2> 3744648 DEBUG (Simulated OverseerAutoScalingTriggerThread) [    ] o.a.s.c.a.OverseerTriggerThread Current znodeVersion 3, lastZnodeVersion 3
   [junit4]   2> 3744649 DEBUG (TEST-TestSimLargeCluster.testAddNode-seed#[F7E63358B916CC04]) [    ] o.a.s.c.a.s.SimClusterStateProvider -- simCreateCollection .system, currentVersion=1
   [junit4]   2> 3744649 DEBUG (TEST-TestSimLargeCluster.testAddNode-seed#[F7E63358B916CC04]) [    ] o.a.s.c.a.s.SimClusterStateProvider ** creating new collection states, currentVersion=1
   [junit4]   2> 3744649 DEBUG (TEST-TestSimLargeCluster.testAddNode-seed#[F7E63358B916CC04]) [    ] o.a.s.c.a.s.SimClusterStateProvider ** saved cluster state version 1
   [junit4]   2> 3744665 DEBUG (TEST-TestSimLargeCluster.testAddNode-seed#[F7E63358B916CC04]) [    ] o.a.s.c.a.s.SimClusterStateProvider ** creating new collection states, currentVersion=2
   [junit4]   2> 3744666 DEBUG (TEST-TestSimLargeCluster.testAddNode-seed#[F7E63358B916CC04]) [    ] o.a.s.c.a.s.SimClusterStateProvider ** saved cluster state version 2
   [junit4]   2> 3745002 DEBUG (simCloudManagerPool-10209-thread-5) [    ] o.a.s.c.a.s.SimClusterStateProvider ** creating new collection states, currentVersion=3
   [junit4]   2> 3745002 DEBUG (simCloudManagerPool-10209-thread-5) [    ] o.a.s.c.a.s.SimClusterStateProvider ** saved cluster state version 3
   [junit4]   2> 3745237 DEBUG (simCloudManagerPool-10209-thread-8) [    ] o.a.s.c.a.s.SimClusterStateProvider -- elected new leader for .system / shard1 (currentVersion=4): {"core_node1":{
   [junit4]   2>     "core":".system_shard1_replica_n1",
   [junit4]   2>     "shard":"shard1",
   [junit4]   2>     "collection":".system",
   [junit4]   2>     "node_name":"127.0.0.1:10056_solr",
   [junit4]   2>     "type":"NRT",
   [junit4]   2>     "leader":"true",
   [junit4]   2>     "SEARCHER.searcher.maxDoc":0,
   [junit4]   2>     "SEARCHER.searcher.deletedDocs":0,
   [junit4]   2>     "INDEX.sizeInBytes":10240,
   [junit4]   2>     "state":"active",
   [junit4]   2>     "INDEX.sizeInGB":9.5367431640625E-6,
   [junit4]   2>     "SEARCHER.searcher.numDocs":0}}
   [junit4]   2> 3745306 DEBUG (simCloudManagerPool-10209-thread-6) [    ] o.a.s.c.a.s.SimClusterStateProvider ** creating new collection states, currentVersion=4
   [junit4]   2> 3745359 DEBUG (simCloudManagerPool-10209-thread-6) [    ] o.a.s.c.a.s.SimClusterStateProvider ** saved cluster state version 4
   [junit4]   2> 3745387 DEBUG (simCloudManagerPool-10209-thread-7) [    ] o.a.s.c.a.s.SimClusterStateProvider ** creating new collection states, currentVersion=5
   [junit4]   2> 3745416 DEBUG (simCloudManagerPool-10209-thread-7) [    ] o.a.s.c.a.s.SimClusterStateProvider ** saved cluster state version 5
   [junit4]   2> 3745416 DEBUG (TEST-TestSimLargeCluster.testAddNode-seed#[F7E63358B916CC04]) [    ] o.a.s.c.a.s.SimClusterStateProvider -- finished createCollection .system, currentVersion=6
   [junit4]   2> 3745570 DEBUG (simCloudManagerPool-10209-thread-10) [    ] o.a.s.c.a.AutoScalingHandler Verified autoscaling configuration
   [junit4]   2> 3745570 DEBUG (simCloudManagerPool-10209-thread-10) [    ] o.a.s.c.a.OverseerTriggerThread Refreshing /autoscaling.json with znode version 4
   [junit4]   2> 3745570 DEBUG (Simulated OverseerAutoScalingTriggerThread) [    ] o.a.s.c.a.OverseerTriggerThread Processed trigger updates upto znodeVersion 4
   [junit4]   2> 3745571 DEBUG (Simulated OverseerAutoScalingTriggerThread) [    ] o.a.s.c.a.NodeAddedTrigger NodeAddedTrigger node_added_trigger2 - Initial livenodes: [127.0.0.1:10082_solr, 127.0.0.1:10118_solr, 127.0.0.1:10049_solr, 127.0.0.1:10104_solr, 127.0.0.1:10065_solr, 127.0.0.1:10120_solr, 127.0.0.1:10066_solr, 127.0.0.1:10121_solr, 127.0.0.1:10135_solr, 127.0.0.1:10051_solr, 127.0.0.1:10096_solr, 127.0.0.1:10119_solr, 127.0.0.1:10105_solr, 127.0.0.1:10047_solr, 127.0.0.1:10102_solr, 127.0.0.1:10095_solr, 127.0.0.1:10081_solr, 127.0.0.1:10084_solr, 127.0.0.1:10052_solr, 127.0.0.1:10079_solr, 127.0.0.1:10134_solr, 127.0.0.1:10137_solr, 127.0.0.1:10098_solr, 127.0.0.1:10140_solr, 127.0.0.1:10054_solr, 127.0.0.1:10129_solr, 127.0.0.1:10099_solr, 127.0.0.1:10101_solr, 127.0.0.1:10123_solr, 127.0.0.1:10071_solr, 127.0.0.1:10076_solr, 127.0.0.1:10107_solr, 127.0.0.1:10055_solr, 127.0.0.1:10124_solr, 127.0.0.1:10070_solr, 127.0.0.1:10077_solr, 127.0.0.1:10108_solr, 127.0.0.1:10093_solr, 127.0.0.1:10136_solr, 127.0.0.1:10139_solr, 127.0.0.1:10067_solr, 127.0.0.1:10061_solr, 127.0.0.1:10130_solr, 127.0.0.1:10133_solr, 127.0.0.1:10086_solr, 127.0.0.1:10089_solr, 127.0.0.1:10045_solr, 127.0.0.1:10117_solr, 127.0.0.1:10083_solr, 127.0.0.1:10114_solr, 127.0.0.1:10080_solr, 127.0.0.1:10048_solr, 127.0.0.1:10064_solr, 127.0.0.1:10111_solr, 127.0.0.1:10043_solr, 127.0.0.1:10057_solr, 127.0.0.1:10112_solr, 127.0.0.1:10074_solr, 127.0.0.1:10126_solr, 127.0.0.1:10060_solr, 127.0.0.1:10073_solr, 127.0.0.1:10127_solr, 127.0.0.1:10113_solr, 127.0.0.1:10058_solr, 127.0.0.1:10090_solr, 127.0.0.1:10088_solr, 127.0.0.1:10044_solr, 127.0.0.1:10092_solr, 127.0.0.1:10087_solr, 127.0.0.1:10142_solr, 127.0.0.1:10085_solr, 127.0.0.1:10046_solr, 127.0.0.1:10068_solr, 127.0.0.1:10063_solr, 127.0.0.1:10131_solr, 127.0.0.1:10115_solr, 127.0.0.1:10110_solr, 127.0.0.1:10069_solr, 127.0.0.1:10138_solr, 127.0.0.1:10062_solr, 127.0.0.1:10132_solr, 127.0.0.1:10116_solr, 127.0.0.1:10122_solr, 127.0.0.1:10125_solr, 127.0.0.1:10075_solr, 127.0.0.1:10050_solr, 127.0.0.1:10078_solr, 127.0.0.1:10141_solr, 127.0.0.1:10128_solr, 127.0.0.1:10097_solr, 127.0.0.1:10091_solr, 127.0.0.1:10094_solr, 127.0.0.1:10106_solr, 127.0.0.1:10100_solr, 127.0.0.1:10109_solr, 127.0.0.1:10053_solr, 127.0.0.1:10059_solr, 127.0.0.1:10103_solr, 127.0.0.1:10072_solr, 127.0.0.1:10056_solr]
   [junit4]   2> 3745571 DEBUG (Simulated OverseerAutoScalingTriggerThread) [    ] o.a.s.c.a.NodeAddedTrigger NodeAddedTrigger node_added_trigger2 instantiated with properties: {event=nodeAdded, waitFor=5, actions=[{name=start, class=org.apache.solr.cloud.autoscaling.sim.TestSimLargeCluster$StartTriggerAction}, {name=compute, class=org.apache.solr.cloud.autoscaling.ComputePlanAction}, {name=execute, class=org.apache.solr.cloud.autoscaling.ExecutePlanAction}, {name=test, class=org.apache.solr.cloud.autoscaling.sim.TestSimLargeCluster$FinishTriggerAction}], enabled=true}
   [junit4]   2> 3745571 DEBUG (Simulated OverseerAutoScalingTriggerThread) [    ] o.a.s.c.a.OverseerTriggerThread -- cleaning old nodeLost / nodeAdded markers
   [junit4]   2> 3745571 DEBUG (Simulated OverseerAutoScalingTriggerThread) [    ] o.a.s.c.a.OverseerTriggerThread Current znodeVersion 4, lastZnodeVersion 4
   [junit4]   2> 3745571 DEBUG (simCloudManagerPool-10209-thread-12) [    ] o.a.s.c.a.s.SimClusterStateProvider -- simCreateCollection testNodeAdded, currentVersion=6
   [junit4]   2> 3745572 DEBUG (simCloudManagerPool-10209-thread-12) [    ] o.a.s.c.a.s.SimClusterStateProvider ** creating new collection states, currentVersion=6
   [junit4]   2> 3745572 DEBUG (simCloudManagerPool-10209-thread-12) [    ] o.a.s.c.a.s.SimClusterStateProvider ** saved cluster state version 6
   [junit4]   2> 3745573 DEBUG (ScheduledTrigger-10210-thread-3) [    ] o.a.s.c.a.NodeAddedTrigger Running NodeAddedTrigger node_added_trigger2
   [junit4]   2> 3745573 DEBUG (ScheduledTrigger-10210-thread-3) [    ] o.a.s.c.a.NodeAddedTrigger Found livenodes: 100
   [junit4]   2> 3745585 DEBUG (simCloudManagerPool-10209-thread-12) [    ] o.a.s.c.a.s.SimClusterStateProvider ** creating new collection states, currentVersion=7
   [junit4]   2> 3745585 DEBUG (simCloudManagerPool-10209-thread-12) [    ] o.a.s.c.a.s.SimClusterStateProvider ** saved cluster state version 7
   [junit4]   2> 3745589 DEBUG (ScheduledTrigger-10210-thread-3) [    ] o.a.s.c.a.NodeAddedTrigger Running NodeAddedTrigger node_added_trigger2
   [junit4]   2> 3745589 DEBUG (ScheduledTrigger-10210-thread-3) [    ] o.a.s.c.a.NodeAddedTrigger Found livenodes: 100
   [junit4]   2> 3745626 DEBUG (ScheduledTrigger-10210-thread-3) [    ] o.a.s.c.a.NodeAddedTrigger Running NodeAddedTrigger node_added_trigger2
   [junit4]   2> 3745626 DEBUG (ScheduledTrigger-10210-thread-3) [    ] o.a.s.c.a.NodeAddedTrigger Found livenodes: 100
   [junit4]   2> 3745646 DEBUG (ScheduledTrigger-10210-thread-3) [    ] o.a.s.c.a.NodeAddedTrigger Running NodeAddedTrigger node_added_trigger2
   [junit4]   2> 3745646 DEBUG (ScheduledTrigger-10210-thread-3) [    ] o.a.s.c.a.NodeAddedTrigger Found livenodes: 100
   [junit4]   2> 3745662 DEBUG (ScheduledTrigger-10210-thread-3) [    ] o.a.s.c.a.NodeAddedTrigger Running NodeAddedTrigger node_added_trigger2
   [junit4]   2> 3745662 DEBUG (ScheduledTrigger-10210-thread-3) [    ] o.a.s.c.a.NodeAddedTrigger Found livenodes: 100
   [junit4]   2> 3745682 DEBUG (ScheduledTrigger-10210-thread-3) [    ] o.a.s.c.a.NodeAddedTrigger Running NodeAddedTrigger node_added_trigger2
   [junit4]   2> 3745682 DEBUG (ScheduledTrigger-10210-thread-3) [    ] o.a.s.c.a.NodeAddedTrigger Found livenodes: 100
   [junit4]   2> 3745698 DEBUG (ScheduledTrigger-10210-thread-3) [    ] o.a.s.c.a.NodeAddedTrigger Running NodeAddedTrigger node_added_trigger2
   [junit4]   2> 3745699 DEBUG (ScheduledTrigger-10210-thread-3) [    ] o.a.s.c.a.NodeAddedTrigger Found livenodes: 100
   [junit4]   2> 3745719 DEBUG (ScheduledTrigger-10210-thread-3) [    ] o.a.s.c.a.NodeAddedTrigger Running NodeAddedTrigger node_added_trigger2
   [junit4]   2> 3745719 DEBUG (ScheduledTrigger-10210-thread-3) [    ] o.a.s.c.a.NodeAddedTrigger Found livenodes: 100
   [junit4]   2> 3745735 DEBUG (ScheduledTrigger-10210-thread-3) [    ] o.a.s.c.a.NodeAddedTrigger Running NodeAddedTrigger node_added_trigger2
   [junit4]   2> 3745735 DEBUG (ScheduledTrigger-10210-thread-3) [    ] o.a.s.c.a.NodeAddedTrigger Found livenodes: 100
   [junit4]   2> 3745755 DEBUG (ScheduledTrigger-10210-thread-3) [    ] o.a.s.c.a.NodeAddedTrigger Running NodeAddedTrigger node_added_trigger2
   [junit4]   2> 3745755 DEBUG (ScheduledTrigger-10210-thread-3) [    ] o.a.s.c.a.NodeAddedTrigger Found livenodes: 100
   [junit4]   2> 3745771 DEBUG (ScheduledTrigger-10210-thread-3) [    ] o.a.s.c.a.NodeAddedTrigger Running NodeAddedTrigger node_added_trigger2
   [junit4]   2> 3745771 DEBUG (ScheduledTrigger-10210-thread-3) [    ] o.a.s.c.a.NodeAddedTrigger Found livenodes: 100
   [junit4]   2> 3745792 DEBUG (ScheduledTrigger-10210-thread-3) [    ] o.a.s.c.a.NodeAddedTrigger Running NodeAddedTrigger node_added_trigger2
   [junit4]   2> 3745792 DEBUG (ScheduledTrigger-10210-thread-3) [    ] o.a.s.c.a.NodeAddedTrigger Found livenodes: 100
   [junit4]   2> 3745808 DEBUG (ScheduledTrigger-10210-thread-3) [    ] o.a.s.c.a.NodeAddedTrigger Running NodeAddedTrigger node_added_trigger2
   [junit4]   2> 3745808 DEBUG (ScheduledTrigger-10210-thread-3) [    ] o.a.s.c.a.NodeAddedTrigger Found livenodes: 100
   [junit4]   2> 3745828 DEBUG (ScheduledTrigger-10210-thread-3) [    ] o.a.s.c.a.NodeAddedTrigger Running NodeAddedTrigger node_added_trigger2
   [junit4]   2> 3745828 DEBUG (ScheduledTrigger-10210-thread-3) [    ] o.a.s.c.a.NodeAddedTrigger Found livenodes: 100
   [junit4]   2> 3745844 DEBUG (ScheduledTrigger-10210-thread-3) [    ] o.a.s.c.a.NodeAddedTrigger Running NodeAddedTrigger node_added_trigger2
   [junit4]   2> 3745844 DEBUG (ScheduledTrigger-10210-thread-3) [    ] o.a.s.c.a.NodeAddedTrigger Found livenodes: 100
   [junit4]   2> 3745865 DEBUG (ScheduledTrigger-10210-thread-3) [    ] o.a.s.c.a.NodeAddedTrigger Running NodeAddedTrigger node_added_trigger2
   [junit4]   2> 3745865 DEBUG (ScheduledTrigger-10210-thread-3) [    ] o.a.s.c.a.NodeAddedTrigger Found livenodes: 100
   [junit4]   2> 3745881 DEBUG (ScheduledTrigger-10210-thread-3) [    ] o.a.s.c.a.NodeAddedTrigger Running NodeAddedTrigger node_added_trigger2
   [junit4]   2> 3745881 DEBUG (ScheduledTrigger-10210-thread-3) [    ] o.a.s.c.a.NodeAddedTrigger Found livenodes: 100
   [junit4]   2> 3745901 DEBUG (ScheduledTrigger-10210-thread-3) [    ] o.a.s.c.a.NodeAddedTrigger Running NodeAddedTrigger node_added_trigger2
   [junit4]   2> 3745901 DEBUG (ScheduledTrigger-10210-thread-3) [    ] o.a.s.c.a.NodeAddedTrigger Found livenodes: 100
   [junit4]   2> 3745917 DEBUG (ScheduledTrigger-10210-thread-3) [    ] o.a.s.c.a.NodeAddedTrigger Running NodeAddedTrigger node_added_trigger2
   [junit4]   2> 3745917 DEBUG (ScheduledTrigger-10210-thread-3) [    ] o.a.s.c.a.NodeAddedTrigger Found livenodes: 100
   [junit4]   2> 3745938 DEBUG (ScheduledTrigger-10210-thread-3) [    ] o.a.s.c.a.NodeAddedTrigger Running NodeAddedTrigger node_added_trigger2
   [junit4]   2> 3745938 DEBUG (ScheduledTrigger-10210-thread-3) [    ] o.a.s.c.a.NodeAddedTrigger Found livenodes: 100
   [junit4]   2> 3745956 DEBUG (ScheduledTrigger-10210-thread-3) [    ] o.a.s.c.a.NodeAddedTrigger Running NodeAddedTrigger node_added_trigger2
   [junit4]   2> 3745956 DEBUG (ScheduledTrigger-10210-thread-3) [    ] o.a.s.c.a.NodeAddedTrigger Found livenodes: 100
   [junit4]   2> 3745974 DEBUG (ScheduledTrigger-10210-thread-3) [    ] o.a.s.c.a.NodeAddedTrigger Running NodeAddedTrigger node_added_trigger2
   [junit4]   2> 3745974 DEBUG (ScheduledTrigger-10210-thread-3) [    ] o.a.s.c.a.NodeAddedTrigger Found livenodes: 100
   [junit4]   2> 3745990 DEBUG (ScheduledTrigger-10210-thread-3) [    ] o.a.s.c.a.NodeAddedTrigger Running NodeAddedTrigger node_added_trigger2
   [junit4]   2> 3745990 DEBUG (ScheduledTrigger-10210-thread-3) [    ] o.a.s.c.a.NodeAddedTrigger Found livenodes: 100
   [junit4]   2> 3746010 DEBUG (ScheduledTrigger-10210-thread-3) [    ] o.a.s.c.a.NodeAddedTrigger Running NodeAddedTrigger node_added_trigger2
   [junit4]   2> 3746011 DEBUG (ScheduledTrigger-10210-thread-3) [    ] o.a.s.c.a.NodeAddedTrigger Found livenodes: 100
   [junit4]   2> 3746027 DEBUG (ScheduledTrigger-10210-thread-3) [    ] o.a.s.c.a.NodeAddedTrigger Running NodeAddedTrigger node_added_trigger2
   [junit4]   2> 3746027 DEBUG (ScheduledTrigger-10210-thread-3) [    ] o.a.s.c.a.NodeAddedTrigger Found livenodes: 100
   [junit4]   2> 3746047 DEBUG (ScheduledTrigger-10210-thread-3) [    ] o.a.s.c.a.NodeAddedTrigger Running NodeAddedTrigger node_added_trigger2
   [junit4]   2> 3746047 DEBUG (ScheduledTrigger-10210-thread-3) [    ] o.a.s.c.a.NodeAddedTrigger Found livenodes: 100
   [junit4]   2> 3746063 DEBUG (ScheduledTrigger-10210-thread-3) [    ] o.a.s.c.a.NodeAddedTrigger Running NodeAddedTrigger node_added_trigger2
   [junit4]   2> 3746063 DEBUG (ScheduledTrigger-10210-thread-3) [    ] o.a.s.c.a.NodeAddedTrigger Found livenodes: 100
   [junit4]   2> 3746083 DEBUG (ScheduledTrigger-10210-thread-3) [    ] o.a.s.c.a.NodeAddedTrigger Running NodeAddedTrigger node_added_trigger2
   [junit4]   2> 3746083 DEBUG (ScheduledTrigger-10210-thread-3) [    ] o.a.s.c.a.NodeAddedTrigger Found livenodes: 100
   [junit4]   2> 3746100 DEBUG (ScheduledTrigger-10210-thread-3) [    ] o.a.s.c.a.NodeAddedTrigger Running NodeAddedTrigger node_added_trigger2
   [junit4]   2> 3746100 DEBUG (ScheduledTrigger-10210-thread-3) [    ] o.a.s.c.a.NodeAddedTrigger Found livenodes: 100
   [junit4]   2> 3746120 DEBUG (ScheduledTrigger-10210-thread-3) [    ] o.a.s.c.a.NodeAddedTrigger Running NodeAddedTrigger node_added_trigger2
   [junit4]   2> 3746120 DEBUG (ScheduledTrigger-10210-thread-3) [    ] o.a.s.c.a.NodeAddedTrigger Found livenodes: 100
   [junit4]   2> 3746136 DEBUG (ScheduledTrigger-10210-thread-3) [    ] o.a.s.c.a.NodeAddedTrigger Running NodeAddedTrigger node_added_trigger2
   [junit4]   2> 3746136 DEBUG (ScheduledTrigger-10210-thread-3) [    ] o.a.s.c.a.NodeAddedTrigger Found livenodes: 100
   [junit4]   2> 3746156 DEBUG (ScheduledTrigger-10210-thread-3) [    ] o.a.s.c.a.NodeAddedTrigger Running NodeAddedTrigger node_added_trigger2
   [junit4]   2> 3746156 DEBUG (ScheduledTrigger-10210-thread-3) [    ] o.a.s.c.a.NodeAddedTrigger Found livenodes: 100
   [junit4]   2> 3746173 DEBUG (ScheduledTrigger-10210-thread-3) [    ] o.a.s.c.a.NodeAddedTrigger Running NodeAddedTrigger node_added_trigger2
   [junit4]   2> 3746173 DEBUG (ScheduledTrigger-10210-thread-3) [    ] o.a.s.c.a.NodeAddedTrigger Found livenodes: 100
   [junit4]   2> 3746193 DEBUG (ScheduledTrigger-10210-thread-3) [    ] o.a.s.c.a.NodeAddedTrigger Running NodeAddedTrigger node_added_trigger2
   [junit4]   2> 3746193 DEBUG (ScheduledTrigger-10210-thread-3) [    ] o.a.s.c.a.NodeAddedTrigger Found livenodes: 100
   [junit4]   2> 3746209 DEBUG (ScheduledTrigger-10210-thread-3) [    ] o.a.s.c.a.NodeAddedTrigger Running NodeAddedTrigger node_added_trigger2
   [junit4]   2> 3746209 DEBUG (ScheduledTrigger-10210-thread-3) [    ] o.a.s.c.a.NodeAddedTrigger Found livenodes: 100
   [junit4]   2> 3746229 DEBUG (ScheduledTrigger-10210-thread-3) [    ] o.a.s.c.a.NodeAddedTrigger Running NodeAddedTrigger node_added_trigger2
   [junit4]   2> 3746229 DEBUG (ScheduledTrigger-10210-thread-3) [    ] o.a.s.c.a.NodeAddedTrigger Found livenodes: 100
   [junit4]   2> 3746245 DEBUG (ScheduledTrigger-10210-thread-3) [    ] o.a.s.c.a.NodeAddedTrigger Running NodeAddedTrigger node_added_trigger2
   [junit4]   2> 3746246 DEBUG (ScheduledTrigger-10210-thread-3) [    ] o.a.s.c.a.NodeAddedTrigger Found livenodes: 100
   [junit4]   2> 3746266 DEBUG (ScheduledTrigger-10210-thread-3) [    ] o.a.s.c.a.NodeAddedTrigger Running NodeAddedTrigger node_added_trigger2
   [junit4]   2> 3746266 DEBUG (ScheduledTrigger-10210-thread-3) [    ] o.a.s.c.a.NodeAddedTrigger Found livenodes: 100
   [junit4]   2> 3746282 DEBUG (ScheduledTrigger-10210-thread-3) [    ] o.a.s.c.a.NodeAddedTrigger Running NodeAddedTrigger node_added_trigger2
   [junit4]   2> 3746282 DEBUG (ScheduledTrigger-10210-thread-3) [    ] o.a.s.c.a.NodeAddedTrigger Found livenodes: 100
   [junit4]   2> 3746302 DEBUG (ScheduledTrigger-10210-thread-3) [    ] o.a.s.c.a.NodeAddedTrigger Running NodeAddedTrigger node_added_trigger2
   [junit4]   2> 3746302 DEBUG (ScheduledTrigger-10210-thread-3) [    ] o.a.s.c.a.NodeAddedTrigger Found livenodes: 100
   [junit4]   2> 3746318 DEBUG (ScheduledTrigger-10210-thread-3) [    ] o.a.s.c.a.NodeAddedTrigger Running NodeAddedTrigger node_added_trigger2
   [junit4]   2> 3746318 DEBUG (ScheduledTrigger-10210-thread-3) [    ] o.a.s.c.a.NodeAddedTrigger Found livenodes: 100
   [junit4]   2> 3746339 DEBUG (ScheduledTrigger-10210-thread-3) [    ] o.a.s.c.a.NodeAddedTrigger Running NodeAddedTrigger node_added_trigger2
   [junit4]   2> 3746339 DEBUG (ScheduledTrigger-10210-thread-3) [    ] o.a.s.c.a.NodeAddedTrigger Found livenodes: 100
   [junit4]   2> 3746355 DEBUG (ScheduledTrigger-10210-thread-3) [    ] o.a.s.c.a.NodeAddedTrigger Running NodeAddedTrigger node_added_trigger2
   [junit4]   2> 3746355 DEBUG (ScheduledTrigger-10210-thread-3) [    ] o.a.s.c.a.NodeAddedTrigger Found livenodes: 100
   [junit4]   2> 3746375 DEBUG (ScheduledTrigger-10210-thread-3) [    ] o.a.s.c.a.NodeAddedTrigger Running NodeAddedTrigger node_added_trigger2
   [junit4]   2> 3746375 DEBUG (ScheduledTrigger-10210-thread-3) [    ] o.a.s.c.a.NodeAddedTrigger Found livenodes: 100
   [junit4]   2> 3746391 DEBUG (ScheduledTrigger-10210-thread-3) [    ] o.a.s.c.a.NodeAddedTrigger Running NodeAddedTrigger node_added_trigger2
   [junit4]   2> 3746391 DEBUG (ScheduledTrigger-10210-thread-3) [    ] o.a.s.c.a.NodeAddedTrigger Found livenodes: 100
   [junit4]   2> 3746412 DEBUG (ScheduledTrigger-10210-thread-3) [    ] o.a.s.c.a.NodeAddedTrigger Running NodeAddedTrigger node_added_trigger2
   [junit4]   2> 3746412 DEBUG (ScheduledTrigger-10210-thread-3) [    ] o.a.s.c.a.NodeAddedTrigger Found livenodes: 100
   [junit4]   2> 3746428 DEBUG (ScheduledTrigger-10210-thread-3) [    ] o.a.s.c.a.NodeAddedTrigger Running NodeAddedTrigger node_added_trigger2
   [junit4]   2> 3746428 DEBUG (ScheduledTrigger-10210-thread-3) [    ] o.a.s.c.a.NodeAddedTrigger Found livenodes: 100
   [junit4]   2> 3746448 DEBUG (ScheduledTrigger-10210-thread-3) [    ] o.a.s.c.a.NodeAddedTrigger Running NodeAddedTrigger node_added_trigger2
   [junit4]   2> 3746448 DEBUG (ScheduledTrigger-10210-thread-3) [    ] o.a.s.c.a.NodeAddedTrigger Found livenodes: 100
   [junit4]   2> 3746464 DEBUG (ScheduledTrigger-10210-thread-3) [    ] o.a.s.c.a.NodeAddedTrigger Running NodeAddedTrigger node_added_trigger2
   [junit4]   2> 3746464 DEBUG (ScheduledTrigger-10210-thread-3) [    ] o.a.s.c.a.NodeAddedTrigger Found livenodes: 100
   [junit4]   2> 3746489 DEBUG (ScheduledTrigger-10210-thread-3) [    ] o.a.s.c.a.NodeAddedTrigger Running NodeAddedTrigger node_added_trigger2
   [junit4]   2> 3746489 DEBUG (ScheduledTrigger-10210-thread-3) [    ] o.a.s.c.a.NodeAddedTrigger Found livenodes: 100
   [junit4]   2> 3746509 DEBUG (ScheduledTrigger-10210-thread-3) [    ] o.a.s.c.a.NodeAddedTrigger Running NodeAddedTrigger node_added_trigger2
   [junit4]   2> 3746509 DEBUG (ScheduledTrigger-10210-thread-3) [    ] o.a.s.c.a.NodeAddedTrigger Found livenodes: 100
   [junit4]   2> 3746525 DEBUG (ScheduledTrigger-10210-thread-3) [    ] o.a.s.c.a.NodeAddedTrigger Running NodeAddedTrigger node_added_trigger2
   [junit4]   2> 3746525 DEBUG (ScheduledTrigger-10210-thread-3) [    ] o.a.s.c.a.NodeAddedTrigger Found livenodes: 100
   [junit4]   2> 3746546 DEBUG (ScheduledTrigger-10210-thread-3) [    ] o.a.s.c.a.NodeAddedTrigger Running NodeAddedTrigger node_added_trigger2
   [junit4]   2> 3746546 DEBUG (ScheduledTrigger-10210-thread-3) [    ] o.a.s.c.a.NodeAddedTrigger Found livenodes: 100
   [junit4]   2> 3746561 DEBUG (ScheduledTrigger-10210-thread-3) [    ] o.a.s.c.a.NodeAddedTrigger Running NodeAddedTrigger node_added_trigger2
   [junit4]   2> 3746562 DEBUG (ScheduledTrigger-10210-thread-3) [    ] o.a.s.c.a.NodeAddedTrigger Found livenodes: 100
   [junit4]   2> 3746578 DEBUG (ScheduledTrigger-10210-thread-3) [    ] o.a.s.c.a.NodeAddedTrigger Running NodeAddedTrigger node_added_trigger2
   [junit4]   2> 3746578 DEBUG (ScheduledTrigger-10210-thread-3) [    ] o.a.s.c.a.NodeAddedTrigger Found livenodes: 100
   [junit4]   2> 3746598 DEBUG (ScheduledTrigger-10210-thread-3) [    ] o.a.s.c.a.NodeAddedTrigger Running NodeAddedTrigger node_added_trigger2
   [junit4]   2> 3746598 DEBUG (ScheduledTrigger-10210-thread-3) [    ] o.a.s.c.a.NodeAddedTrigger Found livenodes: 100
   [junit4]   2> 3746614 DEBUG (ScheduledTrigger-10210-thread-3) [    ] o.a.s.c.a.NodeAddedTrigger Running NodeAddedTrigger node_added_trigger2
   [junit4]   2> 3746614 DEBUG (ScheduledTrigger-10210-thread-3) [    ] o.a.s.c.a.NodeAddedTrigger Found livenodes: 100
   [junit4]   2> 3746634 DEBUG (ScheduledTrigger-10210-thread-3) [    ] o.a.s.c.a.NodeAddedTrigger Running NodeAddedTrigger node_added_trigger2
   [junit4]   2> 3746634 DEBUG (ScheduledTrigger-10210-thread-3) [    ] o.a.s.c.a.NodeAddedTrigger Found livenodes: 100
   [junit4]   2> 3746651 DEBUG (ScheduledTrigger-10210-thread-3) [    ] o.a.s.c.a.NodeAddedTrigger Running NodeAddedTrigger node_added_trigger2
   [junit4]   2> 3746651 DEBUG (ScheduledTrigger-10210-thread-3) [    ] o.a.s.c.a.NodeAddedTrigger Found livenodes: 100
   [junit4]   2> 3746671 DEBUG (ScheduledTrigger-10210-thread-3) [    ] o.a.s.c.a.NodeAddedTrigger Running NodeAddedTrigger node_added_trigger2
   [junit4]   2> 3746671 DEBUG (ScheduledTrigger-10210-thread-3) [    ] o.a.s.c.a.NodeAddedTrigger Found livenodes: 100
   [junit4]   2> 3746687 DEBUG (ScheduledTrigger-10210-thread-3) [    ] o.a.s.c.a.NodeAddedTrigger Running NodeAddedTrigger node_added_trigger2
   [junit4]   2> 3746687 DEBUG (ScheduledTrigger-10210-thread-3) [    ] o.a.s.c.a.NodeAddedTrigger Found livenodes: 100
   [junit4]   2> 3746707 DEBUG (ScheduledTrigger-10210-thread-3) [    ] o.a.s.c.a.NodeAddedTrigger Running NodeAddedTrigger node_added_trigger2
   [junit4]   2> 3746708 DEBUG (ScheduledTrigger-10210-thread-3) [    ] o.a.s.c.a.NodeAddedTrigger Found livenodes: 100
   [junit4]   2> 3746723 DEBUG (ScheduledTrigger-10210-thread-3) [    ] o.a.s.c.a.NodeAddedTrigger Running NodeAddedTrigger node_added_trigger2
   [junit4]   2> 3746724 DEBUG (ScheduledTrigger-10210-thread-3) [    ] o.a.s.c.a.NodeAddedTrigger Found livenodes: 100
   [junit4]   2> 3746744 DEBUG (ScheduledTrigger-10210-thread-3) [    ] o.a.s.c.a.NodeAddedTrigger Running NodeAddedTrigger node_added_trigger2
   [junit4]   2> 3746744 DEBUG (ScheduledTrigger-10210-thread-3) [    ] o.a.s.c.a.NodeAddedTrigger Found livenodes: 100
   [junit4]   2> 3746760 DEBUG (ScheduledTrigger-10210-thread-3) [    ] o.a.s.c.a.NodeAddedTrigger Running NodeAddedTrigger node_added_trigger2
   [junit4]   2> 3746760 DEBUG (ScheduledTrigger-10210-thread-3) [    ] o.a.s.c.a.NodeAddedTrigger Found livenodes: 100
   [junit4]   2> 3746780 DEBUG (ScheduledTrigger-10210-thread-3) [    ] o.a.s.c.a.NodeAddedTrigger Running NodeAddedTrigger node_added_trigger2
   [junit4]   2> 3746780 DEBUG (ScheduledTrigger-10210-thread-3) [    ] o.a.s.c.a.NodeAddedTrigger Found livenodes: 100
   [junit4]   2> 3746796 DEBUG (ScheduledTrigger-10210-thread-3) [    ] o.a.s.c.a.NodeAddedTrigger Running NodeAddedTrigger node_added_trigger2
   [junit4]   2> 3746796 DEBUG (ScheduledTrigger-10210-thread-3) [    ] o.a.s.c.a.NodeAddedTrigger Found livenodes: 100
   [junit4]   2> 3746817 DEBUG (ScheduledTrigger-10210-thread-3) [    ] o.a.s.c.a.NodeAddedTrigger Running NodeAddedTrigger node_added_trigger2
   [junit4]   2> 3746817 DEBUG (ScheduledTrigger-10210-thread-3) [    ] o.a.s.c.a.NodeAddedTrigger Found livenodes: 100
   [junit4]   2> 3746833 DEBUG (ScheduledTrigger-10210-thread-3) [    ] o.a.s.c.a.NodeAddedTrigger Running NodeAddedTrigger node_added_trigger2
   [junit4]   2> 3746833 DEBUG (ScheduledTrigger-10210-thread-3) [    ] o.a.s.c.a.NodeAddedTrigger Found livenodes: 100
   [junit4]   2> 3746909 DEBUG (ScheduledTrigger-10210-thread-3) [    ] o.a.s.c.a.NodeAddedTrigger Running NodeAddedTrigger node_added_trigger2
   [junit4]   2> 3746909 DEBUG (ScheduledTrigger-10210-thread-3) [    ] o.a.s.c.a.NodeAddedTrigger Found livenodes: 100
   [junit4]   2> 3746919 DEBUG (ScheduledTrigger-10210-thread-3) [    ] o.a.s.c.a.NodeAddedTrigger Running NodeAddedTrigger node_added_trigger2
   [junit4]   2> 3746919 DEBUG (ScheduledTrigger-10210-thread-3) [    ] o.a.s.c.a.NodeAddedTrigger Found livenodes: 100
   [junit4]   2> 3746929 DEBUG (ScheduledTrigger-10210-thread-3) [    ] o.a.s.c.a.NodeAddedTrigger Running NodeAddedTrigger node_added_trigger2
   [junit4]   2> 3746929 DEBUG (ScheduledTrigger-10210-thread-3) [    ] o.a.s.c.a.NodeAddedTrigger Found livenodes: 100
   [junit4]   2> 3746939 DEBUG (ScheduledTrigger-10210-thread-3) [    ] o.a.s.c.a.NodeAddedTrigger Running NodeAddedTrigger node_added_trigger2
   [junit4]   2> 3746939 DEBUG (ScheduledTrigger-10210-thread-3) [    ] o.a.s.c.a.NodeAddedTrigger Found livenodes: 100
   [junit4]   2> 3746963 DEBUG (ScheduledTrigger-10210-thread-3) [    ] o.a.s.c.a.NodeAddedTrigger Running NodeAddedTrigger node_added_trigger2
   [junit4]   2> 3746963 DEBUG (ScheduledTrigger-10210-thread-3) [    ] o.a.s.c.a.NodeAddedTrigger Found livenodes: 100
   [junit4]   2> 3746975 DEBUG (ScheduledTrigger-10210-thread-3) [    ] o.a.s.c.a.NodeAddedTrigger Running NodeAddedTrigger node_added_trigger2
   [junit4]   2> 3746975 DEBUG (ScheduledTrigger-10210-thread-3) [    ] o.a.s.c.a.NodeAddedTrigger Found livenodes: 100
   [junit4]   2> 3746999 DEBUG (ScheduledTrigger-10210-thread-3) [    ] o.a.s.c.a.NodeAddedTrigger Running NodeAddedTrigger node_added_trigger2
   [junit4]   2> 3746999 DEBUG (ScheduledTrigger-10210-thread-3) [    ] o.a.s.c.a.NodeAddedTrigger Found livenodes: 100
   [junit4]   2> 3747019 DEBUG (ScheduledTrigger-10210-thread-3) [    ] o.a.s.c.a.NodeAddedTrigger Running NodeAddedTrigger node_added_trigger2
   [junit4]   2> 3747019 DEBUG (ScheduledTrigger-10210-thread-3) [    ] o.a.s.c.a.NodeAddedTrigger Found livenodes: 100
   [junit4]   2> 3747035 DEBUG (ScheduledTrigger-10210-thread-3) [    ] o.a.s.c.a.NodeAddedTrigger Running NodeAddedTrigger node_added_trigger2
   [junit4]   2> 3747035 DEBUG (ScheduledTrigger-10210-thread-3) [    ] o.a.s.c.a.NodeAddedTrigger Found livenodes: 100
   [junit4]   2> 3747056 DEBUG (ScheduledTrigger-10210-thread-3) [    ] o.a.s.c.a.NodeAddedTrigger Running NodeAddedTrigger node_added_trigger2
   [junit4]   2> 3747056 DEBUG (ScheduledTrigger-10210-thread-3) [    ] o.a.s.c.a.NodeAddedTrigger Found livenodes: 100
   [junit4]   2> 3747072 DEBUG (ScheduledTrigger-10210-thread-3) [    ] o.a.s.c.a.NodeAddedTrigger Running NodeAddedTrigger node_added_trigger2
   [junit4]   2> 3747072 DEBUG (ScheduledTrigger-10210-thread-3) [    ] o.a.s.c.a.NodeAddedTrigger Found livenodes: 100
   [junit4]   2> 3747092 DEBUG (ScheduledTrigger-10210-thread-3) [    ] o.a.s.c.a.NodeAddedTrigger Running NodeAddedTrigger node_added_trigger2
   [junit4]   2> 3747092 DEBUG (ScheduledTrigger-10210-thread-3) [    ] o.a.s.c.a.NodeAddedTrigger Found livenodes: 100
   [junit4]   2> 3747108 DEBUG (ScheduledTrigger-10210-thread-3) [    ] o.a.s.c.a.NodeAddedTrigger Running NodeAddedTrigger node_added_trigger2
   [junit4]   2> 3747108 DEBUG (ScheduledTrigger-10210-thread-3) [    ] o.a.s.c.a.NodeAddedTrigger Found livenodes: 100
   [junit4]   2> 3747129 DEBUG (ScheduledTrigger-10210-thread-3) [    ] o.a.s.c.a.NodeAddedTrigger Running NodeAddedTrigger node_added_trigger2
   [junit4]   2> 3747129 DEBUG (ScheduledTrigger-10210-thread-3) [    ] o.a.s.c.a.NodeAddedTrigger Found livenodes: 100
   [junit4]   2> 3747145 DEBUG (ScheduledTrigger-10210-thread-3) [    ] o.a.s.c.a.NodeAddedTrigger Running NodeAddedTrigger node_added_trigger2
   [junit4]   2> 3747145 DEBUG (ScheduledTrigger-10210-thread-3) [    ] o.a.s.c.a.NodeAddedTrigger Found livenodes: 100
   [junit4]   2> 3747165 DEBUG (ScheduledTrigger-10210-thread-3) [    ] o.a.s.c.a.NodeAddedTrigger Running NodeAddedTrigger node_added_trigger2
   [junit4]   2> 3747165 DEBUG (ScheduledTrigger-10210-thread-3) [    ] o.a.s.c.a.NodeAddedTrigger Found livenodes: 100
   [junit4]   2> 3747181 DEBUG (ScheduledTrigger-10210-thread-3) [    ] o.a.s.c.a.NodeAddedTrigger Running NodeAddedTrigger node_added_trigger2
   [junit4]   2> 3747181 DEBUG (ScheduledTrigger-10210-thread-3) [    ] o.a.s.c.a.NodeAddedTrigger Found livenodes: 100
   [junit4]   2> 3747201 DEBUG (ScheduledTrigger-10210-thread-3) [    ] o.a.s.c.a.NodeAddedTrigger Running NodeAddedTrigger node_added_trigger2
   [junit4]   2> 3747202 DEBUG (ScheduledTrigger-10210-thread-3) [    ] o.a.s.c.a.NodeAddedTrigger Found livenodes: 100
   [junit4]   2> 3747218 DEBUG (ScheduledTrigger-10210-thread-3) [    ] o.a.s.c.a.NodeAddedTrigger Running NodeAddedTrigger node_added_trigger2
   [junit4]   2> 3747218 DEBUG (ScheduledTrigger-10210-thread-3) [    ] o.a.s.c.a.NodeAddedTrigger Found livenodes: 100
   [junit4]   2> 3747238 DEBUG (ScheduledTrigger-10210-thread-3) [    ] o.a.s.c.a.NodeAddedTrigger Running NodeAddedTrigger node_added_trigger2
   [junit4]   2> 3747238 DEBUG (ScheduledTrigger-10210-thread-3) [    ] o.a.s.c.a.NodeAddedTrigger Found livenodes: 100
   [junit4]   2> 3747254 DEBUG (ScheduledTrigger-10210-thread-3) [    ] o.a.s.c.a.NodeAddedTrigger Running NodeAddedTrigger node_added_trigger2
   [junit4]   2> 3747254 DEBUG (ScheduledTrigger-10210-thread-3) [    ] o.a.s.c.a.NodeAddedTrigger Found livenodes: 100
   [junit4]   2> 3747274 DEBUG (ScheduledTrigger-10210-thread-3) [    ] o.a.s.c.a.NodeAddedTrigger Running NodeAddedTrigger node_added_trigger2
   [junit4]   2> 3747274 DEBUG (ScheduledTrigger-10210-thread-3) [    ] o.a.s.c.a.NodeAddedTrigger Found livenodes: 100
   [junit4]   2> 3747291 DEBUG (ScheduledTrigger-10210-thread-3) [    ] o.a.s.c.a.NodeAddedTrigger Running NodeAddedTrigger node_added_trigger2
   [junit4]   2> 3747291 DEBUG (ScheduledTrigger-10210-thread-3) [    ] o.a.s.c.a.NodeAddedTrigger Found livenodes: 100
   [junit4]   2> 3747327 DEBUG (ScheduledTrigger-10210-thread-3) [    ] o.a.s.c.a.NodeAddedTrigger Running NodeAddedTrigger node_added_trigger2
   [junit4]   2> 3747327 DEBUG (ScheduledTrigger-10210-thread-3) [    ] o.a.s.c.a.NodeAddedTrigger Found livenodes: 100
   [junit4]   2> 3747347 DEBUG (ScheduledTrigger-10210-thread-3) [    ] o.a.s.c.a.NodeAddedTrigger Running NodeAddedTrigger node_added_trigger2
   [junit4]   2> 3747347 DEBUG (ScheduledTrigger-10210-thread-3) [    ] o.a.s.c.a.NodeAddedTrigger Found livenodes: 100
   [junit4]   2> 3747363 DEBUG (ScheduledTrigger-10210-thread-3) [    ] o.a.s.c.a.NodeAddedTrigger Running NodeAddedTrigger node_added_trigger2
   [junit4]   2> 3747364 DEBUG (ScheduledTrigger-10210-thread-3) [    ] o.a.s.c.a.NodeAddedTrigger Found livenodes: 100
   [junit4]   2> 3747400 DEBUG (ScheduledTrigger-10210-thread-3) [    ] o.a.s.c.a.NodeAddedTrigger Running NodeAddedTrigger node_added_trigger2
   [junit4]   2> 3747400 DEBUG (ScheduledTrigger-10210-thread-3) [    ] o.a.s.c.a.NodeAddedTrigger Found livenodes: 100
   [junit4]   2> 3747420 DEBUG (ScheduledTrigger-10210-thread-3) [    ] o.a.s.c.a.NodeAddedTrigger Running NodeAddedTrigger node_added_trigger2
   [junit4]   2> 3747420 DEBUG (ScheduledTrigger-10210-thread-3) [    ] o.a.s.c.a.NodeAddedTrigger Found livenodes: 100
   [junit4]   2> 3747436 DEBUG (ScheduledTrigger-10210-thread-3) [    ] o.a.s.c.a.NodeAddedTrigger Running NodeAddedTrigger node_added_trigger2
   [junit4]   2> 3747436 DEBUG (ScheduledTrigger-10210-thread-3) [    ] o.a.s.c.a.NodeAddedTrigger Found livenodes: 100
   [junit4]   2> 3747457 DEBUG (ScheduledTrigger-10210-thread-3) [    ] o.a.s.c.a.NodeAddedTrigger Running NodeAddedTrigger node_added_trigger2
   [junit4]   2> 3747457 DEBUG (ScheduledTrigger-10210-thread-3) [    ] o.a.s.c.a.NodeAddedTrigger Found livenodes: 100
   [junit4]   2> 3747473 DEBUG (ScheduledTrigger-10210-thread-3) [    ] o.a.s.c.a.NodeAddedTrigger Running NodeAddedTrigger node_added_trigger2
   [junit4]   2> 3747473 DEBUG (ScheduledTrigger-10210-thread-3) [    ] o.a.s.c.a.NodeAddedTrigger Found livenodes: 100
   [junit4]   2> 3747493 DEBUG (ScheduledTrigger-10210-thread-3) [    ] o.a.s.c.a.NodeAddedTrigger Running NodeAddedTrigger node_added_trigger2
   [junit4]   2> 3747493 DEBUG (ScheduledTrigger-10210-thread-3) [    ] o.a.s.c.a.NodeAddedTrigger Found livenodes: 100
   [junit4]   2> 3747509 DEBUG (ScheduledTrigger-10210-thread-3) [    ] o.a.s.c.a.NodeAddedTrigger Running NodeAddedTrigger node_added_trigger2
   [junit4]   2> 3747509 DEBUG (ScheduledTrigger-10210-thread-3) [    ] o.a.s.c.a.NodeAddedTrigger Found livenodes: 100
   [junit4]   2> 3747530 DEBUG (ScheduledTrigger-10210-thread-3) [    ] o.a.s.c.a.NodeAddedTrigger Running NodeAddedTrigger node_added_trigger2
   [junit4]   2> 3747530 DEBUG (ScheduledTrigger-10210-thread-3) [    ] o.a.s.c.a.NodeAddedTrigger Found livenodes: 100
   [junit4]   2> 3747546 DEBUG (ScheduledTrigger-10210-thread-3) [    ] o.a.s.c.a.NodeAddedTrigger Running NodeAddedTrigger node_added_trigger2
   [junit4]   2> 3747546 DEBUG (ScheduledTrigger-10210-thread-3) [    ] o.a.s.c.a.NodeAddedTrigger Found livenodes: 100
   [junit4]   2> 3747566 DEBUG (ScheduledTrigger-10210-thread-3) [    ] o.a.s.c.a.NodeAddedTrigger Running NodeAddedTrigger node_added_trigger2
   [junit4]   2> 3747566 DEBUG (ScheduledTrigger-10210-thread-3) [    ] o.a.s.c.a.NodeAddedTrigger Found livenodes: 100
   [junit4]   2> 3747582 DEBUG (ScheduledTrigger-10210-thread-3) [    ] o.a.s.c.a.NodeAddedTrigger Running NodeAddedTrigger node_added_trigger2
   [junit4]   2> 3747582 DEBUG (ScheduledTrigger-10210-thread-3) [    ] o.a.s.c.a.NodeAddedTrigger Found livenodes: 100
   [junit4]   2> 3747603 DEBUG (ScheduledTrigger-10210-thread-3) [    ] o.a.s.c.a.NodeAddedTrigger Running NodeAddedTrigger node_added_trigger2
   [junit4]   2> 3747603 DEBUG (ScheduledTrigger-10210-thread-3) [    ] o.a.s.c.a.NodeAddedTrigger Found livenodes: 100
   [junit4]   2> 3747619 DEBUG (ScheduledTrigger-10210-thread-3) [    ] o.a.s.c.a.NodeAddedTrigger Running NodeAddedTrigger node_added_trigger2
   [junit4]   2> 3747619 DEBUG (ScheduledTrigger-10210-thread-3) [    ] o.a.s.c.a.NodeAddedTrigger Found livenodes: 100
   [junit4]   2> 3747639 DEBUG (ScheduledTrigger-10210-thread-3) [    ] o.a.s.c.a.NodeAddedTrigger Running NodeAddedTrigger node_added_trigger2
   [junit4]   2> 3747639 DEBUG (ScheduledTrigger-10210-thread-3) [    ] o.a.s.c.a.NodeAddedTrigger Found livenodes: 100
   [junit4]   2> 3747655 DEBUG (ScheduledTrigger-10210-thread-3) [    ] o.a.s.c.a.NodeAddedTrigger Running NodeAddedTrigger node_added_trigger2
   [junit4]   2> 3747655 DEBUG (ScheduledTrigger-10210-thread-3) [    ] o.a.s.c.a.NodeAddedTrigger Found livenodes: 100
   [junit4]   2> 3747671 DEBUG (ScheduledTrigger-10210-thread-3) [    ] o.a.s.c.a.NodeAddedTrigger Running NodeAddedTrigger node_added_trigger2
   [junit4]   2> 3747671 DEBUG (ScheduledTrigger-10210-thread-3) [    ] o.a.s.c.a.NodeAddedTrigger Found livenodes: 100
   [junit4]   2> 3747809 DEBUG (ScheduledTrigger-10210-thread-4) [    ] o.a.s.c.a.NodeAddedTrigger Running NodeAddedTrigger node_added_trigger2
   [junit4]   2> 3747809 DEBUG (ScheduledTrigger-10210-thread-4) [    ] o.a.s.c.a.NodeAddedTrigger Found livenodes: 100
   [junit4]   2> 3747830 DEBUG (ScheduledTrigger-10210-thread-4) [    ] o.a.s.c.a.NodeAddedTrigger Running NodeAddedTrigger node_added_trigger2
   [junit4]   2> 3747830 DEBUG (ScheduledTrigger-10210-thread-4) [    ] o.a.s.c.a.NodeAddedTrigger Found livenodes: 100
   [junit4]   2> 3747862 DEBUG (ScheduledTrigger-10210-thread-4) [    ] o.a.s.c.a.NodeAddedTrigger Running NodeAddedTrigger node_added_trigger2
   [junit4]   2> 3747862 DEBUG (ScheduledTrigger-10210-thread-4) [    ] o.a.s.c.a.NodeAddedTrigger Found livenodes: 100
   [junit4]   2> 3747996 DEBUG (ScheduledTrigger-10210-thread-3) [    ] o.a.s.c.a.NodeAddedTrigger Running NodeAddedTrigger node_added_trigger2
   [junit4]   2> 3747996 DEBUG (ScheduledTrigger-10210-thread-3) [    ] o.a.s.c.a.NodeAddedTrigger Found livenodes: 100
   [junit4]   2> 3748016 DEBUG (ScheduledTrigger-10210-thread-3) [    ] o.a.s.c.a.NodeAddedTrigger Running NodeAddedTrigger node_added_trigger2
   [junit4]   2> 3748016 DEBUG (ScheduledTrigger-10210-thread-3) [    ] o.a.s.c.a.NodeAddedTrigger Found livenodes: 100
   [junit4]   2> 3748032 DEBUG (ScheduledTrigger-10210-thread-3) [    ] o.a.s.c.a.NodeAddedTrigger Running NodeAddedTrigger node_added_trigger2
   [junit4]   2> 3748032 DEBUG (ScheduledTrigger-10210-thread-3) [    ] o.a.s.c.a.NodeAddedTrigger Found livenodes: 100
   [junit4]   2> 3748052 DEBUG (ScheduledTrigger-10210-thread-3) [    ] o.a.s.c.a.NodeAddedTrigger Running NodeAddedTrigger node_added_trigger2
   [junit4]   2> 3748052 DEBUG (ScheduledTrigger-10210-thread-3) [    ] o.a.s.c.a.NodeAddedTrigger Found livenodes: 100
   [junit4]   2> 3748069 DEBUG (ScheduledTrigger-10210-thread-3) [    ] o.a.s.c.a.NodeAddedTrigger Running NodeAddedTrigger node_added_trigger2
   [junit4]   2> 3748069 DEBUG (ScheduledTrigger-10210-thread-3) [    ] o.a.s.c.a.NodeAddedTrigger Found livenodes: 100
   [junit4]   2> 3748089 DEBUG (ScheduledTrigger-10210-thread-3) [    ] o.a.s.c.a.NodeAddedTrigger Running NodeAddedTrigger node_added_trigger2
   [junit4]   2> 3748089 DEBUG (ScheduledTrigger-10210-thread-3) [    ] o.a.s.c.a.NodeAddedTrigger Found livenodes: 100
   [junit4]   2> 3748105 DEBUG (ScheduledTrigger-10210-thread-3) [    ] o.a.s.c.a.NodeAddedTrigger Running NodeAddedTrigger node_added_trigger2
   [junit4]   2> 3748105 DEBUG (ScheduledTrigger-10210-thread-3) [    ] o.a.s.c.a.NodeAddedTrigger Found livenodes: 100
   [junit4]   2> 3748125 DEBUG (ScheduledTrigger-10210-thread-3) [    ] o.a.s.c.a.NodeAddedTrigger Running NodeAddedTrigger node_added_trigger2
   [junit4]   2> 3748125 DEBUG (ScheduledTrigger-10210-thread-3) [    ] o.a.s.c.a.NodeAddedTrigger Found livenodes: 100
   [junit4]   2> 3748141 DEBUG (ScheduledTrigger-10210-thread-3) [    ] o.a.s.c.a.NodeAddedTrigger Running NodeAddedTrigger node_added_trigger2
   [junit4]   2> 3748142 DEBUG (ScheduledTrigger-10210-thread-3) [    ] o.a.s.c.a.NodeAddedTrigger Found livenodes: 100
   [junit4]   2> 3748271 DEBUG (ScheduledTrigger-10210-thread-3) [    ] o.a.s.c.a.NodeAddedTrigger Running NodeAddedTrigger node_added_trigger2
   [junit4]   2> 3748271 DEBUG (ScheduledTrigger-10210-thread-3) [    ] o.a.s.c.a.NodeAddedTrigger Found livenodes: 100
   [junit4]   2> 3748287 DEBUG (ScheduledTrigger-10210-thread-3) [    ] o.a.s.c.a.NodeAddedTrigger Running NodeAddedTrigger node_added_trigger2
   [junit4]   2> 3748287 DEBUG (ScheduledTrigger-10210-thread-3) [    ] o.a.s.c.a.NodeAddedTrigger Found livenodes: 100
   [junit4]   2> 3748308 DEBUG (ScheduledTrigger-10210-thread-3) [    ] o.a.s.c.a.NodeAddedTrigger Running NodeAddedTrigger node_added_trigger2
   [junit4]   2> 3748308 DEBUG (ScheduledTrigger-10210-thread-3) [    ] o.a.s.c.a.NodeAddedTrigger Found livenodes: 100
   [junit4]   2> 3748324 DEBUG (ScheduledTrigger-10210-thread-3) [    ] o.a.s.c.a.NodeAddedTrigger Running NodeAddedTrigger node_added_trigger2
   [junit4]   2> 3748324 DEBUG (ScheduledTrigger-10210-thread-3) [    ] o.a.s.c.a.NodeAddedTrigger Found livenodes: 100
   [junit4]   2> 3748344 DEBUG (ScheduledTrigger-10210-thread-3) [    ] o.a.s.c.a.NodeAddedTrigger Running NodeAddedTrigger node_added_trigger2
   [junit4]   2> 3748344 DEBUG (ScheduledTrigger-10210-thread-3) [    ] o.a.s.c.a.NodeAddedTrigger Found livenodes: 100
   [junit4]   2> 3748360 DEBUG (ScheduledTrigger-10210-thread-3) [    ] o.a.s.c.a.NodeAddedTrigger Running NodeAddedTrigger node_added_trigger2
   [junit4]   2> 3748360 DEBUG (ScheduledTrigger-10210-thread-3) [    ] o.a.s.c.a.NodeAddedTrigger Found livenodes: 100
   [junit4]   2> 3748381 DEBUG (ScheduledTrigger-10210-thread-3) [    ] o.a.s.c.a.NodeAddedTrigger Running NodeAddedTrigger node_added_trigger2
   [junit4]   2> 3748381 DEBUG (ScheduledTrigger-10210-thread-3) [    ] o.a.s.c.a.NodeAddedTrigger Found livenodes: 100
   [junit4]   2> 3748397 DEBUG (ScheduledTrigger-10210-thread-3) [    ] o.a.s.c.a.NodeAddedTrigger Running NodeAddedTrigger node_added_trigger2
   [junit4]   2> 3748397 DEBUG (ScheduledTrigger-10210-thread-3) [    ] o.a.s.c.a.NodeAddedTrigger Found livenodes: 100
   [junit4]   2> 3748417 DEBUG (ScheduledTrigger-10210-thread-3) [    ] o.a.s.c.a.NodeAddedTrigger Running NodeAddedTrigger node_added_trigger2
   [junit4]   2> 3748417 DEBUG (ScheduledTrigger-10210-thread-3) [    ] o.a.s.c.a.NodeAddedTrigger Found livenodes: 100
   [junit4]   2> 3748433 DEBUG (ScheduledTrigger-10210-thread-3) [    ] o.a.s.c.a.NodeAddedTrigger Running NodeAddedTrigger node_added_trigger2
   [junit4]   2> 3748433 DEBUG (ScheduledTrigger-10210-thread-3) [    ] o.a.s.c.a.NodeAddedTrigger Found livenodes: 100
   [junit4]   2> 3748453 DEBUG (ScheduledTrigger-10210-thread-3) [    ] o.a.s.c.a.NodeAddedTrigger Running NodeAddedTrigger node_added_trigger2
   [junit4]   2> 3748454 DEBUG (ScheduledTrigger-10210-thread-3) [    ] o.a.s.c.a.NodeAddedTrigger Found livenodes: 100
   [junit4]   2> 3748470 DEBUG (ScheduledTrigger-10210-thread-3) [    ] o.a.s.c.a.NodeAddedTrigger Running NodeAddedTrigger node_added_trigger2
   [junit4]   2> 3748470 DEBUG (ScheduledTrigger-10210-thread-3) [    ] o.a.s.c.a.NodeAddedTrigger Found livenodes: 100
   [junit4]   2> 3748490 DEBUG (ScheduledTrigger-10210-thread-3) [    ] o.a.s.c.a.NodeAddedTrigger Running NodeAddedTrigger node_added_trigger2
   [junit4]   2> 3748490 DEBUG (ScheduledTrigger-10210-thread-3) [    ] o.a.s.c.a.NodeAddedTrigger Found livenodes: 100
   [junit4]   2> 3748506 DEBUG (ScheduledTrigger-10210-thread-3) [    ] o.a.s.c.a.NodeAddedTrigger Running NodeAddedTrigger node_added_trigger2
   [junit4]   2> 3748506 DEBUG (ScheduledTrigger-10210-thread-3) [    ] o.a.s.c.a.NodeAddedTrigger Found livenodes: 100
   [junit4]   2> 3748526 DEBUG (ScheduledTrigger-10210-thread-3) [    ] o.a.s.c.a.NodeAddedTrigger Running NodeAddedTrigger node_added_trigger2
   [junit4]   2> 3748526 DEBUG (ScheduledTrigger-10210-thread-3) [    ] o.a.s.c.a.NodeAddedTrigger Found livenodes: 100
   [junit4]   2> 3748543 DEBUG (ScheduledTrigger-10210-thread-3) [    ] o.a.s.c.a.NodeAddedTrigger Running NodeAddedTrigger node_added_trigger2
   [junit4]   2> 3748543 DEBUG (ScheduledTrigger-10210-thread-3) [    ] o.a.s.c.a.NodeAddedTrigger Found livenodes: 100
   [junit4]   2> 3748563 DEBUG (ScheduledTrigger-10210-thread-3) [    ] o.a.s.c.a.NodeAddedTrigger Running NodeAddedTrigger node_added_trigger2
   [junit4]   2> 3748563 DEBUG (ScheduledTrigger-10210-thread-3) [    ] o.a.s.c.a.NodeAddedTrigger Found livenodes: 100
   [junit4]   2> 3748579 DEBUG (ScheduledTrigger-10210-thread-3) [    ] o.a.s.c.a.NodeAddedTrigger Running NodeAddedTrigger node_added_trigger2
   [junit4]   2> 3748579 DEBUG (ScheduledTrigger-10210-thread-3) [    ] o.a.s.c.a.NodeAddedTrigger Found livenodes: 100
   [junit4]   2> 3748599 DEBUG (ScheduledTrigger-10210-thread-3) [    ] o.a.s.c.a.NodeAddedTrigger Running NodeAddedTrigger node_added_trigger2
   [junit4]   2> 3748599 DEBUG (ScheduledTrigger-10210-thread-3) [    ] o.a.s.c.a.NodeAddedTrigger Found livenodes: 100
   [junit4]   2> 3748616 DEBUG (ScheduledTrigger-10210-thread-3) [    ] o.a.s.c.a.NodeAddedTrigger Running NodeAddedTrigger node_added_trigger2
   [junit4]   2> 3748616 DEBUG (ScheduledTrigger-10210-thread-3) [    ] o.a.s.c.a.NodeAddedTrigger Found livenodes: 100
   [junit4]   2> 3748636 DEBUG (ScheduledTrigger-10210-thread-3) [    ] o.a.s.c.a.NodeAddedTrigger Running NodeAddedTrigger node_added_trigger2
   [junit4]   2> 3748636 DEBUG (ScheduledTrigger-10210-thread-3) [    ] o.a.s.c.a.NodeAddedTrigger Found livenodes: 100
   [junit4]   2> 3748652 DEBUG (ScheduledTrigger-10210-thread-3) [    ] o.a.s.c.a.NodeAddedTrigger Running NodeAddedTrigger node_added_trigger2
   [junit4]   2> 3748652 DEBUG (ScheduledTrigger-10210-thread-3) [    ] o.a.s.c.a.NodeAddedTrigger Found livenodes: 100
   [junit4]   2> 3748672 DEBUG (ScheduledTrigger-10210-thread-3) [    ] o.a.s.c.a.NodeAddedTrigger Running NodeAddedTrigger node_added_trigger2
   [junit4]   2> 3748672 DEBUG (ScheduledTrigger-10210-thread-3) [    ] o.a.s.c.a.NodeAddedTrigger Found livenodes: 100
   [junit4]   2> 3748689 DEBUG (ScheduledTrigger-10210-thread-3) [    ] o.a.s.c.a.NodeAddedTrigger Running NodeAddedTrigger node_added_trigger2
   [junit4]   2> 3748689 DEBUG (ScheduledTrigger-10210-thread-3) [    ] o.a.s.c.a.NodeAddedTrigger Found livenodes: 100
   [junit4]   2> 3748709 DEBUG (ScheduledTrigger-10210-thread-3) [    ] o.a.s.c.a.NodeAddedTrigger Running NodeAddedTrigger node_added_trigger2
   [junit4]   2> 3748709 DEBUG (ScheduledTrigger-10210-thread-3) [    ] o.a.s.c.a.NodeAddedTrigger Found livenodes: 100
   [junit4]   2> 3748725 DEBUG (ScheduledTrigger-10210-thread-3) [    ] o.a.s.c.a.NodeAddedTrigger Running NodeAddedTrigger node_added_trigger2
   [junit4]   2> 3748725 DEBUG (ScheduledTrigger-10210-thread-3) [    ] o.a.s.c.a.NodeAddedTrigger Found livenodes: 100
   [junit4]   2> 3748745 DEBUG (ScheduledTrigger-10210-thread-3) [    ] o.a.s.c.a.NodeAddedTrigger Running NodeAddedTrigger node_added_trigger2
   [junit4]   2> 3748745 DEBUG (ScheduledTrigger-10210-thread-3) [    ] o.a.s.c.a.NodeAddedTrigger Found livenodes: 100
   [junit4]   2> 3748761 DEBUG (ScheduledTrigger-10210-thread-3) [    ] o.a.s.c.a.NodeAddedTrigger Running NodeAddedTrigger node_added_trigger2
   [junit4]   2> 3748761 DEBUG (ScheduledTrigger-10210-thread-3) [    ] o.a.s.c.a.NodeAddedTrigger Found livenodes: 100
   [junit4]   2> 3748782 DEBUG (ScheduledTrigger-10210-thread-3) [    ] o.a.s.c.a.NodeAddedTrigger Running NodeAddedTrigger node_added_trigger2
   [junit4]   2> 3748782 DEBUG (ScheduledTrigger-10210-thread-3) [    ] o.a.s.c.a.NodeAddedTrigger Found livenodes: 100
   [junit4]   2> 3748798 DEBUG (ScheduledTrigger-10210-thread-3) [    ] o.a.s.c.a.NodeAddedTrigger Running NodeAddedTrigger node_added_trigger2
   [junit4]   2> 3748798 DEBUG (ScheduledTrigger-10210-thread-3) [    ] o.a.s.c.a.NodeAddedTrigger Found livenodes: 100
   [junit4]   2> 3748818 DEBUG (ScheduledTrigger-10210-thread-3) [    ] o.a.s.c.a.NodeAddedTrigger Running NodeAddedTrigger node_added_trigger2
   [junit4]   2> 3748818 DEBUG (ScheduledTrigger-10210-thread-3) [    ] o.a.s.c.a.NodeAddedTrigger Found livenodes: 100
   [junit4]   2> 3748834 DEBUG (ScheduledTrigger-10210-thread-3) [    ] o.a.s.c.a.NodeAddedTrigger Running NodeAddedTrigger node_added_trigger2
   [junit4]   2> 3748834 DEBUG (ScheduledTrigger-10210-thread-3) [    ] o.a.s.c.a.NodeAddedTrigger Found livenodes: 100
   [junit4]   2> 3748855 DEBUG (ScheduledTrigger-10210-thread-3) [    ] o.a.s.c.a.NodeAddedTrigger Running NodeAddedTrigger node_added_trigger2
   [junit4]   2> 3748855 DEBUG (ScheduledTrigger-10210-thread-3) [    ] o.a.s.c.a.NodeAddedTrigger Found livenodes: 100
   [junit4]   2> 3748871 DEBUG (ScheduledTrigger-10210-thread-3) [    ] o.a.s.c.a.NodeAddedTrigger Running NodeAddedTrigger node_added_trigger2
   [junit4]   2> 3748871 DEBUG (ScheduledTrigger-10210-thread-3) [    ] o.a.s.c.a.NodeAddedTrigger Found livenodes: 100
   [junit4]   2> 3748891 DEBUG (ScheduledTrigger-10210-thread-3) [    ] o.a.s.c.a.NodeAddedTrigger Running NodeAddedTrigger node_added_trigger2
   [junit4]   2> 3748891 DEBUG (ScheduledTrigger-10210-thread-3) [    ] o.a.s.c.a.NodeAddedTrigger Found livenodes: 100
   [junit4]   2> 3748907 DEBUG (ScheduledTrigger-10210-thread-3) [    ] o.a.s.c.a.NodeAddedTrigger Running NodeAddedTrigger node_added_trigger2
   [junit4]   2> 3748907 DEBUG (ScheduledTrigger-10210-thread-3) [    ] o.a.s.c.a.NodeAddedTrigger Found livenodes: 100
   [junit4]   2> 3748928 DEBUG (ScheduledTrigger-10210-thread-3) [    ] o.a.s.c.a.NodeAddedTrigger Running NodeAddedTrigger node_added_trigger2
   [junit4]   2> 3748928 DEBUG (ScheduledTrigger-10210-thread-3) [    ] o.a.s.c.a.NodeAddedTrigger Found livenodes: 100
   [junit4]   2> 3748944 DEBUG (ScheduledTrigger-10210-thread-3) [    ] o.a.s.c.a.NodeAddedTrigger Running NodeAddedTrigger node_added_trigger2
   [junit4]   2> 3748944 DEBUG (ScheduledTrigger-10210-thread-3) [    ] o.a.s.c.a.NodeAddedTrigger Found livenodes: 100
   [junit4]   2> 3748964 DEBUG (ScheduledTrigger-10210-thread-3) [    ] o.a.s.c.a.NodeAddedTrigger Running NodeAddedTrigger node_added_trigger2
   [junit4]   2> 3748964 DEBUG (ScheduledTrigger-10210-thread-3) [    ] o.a.s.c.a.NodeAddedTrigger Found livenodes: 100
   [junit4]   2> 3748980 DEBUG (ScheduledTrigger-10210-thread-3) [    ] o.a.s.c.a.NodeAddedTrigger Running NodeAddedTrigger node_added_trigger2
   [junit4]   2> 3748980 DEBUG (ScheduledTrigger-10210-thread-3) [    ] o.a.s.c.a.NodeAddedTrigger Found livenodes: 100
   [junit4]   2> 3749000 DEBUG (ScheduledTrigger-10210-thread-3) [    ] o.a.s.c.a.NodeAddedTrigger Running NodeAddedTrigger node_added_trigger2
   [junit4]   2> 3749001 DEBUG (ScheduledTrigger-10210-thread-3) [    ] o.a.s.c.a.NodeAddedTrigger Found livenodes: 100
   [junit4]   2> 3749017 DEBUG (ScheduledTrigger-10210-thread-3) [    ] o.a.s.c.a.NodeAddedTrigger Running NodeAddedTrigger node_added_trigger2
   [junit4]   2> 3749017 DEBUG (ScheduledTrigger-10210-thread-3) [    ] o.a.s.c.a.NodeAddedTrigger Found livenodes: 100
   [junit4]   2> 3749037 DEBUG (ScheduledTrigger-10210-thread-3) [    ] o.a.s.c.a.NodeAddedTrigger Running NodeAddedTrigger node_added_trigger2
   [junit4]   2> 3749037 DEBUG (ScheduledTrigger-10210-thread-3) [    ] o.a.s.c.a.NodeAddedTrigger Found livenodes: 100
   [junit4]   2> 3749053 DEBUG (ScheduledTrigger-10210-thread-3) [    ] o.a.s.c.a.NodeAddedTrigger Running NodeAddedTrigger node_added_trigger2
   [junit4]   2> 3749053 DEBUG (ScheduledTrigger-10210-thread-3) [    ] o.a.s.c.a.NodeAddedTrigger Found livenodes: 100
   [junit4]   2> 3749073 DEBUG (ScheduledTrigger-10210-thread-3) [    ] o.a.s.c.a.NodeAddedTrigger Running NodeAddedTrigger node_added_trigger2
   [junit4]   2> 3749074 DEBUG (ScheduledTrigger-10210-thread-3) [    ] o.a.s.c.a.NodeAddedTrigger Found livenodes: 100
   [junit4]   2> 3749090 DEBUG (ScheduledTrigger-10210-thread-3) [    ] o.a.s.c.a.NodeAddedTrigger Running NodeAddedTrigger node_added_trigger2
   [junit4]   2> 3749090 DEBUG (ScheduledTrigger-10210-thread-3) [    ] o.a.s.c.a.NodeAddedTrigger Found livenodes: 100
   [junit4]   2> 3749110 DEBUG (ScheduledTrigger-10210-thread-3) [    ] o.a.s.c.a.NodeAddedTrigger Running NodeAddedTrigger node_added_trigger2
   [junit4]   2> 3749110 DEBUG (ScheduledTrigger-10210-thread-3) [    ] o.a.s.c.a.NodeAddedTrigger Found livenodes: 100
   [junit4]   2> 3749126 DEBUG (ScheduledTrigger-10210-thread-3) [    ] o.a.s.c.a.NodeAddedTrigger Running NodeAddedTrigger node_added_trigger2
   [junit4]   2> 3749126 DEBUG (ScheduledTrigger-10210-thread-3) [    ] o.a.s.c.a.NodeAddedTrigger Found livenodes: 100
   [junit4]   2> 3749146 DEBUG (ScheduledTrigger-10210-thread-3) [    ] o.a.s.c.a.NodeAddedTrigger Running NodeAddedTrigger node_added_trigger2
   [junit4]   2> 3749146 DEBUG (ScheduledTrigger-10210-thread-3) [    ] o.a.s.c.a.NodeAddedTrigger Found livenodes: 100
   [junit4]   2> 3749162 DEBUG (ScheduledTrigger-10210-thread-3) [    ] o.a.s.c.a.NodeAddedTrigger Running NodeAddedTrigger node_added_trigger2
   [junit4]   2> 3749163 DEBUG (ScheduledTrigger-10210-thread-3) [    ] o.a.s.c.a.NodeAddedTrigger Found livenodes: 100
   [junit4]   2> 3749183 DEBUG (ScheduledTrigger-10210-thread-3) [    ] o.a.s.c.a.NodeAddedTrigger Running NodeAddedTrigger node_added_trigger2
   [junit4]   2> 3749183 DEBUG (ScheduledTrigger-10210-thread-3) [    ] o.a.s.c.a.NodeAddedTrigger Found livenodes: 100
   [junit4]   2> 3749199 DEBUG (ScheduledTrigger-10210-thread-3) [    ] o.a.s.c.a.NodeAddedTrigger Running NodeAddedTrigger node_added_trigger2
   [junit4]   2> 3749199 DEBUG (ScheduledTrigger-10210-thread-3) [    ] o.a.s.c.a.NodeAddedTrigger Found livenodes: 100
   [junit4]   2> 3749219 DEBUG (ScheduledTrigger-10210-thread-3) [    ] o.a.s.c.a.NodeAddedTrigger Running NodeAddedTrigger node_added_trigger2
   [junit4]   2> 3749219 DEBUG (ScheduledTrigger-10210-thread-3) [    ] o.a.s.c.a.NodeAddedTrigger Found livenodes: 100
   [junit4]   2> 3749235 DEBUG (ScheduledTrigger-10210-thread-3) [    ] o.a.s.c.a.NodeAddedTrigger Running NodeAddedTrigger node_added_trigger2
   [junit4]   2> 3749235 DEBUG (ScheduledTrigger-10210-thread-3) [    ] o.a.s.c.a.NodeAddedTrigger Found livenodes: 100
   [junit4]   2> 3749256 DEBUG (ScheduledTrigger-10210-thread-3) [    ] o.a.s.c.a.NodeAddedTrigger Running NodeAddedTrigger node_added_trigger2
   [junit4]   2> 3749256 DEBUG (ScheduledTrigger-10210-thread-3) [    ] o.a.s.c.a.NodeAddedTrigger Found livenodes: 100
   [junit4]   2> 3749272 DEBUG (ScheduledTrigger-10210-thread-2) [    ] o.a.s.c.a.NodeAddedTrigger Running NodeAddedTrigger node_added_trigger2
   [junit4]   2> 3749272 DEBUG (ScheduledTrigger-10210-thread-2) [    ] o.a.s.c.a.NodeAddedTrigger Found livenodes: 100
   [junit4]   2> 3749292 DEBUG (ScheduledTrigger-10210-thread-2) [    ] o.a.s.c.a.NodeAddedTrigger Running NodeAddedTrigger node_added_trigger2
   [junit4]   2> 3749292 DEBUG (ScheduledTrigger-10210-thread-2) [    ] o.a.s.c.a.NodeAddedTrigger Found livenodes: 100
   [junit4]   2> 3749438 DEBUG (ScheduledTrigger-10210-thread-2) [    ] o.a.s.c.a.NodeAddedTrigger Running NodeAddedTrigger node_added_trigger2
   [junit4]   2> 3749438 DEBUG (ScheduledTrigger-10210-thread-2) [    ] o.a.s.c.a.NodeAddedTrigger Found livenodes: 100
   [junit4]   2> 3749458 DEBUG (ScheduledTrigger-10210-thread-1) [    ] o.a.s.c.a.NodeAddedTrigger Running NodeAddedTrigger node_added_trigger2
   [junit4]   2> 3749458 DEBUG (ScheduledTrigger-10210-thread-1) [    ] o.a.s.c.a.NodeAddedTrigger Found livenodes: 100
   [junit4]   2> 3749474 DEBUG (ScheduledTrigger-10210-thread-3) [    ] o.a.s.c.a.NodeAddedTrigger Running NodeAddedTrigger node_added_trigger2
   [junit4]   2> 3749474 DEBUG (ScheduledTrigger-10210-thread-3) [    ] o.a.s.c.a.NodeAddedTrigger Found livenodes: 100
   [junit4]   2> 3749491 DEBUG (ScheduledTrigger-10210-thread-3) [    ] o.a.s.c.a.NodeAddedTrigger Running NodeAddedTrigger node_added_trigger2
   [junit4]   2> 3749491 DEBUG (ScheduledTrigger-10210-thread-3) [    ] o.a.s.c.a.NodeAddedTrigger Found livenodes: 100
   [junit4]   2> 3749511 DEBUG (ScheduledTrigger-10210-thread-3) [    ] o.a.s.c.a.NodeAddedTrigger Running NodeAddedTrigger node_added_trigger2
   [junit4]   2> 3749511 DEBUG (ScheduledTrigger-10210-thread-3) [    ] o.a.s.c.a.NodeAddedTrigger Found livenodes: 100
   [junit4]   2> 3749527 DEBUG (ScheduledTrigger-10210-thread-3) [    ] o.a.s.c.a.NodeAddedTrigger Running NodeAddedTrigger node_added_trigger2
   [junit4]   2> 3749527 DEBUG (ScheduledTrigger-10210-thread-3) [    ] o.a.s.c.a.NodeAddedTrigger Found livenodes: 100
   [junit4]   2> 3749547 DEBUG (ScheduledTrigger-10210-thread-3) [    ] o.a.s.c.a.NodeAddedTrigger Running NodeAddedTrigger node_added_trigger2
   [junit4]   2> 3749547 DEBUG (ScheduledTrigger-10210-thread-3) [    ] o.a.s.c.a.NodeAddedTrigger Found livenodes: 100
   [junit4]   2> 3749564 DEBUG (ScheduledTrigger-10210-thread-3) [    ] o.a.s.c.a.NodeAddedTrigger Running NodeAddedTrigger node_added_trigger2
   [junit4]   2> 3749564 DEBUG (ScheduledTrigger-10210-thread-3) [    ] o.a.s.c.a.NodeAddedTrigger Found livenodes: 100
   [junit4]   2> 3749584 DEBUG (ScheduledTrigger-10210-thread-3) [    ] o.a.s.c.a.NodeAddedTrigger Running NodeAddedTrigger node_added_trigger2
   [junit4]   2> 3749584 DEBUG (ScheduledTrigger-10210-thread-3) [    ] o.a.s.c.a.NodeAddedTrigger Found livenodes: 100
   [junit4]   2> 3749600 DEBUG (ScheduledTrigger-10210-thread-3) [    ] o.a.s.c.a.NodeAddedTrigger Running NodeAddedTrigger node_added_trigger2
   [junit4]   2> 3749600 DEBUG (ScheduledTrigger-10210-thread-3) [    ] o.a.s.c.a.NodeAddedTrigger Found livenodes: 100
   [junit4]   2> 3749620 DEBUG (ScheduledTrigger-10210-thread-3) [    ] o.a.s.c.a.NodeAddedTrigger Running NodeAddedTrigger node_added_trigger2
   [junit4]   2> 3749620 DEBUG (ScheduledTrigger-10210-thread-3) [    ] o.a.s.c.a.NodeAddedTrigger Found livenodes: 100
   [junit4]   2> 3749636 DEBUG (ScheduledTrigger-10210-thread-3) [    ] o.a.s.c.a.NodeAddedTrigger Running NodeAddedTrigger node_added_trigger2
   [junit4]   2> 3749637 DEBUG (ScheduledTrigger-10210-thread-3) [    ] o.a.s.c.a.NodeAddedTrigger Found livenodes: 100
   [junit4]   2> 3749657 DEBUG (ScheduledTrigger-10210-thread-3) [    ] o.a.s.c.a.NodeAddedTrigger Running NodeAddedTrigger node_added_trigger2
   [junit4]   2> 3749657 DEBUG (ScheduledTrigger-10210-thread-3) [    ] o.a.s.c.a.NodeAddedTrigger Found livenodes: 100
   [junit4]   2> 3749673 DEBUG (ScheduledTrigger-10210-thread-3) [    ] o.a.s.c.a.NodeAddedTrigger Running NodeAddedTrigger node_added_trigger2
   [junit4]   2> 3749673 DEBUG (ScheduledTrigger-10210-thread-3) [    ] o.a.s.c.a.NodeAddedTrigger Found livenodes: 100
   [junit4]   2> 3749693 DEBUG (ScheduledTrigger-10210-thread-3) [    ] o.a.s.c.a.NodeAddedTrigger Running NodeAddedTrigger node_added_trigger2
   [junit4]   2> 3749693 DEBUG (ScheduledTrigger-10210-thread-3) [    ] o.a.s.c.a.NodeAddedTrigger Found livenodes: 100
   [junit4]   2> 3749714 DEBUG (ScheduledTrigger-10210-thread-3) [    ] o.a.s.c.a.NodeAddedTrigger Running NodeAddedTrigger node_added_trigger2
   [junit4]   2> 3749714 DEBUG (ScheduledTrigger-10210-thread-3) [    ] o.a.s.c.a.NodeAddedTrigger Found livenodes: 100
   [junit4]   2> 3749734 DEBUG (ScheduledTrigger-10210-thread-3) [    ] o.a.s.c.a.NodeAddedTrigger Running NodeAddedTrigger node_added_trigger2
   [junit4]   2> 3749734 DEBUG (ScheduledTrigger-10210-thread-3) [    ] o.a.s.c.a.NodeAddedTrigger Found livenodes: 100
   [junit4]   2> 3749750 DEBUG (ScheduledTrigger-10210-thread-3) [    ] o.a.s.c.a.NodeAddedTrigger Running NodeAddedTrigger node_added_trigger2
   [junit4]   2> 3749750 DEBUG (ScheduledTrigger-10210-thread-3) [    ] o.a.s.c.a.NodeAddedTrigger Found livenodes: 100
   [junit4]   2> 3749766 DEBUG (ScheduledTrigger-10210-thread-4) [    ] o.a.s.c.a.NodeAddedTrigger Running NodeAddedTrigger node_added_trigger2
   [junit4]   2> 3749766 DEBUG (ScheduledTrigger-10210-thread-4) [    ] o.a.s.c.a.NodeAddedTrigger Found livenodes: 100
   [junit4]   2> 3749790 DEBUG (ScheduledTrigger-10210-thread-4) [    ] o.a.s.c.a.NodeAddedTrigger Running NodeAddedTrigger node_added_trigger2
   [junit4]   2> 3749790 DEBUG (ScheduledTrigger-10210-thread-4) [    ] o.a.s.c.a.NodeAddedTrigger Found livenodes: 100
   [junit4]   2> 3749916 DEBUG (ScheduledTrigger-10210-thread-4) [    ] o.a.s.c.a.NodeAddedTrigger Running NodeAddedTrigger node_added_trigger2
   [junit4]   2> 3749916 DEBUG (ScheduledTrigger-10210-thread-4) [    ] o.a.s.c.a.NodeAddedTrigger Found livenodes: 100
   [junit4]   2> 3749928 DEBUG (ScheduledTrigger-10210-thread-2) [    ] o.a.s.c.a.NodeAddedTrigger Running NodeAddedTrigger node_added_trigger2
   [junit4]   2> 3749928 DEBUG (ScheduledTrigger-10210-thread-2) [    ] o.a.s.c.a.NodeAddedTrigger Found livenodes: 100
   [junit4]   2> 3749944 DEBUG (ScheduledTrigger-10210-thread-2) [    ] o.a.s.c.a.NodeAddedTrigger Running NodeAddedTrigger node_added_trigger2
   [junit4]   2> 3749944 DEBUG (ScheduledTrigger-10210-thread-2) [    ] o.a.s.c.a.NodeAddedTrigger Found livenodes: 100
   [junit4]   2> 3749965 DEBUG (ScheduledTrigger-10210-thread-2) [    ] o.a.s.c.a.NodeAddedTrigger Running NodeAddedTrigger node_added_trigger2
   [junit4]   2> 3749965 DEBUG (ScheduledTrigger-10210-thread-2) [    ] o.a.s.c.a.NodeAddedTrigger Found livenodes: 100
   [junit4]   2> 3749985 DEBUG (ScheduledTrigger-10210-thread-2) [    ] o.a.s.c.a.NodeAddedTrigger Running NodeAddedTrigger node_added_trigger2
   [junit4]   2> 3749985 DEBUG (ScheduledTrigger-10210-thread-2) [    ] o.a.s.c.a.NodeAddedTrigger Found livenodes: 100
   [junit4]   2> 3750013 DEBUG (ScheduledTrigger-10210-thread-2) [    ] o.a.s.c.a.NodeAddedTrigger Running NodeAddedTrigger node_added_trigger2
   [junit4]   2> 3750013 DEBUG (ScheduledTrigger-10210-thread-2) [    ] o.a.s.c.a.NodeAddedTrigger Found livenodes: 100
   [junit4]   2> 3750029 DEBUG (ScheduledTrigger-10210-thread-2) [    ] o.a.s.c.a.NodeAddedTrigger Running NodeAddedTrigger node_added_trigger2
   [junit4]   2> 3750030 DEBUG (ScheduledTrigger-10210-thread-2) [    ] o.a.s.c.a.NodeAddedTrigger Found livenodes: 100
   [junit4]   2> 3750051 DEBUG (ScheduledTrigger-10210-thread-2) [    ] o.a.s.c.a.NodeAddedTrigger Running NodeAddedTrigger node_added_trigger2
   [junit4]   2> 3750051 DEBUG (ScheduledTrigger-10210-thread-2) [    ] o.a.s.c.a.NodeAddedTrigger Found livenodes: 100
   [junit4]   2> 3750074 DEBUG (ScheduledTrigger-10210-thread-2) [    ] o.a.s.c.a.NodeAddedTrigger Running NodeAddedTrigger node_added_trigger2
   [junit4]   2> 3750074 DEBUG (ScheduledTrigger-10210-thread-2) [    ] o.a.s.c.a.NodeAddedTrigger Found livenodes: 100
   [junit4]   2> 3750108 DEBUG (ScheduledTrigger-10210-thread-2) [    ] o.a.s.c.a.NodeAddedTrigger Running NodeAddedTrigger node_added_trigger2
   [junit4]   2> 3750108 DEBUG (ScheduledTrigger-10210-thread-2) [    ] o.a.s.c.a.NodeAddedTrigger Found livenodes: 100
   [junit4]   2> 3750123 DEBUG (ScheduledTrigger-10210-thread-2) [    ] o.a.s.c.a.NodeAddedTrigger Running NodeAddedTrigger node_added_trigger2
   [junit4]   2> 3750123 DEBUG (ScheduledTrigger-10210-thread-2) [    ] o.a.s.c.a.NodeAddedTrigger Found livenodes: 100
   [junit4]   2> 3750139 DEBUG (ScheduledTrigger-10210-thread-2) [    ] o.a.s.c.a.NodeAddedTrigger Running NodeAddedTrigger node_added_trigger2
   [junit4]   2> 3750139 DEBUG (ScheduledTrigger-10210-thread-2) [    ] o.a.s.c.a.NodeAddedTrigger Found livenodes: 100
   [junit4]   2> 3750159 DEBUG (ScheduledTrigger-10210-thread-2) [    ] o.a.s.c.a.NodeAddedTrigger Running NodeAddedTrigger node_added_trigger2
   [junit4]   2> 3750159 DEBUG (ScheduledTrigger-10210-thread-2) [    ] o.a.s.c.a.NodeAddedTrigger Found livenodes: 100
   [junit4]   2> 3750175 DEBUG (ScheduledTrigger-10210-thread-2) [    ] o.a.s.c.a.NodeAddedTrigger Running NodeAddedTrigger node_added_trigger2
   [junit4]   2> 3750176 DEBUG (ScheduledTrigger-10210-thread-2) [    ] o.a.s.c.a.NodeAddedTrigger Found livenodes: 100
   [junit4]   2> 3750196 DEBUG (ScheduledTrigger-10210-thread-2) [    ] o.a.s.c.a.NodeAddedTrigger Running NodeAddedTrigger node_added_trigger2
   [junit4]   2> 3750196 DEBUG (ScheduledTrigger-10210-thread-2) [    ] o.a.s.c.a.NodeAddedTrigger Found livenodes: 100
   [junit4]   2> 3750212 DEBUG (ScheduledTrigger-10210-thread-2) [    ] o.a.s.c.a.NodeAddedTrigger Running NodeAddedTrigger node_added_trigger2
   [junit4]   2> 3750212 DEBUG (ScheduledTrigger-10210-thread-2) [    ] o.a.s.c.a.NodeAddedTrigger Found livenodes: 100
   [junit4]   2> 3750232 DEBUG (ScheduledTrigger-10210-thread-2) [    ] o.a.s.c.a.NodeAddedTrigger Running NodeAddedTrigger node_added_trigger2
   [junit4]   2> 3750232 DEBUG (ScheduledTrigger-10210-thread-2) [    ] o.a.s.c.a.NodeAddedTrigger Found livenodes: 100
   [junit4]   2> 3750249 DEBUG (ScheduledTrigger-10210-thread-2) [    ] o.a.s.c.a.NodeAddedTrigger Running NodeAddedTrigger node_added_trigger2
   [junit4]   2> 3750249 DEBUG (ScheduledTrigger-10210-thread-2) [    ] o.a.s.c.a.NodeAddedTrigger Found livenodes: 100
   [junit4]   2> 3750269 DEBUG (ScheduledTrigger-10210-thread-2) [    ] o.a.s.c.a.NodeAddedTrigger Running NodeAddedTrigger node_added_trigger2
   [junit4]   2> 3750269 DEBUG (ScheduledTrigger-10210-thread-2) [    ] o.a.s.c.a.NodeAddedTrigger Found livenodes: 100
   [junit4]   2> 3750279 DEBUG (ScheduledTrigger-10210-thread-2) [    ] o.a.s.c.a.NodeAddedTrigger Running NodeAddedTrigger node_added_trigger2
   [junit4]   2> 3750279 DEBUG (ScheduledTrigger-10210-thread-2) [    ] o.a.s.c.a.NodeAddedTrigger Found livenodes: 100
   [junit4]   2> 3750293 DEBUG (ScheduledTrigger-10210-thread-2) [    ] o.a.s.c.a.NodeAddedTrigger Running NodeAddedTrigger node_added_trigger2
   [junit4]   2> 3750293 DEBUG (ScheduledTrigger-10210-thread-2) [    ] o.a.s.c.a.NodeAddedTrigger Found livenodes: 100
   [junit4]   2> 3750309 DEBUG (ScheduledTrigger-10210-thread-2) [    ] o.a.s.c.a.NodeAddedTrigger Running NodeAddedTrigger node_added_trigger2
   [junit4]   2> 3750309 DEBUG (ScheduledTrigger-10210-thread-2) [    ] o.a.s.c.a.NodeAddedTrigger Found livenodes: 100
   [junit4]   2> 3750329 DEBUG (ScheduledTrigger-10210-thread-2) [    ] o.a.s.c.a.NodeAddedTrigger Running NodeAddedTrigger node_added_trigger2
   [junit4]   2> 3750329 DEBUG (ScheduledTrigger-10210-thread-2) [    ] o.a.s.c.a.NodeAddedTrigger Found livenodes: 100
   [junit4]   2> 3750345 DEBUG (ScheduledTrigger-10210-thread-2) [    ] o.a.s.c.a.NodeAddedTrigger Running NodeAddedTrigger node_added_trigger2
   [junit4]   2> 3750346 DEBUG (ScheduledTrigger-10210-thread-2) [    ] o.a.s.c.a.NodeAddedTrigger Found livenodes: 100
   [junit4]   2> 3750366 DEBUG (ScheduledTrigger-10210-thread-2) [    ] o.a.s.c.a.NodeAddedTrigger Running NodeAddedTrigger node_added_trigger2
   [junit4]   2> 3750366 DEBUG (ScheduledTrigger-10210-thread-2) [    ] o.a.s.c.a.NodeAddedTrigger Found livenodes: 100
   [junit4]   2> 3750382 DEBUG (ScheduledTrigger-10210-thread-2) [    ] o.a.s.c.a.NodeAddedTrigger Running NodeAddedTrigger node_added_trigger2
   [junit4]   2> 3750382 DEBUG (ScheduledTrigger-10210-thread-2) [    ] o.a.s.c.a.NodeAddedTrigger Found livenodes: 100
   [junit4]   2> 3750402 DEBUG (ScheduledTrigger-10210-thread-2) [    ] o.a.s.c.a.NodeAddedTrigger Running NodeAddedTrigger node_added_trigger2
   [junit4]   2> 3750402 DEBUG (ScheduledTrigger-10210-thread-2) [    ] o.a.s.c.a.NodeAddedTrigger Found livenodes: 100
   [junit4]   2> 3750419 DEBUG (ScheduledTrigger-10210-thread-2) [    ] o.a.s.c.a.NodeAddedTrigger Running NodeAddedTrigger node_added_trigger2
   [junit4]   2> 3750419 DEBUG (ScheduledTrigger-10210-thread-2) [    ] o.a.s.c.a.NodeAddedTrigger Found livenodes: 100
   [junit4]   2> 3750439 DEBUG (ScheduledTrigger-10210-thread-2) [    ] o.a.s.c.a.NodeAddedTrigger Running NodeAddedTrigger node_added_trigger2
   [junit4]   2> 3750439 DEBUG (ScheduledTrigger-10210-thread-2) [    ] o.a.s.c.a.NodeAddedTrigger Found livenodes: 100
   [junit4]   2> 3750475 DEBUG (ScheduledTrigger-10210-thread-2) [    ] o.a.s.c.a.NodeAddedTrigger Running NodeAddedTrigger node_added_trigger2
   [junit4]   2> 3750475 DEBUG (ScheduledTrigger-10210-thread-2) [    ] o.a.s.c.a.NodeAddedTrigger Found livenodes: 100
   [junit4]   2> 3750491 DEBUG (ScheduledTrigger-10210-thread-2) [    ] o.a.s.c.a.NodeAddedTrigger Running NodeAddedTrigger node_added_trigger2
   [junit4]   2> 3750491 DEBUG (ScheduledTrigger-10210-thread-2) [    ] o.a.s.c.a.NodeAddedTrigger Found livenodes: 100
   [junit4]   2> 3750512 DEBUG (ScheduledTrigger-10210-thread-2) [    ] o.a.s.c.a.NodeAddedTrigger Running NodeAddedTrigger node_added_trigger2
   [junit4]   2> 3750512 DEBUG (ScheduledTrigger-10210-thread-2) [    ] o.a.s.c.a.NodeAddedTrigger Found livenodes: 100
   [junit4]   2> 3750528 DEBUG (ScheduledTrigger-10210-thread-2) [    ] o.a.s.c.a.NodeAddedTrigger Running NodeAddedTrigger node_added_trigger2
   [junit4]   2> 3750528 DEBUG (ScheduledTrigger-10210-thread-2) [    ] o.a.s.c.a.NodeAddedTrigger Found livenodes: 100
   [junit4]   2> 3750548 DEBUG (ScheduledTrigger-10210-thread-2) [    ] o.a.s.c.a.NodeAddedTrigger Running NodeAddedTrigger node_added_trigger2
   [junit4]   2> 3750548 DEBUG (ScheduledTrigger-10210-thread-2) [    ] o.a.s.c.a.NodeAddedTrigger Found livenodes: 100
   [junit4]   2> 3750564 DEBUG (ScheduledTrigger-10210-thread-2) [    ] o.a.s.c.a.NodeAddedTrigger Running NodeAddedTrigger node_added_trigger2
   [junit4]   2> 3750564 DEBUG (ScheduledTrigger-10210-thread-2) [    ] o.a.s.c.a.NodeAddedTrigger Found livenodes: 100
   [junit4]   2> 3750585 DEBUG (ScheduledTrigger-10210-thread-2) [    ] o.a.s.c.a.NodeAddedTrigger Running NodeAddedTrigger node_added_trigger2
   [junit4]   2> 3750585 DEBUG (ScheduledTrigger-10210-thread-2) [    ] o.a.s.c.a.NodeAddedTrigger Found livenodes: 100
   [junit4]   2> 3750605 DEBUG (ScheduledTrigger-10210-thread-2) [    ] o.a.s.c.a.NodeAddedTrigger Running NodeAddedTrigger node_added_trigger2
   [junit4]   2> 3750605 DEBUG (ScheduledTrigger-10210-thread-2) [    ] o.a.s.c.a.NodeAddedTrigger Found livenodes: 100
   [junit4]   2> 3750625 DEBUG (ScheduledTrigger-10210-thread-2) [    ] o.a.s.c.a.NodeAddedTrigger Running NodeAddedTrigger node_added_trigger2
   [junit4]   2> 3750625 DEBUG (ScheduledTrigger-10210-thread-2) [    ] o.a.s.c.a.NodeAddedTrigger Found livenodes: 100
   [junit4]   2> 3750641 DEBUG (ScheduledTrigger-10210-thread-2) [    ] o.a.s.c.a.NodeAddedTrigger Running NodeAddedTrigger node_added_trigger2
   [junit4]   2> 3750641 DEBUG (ScheduledTrigger-10210-thread-2) [    ] o.a.s.c.a.NodeAddedTrigger Found livenodes: 100
   [junit4]   2> 3750664 DEBUG (ScheduledTrigger-10210-thread-2) [    ] o.a.s.c.a.NodeAddedTrigger Running NodeAddedTrigger node_added_trigger2
   [junit4]   2> 3750664 DEBUG (ScheduledTrigger-10210-thread-2) [    ] o.a.s.c.a.NodeAddedTrigger Found livenodes: 100
   [junit4]   2> 3750678 DEBUG (ScheduledTrigger-10210-thread-2) [    ] o.a.s.c.a.NodeAddedTrigger Running NodeAddedTrigger node_added_trigger2
   [junit4]   2> 3750678 DEBUG (ScheduledTrigger-10210-thread-2) [    ] o.a.s.c.a.NodeAddedTrigger Found livenodes: 100
   [junit4]   2> 3750698 DEBUG (ScheduledTrigger-10210-thread-2) [    ] o.a.s.c.a.NodeAddedTrigger Running NodeAddedTrigger node_added_trigger2
   [junit4]   2> 3750698 DEBUG (ScheduledTrigger-10210-thread-2) [    ] o.a.s.c.a.NodeAddedTrigger Found livenodes: 100
   [junit4]   2> 3750714 DEBUG (ScheduledTrigger-10210-thread-2) [    ] o.a.s.c.a.NodeAddedTrigger Running NodeAddedTrigger node_added_trigger2
   [junit4]   2> 3750714 DEBUG (ScheduledTrigger-10210-thread-2) [    ] o.a.s.c.a.NodeAddedTrigger Found livenodes: 100
   [junit4]   2> 3750734 DEBUG (ScheduledTrigger-10210-thread-2) [    ] o.a.s.c.a.NodeAddedTrigger Running NodeAddedTrigger node_added_trigger2
   [junit4]   2> 3750734 DEBUG (ScheduledTrigger-10210-thread-2) [    ] o.a.s.c.a.NodeAddedTrigger Found livenodes: 100
   [junit4]   2> 3750751 DEBUG (ScheduledTrigger-10210-thread-2) [    ] o.a.s.c.a.NodeAddedTrigger Running NodeAddedTrigger node_added_trigger2
   [junit4]   2> 3750751 DEBUG (ScheduledTrigger-10210-thread-2) [    ] o.a.s.c.a.NodeAddedTrigger Found livenodes: 100
   [junit4]   2> 3750771 DEBUG (ScheduledTrigger-10210-thread-2) [    ] o.a.s.c.a.NodeAddedTrigger Running NodeAddedTrigger node_added_trigger2
   [junit4]   2> 3750771 DEBUG (ScheduledTrigger-10210-thread-2) [    ] o.a.s.c.a.NodeAddedTrigger Found livenodes: 100
   [junit4]   2> 3750787 DEBUG (ScheduledTrigger-10210-thread-2) [    ] o.a.s.c.a.NodeAddedTrigger Running NodeAddedTrigger node_added_trigger2
   [junit4]   2> 3750787 DEBUG (ScheduledTrigger-10210-thread-2) [    ] o.a.s.c.a.NodeAddedTrigger Found livenodes: 100
   [junit4]   2> 3750807 DEBUG (ScheduledTrigger-10210-thread-2) [    ] o.a.s.c.a.NodeAddedTrigger Running NodeAddedTrigger node_added_trigger2
   [junit4]   2> 3750807 DEBUG (ScheduledTrigger-10210-thread-2) [    ] o.a.s.c.a.NodeAddedTrigger Found livenodes: 100
   [junit4]   2> 3750828 DEBUG (ScheduledTrigger-10210-thread-2) [    ] o.a.s.c.a.NodeAddedTrigger Running NodeAddedTrigger node_added_trigger2
   [junit4]   2> 3750828 DEBUG (ScheduledTrigger-10210-thread-2) [    ] o.a.s.c.a.NodeAddedTrigger Found livenodes: 100
   [junit4]   2> 3750848 DEBUG (ScheduledTrigger-10210-thread-2) [    ] o.a.s.c.a.NodeAddedTrigger Running NodeAddedTrigger node_added_trigger2
   [junit4]   2> 3750848 DEBUG (ScheduledTrigger-10210-thread-2) [    ] o.a.s.c.a.NodeAddedTrigger Found livenodes: 100
   [junit4]   2> 3750864 DEBUG (ScheduledTrigger-10210-thread-2) [    ] o.a.s.c.a.NodeAddedTrigger Running NodeAddedTrigger node_added_trigger2
   [junit4]   2> 3750864 DEBUG (ScheduledTrigger-10210-thread-2) [    ] o.a.s.c.a.NodeAddedTrigger Found livenodes: 100
   [junit4]   2> 3750884 DEBUG (ScheduledTrigger-10210-thread-2) [    ] o.a.s.c.a.NodeAddedTrigger Running NodeAddedTrigger node_added_trigger2
   [junit4]   2> 3750884 DEBUG (ScheduledTrigger-10210-thread-2) [    ] o.a.s.c.a.NodeAddedTrigger Found livenodes: 100
   [junit4]   2> 3750895 DEBUG (ScheduledTrigger-10210-thread-2) [    ] o.a.s.c.a.NodeAddedTrigger Running NodeAddedTrigger node_added_trigger2
   [junit4]   2> 3750895 DEBUG (ScheduledTrigger-10210-thread-2) [    ] o.a.s.c.a.NodeAddedTrigger Found livenodes: 100
   [junit4]   2> 3750925 DEBUG (ScheduledTrigger-10210-thread-2) [    ] o.a.s.c.a.NodeAddedTrigger Running NodeAddedTrigger node_added_trigger2
   [junit4]   2> 3750925 DEBUG (ScheduledTrigger-10210-thread-2) [    ] o.a.s.c.a.NodeAddedTrigger Found livenodes: 100
   [junit4]   2> 3750941 DEBUG (ScheduledTrigger-10210-thread-2) [    ] o.a.s.c.a.NodeAddedTrigger Running NodeAddedTrigger node_added_trigger2
   [junit4]   2> 3750941 DEBUG (ScheduledTrigger-10210-thread-2) [    ] o.a.s.c.a.NodeAddedTrigger Found livenodes: 100
   [junit4]   2> 3750952 DEBUG (ScheduledTrigger-10210-thread-2) [    ] o.a.s.c.a.NodeAddedTrigger Running NodeAddedTrigger node_added_trigger2
   [junit4]   2> 3750952 DEBUG (ScheduledTrigger-10210-thread-2) [    ] o.a.s.c.a.NodeAddedTrigger Found livenodes: 100
   [junit4]   2> 3750986 DEBUG (ScheduledTrigger-10210-thread-2) [    ] o.a.s.c.a.NodeAddedTrigger Running NodeAddedTrigger node_added_trigger2
   [junit4]   2> 3750986 DEBUG (ScheduledTrigger-10210-thread-2) [    ] o.a.s.c.a.NodeAddedTrigger Found livenodes: 100
   [junit4]   2> 3751002 DEBUG (ScheduledTrigger-10210-thread-2) [    ] o.a.s.c.a.NodeAddedTrigger Running NodeAddedTrigger node_added_trigger2
   [junit4]   2> 3751002 DEBUG (ScheduledTrigger-10210-thread-2) [    ] o.a.s.c.a.NodeAddedTrigger Found livenodes: 100
   [junit4]   2> 3751022 DEBUG (ScheduledTrigger-10210-thread-2) [    ] o.a.s.c.a.NodeAddedTrigger Running NodeAddedTrigger node_added_trigger2
   [junit4]   2> 3751022 DEBUG (ScheduledTrigger-10210-thread-2) [    ] o.a.s.c.a.NodeAddedTrigger Found livenodes: 100
   [junit4]   2> 3751038 DEBUG (ScheduledTrigger-10210-thread-2) [    ] o.a.s.c.a.NodeAddedTrigger Running NodeAddedTrigger node_added_trigger2
   [junit4]   2> 3751038 DEBUG (ScheduledTrigger-10210-thread-2) [    ] o.a.s.c.a.NodeAddedTrigger Found livenodes: 100
   [junit4]   2> 3751059 DEBUG (ScheduledTrigger-10210-thread-2) [    ] o.a.s.c.a.NodeAddedTrigger Running NodeAddedTrigger node_added_trigger2
   [junit4]   2> 3751219 DEBUG (ScheduledTrigger-10210-thread-2) [    ] o.a.s.c.a.NodeAddedTrigger Found livenodes: 100
   [junit4]   2> 3751233 DEBUG (ScheduledTrigger-10210-thread-3) [    ] o.a.s.c.a.NodeAddedTrigger Running NodeAddedTrigger node_added_trigger2
   [junit4]   2> 3751233 DEBUG (ScheduledTrigger-10210-thread-3) [    ] o.a.s.c.a.NodeAddedTrigger Found livenodes: 100
   [junit4]   2> 3751245 DEBUG (ScheduledTrigger-10210-thread-4) [    ] o.a.s.c.a.NodeAddedTrigger Running NodeAddedTrigger node_added_trigger2
   [junit4]   2> 3751245 DEBUG (ScheduledTrigger-10210-thread-4) [    ] o.a.s.c.a.NodeAddedTrigger Found livenodes: 100
   [junit4]   2> 3751261 DEBUG (ScheduledTrigger-10210-thread-1) [    ] o.a.s.c.a.NodeAddedTrigger Running NodeAddedTrigger node_added_trigger2
   [junit4]   2> 3751261 DEBUG (ScheduledTrigger-10210-thread-1) [    ] o.a.s.c.a.NodeAddedTrigger Found livenodes: 100
   [junit4]   2> 3751281 DEBUG (ScheduledTrigger-10210-thread-4) [    ] o.a.s.c.a.NodeAddedTrigger Running NodeAddedTrigger node_added_trigger2
   [junit4]   2> 3751281 DEBUG (ScheduledTrigger-10210-thread-4) [    ] o.a.s.c.a.NodeAddedTrigger Found livenodes: 100
   [junit4]   2> 3751298 DEBUG (ScheduledTrigger-10210-thread-1) [    ] o.a.s.c.a.NodeAddedTrigger Running NodeAddedTrigger node_added_trigger2
   [junit4]   2> 3751298 DEBUG (ScheduledTrigger-10210-thread-1) [    ] o.a.s.c.a.NodeAddedTrigger Found livenodes: 100
   [junit4]   2> 3751318 DEBUG (ScheduledTrigger-10210-thread-4) [    ] o.a.s.c.a.NodeAddedTrigger Running NodeAddedTrigger node_added_trigger2
   [junit4]   2> 3751318 DEBUG (ScheduledTrigger-10210-thread-4) [    ] o.a.s.c.a.NodeAddedTrigger Found livenodes: 100
   [junit4]   2> 3751334 DEBUG (ScheduledTrigger-10210-thread-1) [    ] o.a.s.c.a.NodeAddedTrigger Running NodeAddedTrigger node_added_trigger2
   [junit4]   2> 3751334 DEBUG (ScheduledTrigger-10210-thread-1) [    ] o.a.s.c.a.NodeAddedTrigger Found livenodes: 100
   [junit4]   2> 3751354 DEBUG (ScheduledTrigger-10210-thread-4) [    ] o.a.s.c.a.NodeAddedTrigger Running NodeAddedTrigger node_added_trigger2
   [junit4]   2> 3751354 DEBUG (ScheduledTrigger-10210-thread-4) [    ] o.a.s.c.a.NodeAddedTrigger Found livenodes: 100
   [junit4]   2> 3751370 DEBUG (ScheduledTrigger-10210-thread-1) [    ] o.a.s.c.a.NodeAddedTrigger Running NodeAddedTrigger node_added_trigger2
   [junit4]   2> 3751371 DEBUG (ScheduledTrigger-10210-thread-1) [    ] o.a.s.c.a.NodeAddedTrigger Found livenodes: 100
   [junit4]   2> 3751391 DEBUG (ScheduledTrigger-10210-thread-4) [    ] o.a.s.c.a.NodeAddedTrigger Running NodeAddedTrigger node_added_trigger2
   [junit4]   2> 3751391 DEBUG (ScheduledTrigger-10210-thread-4) [    ] o.a.s.c.a.NodeAddedTrigger Found livenodes: 100
   [junit4]   2> 3751401 DEBUG (ScheduledTrigger-10210-thread-4) [    ] o.a.s.c.a.NodeAddedTrigger Running NodeAddedTrigger node_added_trigger2
   [junit4]   2> 3751401 DEBUG (ScheduledTrigger-10210-thread-4) [    ] o.a.s.c.a.NodeAddedTrigger Found livenodes: 100
   [junit4]   2> 3751420 DEBUG (ScheduledTrigger-10210-thread-4) [    ] o.a.s.c.a.NodeAddedTrigger Running NodeAddedTrigger node_added_trigger2
   [junit4]   2> 3751420 DEBUG (ScheduledTrigger-10210-thread-4) [    ] o.a.s.c.a.NodeAddedTrigger Found livenodes: 100
   [junit4]   2> 3751440 DEBUG (ScheduledTrigger-10210-thread-4) [    ] o.a.s.c.a.NodeAddedTrigger Running NodeAddedTrigger node_added_trigger2
   [junit4]   2> 3751440 DEBUG (ScheduledTrigger-10210-thread-4) [    ] o.a.s.c.a.NodeAddedTrigger Found livenodes: 100
   [junit4]   2> 3751456 DEBUG (ScheduledTrigger-10210-thread-4) [    ] o.a.s.c.a.NodeAddedTrigger Running NodeAddedTrigger node_add

[...truncated too long message...]

ivy-fail-disallowed-ivy-version:

ivy-fail:

ivy-fail:

ivy-configure:
[ivy:configure] :: loading settings :: file = /home/jenkins/jenkins-slave/workspace/Lucene-Solr-Tests-7.7/lucene/top-level-ivy-settings.xml

resolve:

ivy-availability-check:
[loadresource] Do not set property disallowed.ivy.jars.list as its length is 0.

-ivy-fail-disallowed-ivy-version:

ivy-fail:

ivy-configure:
[ivy:configure] :: loading settings :: file = /home/jenkins/jenkins-slave/workspace/Lucene-Solr-Tests-7.7/lucene/top-level-ivy-settings.xml

resolve:

ivy-availability-check:
[loadresource] Do not set property disallowed.ivy.jars.list as its length is 0.

-ivy-fail-disallowed-ivy-version:

ivy-fail:

ivy-fail:

ivy-configure:
[ivy:configure] :: loading settings :: file = /home/jenkins/jenkins-slave/workspace/Lucene-Solr-Tests-7.7/lucene/top-level-ivy-settings.xml

resolve:

ivy-availability-check:
[loadresource] Do not set property disallowed.ivy.jars.list as its length is 0.

-ivy-fail-disallowed-ivy-version:

ivy-fail:

ivy-configure:
[ivy:configure] :: loading settings :: file = /home/jenkins/jenkins-slave/workspace/Lucene-Solr-Tests-7.7/lucene/top-level-ivy-settings.xml

resolve:

ivy-availability-check:
[loadresource] Do not set property disallowed.ivy.jars.list as its length is 0.

-ivy-fail-disallowed-ivy-version:

ivy-fail:

ivy-fail:

ivy-configure:
[ivy:configure] :: loading settings :: file = /home/jenkins/jenkins-slave/workspace/Lucene-Solr-Tests-7.7/lucene/top-level-ivy-settings.xml

resolve:

ivy-availability-check:
[loadresource] Do not set property disallowed.ivy.jars.list as its length is 0.

-ivy-fail-disallowed-ivy-version:

ivy-fail:

ivy-fail:

ivy-configure:
[ivy:configure] :: loading settings :: file = /home/jenkins/jenkins-slave/workspace/Lucene-Solr-Tests-7.7/lucene/top-level-ivy-settings.xml

resolve:

ivy-availability-check:
[loadresource] Do not set property disallowed.ivy.jars.list as its length is 0.

-ivy-fail-disallowed-ivy-version:

ivy-fail:

ivy-fail:

ivy-configure:
[ivy:configure] :: loading settings :: file = /home/jenkins/jenkins-slave/workspace/Lucene-Solr-Tests-7.7/lucene/top-level-ivy-settings.xml

resolve:

ivy-availability-check:
[loadresource] Do not set property disallowed.ivy.jars.list as its length is 0.

-ivy-fail-disallowed-ivy-version:

ivy-fail:

ivy-fail:

ivy-configure:
[ivy:configure] :: loading settings :: file = /home/jenkins/jenkins-slave/workspace/Lucene-Solr-Tests-7.7/lucene/top-level-ivy-settings.xml

resolve:

ivy-availability-check:
[loadresource] Do not set property disallowed.ivy.jars.list as its length is 0.

-ivy-fail-disallowed-ivy-version:

ivy-fail:

ivy-fail:

ivy-configure:
[ivy:configure] :: loading settings :: file = /home/jenkins/jenkins-slave/workspace/Lucene-Solr-Tests-7.7/lucene/top-level-ivy-settings.xml

resolve:

ivy-availability-check:
[loadresource] Do not set property disallowed.ivy.jars.list as its length is 0.

-ivy-fail-disallowed-ivy-version:

ivy-fail:

ivy-fail:

ivy-configure:
[ivy:configure] :: loading settings :: file = /home/jenkins/jenkins-slave/workspace/Lucene-Solr-Tests-7.7/lucene/top-level-ivy-settings.xml

resolve:

ivy-availability-check:
[loadresource] Do not set property disallowed.ivy.jars.list as its length is 0.

-ivy-fail-disallowed-ivy-version:

ivy-fail:

ivy-fail:

ivy-configure:
[ivy:configure] :: loading settings :: file = /home/jenkins/jenkins-slave/workspace/Lucene-Solr-Tests-7.7/lucene/top-level-ivy-settings.xml

resolve:

ivy-availability-check:
[loadresource] Do not set property disallowed.ivy.jars.list as its length is 0.

-ivy-fail-disallowed-ivy-version:

ivy-fail:

ivy-fail:

ivy-configure:
[ivy:configure] :: loading settings :: file = /home/jenkins/jenkins-slave/workspace/Lucene-Solr-Tests-7.7/lucene/top-level-ivy-settings.xml

resolve:

ivy-availability-check:
[loadresource] Do not set property disallowed.ivy.jars.list as its length is 0.

-ivy-fail-disallowed-ivy-version:

ivy-fail:

ivy-fail:

ivy-configure:
[ivy:configure] :: loading settings :: file = /home/jenkins/jenkins-slave/workspace/Lucene-Solr-Tests-7.7/lucene/top-level-ivy-settings.xml

resolve:

ivy-availability-check:
[loadresource] Do not set property disallowed.ivy.jars.list as its length is 0.

-ivy-fail-disallowed-ivy-version:

ivy-fail:

ivy-fail:

ivy-configure:
[ivy:configure] :: loading settings :: file = /home/jenkins/jenkins-slave/workspace/Lucene-Solr-Tests-7.7/lucene/top-level-ivy-settings.xml

resolve:

jar-checksums:
    [mkdir] Created dir: /home/jenkins/jenkins-slave/workspace/Lucene-Solr-Tests-7.7/solr/null1828546341
     [copy] Copying 242 files to /home/jenkins/jenkins-slave/workspace/Lucene-Solr-Tests-7.7/solr/null1828546341
   [delete] Deleting directory /home/jenkins/jenkins-slave/workspace/Lucene-Solr-Tests-7.7/solr/null1828546341

check-working-copy:
[ivy:cachepath] :: resolving dependencies :: org.eclipse.jgit#org.eclipse.jgit-caller;working
[ivy:cachepath] 	confs: [default]
[ivy:cachepath] 	found org.eclipse.jgit#org.eclipse.jgit;4.6.0.201612231935-r in public
[ivy:cachepath] 	found com.jcraft#jsch;0.1.53 in public
[ivy:cachepath] 	found com.googlecode.javaewah#JavaEWAH;1.1.6 in public
[ivy:cachepath] 	found org.apache.httpcomponents#httpclient;4.3.6 in public
[ivy:cachepath] 	found org.apache.httpcomponents#httpcore;4.3.3 in public
[ivy:cachepath] 	found commons-logging#commons-logging;1.1.3 in public
[ivy:cachepath] 	found commons-codec#commons-codec;1.6 in public
[ivy:cachepath] 	found org.slf4j#slf4j-api;1.7.2 in public
[ivy:cachepath] :: resolution report :: resolve 32ms :: artifacts dl 1ms
	---------------------------------------------------------------------
	|                  |            modules            ||   artifacts   |
	|       conf       | number| search|dwnlded|evicted|| number|dwnlded|
	---------------------------------------------------------------------
	|      default     |   8   |   0   |   0   |   0   ||   8   |   0   |
	---------------------------------------------------------------------
[wc-checker] Initializing working copy...
[wc-checker] SLF4J: Failed to load class "org.slf4j.impl.StaticLoggerBinder".
[wc-checker] SLF4J: Defaulting to no-operation (NOP) logger implementation
[wc-checker] SLF4J: See http://www.slf4j.org/codes.html#StaticLoggerBinder for further details.
[wc-checker] Checking working copy status...

-jenkins-base:

BUILD SUCCESSFUL
Total time: 200 minutes 19 seconds
Archiving artifacts
java.lang.InterruptedException: no matches found within 10000
	at hudson.FilePath$ValidateAntFileMask.hasMatch(FilePath.java:2847)
	at hudson.FilePath$ValidateAntFileMask.invoke(FilePath.java:2726)
	at hudson.FilePath$ValidateAntFileMask.invoke(FilePath.java:2707)
	at hudson.FilePath$FileCallableWrapper.call(FilePath.java:3086)
Also:   hudson.remoting.Channel$CallSiteStackTrace: Remote call to lucene2
		at hudson.remoting.Channel.attachCallSiteStackTrace(Channel.java:1741)
		at hudson.remoting.UserRequest$ExceptionResponse.retrieve(UserRequest.java:357)
		at hudson.remoting.Channel.call(Channel.java:955)
		at hudson.FilePath.act(FilePath.java:1072)
		at hudson.FilePath.act(FilePath.java:1061)
		at hudson.FilePath.validateAntFileMask(FilePath.java:2705)
		at hudson.tasks.ArtifactArchiver.perform(ArtifactArchiver.java:243)
		at hudson.tasks.BuildStepCompatibilityLayer.perform(BuildStepCompatibilityLayer.java:81)
		at hudson.tasks.BuildStepMonitor$1.perform(BuildStepMonitor.java:20)
		at hudson.model.AbstractBuild$AbstractBuildExecution.perform(AbstractBuild.java:744)
		at hudson.model.AbstractBuild$AbstractBuildExecution.performAllBuildSteps(AbstractBuild.java:690)
		at hudson.model.Build$BuildExecution.post2(Build.java:186)
		at hudson.model.AbstractBuild$AbstractBuildExecution.post(AbstractBuild.java:635)
		at hudson.model.Run.execute(Run.java:1835)
		at hudson.model.FreeStyleBuild.run(FreeStyleBuild.java:43)
		at hudson.model.ResourceController.execute(ResourceController.java:97)
		at hudson.model.Executor.run(Executor.java:429)
Caused: hudson.FilePath$TunneledInterruptedException
	at hudson.FilePath$FileCallableWrapper.call(FilePath.java:3088)
	at hudson.remoting.UserRequest.perform(UserRequest.java:212)
	at hudson.remoting.UserRequest.perform(UserRequest.java:54)
	at hudson.remoting.Request$2.run(Request.java:369)
	at hudson.remoting.InterceptingExecutorService$1.call(InterceptingExecutorService.java:72)
	at java.util.concurrent.FutureTask.run(FutureTask.java:266)
	at java.util.concurrent.ThreadPoolExecutor.runWorker(ThreadPoolExecutor.java:1142)
	at java.util.concurrent.ThreadPoolExecutor$Worker.run(ThreadPoolExecutor.java:617)
	at java.lang.Thread.run(Thread.java:748)
Caused: java.lang.InterruptedException: java.lang.InterruptedException: no matches found within 10000
	at hudson.FilePath.act(FilePath.java:1074)
	at hudson.FilePath.act(FilePath.java:1061)
	at hudson.FilePath.validateAntFileMask(FilePath.java:2705)
	at hudson.tasks.ArtifactArchiver.perform(ArtifactArchiver.java:243)
	at hudson.tasks.BuildStepCompatibilityLayer.perform(BuildStepCompatibilityLayer.java:81)
	at hudson.tasks.BuildStepMonitor$1.perform(BuildStepMonitor.java:20)
	at hudson.model.AbstractBuild$AbstractBuildExecution.perform(AbstractBuild.java:744)
	at hudson.model.AbstractBuild$AbstractBuildExecution.performAllBuildSteps(AbstractBuild.java:690)
	at hudson.model.Build$BuildExecution.post2(Build.java:186)
	at hudson.model.AbstractBuild$AbstractBuildExecution.post(AbstractBuild.java:635)
	at hudson.model.Run.execute(Run.java:1835)
	at hudson.model.FreeStyleBuild.run(FreeStyleBuild.java:43)
	at hudson.model.ResourceController.execute(ResourceController.java:97)
	at hudson.model.Executor.run(Executor.java:429)
No artifacts found that match the file pattern "**/*.events,heapdumps/**,**/hs_err_pid*". Configuration error?
Recording test results
Build step 'Publish JUnit test result report' changed build result to UNSTABLE
Email was triggered for: Unstable (Test Failures)
Sending email for trigger: Unstable (Test Failures)

Mime
View raw message