lucene-dev mailing list archives

Site index · List index
Message view « Date » · « Thread »
Top « Date » · « Thread »
From Apache Jenkins Server <jenk...@builds.apache.org>
Subject [JENKINS] Lucene-Solr-NightlyTests-8.x - Build # 28 - Still Unstable
Date Fri, 22 Feb 2019 22:19:36 GMT
Build: https://builds.apache.org/job/Lucene-Solr-NightlyTests-8.x/28/

4 tests failed.
FAILED:  junit.framework.TestSuite.org.apache.solr.cloud.ChaosMonkeySafeLeaderWithPullReplicasTest

Error Message:
ObjectTracker found 3 object(s) that were not released!!! [InternalHttpClient, SolrCore, MMapDirectory] org.apache.solr.common.util.ObjectReleaseTracker$ObjectTrackerException: org.apache.http.impl.client.InternalHttpClient  at org.apache.solr.common.util.ObjectReleaseTracker.track(ObjectReleaseTracker.java:42)  at org.apache.solr.client.solrj.impl.HttpClientUtil.createClient(HttpClientUtil.java:321)  at org.apache.solr.client.solrj.impl.HttpClientUtil.createClient(HttpClientUtil.java:330)  at org.apache.solr.handler.IndexFetcher.createHttpClient(IndexFetcher.java:230)  at org.apache.solr.handler.IndexFetcher.<init>(IndexFetcher.java:272)  at org.apache.solr.handler.ReplicationHandler.doFetch(ReplicationHandler.java:420)  at org.apache.solr.cloud.RecoveryStrategy.replicate(RecoveryStrategy.java:237)  at org.apache.solr.cloud.RecoveryStrategy.doReplicateOnlyRecovery(RecoveryStrategy.java:382)  at org.apache.solr.cloud.RecoveryStrategy.doRecovery(RecoveryStrategy.java:328)  at org.apache.solr.cloud.RecoveryStrategy.run(RecoveryStrategy.java:307)  at com.codahale.metrics.InstrumentedExecutorService$InstrumentedRunnable.run(InstrumentedExecutorService.java:176)  at java.util.concurrent.Executors$RunnableAdapter.call(Executors.java:511)  at java.util.concurrent.FutureTask.run(FutureTask.java:266)  at org.apache.solr.common.util.ExecutorUtil$MDCAwareThreadPoolExecutor.lambda$execute$0(ExecutorUtil.java:209)  at java.util.concurrent.ThreadPoolExecutor.runWorker(ThreadPoolExecutor.java:1149)  at java.util.concurrent.ThreadPoolExecutor$Worker.run(ThreadPoolExecutor.java:624)  at java.lang.Thread.run(Thread.java:748)  org.apache.solr.common.util.ObjectReleaseTracker$ObjectTrackerException: org.apache.solr.core.SolrCore  at org.apache.solr.common.util.ObjectReleaseTracker.track(ObjectReleaseTracker.java:42)  at org.apache.solr.core.SolrCore.<init>(SolrCore.java:1062)  at org.apache.solr.core.SolrCore.<init>(SolrCore.java:882)  at org.apache.solr.core.CoreContainer.createFromDescriptor(CoreContainer.java:1189)  at org.apache.solr.core.CoreContainer.create(CoreContainer.java:1099)  at org.apache.solr.handler.admin.CoreAdminOperation.lambda$static$0(CoreAdminOperation.java:92)  at org.apache.solr.handler.admin.CoreAdminOperation.execute(CoreAdminOperation.java:360)  at org.apache.solr.handler.admin.CoreAdminHandler$CallInfo.call(CoreAdminHandler.java:396)  at org.apache.solr.handler.admin.CoreAdminHandler.handleRequestBody(CoreAdminHandler.java:180)  at org.apache.solr.handler.RequestHandlerBase.handleRequest(RequestHandlerBase.java:199)  at org.apache.solr.servlet.HttpSolrCall.handleAdmin(HttpSolrCall.java:736)  at org.apache.solr.servlet.HttpSolrCall.handleAdminRequest(HttpSolrCall.java:717)  at org.apache.solr.servlet.HttpSolrCall.call(HttpSolrCall.java:496)  at org.apache.solr.servlet.SolrDispatchFilter.doFilter(SolrDispatchFilter.java:394)  at org.apache.solr.servlet.SolrDispatchFilter.doFilter(SolrDispatchFilter.java:340)  at org.eclipse.jetty.servlet.ServletHandler$CachedChain.doFilter(ServletHandler.java:1610)  at org.apache.solr.client.solrj.embedded.JettySolrRunner$DebugFilter.doFilter(JettySolrRunner.java:164)  at org.eclipse.jetty.servlet.ServletHandler$CachedChain.doFilter(ServletHandler.java:1610)  at org.eclipse.jetty.servlet.ServletHandler.doHandle(ServletHandler.java:540)  at org.eclipse.jetty.server.handler.ScopedHandler.nextHandle(ScopedHandler.java:255)  at org.eclipse.jetty.server.session.SessionHandler.doHandle(SessionHandler.java:1588)  at org.eclipse.jetty.server.handler.ScopedHandler.nextHandle(ScopedHandler.java:255)  at org.eclipse.jetty.server.handler.ContextHandler.doHandle(ContextHandler.java:1345)  at org.eclipse.jetty.server.handler.ScopedHandler.nextScope(ScopedHandler.java:203)  at org.eclipse.jetty.servlet.ServletHandler.doScope(ServletHandler.java:480)  at org.eclipse.jetty.server.session.SessionHandler.doScope(SessionHandler.java:1557)  at org.eclipse.jetty.server.handler.ScopedHandler.nextScope(ScopedHandler.java:201)  at org.eclipse.jetty.server.handler.ContextHandler.doScope(ContextHandler.java:1247)  at org.eclipse.jetty.server.handler.ScopedHandler.handle(ScopedHandler.java:144)  at org.eclipse.jetty.server.handler.gzip.GzipHandler.handle(GzipHandler.java:703)  at org.eclipse.jetty.server.handler.HandlerWrapper.handle(HandlerWrapper.java:132)  at org.eclipse.jetty.server.Server.handle(Server.java:502)  at org.eclipse.jetty.server.HttpChannel.handle(HttpChannel.java:364)  at org.eclipse.jetty.server.HttpChannel.run(HttpChannel.java:305)  at org.eclipse.jetty.util.thread.QueuedThreadPool.runJob(QueuedThreadPool.java:765)  at org.eclipse.jetty.util.thread.QueuedThreadPool$2.run(QueuedThreadPool.java:683)  at java.lang.Thread.run(Thread.java:748)  org.apache.solr.common.util.ObjectReleaseTracker$ObjectTrackerException: org.apache.lucene.store.MMapDirectory  at org.apache.solr.common.util.ObjectReleaseTracker.track(ObjectReleaseTracker.java:42)  at org.apache.solr.core.CachingDirectoryFactory.get(CachingDirectoryFactory.java:348)  at org.apache.solr.handler.IndexFetcher.fetchLatestIndex(IndexFetcher.java:509)  at org.apache.solr.handler.IndexFetcher.fetchLatestIndex(IndexFetcher.java:351)  at org.apache.solr.handler.ReplicationHandler.doFetch(ReplicationHandler.java:424)  at org.apache.solr.handler.ReplicationHandler.lambda$setupPolling$13(ReplicationHandler.java:1193)  at java.util.concurrent.Executors$RunnableAdapter.call(Executors.java:511)  at java.util.concurrent.FutureTask.runAndReset(FutureTask.java:308)  at java.util.concurrent.ScheduledThreadPoolExecutor$ScheduledFutureTask.access$301(ScheduledThreadPoolExecutor.java:180)  at java.util.concurrent.ScheduledThreadPoolExecutor$ScheduledFutureTask.run(ScheduledThreadPoolExecutor.java:294)  at java.util.concurrent.ThreadPoolExecutor.runWorker(ThreadPoolExecutor.java:1149)  at java.util.concurrent.ThreadPoolExecutor$Worker.run(ThreadPoolExecutor.java:624)  at java.lang.Thread.run(Thread.java:748)   expected null, but was:<ObjectTracker found 3 object(s) that were not released!!! [InternalHttpClient, SolrCore, MMapDirectory] org.apache.solr.common.util.ObjectReleaseTracker$ObjectTrackerException: org.apache.http.impl.client.InternalHttpClient  at org.apache.solr.common.util.ObjectReleaseTracker.track(ObjectReleaseTracker.java:42)  at org.apache.solr.client.solrj.impl.HttpClientUtil.createClient(HttpClientUtil.java:321)  at org.apache.solr.client.solrj.impl.HttpClientUtil.createClient(HttpClientUtil.java:330)  at org.apache.solr.handler.IndexFetcher.createHttpClient(IndexFetcher.java:230)  at org.apache.solr.handler.IndexFetcher.<init>(IndexFetcher.java:272)  at org.apache.solr.handler.ReplicationHandler.doFetch(ReplicationHandler.java:420)  at org.apache.solr.cloud.RecoveryStrategy.replicate(RecoveryStrategy.java:237)  at org.apache.solr.cloud.RecoveryStrategy.doReplicateOnlyRecovery(RecoveryStrategy.java:382)  at org.apache.solr.cloud.RecoveryStrategy.doRecovery(RecoveryStrategy.java:328)  at org.apache.solr.cloud.RecoveryStrategy.run(RecoveryStrategy.java:307)  at com.codahale.metrics.InstrumentedExecutorService$InstrumentedRunnable.run(InstrumentedExecutorService.java:176)  at java.util.concurrent.Executors$RunnableAdapter.call(Executors.java:511)  at java.util.concurrent.FutureTask.run(FutureTask.java:266)  at org.apache.solr.common.util.ExecutorUtil$MDCAwareThreadPoolExecutor.lambda$execute$0(ExecutorUtil.java:209)  at java.util.concurrent.ThreadPoolExecutor.runWorker(ThreadPoolExecutor.java:1149)  at java.util.concurrent.ThreadPoolExecutor$Worker.run(ThreadPoolExecutor.java:624)  at java.lang.Thread.run(Thread.java:748)  org.apache.solr.common.util.ObjectReleaseTracker$ObjectTrackerException: org.apache.solr.core.SolrCore  at org.apache.solr.common.util.ObjectReleaseTracker.track(ObjectReleaseTracker.java:42)  at org.apache.solr.core.SolrCore.<init>(SolrCore.java:1062)  at org.apache.solr.core.SolrCore.<init>(SolrCore.java:882)  at org.apache.solr.core.CoreContainer.createFromDescriptor(CoreContainer.java:1189)  at org.apache.solr.core.CoreContainer.create(CoreContainer.java:1099)  at org.apache.solr.handler.admin.CoreAdminOperation.lambda$static$0(CoreAdminOperation.java:92)  at org.apache.solr.handler.admin.CoreAdminOperation.execute(CoreAdminOperation.java:360)  at org.apache.solr.handler.admin.CoreAdminHandler$CallInfo.call(CoreAdminHandler.java:396)  at org.apache.solr.handler.admin.CoreAdminHandler.handleRequestBody(CoreAdminHandler.java:180)  at org.apache.solr.handler.RequestHandlerBase.handleRequest(RequestHandlerBase.java:199)  at org.apache.solr.servlet.HttpSolrCall.handleAdmin(HttpSolrCall.java:736)  at org.apache.solr.servlet.HttpSolrCall.handleAdminRequest(HttpSolrCall.java:717)  at org.apache.solr.servlet.HttpSolrCall.call(HttpSolrCall.java:496)  at org.apache.solr.servlet.SolrDispatchFilter.doFilter(SolrDispatchFilter.java:394)  at org.apache.solr.servlet.SolrDispatchFilter.doFilter(SolrDispatchFilter.java:340)  at org.eclipse.jetty.servlet.ServletHandler$CachedChain.doFilter(ServletHandler.java:1610)  at org.apache.solr.client.solrj.embedded.JettySolrRunner$DebugFilter.doFilter(JettySolrRunner.java:164)  at org.eclipse.jetty.servlet.ServletHandler$CachedChain.doFilter(ServletHandler.java:1610)  at org.eclipse.jetty.servlet.ServletHandler.doHandle(ServletHandler.java:540)  at org.eclipse.jetty.server.handler.ScopedHandler.nextHandle(ScopedHandler.java:255)  at org.eclipse.jetty.server.session.SessionHandler.doHandle(SessionHandler.java:1588)  at org.eclipse.jetty.server.handler.ScopedHandler.nextHandle(ScopedHandler.java:255)  at org.eclipse.jetty.server.handler.ContextHandler.doHandle(ContextHandler.java:1345)  at org.eclipse.jetty.server.handler.ScopedHandler.nextScope(ScopedHandler.java:203)  at org.eclipse.jetty.servlet.ServletHandler.doScope(ServletHandler.java:480)  at org.eclipse.jetty.server.session.SessionHandler.doScope(SessionHandler.java:1557)  at org.eclipse.jetty.server.handler.ScopedHandler.nextScope(ScopedHandler.java:201)  at org.eclipse.jetty.server.handler.ContextHandler.doScope(ContextHandler.java:1247)  at org.eclipse.jetty.server.handler.ScopedHandler.handle(ScopedHandler.java:144)  at org.eclipse.jetty.server.handler.gzip.GzipHandler.handle(GzipHandler.java:703)  at org.eclipse.jetty.server.handler.HandlerWrapper.handle(HandlerWrapper.java:132)  at org.eclipse.jetty.server.Server.handle(Server.java:502)  at org.eclipse.jetty.server.HttpChannel.handle(HttpChannel.java:364)  at org.eclipse.jetty.server.HttpChannel.run(HttpChannel.java:305)  at org.eclipse.jetty.util.thread.QueuedThreadPool.runJob(QueuedThreadPool.java:765)  at org.eclipse.jetty.util.thread.QueuedThreadPool$2.run(QueuedThreadPool.java:683)  at java.lang.Thread.run(Thread.java:748)  org.apache.solr.common.util.ObjectReleaseTracker$ObjectTrackerException: org.apache.lucene.store.MMapDirectory  at org.apache.solr.common.util.ObjectReleaseTracker.track(ObjectReleaseTracker.java:42)  at org.apache.solr.core.CachingDirectoryFactory.get(CachingDirectoryFactory.java:348)  at org.apache.solr.handler.IndexFetcher.fetchLatestIndex(IndexFetcher.java:509)  at org.apache.solr.handler.IndexFetcher.fetchLatestIndex(IndexFetcher.java:351)  at org.apache.solr.handler.ReplicationHandler.doFetch(ReplicationHandler.java:424)  at org.apache.solr.handler.ReplicationHandler.lambda$setupPolling$13(ReplicationHandler.java:1193)  at java.util.concurrent.Executors$RunnableAdapter.call(Executors.java:511)  at java.util.concurrent.FutureTask.runAndReset(FutureTask.java:308)  at java.util.concurrent.ScheduledThreadPoolExecutor$ScheduledFutureTask.access$301(ScheduledThreadPoolExecutor.java:180)  at java.util.concurrent.ScheduledThreadPoolExecutor$ScheduledFutureTask.run(ScheduledThreadPoolExecutor.java:294)  at java.util.concurrent.ThreadPoolExecutor.runWorker(ThreadPoolExecutor.java:1149)  at java.util.concurrent.ThreadPoolExecutor$Worker.run(ThreadPoolExecutor.java:624)  at java.lang.Thread.run(Thread.java:748)  >

Stack Trace:
java.lang.AssertionError: ObjectTracker found 3 object(s) that were not released!!! [InternalHttpClient, SolrCore, MMapDirectory]
org.apache.solr.common.util.ObjectReleaseTracker$ObjectTrackerException: org.apache.http.impl.client.InternalHttpClient
	at org.apache.solr.common.util.ObjectReleaseTracker.track(ObjectReleaseTracker.java:42)
	at org.apache.solr.client.solrj.impl.HttpClientUtil.createClient(HttpClientUtil.java:321)
	at org.apache.solr.client.solrj.impl.HttpClientUtil.createClient(HttpClientUtil.java:330)
	at org.apache.solr.handler.IndexFetcher.createHttpClient(IndexFetcher.java:230)
	at org.apache.solr.handler.IndexFetcher.<init>(IndexFetcher.java:272)
	at org.apache.solr.handler.ReplicationHandler.doFetch(ReplicationHandler.java:420)
	at org.apache.solr.cloud.RecoveryStrategy.replicate(RecoveryStrategy.java:237)
	at org.apache.solr.cloud.RecoveryStrategy.doReplicateOnlyRecovery(RecoveryStrategy.java:382)
	at org.apache.solr.cloud.RecoveryStrategy.doRecovery(RecoveryStrategy.java:328)
	at org.apache.solr.cloud.RecoveryStrategy.run(RecoveryStrategy.java:307)
	at com.codahale.metrics.InstrumentedExecutorService$InstrumentedRunnable.run(InstrumentedExecutorService.java:176)
	at java.util.concurrent.Executors$RunnableAdapter.call(Executors.java:511)
	at java.util.concurrent.FutureTask.run(FutureTask.java:266)
	at org.apache.solr.common.util.ExecutorUtil$MDCAwareThreadPoolExecutor.lambda$execute$0(ExecutorUtil.java:209)
	at java.util.concurrent.ThreadPoolExecutor.runWorker(ThreadPoolExecutor.java:1149)
	at java.util.concurrent.ThreadPoolExecutor$Worker.run(ThreadPoolExecutor.java:624)
	at java.lang.Thread.run(Thread.java:748)

org.apache.solr.common.util.ObjectReleaseTracker$ObjectTrackerException: org.apache.solr.core.SolrCore
	at org.apache.solr.common.util.ObjectReleaseTracker.track(ObjectReleaseTracker.java:42)
	at org.apache.solr.core.SolrCore.<init>(SolrCore.java:1062)
	at org.apache.solr.core.SolrCore.<init>(SolrCore.java:882)
	at org.apache.solr.core.CoreContainer.createFromDescriptor(CoreContainer.java:1189)
	at org.apache.solr.core.CoreContainer.create(CoreContainer.java:1099)
	at org.apache.solr.handler.admin.CoreAdminOperation.lambda$static$0(CoreAdminOperation.java:92)
	at org.apache.solr.handler.admin.CoreAdminOperation.execute(CoreAdminOperation.java:360)
	at org.apache.solr.handler.admin.CoreAdminHandler$CallInfo.call(CoreAdminHandler.java:396)
	at org.apache.solr.handler.admin.CoreAdminHandler.handleRequestBody(CoreAdminHandler.java:180)
	at org.apache.solr.handler.RequestHandlerBase.handleRequest(RequestHandlerBase.java:199)
	at org.apache.solr.servlet.HttpSolrCall.handleAdmin(HttpSolrCall.java:736)
	at org.apache.solr.servlet.HttpSolrCall.handleAdminRequest(HttpSolrCall.java:717)
	at org.apache.solr.servlet.HttpSolrCall.call(HttpSolrCall.java:496)
	at org.apache.solr.servlet.SolrDispatchFilter.doFilter(SolrDispatchFilter.java:394)
	at org.apache.solr.servlet.SolrDispatchFilter.doFilter(SolrDispatchFilter.java:340)
	at org.eclipse.jetty.servlet.ServletHandler$CachedChain.doFilter(ServletHandler.java:1610)
	at org.apache.solr.client.solrj.embedded.JettySolrRunner$DebugFilter.doFilter(JettySolrRunner.java:164)
	at org.eclipse.jetty.servlet.ServletHandler$CachedChain.doFilter(ServletHandler.java:1610)
	at org.eclipse.jetty.servlet.ServletHandler.doHandle(ServletHandler.java:540)
	at org.eclipse.jetty.server.handler.ScopedHandler.nextHandle(ScopedHandler.java:255)
	at org.eclipse.jetty.server.session.SessionHandler.doHandle(SessionHandler.java:1588)
	at org.eclipse.jetty.server.handler.ScopedHandler.nextHandle(ScopedHandler.java:255)
	at org.eclipse.jetty.server.handler.ContextHandler.doHandle(ContextHandler.java:1345)
	at org.eclipse.jetty.server.handler.ScopedHandler.nextScope(ScopedHandler.java:203)
	at org.eclipse.jetty.servlet.ServletHandler.doScope(ServletHandler.java:480)
	at org.eclipse.jetty.server.session.SessionHandler.doScope(SessionHandler.java:1557)
	at org.eclipse.jetty.server.handler.ScopedHandler.nextScope(ScopedHandler.java:201)
	at org.eclipse.jetty.server.handler.ContextHandler.doScope(ContextHandler.java:1247)
	at org.eclipse.jetty.server.handler.ScopedHandler.handle(ScopedHandler.java:144)
	at org.eclipse.jetty.server.handler.gzip.GzipHandler.handle(GzipHandler.java:703)
	at org.eclipse.jetty.server.handler.HandlerWrapper.handle(HandlerWrapper.java:132)
	at org.eclipse.jetty.server.Server.handle(Server.java:502)
	at org.eclipse.jetty.server.HttpChannel.handle(HttpChannel.java:364)
	at org.eclipse.jetty.server.HttpChannel.run(HttpChannel.java:305)
	at org.eclipse.jetty.util.thread.QueuedThreadPool.runJob(QueuedThreadPool.java:765)
	at org.eclipse.jetty.util.thread.QueuedThreadPool$2.run(QueuedThreadPool.java:683)
	at java.lang.Thread.run(Thread.java:748)

org.apache.solr.common.util.ObjectReleaseTracker$ObjectTrackerException: org.apache.lucene.store.MMapDirectory
	at org.apache.solr.common.util.ObjectReleaseTracker.track(ObjectReleaseTracker.java:42)
	at org.apache.solr.core.CachingDirectoryFactory.get(CachingDirectoryFactory.java:348)
	at org.apache.solr.handler.IndexFetcher.fetchLatestIndex(IndexFetcher.java:509)
	at org.apache.solr.handler.IndexFetcher.fetchLatestIndex(IndexFetcher.java:351)
	at org.apache.solr.handler.ReplicationHandler.doFetch(ReplicationHandler.java:424)
	at org.apache.solr.handler.ReplicationHandler.lambda$setupPolling$13(ReplicationHandler.java:1193)
	at java.util.concurrent.Executors$RunnableAdapter.call(Executors.java:511)
	at java.util.concurrent.FutureTask.runAndReset(FutureTask.java:308)
	at java.util.concurrent.ScheduledThreadPoolExecutor$ScheduledFutureTask.access$301(ScheduledThreadPoolExecutor.java:180)
	at java.util.concurrent.ScheduledThreadPoolExecutor$ScheduledFutureTask.run(ScheduledThreadPoolExecutor.java:294)
	at java.util.concurrent.ThreadPoolExecutor.runWorker(ThreadPoolExecutor.java:1149)
	at java.util.concurrent.ThreadPoolExecutor$Worker.run(ThreadPoolExecutor.java:624)
	at java.lang.Thread.run(Thread.java:748)

 expected null, but was:<ObjectTracker found 3 object(s) that were not released!!! [InternalHttpClient, SolrCore, MMapDirectory]
org.apache.solr.common.util.ObjectReleaseTracker$ObjectTrackerException: org.apache.http.impl.client.InternalHttpClient
	at org.apache.solr.common.util.ObjectReleaseTracker.track(ObjectReleaseTracker.java:42)
	at org.apache.solr.client.solrj.impl.HttpClientUtil.createClient(HttpClientUtil.java:321)
	at org.apache.solr.client.solrj.impl.HttpClientUtil.createClient(HttpClientUtil.java:330)
	at org.apache.solr.handler.IndexFetcher.createHttpClient(IndexFetcher.java:230)
	at org.apache.solr.handler.IndexFetcher.<init>(IndexFetcher.java:272)
	at org.apache.solr.handler.ReplicationHandler.doFetch(ReplicationHandler.java:420)
	at org.apache.solr.cloud.RecoveryStrategy.replicate(RecoveryStrategy.java:237)
	at org.apache.solr.cloud.RecoveryStrategy.doReplicateOnlyRecovery(RecoveryStrategy.java:382)
	at org.apache.solr.cloud.RecoveryStrategy.doRecovery(RecoveryStrategy.java:328)
	at org.apache.solr.cloud.RecoveryStrategy.run(RecoveryStrategy.java:307)
	at com.codahale.metrics.InstrumentedExecutorService$InstrumentedRunnable.run(InstrumentedExecutorService.java:176)
	at java.util.concurrent.Executors$RunnableAdapter.call(Executors.java:511)
	at java.util.concurrent.FutureTask.run(FutureTask.java:266)
	at org.apache.solr.common.util.ExecutorUtil$MDCAwareThreadPoolExecutor.lambda$execute$0(ExecutorUtil.java:209)
	at java.util.concurrent.ThreadPoolExecutor.runWorker(ThreadPoolExecutor.java:1149)
	at java.util.concurrent.ThreadPoolExecutor$Worker.run(ThreadPoolExecutor.java:624)
	at java.lang.Thread.run(Thread.java:748)

org.apache.solr.common.util.ObjectReleaseTracker$ObjectTrackerException: org.apache.solr.core.SolrCore
	at org.apache.solr.common.util.ObjectReleaseTracker.track(ObjectReleaseTracker.java:42)
	at org.apache.solr.core.SolrCore.<init>(SolrCore.java:1062)
	at org.apache.solr.core.SolrCore.<init>(SolrCore.java:882)
	at org.apache.solr.core.CoreContainer.createFromDescriptor(CoreContainer.java:1189)
	at org.apache.solr.core.CoreContainer.create(CoreContainer.java:1099)
	at org.apache.solr.handler.admin.CoreAdminOperation.lambda$static$0(CoreAdminOperation.java:92)
	at org.apache.solr.handler.admin.CoreAdminOperation.execute(CoreAdminOperation.java:360)
	at org.apache.solr.handler.admin.CoreAdminHandler$CallInfo.call(CoreAdminHandler.java:396)
	at org.apache.solr.handler.admin.CoreAdminHandler.handleRequestBody(CoreAdminHandler.java:180)
	at org.apache.solr.handler.RequestHandlerBase.handleRequest(RequestHandlerBase.java:199)
	at org.apache.solr.servlet.HttpSolrCall.handleAdmin(HttpSolrCall.java:736)
	at org.apache.solr.servlet.HttpSolrCall.handleAdminRequest(HttpSolrCall.java:717)
	at org.apache.solr.servlet.HttpSolrCall.call(HttpSolrCall.java:496)
	at org.apache.solr.servlet.SolrDispatchFilter.doFilter(SolrDispatchFilter.java:394)
	at org.apache.solr.servlet.SolrDispatchFilter.doFilter(SolrDispatchFilter.java:340)
	at org.eclipse.jetty.servlet.ServletHandler$CachedChain.doFilter(ServletHandler.java:1610)
	at org.apache.solr.client.solrj.embedded.JettySolrRunner$DebugFilter.doFilter(JettySolrRunner.java:164)
	at org.eclipse.jetty.servlet.ServletHandler$CachedChain.doFilter(ServletHandler.java:1610)
	at org.eclipse.jetty.servlet.ServletHandler.doHandle(ServletHandler.java:540)
	at org.eclipse.jetty.server.handler.ScopedHandler.nextHandle(ScopedHandler.java:255)
	at org.eclipse.jetty.server.session.SessionHandler.doHandle(SessionHandler.java:1588)
	at org.eclipse.jetty.server.handler.ScopedHandler.nextHandle(ScopedHandler.java:255)
	at org.eclipse.jetty.server.handler.ContextHandler.doHandle(ContextHandler.java:1345)
	at org.eclipse.jetty.server.handler.ScopedHandler.nextScope(ScopedHandler.java:203)
	at org.eclipse.jetty.servlet.ServletHandler.doScope(ServletHandler.java:480)
	at org.eclipse.jetty.server.session.SessionHandler.doScope(SessionHandler.java:1557)
	at org.eclipse.jetty.server.handler.ScopedHandler.nextScope(ScopedHandler.java:201)
	at org.eclipse.jetty.server.handler.ContextHandler.doScope(ContextHandler.java:1247)
	at org.eclipse.jetty.server.handler.ScopedHandler.handle(ScopedHandler.java:144)
	at org.eclipse.jetty.server.handler.gzip.GzipHandler.handle(GzipHandler.java:703)
	at org.eclipse.jetty.server.handler.HandlerWrapper.handle(HandlerWrapper.java:132)
	at org.eclipse.jetty.server.Server.handle(Server.java:502)
	at org.eclipse.jetty.server.HttpChannel.handle(HttpChannel.java:364)
	at org.eclipse.jetty.server.HttpChannel.run(HttpChannel.java:305)
	at org.eclipse.jetty.util.thread.QueuedThreadPool.runJob(QueuedThreadPool.java:765)
	at org.eclipse.jetty.util.thread.QueuedThreadPool$2.run(QueuedThreadPool.java:683)
	at java.lang.Thread.run(Thread.java:748)

org.apache.solr.common.util.ObjectReleaseTracker$ObjectTrackerException: org.apache.lucene.store.MMapDirectory
	at org.apache.solr.common.util.ObjectReleaseTracker.track(ObjectReleaseTracker.java:42)
	at org.apache.solr.core.CachingDirectoryFactory.get(CachingDirectoryFactory.java:348)
	at org.apache.solr.handler.IndexFetcher.fetchLatestIndex(IndexFetcher.java:509)
	at org.apache.solr.handler.IndexFetcher.fetchLatestIndex(IndexFetcher.java:351)
	at org.apache.solr.handler.ReplicationHandler.doFetch(ReplicationHandler.java:424)
	at org.apache.solr.handler.ReplicationHandler.lambda$setupPolling$13(ReplicationHandler.java:1193)
	at java.util.concurrent.Executors$RunnableAdapter.call(Executors.java:511)
	at java.util.concurrent.FutureTask.runAndReset(FutureTask.java:308)
	at java.util.concurrent.ScheduledThreadPoolExecutor$ScheduledFutureTask.access$301(ScheduledThreadPoolExecutor.java:180)
	at java.util.concurrent.ScheduledThreadPoolExecutor$ScheduledFutureTask.run(ScheduledThreadPoolExecutor.java:294)
	at java.util.concurrent.ThreadPoolExecutor.runWorker(ThreadPoolExecutor.java:1149)
	at java.util.concurrent.ThreadPoolExecutor$Worker.run(ThreadPoolExecutor.java:624)
	at java.lang.Thread.run(Thread.java:748)

>
	at __randomizedtesting.SeedInfo.seed([8834A9C1C6EEB85D]:0)
	at org.junit.Assert.fail(Assert.java:88)
	at org.junit.Assert.failNotNull(Assert.java:755)
	at org.junit.Assert.assertNull(Assert.java:737)
	at org.apache.solr.SolrTestCaseJ4.teardownTestCases(SolrTestCaseJ4.java:322)
	at sun.reflect.NativeMethodAccessorImpl.invoke0(Native Method)
	at sun.reflect.NativeMethodAccessorImpl.invoke(NativeMethodAccessorImpl.java:62)
	at sun.reflect.DelegatingMethodAccessorImpl.invoke(DelegatingMethodAccessorImpl.java:43)
	at java.lang.reflect.Method.invoke(Method.java:498)
	at com.carrotsearch.randomizedtesting.RandomizedRunner.invoke(RandomizedRunner.java:1750)
	at com.carrotsearch.randomizedtesting.RandomizedRunner$7.evaluate(RandomizedRunner.java:901)
	at com.carrotsearch.randomizedtesting.rules.StatementAdapter.evaluate(StatementAdapter.java:36)
	at com.carrotsearch.randomizedtesting.rules.SystemPropertiesRestoreRule$1.evaluate(SystemPropertiesRestoreRule.java:57)
	at org.apache.lucene.util.AbstractBeforeAfterRule$1.evaluate(AbstractBeforeAfterRule.java:45)
	at com.carrotsearch.randomizedtesting.rules.StatementAdapter.evaluate(StatementAdapter.java:36)
	at org.apache.lucene.util.TestRuleStoreClassName$1.evaluate(TestRuleStoreClassName.java:41)
	at com.carrotsearch.randomizedtesting.rules.NoShadowingOrOverridesOnMethodsRule$1.evaluate(NoShadowingOrOverridesOnMethodsRule.java:40)
	at com.carrotsearch.randomizedtesting.rules.NoShadowingOrOverridesOnMethodsRule$1.evaluate(NoShadowingOrOverridesOnMethodsRule.java:40)
	at com.carrotsearch.randomizedtesting.rules.StatementAdapter.evaluate(StatementAdapter.java:36)
	at com.carrotsearch.randomizedtesting.rules.StatementAdapter.evaluate(StatementAdapter.java:36)
	at com.carrotsearch.randomizedtesting.rules.StatementAdapter.evaluate(StatementAdapter.java:36)
	at org.apache.lucene.util.TestRuleAssertionsRequired$1.evaluate(TestRuleAssertionsRequired.java:53)
	at org.apache.lucene.util.TestRuleMarkFailure$1.evaluate(TestRuleMarkFailure.java:47)
	at org.apache.lucene.util.TestRuleIgnoreAfterMaxFailures$1.evaluate(TestRuleIgnoreAfterMaxFailures.java:64)
	at org.apache.lucene.util.TestRuleIgnoreTestSuites$1.evaluate(TestRuleIgnoreTestSuites.java:54)
	at com.carrotsearch.randomizedtesting.rules.StatementAdapter.evaluate(StatementAdapter.java:36)
	at com.carrotsearch.randomizedtesting.ThreadLeakControl$StatementRunner.run(ThreadLeakControl.java:368)
	at java.lang.Thread.run(Thread.java:748)


FAILED:  org.apache.solr.cloud.hdfs.HdfsUnloadDistributedZkTest.test

Error Message:
Captured an uncaught exception in thread: Thread[id=67866, name=testExecutor-12825-thread-6, state=RUNNABLE, group=TGRP-HdfsUnloadDistributedZkTest]

Stack Trace:
com.carrotsearch.randomizedtesting.UncaughtExceptionError: Captured an uncaught exception in thread: Thread[id=67866, name=testExecutor-12825-thread-6, state=RUNNABLE, group=TGRP-HdfsUnloadDistributedZkTest]
Caused by: org.apache.solr.client.solrj.impl.HttpSolrClient$RemoteSolrException: Error from server at http://127.0.0.1:36095: ADDREPLICA failed to create replica
	at __randomizedtesting.SeedInfo.seed([8834A9C1C6EEB85D]:0)
	at org.apache.solr.client.solrj.impl.HttpSolrClient.executeMethod(HttpSolrClient.java:650)
	at org.apache.solr.client.solrj.impl.HttpSolrClient.request(HttpSolrClient.java:256)
	at org.apache.solr.client.solrj.impl.HttpSolrClient.request(HttpSolrClient.java:245)
	at org.apache.solr.client.solrj.SolrRequest.process(SolrRequest.java:207)
	at org.apache.solr.client.solrj.SolrRequest.process(SolrRequest.java:224)
	at org.apache.solr.cloud.BasicDistributedZkTest.lambda$createCollectionInOneInstance$1(BasicDistributedZkTest.java:657)
	at org.apache.solr.common.util.ExecutorUtil$MDCAwareThreadPoolExecutor.lambda$execute$0(ExecutorUtil.java:209)
	at java.util.concurrent.ThreadPoolExecutor.runWorker(ThreadPoolExecutor.java:1149)
	at java.util.concurrent.ThreadPoolExecutor$Worker.run(ThreadPoolExecutor.java:624)
	at java.lang.Thread.run(Thread.java:748)


FAILED:  org.apache.solr.schema.TestCloudSchemaless.test

Error Message:
Timeout occurred while waiting response from server at: http://127.0.0.1:43519/tnnh/io/collection1

Stack Trace:
org.apache.solr.client.solrj.SolrServerException: Timeout occurred while waiting response from server at: http://127.0.0.1:43519/tnnh/io/collection1
	at __randomizedtesting.SeedInfo.seed([8834A9C1C6EEB85D:60961B6812D5A5]:0)
	at org.apache.solr.client.solrj.impl.HttpSolrClient.executeMethod(HttpSolrClient.java:661)
	at org.apache.solr.client.solrj.impl.HttpSolrClient.request(HttpSolrClient.java:256)
	at org.apache.solr.client.solrj.impl.HttpSolrClient.request(HttpSolrClient.java:245)
	at org.apache.solr.client.solrj.SolrRequest.process(SolrRequest.java:207)
	at org.apache.solr.client.solrj.SolrClient.commit(SolrClient.java:504)
	at org.apache.solr.client.solrj.SolrClient.commit(SolrClient.java:479)
	at org.apache.solr.schema.TestCloudSchemaless.test(TestCloudSchemaless.java:116)
	at sun.reflect.NativeMethodAccessorImpl.invoke0(Native Method)
	at sun.reflect.NativeMethodAccessorImpl.invoke(NativeMethodAccessorImpl.java:62)
	at sun.reflect.DelegatingMethodAccessorImpl.invoke(DelegatingMethodAccessorImpl.java:43)
	at java.lang.reflect.Method.invoke(Method.java:498)
	at com.carrotsearch.randomizedtesting.RandomizedRunner.invoke(RandomizedRunner.java:1750)
	at com.carrotsearch.randomizedtesting.RandomizedRunner$8.evaluate(RandomizedRunner.java:938)
	at com.carrotsearch.randomizedtesting.RandomizedRunner$9.evaluate(RandomizedRunner.java:974)
	at com.carrotsearch.randomizedtesting.RandomizedRunner$10.evaluate(RandomizedRunner.java:988)
	at org.apache.solr.BaseDistributedSearchTestCase$ShardsRepeatRule$ShardsFixedStatement.callStatement(BaseDistributedSearchTestCase.java:1082)
	at org.apache.solr.BaseDistributedSearchTestCase$ShardsRepeatRule$ShardsStatement.evaluate(BaseDistributedSearchTestCase.java:1054)
	at com.carrotsearch.randomizedtesting.rules.SystemPropertiesRestoreRule$1.evaluate(SystemPropertiesRestoreRule.java:57)
	at org.apache.lucene.util.TestRuleSetupTeardownChained$1.evaluate(TestRuleSetupTeardownChained.java:49)
	at org.apache.lucene.util.AbstractBeforeAfterRule$1.evaluate(AbstractBeforeAfterRule.java:45)
	at org.apache.lucene.util.TestRuleThreadAndTestName$1.evaluate(TestRuleThreadAndTestName.java:48)
	at org.apache.lucene.util.TestRuleIgnoreAfterMaxFailures$1.evaluate(TestRuleIgnoreAfterMaxFailures.java:64)
	at org.apache.lucene.util.TestRuleMarkFailure$1.evaluate(TestRuleMarkFailure.java:47)
	at com.carrotsearch.randomizedtesting.rules.StatementAdapter.evaluate(StatementAdapter.java:36)
	at com.carrotsearch.randomizedtesting.ThreadLeakControl$StatementRunner.run(ThreadLeakControl.java:368)
	at com.carrotsearch.randomizedtesting.ThreadLeakControl.forkTimeoutingTask(ThreadLeakControl.java:817)
	at com.carrotsearch.randomizedtesting.ThreadLeakControl$3.evaluate(ThreadLeakControl.java:468)
	at com.carrotsearch.randomizedtesting.RandomizedRunner.runSingleTest(RandomizedRunner.java:947)
	at com.carrotsearch.randomizedtesting.RandomizedRunner$5.evaluate(RandomizedRunner.java:832)
	at com.carrotsearch.randomizedtesting.RandomizedRunner$6.evaluate(RandomizedRunner.java:883)
	at com.carrotsearch.randomizedtesting.RandomizedRunner$7.evaluate(RandomizedRunner.java:894)
	at com.carrotsearch.randomizedtesting.rules.StatementAdapter.evaluate(StatementAdapter.java:36)
	at com.carrotsearch.randomizedtesting.rules.SystemPropertiesRestoreRule$1.evaluate(SystemPropertiesRestoreRule.java:57)
	at org.apache.lucene.util.AbstractBeforeAfterRule$1.evaluate(AbstractBeforeAfterRule.java:45)
	at com.carrotsearch.randomizedtesting.rules.StatementAdapter.evaluate(StatementAdapter.java:36)
	at org.apache.lucene.util.TestRuleStoreClassName$1.evaluate(TestRuleStoreClassName.java:41)
	at com.carrotsearch.randomizedtesting.rules.NoShadowingOrOverridesOnMethodsRule$1.evaluate(NoShadowingOrOverridesOnMethodsRule.java:40)
	at com.carrotsearch.randomizedtesting.rules.NoShadowingOrOverridesOnMethodsRule$1.evaluate(NoShadowingOrOverridesOnMethodsRule.java:40)
	at com.carrotsearch.randomizedtesting.rules.StatementAdapter.evaluate(StatementAdapter.java:36)
	at com.carrotsearch.randomizedtesting.rules.StatementAdapter.evaluate(StatementAdapter.java:36)
	at com.carrotsearch.randomizedtesting.rules.StatementAdapter.evaluate(StatementAdapter.java:36)
	at org.apache.lucene.util.TestRuleAssertionsRequired$1.evaluate(TestRuleAssertionsRequired.java:53)
	at org.apache.lucene.util.TestRuleMarkFailure$1.evaluate(TestRuleMarkFailure.java:47)
	at org.apache.lucene.util.TestRuleIgnoreAfterMaxFailures$1.evaluate(TestRuleIgnoreAfterMaxFailures.java:64)
	at org.apache.lucene.util.TestRuleIgnoreTestSuites$1.evaluate(TestRuleIgnoreTestSuites.java:54)
	at com.carrotsearch.randomizedtesting.rules.StatementAdapter.evaluate(StatementAdapter.java:36)
	at com.carrotsearch.randomizedtesting.ThreadLeakControl$StatementRunner.run(ThreadLeakControl.java:368)
	at java.lang.Thread.run(Thread.java:748)
Caused by: java.net.SocketTimeoutException: Read timed out
	at java.net.SocketInputStream.socketRead0(Native Method)
	at java.net.SocketInputStream.socketRead(SocketInputStream.java:116)
	at java.net.SocketInputStream.read(SocketInputStream.java:171)
	at java.net.SocketInputStream.read(SocketInputStream.java:141)
	at org.apache.http.impl.io.SessionInputBufferImpl.streamRead(SessionInputBufferImpl.java:137)
	at org.apache.http.impl.io.SessionInputBufferImpl.fillBuffer(SessionInputBufferImpl.java:153)
	at org.apache.http.impl.io.SessionInputBufferImpl.readLine(SessionInputBufferImpl.java:282)
	at org.apache.http.impl.conn.DefaultHttpResponseParser.parseHead(DefaultHttpResponseParser.java:138)
	at org.apache.http.impl.conn.DefaultHttpResponseParser.parseHead(DefaultHttpResponseParser.java:56)
	at org.apache.http.impl.io.AbstractMessageParser.parse(AbstractMessageParser.java:259)
	at org.apache.http.impl.DefaultBHttpClientConnection.receiveResponseHeader(DefaultBHttpClientConnection.java:163)
	at org.apache.http.impl.conn.CPoolProxy.receiveResponseHeader(CPoolProxy.java:165)
	at org.apache.http.protocol.HttpRequestExecutor.doReceiveResponse(HttpRequestExecutor.java:273)
	at org.apache.http.protocol.HttpRequestExecutor.execute(HttpRequestExecutor.java:125)
	at org.apache.http.impl.execchain.MainClientExec.execute(MainClientExec.java:272)
	at org.apache.http.impl.execchain.ProtocolExec.execute(ProtocolExec.java:185)
	at org.apache.http.impl.execchain.RetryExec.execute(RetryExec.java:89)
	at org.apache.http.impl.execchain.RedirectExec.execute(RedirectExec.java:110)
	at org.apache.http.impl.client.InternalHttpClient.doExecute(InternalHttpClient.java:185)
	at org.apache.http.impl.client.CloseableHttpClient.execute(CloseableHttpClient.java:83)
	at org.apache.http.impl.client.CloseableHttpClient.execute(CloseableHttpClient.java:56)
	at org.apache.solr.client.solrj.impl.HttpSolrClient.executeMethod(HttpSolrClient.java:549)
	... 47 more


FAILED:  org.apache.solr.client.solrj.request.TestV2Request.testHttpSolrClient

Error Message:
Error from server at https://127.0.0.1:35919/solr: 4 out of 5 the property overlay to be of version 0 within 30 seconds! Failed cores: [https://127.0.0.1:43789/solr/test_shard2_replica_n4/, https://127.0.0.1:44013/solr/test_shard2_replica_n5/, https://127.0.0.1:35919/solr/test_shard1_replica_n1/, https://127.0.0.1:45485/solr/test_shard1_replica_n2/]

Stack Trace:
org.apache.solr.client.solrj.impl.HttpSolrClient$RemoteExecutionException: Error from server at https://127.0.0.1:35919/solr: 4 out of 5 the property overlay to be of version 0 within 30 seconds! Failed cores: [https://127.0.0.1:43789/solr/test_shard2_replica_n4/, https://127.0.0.1:44013/solr/test_shard2_replica_n5/, https://127.0.0.1:35919/solr/test_shard1_replica_n1/, https://127.0.0.1:45485/solr/test_shard1_replica_n2/]
	at __randomizedtesting.SeedInfo.seed([CB5B6E1D0C19E48A:13437637AD2DF6AD]:0)
	at org.apache.solr.client.solrj.impl.HttpSolrClient$RemoteExecutionException.create(HttpSolrClient.java:836)
	at org.apache.solr.client.solrj.impl.HttpSolrClient.executeMethod(HttpSolrClient.java:627)
	at org.apache.solr.client.solrj.impl.HttpSolrClient.request(HttpSolrClient.java:256)
	at org.apache.solr.client.solrj.impl.HttpSolrClient.request(HttpSolrClient.java:245)
	at org.apache.solr.client.solrj.SolrClient.request(SolrClient.java:1274)
	at org.apache.solr.client.solrj.request.TestV2Request.assertSuccess(TestV2Request.java:55)
	at org.apache.solr.client.solrj.request.TestV2Request.doTest(TestV2Request.java:102)
	at org.apache.solr.client.solrj.request.TestV2Request.testHttpSolrClient(TestV2Request.java:76)
	at sun.reflect.NativeMethodAccessorImpl.invoke0(Native Method)
	at sun.reflect.NativeMethodAccessorImpl.invoke(NativeMethodAccessorImpl.java:62)
	at sun.reflect.DelegatingMethodAccessorImpl.invoke(DelegatingMethodAccessorImpl.java:43)
	at java.lang.reflect.Method.invoke(Method.java:498)
	at com.carrotsearch.randomizedtesting.RandomizedRunner.invoke(RandomizedRunner.java:1750)
	at com.carrotsearch.randomizedtesting.RandomizedRunner$8.evaluate(RandomizedRunner.java:938)
	at com.carrotsearch.randomizedtesting.RandomizedRunner$9.evaluate(RandomizedRunner.java:974)
	at com.carrotsearch.randomizedtesting.RandomizedRunner$10.evaluate(RandomizedRunner.java:988)
	at com.carrotsearch.randomizedtesting.rules.SystemPropertiesRestoreRule$1.evaluate(SystemPropertiesRestoreRule.java:57)
	at org.apache.lucene.util.TestRuleSetupTeardownChained$1.evaluate(TestRuleSetupTeardownChained.java:49)
	at org.apache.lucene.util.AbstractBeforeAfterRule$1.evaluate(AbstractBeforeAfterRule.java:45)
	at org.apache.lucene.util.TestRuleThreadAndTestName$1.evaluate(TestRuleThreadAndTestName.java:48)
	at org.apache.lucene.util.TestRuleIgnoreAfterMaxFailures$1.evaluate(TestRuleIgnoreAfterMaxFailures.java:64)
	at org.apache.lucene.util.TestRuleMarkFailure$1.evaluate(TestRuleMarkFailure.java:47)
	at com.carrotsearch.randomizedtesting.rules.StatementAdapter.evaluate(StatementAdapter.java:36)
	at com.carrotsearch.randomizedtesting.ThreadLeakControl$StatementRunner.run(ThreadLeakControl.java:368)
	at com.carrotsearch.randomizedtesting.ThreadLeakControl.forkTimeoutingTask(ThreadLeakControl.java:817)
	at com.carrotsearch.randomizedtesting.ThreadLeakControl$3.evaluate(ThreadLeakControl.java:468)
	at com.carrotsearch.randomizedtesting.RandomizedRunner.runSingleTest(RandomizedRunner.java:947)
	at com.carrotsearch.randomizedtesting.RandomizedRunner$5.evaluate(RandomizedRunner.java:832)
	at com.carrotsearch.randomizedtesting.RandomizedRunner$6.evaluate(RandomizedRunner.java:883)
	at com.carrotsearch.randomizedtesting.RandomizedRunner$7.evaluate(RandomizedRunner.java:894)
	at com.carrotsearch.randomizedtesting.rules.StatementAdapter.evaluate(StatementAdapter.java:36)
	at com.carrotsearch.randomizedtesting.rules.SystemPropertiesRestoreRule$1.evaluate(SystemPropertiesRestoreRule.java:57)
	at org.apache.lucene.util.AbstractBeforeAfterRule$1.evaluate(AbstractBeforeAfterRule.java:45)
	at com.carrotsearch.randomizedtesting.rules.StatementAdapter.evaluate(StatementAdapter.java:36)
	at org.apache.lucene.util.TestRuleStoreClassName$1.evaluate(TestRuleStoreClassName.java:41)
	at com.carrotsearch.randomizedtesting.rules.NoShadowingOrOverridesOnMethodsRule$1.evaluate(NoShadowingOrOverridesOnMethodsRule.java:40)
	at com.carrotsearch.randomizedtesting.rules.NoShadowingOrOverridesOnMethodsRule$1.evaluate(NoShadowingOrOverridesOnMethodsRule.java:40)
	at com.carrotsearch.randomizedtesting.rules.StatementAdapter.evaluate(StatementAdapter.java:36)
	at com.carrotsearch.randomizedtesting.rules.StatementAdapter.evaluate(StatementAdapter.java:36)
	at com.carrotsearch.randomizedtesting.rules.StatementAdapter.evaluate(StatementAdapter.java:36)
	at org.apache.lucene.util.TestRuleAssertionsRequired$1.evaluate(TestRuleAssertionsRequired.java:53)
	at org.apache.lucene.util.TestRuleMarkFailure$1.evaluate(TestRuleMarkFailure.java:47)
	at org.apache.lucene.util.TestRuleIgnoreAfterMaxFailures$1.evaluate(TestRuleIgnoreAfterMaxFailures.java:64)
	at org.apache.lucene.util.TestRuleIgnoreTestSuites$1.evaluate(TestRuleIgnoreTestSuites.java:54)
	at com.carrotsearch.randomizedtesting.rules.StatementAdapter.evaluate(StatementAdapter.java:36)
	at com.carrotsearch.randomizedtesting.ThreadLeakControl$StatementRunner.run(ThreadLeakControl.java:368)
	at java.lang.Thread.run(Thread.java:748)




Build Log:
[...truncated 13495 lines...]
   [junit4] Suite: org.apache.solr.cloud.ChaosMonkeySafeLeaderWithPullReplicasTest
   [junit4]   2> 433780 INFO  (SUITE-ChaosMonkeySafeLeaderWithPullReplicasTest-seed#[8834A9C1C6EEB85D]-worker) [    ] o.a.s.SolrTestCaseJ4 SecureRandom sanity checks: test.solr.allowed.securerandom=null & java.security.egd=file:/dev/./urandom
   [junit4]   2> Creating dataDir: /home/jenkins/jenkins-slave/workspace/Lucene-Solr-NightlyTests-8.x/checkout/solr/build/solr-core/test/J1/temp/solr.cloud.ChaosMonkeySafeLeaderWithPullReplicasTest_8834A9C1C6EEB85D-001/init-core-data-001
   [junit4]   2> 433781 WARN  (SUITE-ChaosMonkeySafeLeaderWithPullReplicasTest-seed#[8834A9C1C6EEB85D]-worker) [    ] o.a.s.SolrTestCaseJ4 startTrackingSearchers: numOpens=1038 numCloses=1038
   [junit4]   2> 433781 INFO  (SUITE-ChaosMonkeySafeLeaderWithPullReplicasTest-seed#[8834A9C1C6EEB85D]-worker) [    ] o.a.s.SolrTestCaseJ4 Using TrieFields (NUMERIC_POINTS_SYSPROP=false) w/NUMERIC_DOCVALUES_SYSPROP=true
   [junit4]   2> 433783 INFO  (SUITE-ChaosMonkeySafeLeaderWithPullReplicasTest-seed#[8834A9C1C6EEB85D]-worker) [    ] o.a.s.SolrTestCaseJ4 Randomized ssl (false) and clientAuth (true) via: @org.apache.solr.util.RandomizeSSL(reason=, ssl=NaN, value=NaN, clientAuth=NaN)
   [junit4]   2> 433783 INFO  (SUITE-ChaosMonkeySafeLeaderWithPullReplicasTest-seed#[8834A9C1C6EEB85D]-worker) [    ] o.a.s.BaseDistributedSearchTestCase Setting hostContext system property: /p/
   [junit4]   2> 433784 INFO  (TEST-ChaosMonkeySafeLeaderWithPullReplicasTest.test-seed#[8834A9C1C6EEB85D]) [    ] o.a.s.c.ChaosMonkeySafeLeaderWithPullReplicasTest Starting ChaosMonkey test with 2 shards and 6 nodes
   [junit4]   2> 433788 INFO  (TEST-ChaosMonkeySafeLeaderWithPullReplicasTest.test-seed#[8834A9C1C6EEB85D]) [    ] o.a.s.c.ZkTestServer STARTING ZK TEST SERVER
   [junit4]   2> 433806 INFO  (ZkTestServer Run Thread) [    ] o.a.s.c.ZkTestServer client port:0.0.0.0/0.0.0.0:0
   [junit4]   2> 433806 INFO  (ZkTestServer Run Thread) [    ] o.a.s.c.ZkTestServer Starting server
   [junit4]   2> 433906 INFO  (TEST-ChaosMonkeySafeLeaderWithPullReplicasTest.test-seed#[8834A9C1C6EEB85D]) [    ] o.a.s.c.ZkTestServer start zk server on port:41943
   [junit4]   2> 433906 INFO  (TEST-ChaosMonkeySafeLeaderWithPullReplicasTest.test-seed#[8834A9C1C6EEB85D]) [    ] o.a.s.c.ZkTestServer parse host and port list: 127.0.0.1:41943
   [junit4]   2> 433906 INFO  (TEST-ChaosMonkeySafeLeaderWithPullReplicasTest.test-seed#[8834A9C1C6EEB85D]) [    ] o.a.s.c.ZkTestServer connecting to 127.0.0.1 41943
   [junit4]   2> 433915 INFO  (zkConnectionManagerCallback-340-thread-1) [    ] o.a.s.c.c.ConnectionManager zkClient has connected
   [junit4]   2> 433918 INFO  (zkConnectionManagerCallback-342-thread-1) [    ] o.a.s.c.c.ConnectionManager zkClient has connected
   [junit4]   2> 433920 INFO  (TEST-ChaosMonkeySafeLeaderWithPullReplicasTest.test-seed#[8834A9C1C6EEB85D]) [    ] o.a.s.c.ZkTestServer put /home/jenkins/jenkins-slave/workspace/Lucene-Solr-NightlyTests-8.x/checkout/solr/core/src/test-files/solr/collection1/conf/solrconfig-tlog.xml to /configs/conf1/solrconfig.xml
   [junit4]   2> 433921 INFO  (TEST-ChaosMonkeySafeLeaderWithPullReplicasTest.test-seed#[8834A9C1C6EEB85D]) [    ] o.a.s.c.ZkTestServer put /home/jenkins/jenkins-slave/workspace/Lucene-Solr-NightlyTests-8.x/checkout/solr/core/src/test-files/solr/collection1/conf/schema15.xml to /configs/conf1/schema.xml
   [junit4]   2> 433922 INFO  (TEST-ChaosMonkeySafeLeaderWithPullReplicasTest.test-seed#[8834A9C1C6EEB85D]) [    ] o.a.s.c.ZkTestServer put /home/jenkins/jenkins-slave/workspace/Lucene-Solr-NightlyTests-8.x/checkout/solr/core/src/test-files/solr/collection1/conf/solrconfig.snippet.randomindexconfig.xml to /configs/conf1/solrconfig.snippet.randomindexconfig.xml
   [junit4]   2> 433923 INFO  (TEST-ChaosMonkeySafeLeaderWithPullReplicasTest.test-seed#[8834A9C1C6EEB85D]) [    ] o.a.s.c.ZkTestServer put /home/jenkins/jenkins-slave/workspace/Lucene-Solr-NightlyTests-8.x/checkout/solr/core/src/test-files/solr/collection1/conf/stopwords.txt to /configs/conf1/stopwords.txt
   [junit4]   2> 433924 INFO  (TEST-ChaosMonkeySafeLeaderWithPullReplicasTest.test-seed#[8834A9C1C6EEB85D]) [    ] o.a.s.c.ZkTestServer put /home/jenkins/jenkins-slave/workspace/Lucene-Solr-NightlyTests-8.x/checkout/solr/core/src/test-files/solr/collection1/conf/protwords.txt to /configs/conf1/protwords.txt
   [junit4]   2> 433926 INFO  (TEST-ChaosMonkeySafeLeaderWithPullReplicasTest.test-seed#[8834A9C1C6EEB85D]) [    ] o.a.s.c.ZkTestServer put /home/jenkins/jenkins-slave/workspace/Lucene-Solr-NightlyTests-8.x/checkout/solr/core/src/test-files/solr/collection1/conf/currency.xml to /configs/conf1/currency.xml
   [junit4]   2> 433927 INFO  (TEST-ChaosMonkeySafeLeaderWithPullReplicasTest.test-seed#[8834A9C1C6EEB85D]) [    ] o.a.s.c.ZkTestServer put /home/jenkins/jenkins-slave/workspace/Lucene-Solr-NightlyTests-8.x/checkout/solr/core/src/test-files/solr/collection1/conf/enumsConfig.xml to /configs/conf1/enumsConfig.xml
   [junit4]   2> 433928 INFO  (TEST-ChaosMonkeySafeLeaderWithPullReplicasTest.test-seed#[8834A9C1C6EEB85D]) [    ] o.a.s.c.ZkTestServer put /home/jenkins/jenkins-slave/workspace/Lucene-Solr-NightlyTests-8.x/checkout/solr/core/src/test-files/solr/collection1/conf/open-exchange-rates.json to /configs/conf1/open-exchange-rates.json
   [junit4]   2> 433929 INFO  (TEST-ChaosMonkeySafeLeaderWithPullReplicasTest.test-seed#[8834A9C1C6EEB85D]) [    ] o.a.s.c.ZkTestServer put /home/jenkins/jenkins-slave/workspace/Lucene-Solr-NightlyTests-8.x/checkout/solr/core/src/test-files/solr/collection1/conf/mapping-ISOLatin1Accent.txt to /configs/conf1/mapping-ISOLatin1Accent.txt
   [junit4]   2> 433930 INFO  (TEST-ChaosMonkeySafeLeaderWithPullReplicasTest.test-seed#[8834A9C1C6EEB85D]) [    ] o.a.s.c.ZkTestServer put /home/jenkins/jenkins-slave/workspace/Lucene-Solr-NightlyTests-8.x/checkout/solr/core/src/test-files/solr/collection1/conf/old_synonyms.txt to /configs/conf1/old_synonyms.txt
   [junit4]   2> 433931 INFO  (TEST-ChaosMonkeySafeLeaderWithPullReplicasTest.test-seed#[8834A9C1C6EEB85D]) [    ] o.a.s.c.ZkTestServer put /home/jenkins/jenkins-slave/workspace/Lucene-Solr-NightlyTests-8.x/checkout/solr/core/src/test-files/solr/collection1/conf/synonyms.txt to /configs/conf1/synonyms.txt
   [junit4]   2> 433932 INFO  (TEST-ChaosMonkeySafeLeaderWithPullReplicasTest.test-seed#[8834A9C1C6EEB85D]) [    ] o.a.s.c.AbstractFullDistribZkTestBase Will use NRT replicas unless explicitly asked otherwise
   [junit4]   2> 434091 WARN  (TEST-ChaosMonkeySafeLeaderWithPullReplicasTest.test-seed#[8834A9C1C6EEB85D]) [    ] o.e.j.s.AbstractConnector Ignoring deprecated socket close linger time
   [junit4]   2> 434092 INFO  (TEST-ChaosMonkeySafeLeaderWithPullReplicasTest.test-seed#[8834A9C1C6EEB85D]) [    ] o.a.s.c.s.e.JettySolrRunner Start Jetty (original configured port=0)
   [junit4]   2> 434092 INFO  (TEST-ChaosMonkeySafeLeaderWithPullReplicasTest.test-seed#[8834A9C1C6EEB85D]) [    ] o.a.s.c.s.e.JettySolrRunner Trying to start Jetty on port 0 try number 1 ...
   [junit4]   2> 434092 INFO  (TEST-ChaosMonkeySafeLeaderWithPullReplicasTest.test-seed#[8834A9C1C6EEB85D]) [    ] o.e.j.s.Server jetty-9.4.14.v20181114; built: 2018-11-14T21:20:31.478Z; git: c4550056e785fb5665914545889f21dc136ad9e6; jvm 1.8.0_191-b12
   [junit4]   2> 434093 INFO  (TEST-ChaosMonkeySafeLeaderWithPullReplicasTest.test-seed#[8834A9C1C6EEB85D]) [    ] o.e.j.s.session DefaultSessionIdManager workerName=node0
   [junit4]   2> 434093 INFO  (TEST-ChaosMonkeySafeLeaderWithPullReplicasTest.test-seed#[8834A9C1C6EEB85D]) [    ] o.e.j.s.session No SessionScavenger set, using defaults
   [junit4]   2> 434093 INFO  (TEST-ChaosMonkeySafeLeaderWithPullReplicasTest.test-seed#[8834A9C1C6EEB85D]) [    ] o.e.j.s.session node0 Scavenging every 660000ms
   [junit4]   2> 434094 INFO  (TEST-ChaosMonkeySafeLeaderWithPullReplicasTest.test-seed#[8834A9C1C6EEB85D]) [    ] o.e.j.s.h.ContextHandler Started o.e.j.s.ServletContextHandler@4445b978{/p,null,AVAILABLE}
   [junit4]   2> 434097 INFO  (TEST-ChaosMonkeySafeLeaderWithPullReplicasTest.test-seed#[8834A9C1C6EEB85D]) [    ] o.e.j.s.AbstractConnector Started ServerConnector@215b3cfd{HTTP/1.1,[http/1.1, h2c]}{127.0.0.1:40901}
   [junit4]   2> 434097 INFO  (TEST-ChaosMonkeySafeLeaderWithPullReplicasTest.test-seed#[8834A9C1C6EEB85D]) [    ] o.e.j.s.Server Started @434318ms
   [junit4]   2> 434097 INFO  (TEST-ChaosMonkeySafeLeaderWithPullReplicasTest.test-seed#[8834A9C1C6EEB85D]) [    ] o.a.s.c.s.e.JettySolrRunner Jetty properties: {solr.data.dir=/home/jenkins/jenkins-slave/workspace/Lucene-Solr-NightlyTests-8.x/checkout/solr/build/solr-core/test/J1/temp/solr.cloud.ChaosMonkeySafeLeaderWithPullReplicasTest_8834A9C1C6EEB85D-001/tempDir-001/control/data, replicaType=NRT, hostContext=/p, hostPort=40901, coreRootDirectory=/home/jenkins/jenkins-slave/workspace/Lucene-Solr-NightlyTests-8.x/checkout/solr/build/solr-core/test/J1/../../../../../../../../../../../home/jenkins/jenkins-slave/workspace/Lucene-Solr-NightlyTests-8.x/checkout/solr/build/solr-core/test/J1/temp/solr.cloud.ChaosMonkeySafeLeaderWithPullReplicasTest_8834A9C1C6EEB85D-001/control-001/cores}
   [junit4]   2> 434098 ERROR (TEST-ChaosMonkeySafeLeaderWithPullReplicasTest.test-seed#[8834A9C1C6EEB85D]) [    ] o.a.s.u.StartupLoggingUtils Missing Java Option solr.log.dir. Logging may be missing or incomplete.
   [junit4]   2> 434098 INFO  (TEST-ChaosMonkeySafeLeaderWithPullReplicasTest.test-seed#[8834A9C1C6EEB85D]) [    ] o.a.s.s.SolrDispatchFilter Using logger factory org.apache.logging.slf4j.Log4jLoggerFactory
   [junit4]   2> 434098 INFO  (TEST-ChaosMonkeySafeLeaderWithPullReplicasTest.test-seed#[8834A9C1C6EEB85D]) [    ] o.a.s.s.SolrDispatchFilter  ___      _       Welcome to Apache Solr™ version 8.1.0
   [junit4]   2> 434098 INFO  (TEST-ChaosMonkeySafeLeaderWithPullReplicasTest.test-seed#[8834A9C1C6EEB85D]) [    ] o.a.s.s.SolrDispatchFilter / __| ___| |_ _   Starting in cloud mode on port null
   [junit4]   2> 434098 INFO  (TEST-ChaosMonkeySafeLeaderWithPullReplicasTest.test-seed#[8834A9C1C6EEB85D]) [    ] o.a.s.s.SolrDispatchFilter \__ \/ _ \ | '_|  Install dir: null
   [junit4]   2> 434098 INFO  (TEST-ChaosMonkeySafeLeaderWithPullReplicasTest.test-seed#[8834A9C1C6EEB85D]) [    ] o.a.s.s.SolrDispatchFilter |___/\___/_|_|    Start time: 2019-02-22T18:55:13.955Z
   [junit4]   2> 434109 INFO  (zkConnectionManagerCallback-344-thread-1) [    ] o.a.s.c.c.ConnectionManager zkClient has connected
   [junit4]   2> 434111 INFO  (TEST-ChaosMonkeySafeLeaderWithPullReplicasTest.test-seed#[8834A9C1C6EEB85D]) [    ] o.a.s.s.SolrDispatchFilter Loading solr.xml from SolrHome (not found in ZooKeeper)
   [junit4]   2> 434111 INFO  (TEST-ChaosMonkeySafeLeaderWithPullReplicasTest.test-seed#[8834A9C1C6EEB85D]) [    ] o.a.s.c.SolrXmlConfig Loading container configuration from /home/jenkins/jenkins-slave/workspace/Lucene-Solr-NightlyTests-8.x/checkout/solr/build/solr-core/test/J1/temp/solr.cloud.ChaosMonkeySafeLeaderWithPullReplicasTest_8834A9C1C6EEB85D-001/control-001/solr.xml
   [junit4]   2> 434115 INFO  (TEST-ChaosMonkeySafeLeaderWithPullReplicasTest.test-seed#[8834A9C1C6EEB85D]) [    ] o.a.s.c.SolrXmlConfig Configuration parameter autoReplicaFailoverWorkLoopDelay is ignored
   [junit4]   2> 434115 INFO  (TEST-ChaosMonkeySafeLeaderWithPullReplicasTest.test-seed#[8834A9C1C6EEB85D]) [    ] o.a.s.c.SolrXmlConfig Configuration parameter autoReplicaFailoverBadNodeExpiration is ignored
   [junit4]   2> 434116 INFO  (TEST-ChaosMonkeySafeLeaderWithPullReplicasTest.test-seed#[8834A9C1C6EEB85D]) [    ] o.a.s.c.SolrXmlConfig MBean server found: com.sun.jmx.mbeanserver.JmxMBeanServer@493d1327, but no JMX reporters were configured - adding default JMX reporter.
   [junit4]   2> 434231 INFO  (TEST-ChaosMonkeySafeLeaderWithPullReplicasTest.test-seed#[8834A9C1C6EEB85D]) [    ] o.a.s.h.c.HttpShardHandlerFactory Host whitelist initialized: WhitelistHostChecker [whitelistHosts=null, whitelistHostCheckingEnabled=false]
   [junit4]   2> 434244 WARN  (TEST-ChaosMonkeySafeLeaderWithPullReplicasTest.test-seed#[8834A9C1C6EEB85D]) [    ] o.e.j.u.s.S.config No Client EndPointIdentificationAlgorithm configured for SslContextFactory@7f75e544[provider=null,keyStore=null,trustStore=null]
   [junit4]   2> 434248 WARN  (TEST-ChaosMonkeySafeLeaderWithPullReplicasTest.test-seed#[8834A9C1C6EEB85D]) [    ] o.e.j.u.s.S.config No Client EndPointIdentificationAlgorithm configured for SslContextFactory@3cfe7896[provider=null,keyStore=null,trustStore=null]
   [junit4]   2> 434249 INFO  (TEST-ChaosMonkeySafeLeaderWithPullReplicasTest.test-seed#[8834A9C1C6EEB85D]) [    ] o.a.s.c.ZkContainer Zookeeper client=127.0.0.1:41943/solr
   [junit4]   2> 434252 INFO  (zkConnectionManagerCallback-350-thread-1) [    ] o.a.s.c.c.ConnectionManager zkClient has connected
   [junit4]   2> 434261 INFO  (zkConnectionManagerCallback-352-thread-1) [    ] o.a.s.c.c.ConnectionManager zkClient has connected
   [junit4]   2> 434362 INFO  (TEST-ChaosMonkeySafeLeaderWithPullReplicasTest.test-seed#[8834A9C1C6EEB85D]) [n:127.0.0.1:40901_p    ] o.a.s.c.OverseerElectionContext I am going to be the leader 127.0.0.1:40901_p
   [junit4]   2> 434363 INFO  (TEST-ChaosMonkeySafeLeaderWithPullReplicasTest.test-seed#[8834A9C1C6EEB85D]) [n:127.0.0.1:40901_p    ] o.a.s.c.Overseer Overseer (id=74233331212419076-127.0.0.1:40901_p-n_0000000000) starting
   [junit4]   2> 434369 INFO  (zkConnectionManagerCallback-359-thread-1) [    ] o.a.s.c.c.ConnectionManager zkClient has connected
   [junit4]   2> 434372 INFO  (TEST-ChaosMonkeySafeLeaderWithPullReplicasTest.test-seed#[8834A9C1C6EEB85D]) [n:127.0.0.1:40901_p    ] o.a.s.c.s.i.ZkClientClusterStateProvider Cluster at 127.0.0.1:41943/solr ready
   [junit4]   2> 434372 INFO  (OverseerStateUpdate-74233331212419076-127.0.0.1:40901_p-n_0000000000) [n:127.0.0.1:40901_p    ] o.a.s.c.Overseer Starting to work on the main queue : 127.0.0.1:40901_p
   [junit4]   2> 434373 INFO  (TEST-ChaosMonkeySafeLeaderWithPullReplicasTest.test-seed#[8834A9C1C6EEB85D]) [n:127.0.0.1:40901_p    ] o.a.s.c.ZkController Register node as live in ZooKeeper:/live_nodes/127.0.0.1:40901_p
   [junit4]   2> 434374 INFO  (OverseerStateUpdate-74233331212419076-127.0.0.1:40901_p-n_0000000000) [n:127.0.0.1:40901_p    ] o.a.s.c.c.ZkStateReader Updated live nodes from ZooKeeper... (0) -> (1)
   [junit4]   2> 434375 INFO  (zkCallback-358-thread-1) [    ] o.a.s.c.c.ZkStateReader Updated live nodes from ZooKeeper... (0) -> (1)
   [junit4]   2> 434394 INFO  (TEST-ChaosMonkeySafeLeaderWithPullReplicasTest.test-seed#[8834A9C1C6EEB85D]) [n:127.0.0.1:40901_p    ] o.a.s.h.a.MetricsHistoryHandler No .system collection, keeping metrics history in memory.
   [junit4]   2> 434409 INFO  (TEST-ChaosMonkeySafeLeaderWithPullReplicasTest.test-seed#[8834A9C1C6EEB85D]) [n:127.0.0.1:40901_p    ] o.a.s.m.r.SolrJmxReporter JMX monitoring for 'solr.node' (registry 'solr.node') enabled at server: com.sun.jmx.mbeanserver.JmxMBeanServer@493d1327
   [junit4]   2> 434415 INFO  (TEST-ChaosMonkeySafeLeaderWithPullReplicasTest.test-seed#[8834A9C1C6EEB85D]) [n:127.0.0.1:40901_p    ] o.a.s.m.r.SolrJmxReporter JMX monitoring for 'solr.jvm' (registry 'solr.jvm') enabled at server: com.sun.jmx.mbeanserver.JmxMBeanServer@493d1327
   [junit4]   2> 434416 INFO  (TEST-ChaosMonkeySafeLeaderWithPullReplicasTest.test-seed#[8834A9C1C6EEB85D]) [n:127.0.0.1:40901_p    ] o.a.s.m.r.SolrJmxReporter JMX monitoring for 'solr.jetty' (registry 'solr.jetty') enabled at server: com.sun.jmx.mbeanserver.JmxMBeanServer@493d1327
   [junit4]   2> 434417 INFO  (TEST-ChaosMonkeySafeLeaderWithPullReplicasTest.test-seed#[8834A9C1C6EEB85D]) [n:127.0.0.1:40901_p    ] o.a.s.c.CorePropertiesLocator Found 0 core definitions underneath /home/jenkins/jenkins-slave/workspace/Lucene-Solr-NightlyTests-8.x/checkout/solr/build/solr-core/test/J1/../../../../../../../../../../../home/jenkins/jenkins-slave/workspace/Lucene-Solr-NightlyTests-8.x/checkout/solr/build/solr-core/test/J1/temp/solr.cloud.ChaosMonkeySafeLeaderWithPullReplicasTest_8834A9C1C6EEB85D-001/control-001/cores
   [junit4]   2> 434450 INFO  (zkConnectionManagerCallback-365-thread-1) [    ] o.a.s.c.c.ConnectionManager zkClient has connected
   [junit4]   2> 434451 INFO  (TEST-ChaosMonkeySafeLeaderWithPullReplicasTest.test-seed#[8834A9C1C6EEB85D]) [    ] o.a.s.c.c.ZkStateReader Updated live nodes from ZooKeeper... (0) -> (1)
   [junit4]   2> 434452 INFO  (TEST-ChaosMonkeySafeLeaderWithPullReplicasTest.test-seed#[8834A9C1C6EEB85D]) [    ] o.a.s.c.s.i.ZkClientClusterStateProvider Cluster at 127.0.0.1:41943/solr ready
   [junit4]   2> 434462 INFO  (qtp551078403-1148) [n:127.0.0.1:40901_p    ] o.a.s.h.a.CollectionsHandler Invoked Collection Action :create with params collection.configName=conf1&name=control_collection&nrtReplicas=1&action=CREATE&numShards=1&createNodeSet=127.0.0.1:40901_p&wt=javabin&version=2 and sendToOCPQueue=true
   [junit4]   2> 434466 INFO  (OverseerThreadFactory-241-thread-1-processing-n:127.0.0.1:40901_p) [n:127.0.0.1:40901_p    ] o.a.s.c.a.c.CreateCollectionCmd Create collection control_collection
   [junit4]   2> 434586 INFO  (qtp551078403-1151) [n:127.0.0.1:40901_p    x:control_collection_shard1_replica_n1] o.a.s.h.a.CoreAdminOperation core create command qt=/admin/cores&collection.configName=conf1&newCollection=true&name=control_collection_shard1_replica_n1&action=CREATE&numShards=1&collection=control_collection&shard=shard1&wt=javabin&version=2&replicaType=NRT
   [junit4]   2> 434587 INFO  (qtp551078403-1151) [n:127.0.0.1:40901_p    x:control_collection_shard1_replica_n1] o.a.s.c.TransientSolrCoreCacheDefault Allocating transient cache for 4 transient cores
   [junit4]   2> 435632 INFO  (qtp551078403-1151) [n:127.0.0.1:40901_p c:control_collection s:shard1  x:control_collection_shard1_replica_n1] o.a.s.c.SolrConfig Using Lucene MatchVersion: 8.1.0
   [junit4]   2> 435660 INFO  (qtp551078403-1151) [n:127.0.0.1:40901_p c:control_collection s:shard1  x:control_collection_shard1_replica_n1] o.a.s.s.IndexSchema [control_collection_shard1_replica_n1] Schema name=test
   [junit4]   2> 435665 WARN  (qtp551078403-1151) [n:127.0.0.1:40901_p c:control_collection s:shard1  x:control_collection_shard1_replica_n1] o.a.s.c.SolrResourceLoader Solr loaded a deprecated plugin/analysis class [solr.TrieIntField]. Please consult documentation how to replace it accordingly.
   [junit4]   2> 435671 WARN  (qtp551078403-1151) [n:127.0.0.1:40901_p c:control_collection s:shard1  x:control_collection_shard1_replica_n1] o.a.s.c.SolrResourceLoader Solr loaded a deprecated plugin/analysis class [solr.TrieFloatField]. Please consult documentation how to replace it accordingly.
   [junit4]   2> 435673 WARN  (qtp551078403-1151) [n:127.0.0.1:40901_p c:control_collection s:shard1  x:control_collection_shard1_replica_n1] o.a.s.c.SolrResourceLoader Solr loaded a deprecated plugin/analysis class [solr.TrieLongField]. Please consult documentation how to replace it accordingly.
   [junit4]   2> 435678 WARN  (qtp551078403-1151) [n:127.0.0.1:40901_p c:control_collection s:shard1  x:control_collection_shard1_replica_n1] o.a.s.c.SolrResourceLoader Solr loaded a deprecated plugin/analysis class [solr.TrieDoubleField]. Please consult documentation how to replace it accordingly.
   [junit4]   2> 435687 WARN  (qtp551078403-1151) [n:127.0.0.1:40901_p c:control_collection s:shard1  x:control_collection_shard1_replica_n1] o.a.s.c.SolrResourceLoader Solr loaded a deprecated plugin/analysis class [solr.TrieDateField]. Please consult documentation how to replace it accordingly.
   [junit4]   2> 435824 INFO  (qtp551078403-1151) [n:127.0.0.1:40901_p c:control_collection s:shard1  x:control_collection_shard1_replica_n1] o.a.s.s.IndexSchema Loaded schema test/1.6 with uniqueid field id
   [junit4]   2> 435978 INFO  (qtp551078403-1151) [n:127.0.0.1:40901_p c:control_collection s:shard1  x:control_collection_shard1_replica_n1] o.a.s.c.CoreContainer Creating SolrCore 'control_collection_shard1_replica_n1' using configuration from collection control_collection, trusted=true
   [junit4]   2> 435978 INFO  (qtp551078403-1151) [n:127.0.0.1:40901_p c:control_collection s:shard1  x:control_collection_shard1_replica_n1] o.a.s.m.r.SolrJmxReporter JMX monitoring for 'solr.core.control_collection.shard1.replica_n1' (registry 'solr.core.control_collection.shard1.replica_n1') enabled at server: com.sun.jmx.mbeanserver.JmxMBeanServer@493d1327
   [junit4]   2> 435988 INFO  (qtp551078403-1151) [n:127.0.0.1:40901_p c:control_collection s:shard1  x:control_collection_shard1_replica_n1] o.a.s.c.SolrCore [[control_collection_shard1_replica_n1] ] Opening new SolrCore at [/home/jenkins/jenkins-slave/workspace/Lucene-Solr-NightlyTests-8.x/checkout/solr/build/solr-core/test/J1/temp/solr.cloud.ChaosMonkeySafeLeaderWithPullReplicasTest_8834A9C1C6EEB85D-001/control-001/cores/control_collection_shard1_replica_n1], dataDir=[/home/jenkins/jenkins-slave/workspace/Lucene-Solr-NightlyTests-8.x/checkout/solr/build/solr-core/test/J1/../../../../../../../../../../../home/jenkins/jenkins-slave/workspace/Lucene-Solr-NightlyTests-8.x/checkout/solr/build/solr-core/test/J1/temp/solr.cloud.ChaosMonkeySafeLeaderWithPullReplicasTest_8834A9C1C6EEB85D-001/control-001/cores/control_collection_shard1_replica_n1/data/]
   [junit4]   2> 435995 INFO  (qtp551078403-1151) [n:127.0.0.1:40901_p c:control_collection s:shard1  x:control_collection_shard1_replica_n1] o.a.s.u.RandomMergePolicy RandomMergePolicy wrapping class org.apache.lucene.index.TieredMergePolicy: [TieredMergePolicy: maxMergeAtOnce=13, maxMergeAtOnceExplicit=20, maxMergedSegmentMB=0.9541015625, floorSegmentMB=1.544921875, forceMergeDeletesPctAllowed=1.0196649949060188, segmentsPerTier=18.0, maxCFSSegmentSizeMB=8.796093022207999E12, noCFSRatio=0.13621351896583012, deletesPctAllowed=21.287807885716287
   [junit4]   2> 436004 WARN  (qtp551078403-1151) [n:127.0.0.1:40901_p c:control_collection s:shard1  x:control_collection_shard1_replica_n1] o.a.s.c.RequestHandlers INVALID paramSet a in requestHandler {type = requestHandler,name = /dump,class = DumpRequestHandler,attributes = {initParams=a, name=/dump, class=DumpRequestHandler},args = {defaults={a=A,b=B}}}
   [junit4]   2> 436049 INFO  (qtp551078403-1151) [n:127.0.0.1:40901_p c:control_collection s:shard1  x:control_collection_shard1_replica_n1] o.a.s.u.UpdateHandler Using UpdateLog implementation: org.apache.solr.update.UpdateLog
   [junit4]   2> 436049 INFO  (qtp551078403-1151) [n:127.0.0.1:40901_p c:control_collection s:shard1  x:control_collection_shard1_replica_n1] o.a.s.u.UpdateLog Initializing UpdateLog: dataDir= defaultSyncLevel=FLUSH numRecordsToKeep=100 maxNumLogsToKeep=10 numVersionBuckets=65536
   [junit4]   2> 436051 INFO  (qtp551078403-1151) [n:127.0.0.1:40901_p c:control_collection s:shard1  x:control_collection_shard1_replica_n1] o.a.s.u.CommitTracker Hard AutoCommit: disabled
   [junit4]   2> 436051 INFO  (qtp551078403-1151) [n:127.0.0.1:40901_p c:control_collection s:shard1  x:control_collection_shard1_replica_n1] o.a.s.u.CommitTracker Soft AutoCommit: disabled
   [junit4]   2> 436052 INFO  (qtp551078403-1151) [n:127.0.0.1:40901_p c:control_collection s:shard1  x:control_collection_shard1_replica_n1] o.a.s.u.RandomMergePolicy RandomMergePolicy wrapping class org.apache.lucene.index.TieredMergePolicy: [TieredMergePolicy: maxMergeAtOnce=27, maxMergeAtOnceExplicit=31, maxMergedSegmentMB=1.42578125, floorSegmentMB=1.572265625, forceMergeDeletesPctAllowed=24.400921728142553, segmentsPerTier=17.0, maxCFSSegmentSizeMB=8.796093022207999E12, noCFSRatio=0.0, deletesPctAllowed=41.93896045430941
   [junit4]   2> 436053 INFO  (qtp551078403-1151) [n:127.0.0.1:40901_p c:control_collection s:shard1  x:control_collection_shard1_replica_n1] o.a.s.s.SolrIndexSearcher Opening [Searcher@30ddfaf2[control_collection_shard1_replica_n1] main]
   [junit4]   2> 436055 INFO  (qtp551078403-1151) [n:127.0.0.1:40901_p c:control_collection s:shard1  x:control_collection_shard1_replica_n1] o.a.s.r.ManagedResourceStorage Configured ZooKeeperStorageIO with znodeBase: /configs/conf1
   [junit4]   2> 436056 INFO  (qtp551078403-1151) [n:127.0.0.1:40901_p c:control_collection s:shard1  x:control_collection_shard1_replica_n1] o.a.s.r.ManagedResourceStorage Loaded null at path _rest_managed.json using ZooKeeperStorageIO:path=/configs/conf1
   [junit4]   2> 436056 INFO  (qtp551078403-1151) [n:127.0.0.1:40901_p c:control_collection s:shard1  x:control_collection_shard1_replica_n1] o.a.s.h.ReplicationHandler Commits will be reserved for 10000ms.
   [junit4]   2> 436057 INFO  (qtp551078403-1151) [n:127.0.0.1:40901_p c:control_collection s:shard1  x:control_collection_shard1_replica_n1] o.a.s.u.UpdateLog Could not find max version in index or recent updates, using new clock 1626196374626238464
   [junit4]   2> 436060 INFO  (searcherExecutor-246-thread-1-processing-n:127.0.0.1:40901_p x:control_collection_shard1_replica_n1 c:control_collection s:shard1) [n:127.0.0.1:40901_p c:control_collection s:shard1  x:control_collection_shard1_replica_n1] o.a.s.c.SolrCore [control_collection_shard1_replica_n1] Registered new searcher Searcher@30ddfaf2[control_collection_shard1_replica_n1] main{ExitableDirectoryReader(UninvertingDirectoryReader())}
   [junit4]   2> 436064 INFO  (qtp551078403-1151) [n:127.0.0.1:40901_p c:control_collection s:shard1  x:control_collection_shard1_replica_n1] o.a.s.c.ZkShardTerms Successful update of terms at /collections/control_collection/terms/shard1 to Terms{values={core_node2=0}, version=0}
   [junit4]   2> 436064 INFO  (qtp551078403-1151) [n:127.0.0.1:40901_p c:control_collection s:shard1  x:control_collection_shard1_replica_n1] o.a.s.c.ShardLeaderElectionContextBase make sure parent is created /collections/control_collection/leaders/shard1
   [junit4]   2> 436069 INFO  (qtp551078403-1151) [n:127.0.0.1:40901_p c:control_collection s:shard1  x:control_collection_shard1_replica_n1] o.a.s.c.ShardLeaderElectionContext Enough replicas found to continue.
   [junit4]   2> 436069 INFO  (qtp551078403-1151) [n:127.0.0.1:40901_p c:control_collection s:shard1  x:control_collection_shard1_replica_n1] o.a.s.c.ShardLeaderElectionContext I may be the new leader - try and sync
   [junit4]   2> 436069 INFO  (qtp551078403-1151) [n:127.0.0.1:40901_p c:control_collection s:shard1  x:control_collection_shard1_replica_n1] o.a.s.c.SyncStrategy Sync replicas to http://127.0.0.1:40901/p/control_collection_shard1_replica_n1/
   [junit4]   2> 436069 INFO  (qtp551078403-1151) [n:127.0.0.1:40901_p c:control_collection s:shard1  x:control_collection_shard1_replica_n1] o.a.s.c.SyncStrategy Sync Success - now sync replicas to me
   [junit4]   2> 436069 INFO  (qtp551078403-1151) [n:127.0.0.1:40901_p c:control_collection s:shard1  x:control_collection_shard1_replica_n1] o.a.s.c.SyncStrategy http://127.0.0.1:40901/p/control_collection_shard1_replica_n1/ has no replicas
   [junit4]   2> 436069 INFO  (qtp551078403-1151) [n:127.0.0.1:40901_p c:control_collection s:shard1  x:control_collection_shard1_replica_n1] o.a.s.c.ShardLeaderElectionContextBase Creating leader registration node /collections/control_collection/leaders/shard1/leader after winning as /collections/control_collection/leader_elect/shard1/election/74233331212419076-core_node2-n_0000000000
   [junit4]   2> 436083 INFO  (qtp551078403-1151) [n:127.0.0.1:40901_p c:control_collection s:shard1  x:control_collection_shard1_replica_n1] o.a.s.c.ShardLeaderElectionContext I am the new leader: http://127.0.0.1:40901/p/control_collection_shard1_replica_n1/ shard1
   [junit4]   2> 436185 INFO  (zkCallback-351-thread-1) [    ] o.a.s.c.c.ZkStateReader A cluster state change: [WatchedEvent state:SyncConnected type:NodeDataChanged path:/collections/control_collection/state.json] for collection [control_collection] has occurred - updating... (live nodes size: [1])
   [junit4]   2> 436188 INFO  (qtp551078403-1151) [n:127.0.0.1:40901_p c:control_collection s:shard1  x:control_collection_shard1_replica_n1] o.a.s.c.ZkController I am the leader, no recovery necessary
   [junit4]   2> 436192 INFO  (qtp551078403-1151) [n:127.0.0.1:40901_p c:control_collection s:shard1  x:control_collection_shard1_replica_n1] o.a.s.s.HttpSolrCall [admin] webapp=null path=/admin/cores params={qt=/admin/cores&collection.configName=conf1&newCollection=true&name=control_collection_shard1_replica_n1&action=CREATE&numShards=1&collection=control_collection&shard=shard1&wt=javabin&version=2&replicaType=NRT} status=0 QTime=1605
   [junit4]   2> 436198 INFO  (qtp551078403-1148) [n:127.0.0.1:40901_p    ] o.a.s.h.a.CollectionsHandler Wait for new collection to be active for at most 45 seconds. Check all shard replicas
   [junit4]   2> 436299 INFO  (zkCallback-351-thread-2) [    ] o.a.s.c.c.ZkStateReader A cluster state change: [WatchedEvent state:SyncConnected type:NodeDataChanged path:/collections/control_collection/state.json] for collection [control_collection] has occurred - updating... (live nodes size: [1])
   [junit4]   2> 436299 INFO  (zkCallback-351-thread-3) [    ] o.a.s.c.c.ZkStateReader A cluster state change: [WatchedEvent state:SyncConnected type:NodeDataChanged path:/collections/control_collection/state.json] for collection [control_collection] has occurred - updating... (live nodes size: [1])
   [junit4]   2> 436301 INFO  (qtp551078403-1148) [n:127.0.0.1:40901_p    ] o.a.s.s.HttpSolrCall [admin] webapp=null path=/admin/collections params={collection.configName=conf1&name=control_collection&nrtReplicas=1&action=CREATE&numShards=1&createNodeSet=127.0.0.1:40901_p&wt=javabin&version=2} status=0 QTime=1839
   [junit4]   2> 436365 INFO  (zkConnectionManagerCallback-371-thread-1) [    ] o.a.s.c.c.ConnectionManager zkClient has connected
   [junit4]   2> 436367 INFO  (TEST-ChaosMonkeySafeLeaderWithPullReplicasTest.test-seed#[8834A9C1C6EEB85D]) [    ] o.a.s.c.c.ZkStateReader Updated live nodes from ZooKeeper... (0) -> (1)
   [junit4]   2> 436371 INFO  (TEST-ChaosMonkeySafeLeaderWithPullReplicasTest.test-seed#[8834A9C1C6EEB85D]) [    ] o.a.s.c.s.i.ZkClientClusterStateProvider Cluster at 127.0.0.1:41943/solr ready
   [junit4]   2> 436372 INFO  (TEST-ChaosMonkeySafeLeaderWithPullReplicasTest.test-seed#[8834A9C1C6EEB85D]) [    ] o.a.s.c.ChaosMonkey monkey: init - expire sessions:false cause connection loss:false
   [junit4]   2> 436377 INFO  (qtp551078403-1151) [n:127.0.0.1:40901_p    ] o.a.s.h.a.CollectionsHandler Invoked Collection Action :create with params collection.configName=conf1&name=collection1&nrtReplicas=1&action=CREATE&numShards=2&createNodeSet=&stateFormat=1&wt=javabin&version=2 and sendToOCPQueue=true
   [junit4]   2> 436388 INFO  (OverseerThreadFactory-241-thread-2-processing-n:127.0.0.1:40901_p) [n:127.0.0.1:40901_p    ] o.a.s.c.a.c.CreateCollectionCmd Create collection collection1
   [junit4]   2> 436389 INFO  (OverseerCollectionConfigSetProcessor-74233331212419076-127.0.0.1:40901_p-n_0000000000) [n:127.0.0.1:40901_p    ] o.a.s.c.OverseerTaskQueue Response ZK path: /overseer/collection-queue-work/qnr-0000000000 doesn't exist.  Requestor may have disconnected from ZooKeeper
   [junit4]   2> 436600 WARN  (OverseerThreadFactory-241-thread-2-processing-n:127.0.0.1:40901_p) [n:127.0.0.1:40901_p    ] o.a.s.c.a.c.CreateCollectionCmd It is unusual to create a collection (collection1) without cores.
   [junit4]   2> 436603 INFO  (qtp551078403-1151) [n:127.0.0.1:40901_p    ] o.a.s.h.a.CollectionsHandler Wait for new collection to be active for at most 45 seconds. Check all shard replicas
   [junit4]   2> 436604 INFO  (qtp551078403-1151) [n:127.0.0.1:40901_p    ] o.a.s.s.HttpSolrCall [admin] webapp=null path=/admin/collections params={collection.configName=conf1&name=collection1&nrtReplicas=1&action=CREATE&numShards=2&createNodeSet=&stateFormat=1&wt=javabin&version=2} status=0 QTime=226
   [junit4]   2> 436605 INFO  (TEST-ChaosMonkeySafeLeaderWithPullReplicasTest.test-seed#[8834A9C1C6EEB85D]) [    ] o.a.s.c.AbstractFullDistribZkTestBase Creating jetty instances pullReplicaCount=2 numOtherReplicas=2
   [junit4]   2> 436714 INFO  (TEST-ChaosMonkeySafeLeaderWithPullReplicasTest.test-seed#[8834A9C1C6EEB85D]) [    ] o.a.s.c.AbstractFullDistribZkTestBase create jetty 1 in directory /home/jenkins/jenkins-slave/workspace/Lucene-Solr-NightlyTests-8.x/checkout/solr/build/solr-core/test/J1/temp/solr.cloud.ChaosMonkeySafeLeaderWithPullReplicasTest_8834A9C1C6EEB85D-001/shard-1-001 of type NRT
   [junit4]   2> 436717 WARN  (closeThreadPool-372-thread-1) [    ] o.e.j.s.AbstractConnector Ignoring deprecated socket close linger time
   [junit4]   2> 436724 INFO  (closeThreadPool-372-thread-1) [    ] o.a.s.c.s.e.JettySolrRunner Start Jetty (original configured port=0)
   [junit4]   2> 436724 INFO  (closeThreadPool-372-thread-1) [    ] o.a.s.c.s.e.JettySolrRunner Trying to start Jetty on port 0 try number 1 ...
   [junit4]   2> 436724 INFO  (closeThreadPool-372-thread-1) [    ] o.e.j.s.Server jetty-9.4.14.v20181114; built: 2018-11-14T21:20:31.478Z; git: c4550056e785fb5665914545889f21dc136ad9e6; jvm 1.8.0_191-b12
   [junit4]   2> 436725 INFO  (closeThreadPool-372-thread-1) [    ] o.e.j.s.session DefaultSessionIdManager workerName=node0
   [junit4]   2> 436725 INFO  (closeThreadPool-372-thread-1) [    ] o.e.j.s.session No SessionScavenger set, using defaults
   [junit4]   2> 436725 INFO  (closeThreadPool-372-thread-1) [    ] o.e.j.s.session node0 Scavenging every 660000ms
   [junit4]   2> 436725 INFO  (closeThreadPool-372-thread-1) [    ] o.e.j.s.h.ContextHandler Started o.e.j.s.ServletContextHandler@566215e9{/p,null,AVAILABLE}
   [junit4]   2> 436730 INFO  (closeThreadPool-372-thread-1) [    ] o.e.j.s.AbstractConnector Started ServerConnector@23db8b90{HTTP/1.1,[http/1.1, h2c]}{127.0.0.1:43350}
   [junit4]   2> 436730 INFO  (closeThreadPool-372-thread-1) [    ] o.e.j.s.Server Started @436951ms
   [junit4]   2> 436730 INFO  (closeThreadPool-372-thread-1) [    ] o.a.s.c.s.e.JettySolrRunner Jetty properties: {solr.data.dir=/home/jenkins/jenkins-slave/workspace/Lucene-Solr-NightlyTests-8.x/checkout/solr/build/solr-core/test/J1/temp/solr.cloud.ChaosMonkeySafeLeaderWithPullReplicasTest_8834A9C1C6EEB85D-001/tempDir-001/jetty1, replicaType=NRT, solrconfig=solrconfig.xml, hostContext=/p, hostPort=43350, coreRootDirectory=/home/jenkins/jenkins-slave/workspace/Lucene-Solr-NightlyTests-8.x/checkout/solr/build/solr-core/test/J1/../../../../../../../../../../../home/jenkins/jenkins-slave/workspace/Lucene-Solr-NightlyTests-8.x/checkout/solr/build/solr-core/test/J1/temp/solr.cloud.ChaosMonkeySafeLeaderWithPullReplicasTest_8834A9C1C6EEB85D-001/shard-1-001/cores}
   [junit4]   2> 436730 ERROR (closeThreadPool-372-thread-1) [    ] o.a.s.u.StartupLoggingUtils Missing Java Option solr.log.dir. Logging may be missing or incomplete.
   [junit4]   2> 436730 INFO  (closeThreadPool-372-thread-1) [    ] o.a.s.s.SolrDispatchFilter Using logger factory org.apache.logging.slf4j.Log4jLoggerFactory
   [junit4]   2> 436730 INFO  (closeThreadPool-372-thread-1) [    ] o.a.s.s.SolrDispatchFilter  ___      _       Welcome to Apache Solr™ version 8.1.0
   [junit4]   2> 436730 INFO  (closeThreadPool-372-thread-1) [    ] o.a.s.s.SolrDispatchFilter / __| ___| |_ _   Starting in cloud mode on port null
   [junit4]   2> 436730 INFO  (closeThreadPool-372-thread-1) [    ] o.a.s.s.SolrDispatchFilter \__ \/ _ \ | '_|  Install dir: null
   [junit4]   2> 436730 INFO  (closeThreadPool-372-thread-1) [    ] o.a.s.s.SolrDispatchFilter |___/\___/_|_|    Start time: 2019-02-22T18:55:16.587Z
   [junit4]   2> 436753 INFO  (zkConnectionManagerCallback-374-thread-1) [    ] o.a.s.c.c.ConnectionManager zkClient has connected
   [junit4]   2> 436756 INFO  (closeThreadPool-372-thread-1) [    ] o.a.s.s.SolrDispatchFilter Loading solr.xml from SolrHome (not found in ZooKeeper)
   [junit4]   2> 436756 INFO  (closeThreadPool-372-thread-1) [    ] o.a.s.c.SolrXmlConfig Loading container configuration from /home/jenkins/jenkins-slave/workspace/Lucene-Solr-NightlyTests-8.x/checkout/solr/build/solr-core/test/J1/temp/solr.cloud.ChaosMonkeySafeLeaderWithPullReplicasTest_8834A9C1C6EEB85D-001/shard-1-001/solr.xml
   [junit4]   2> 436760 INFO  (closeThreadPool-372-thread-1) [    ] o.a.s.c.SolrXmlConfig Configuration parameter autoReplicaFailoverWorkLoopDelay is ignored
   [junit4]   2> 436760 INFO  (closeThreadPool-372-thread-1) [    ] o.a.s.c.SolrXmlConfig Configuration parameter autoReplicaFailoverBadNodeExpiration is ignored
   [junit4]   2> 436761 INFO  (closeThreadPool-372-thread-1) [    ] o.a.s.c.SolrXmlConfig MBean server found: com.sun.jmx.mbeanserver.JmxMBeanServer@493d1327, but no JMX reporters were configured - adding default JMX reporter.
   [junit4]   2> 436831 INFO  (closeThreadPool-372-thread-1) [    ] o.a.s.h.c.HttpShardHandlerFactory Host whitelist initialized: WhitelistHostChecker [whitelistHosts=null, whitelistHostCheckingEnabled=false]
   [junit4]   2> 436840 WARN  (closeThreadPool-372-thread-1) [    ] o.e.j.u.s.S.config No Client EndPointIdentificationAlgorithm configured for SslContextFactory@2848e31a[provider=null,keyStore=null,trustStore=null]
   [junit4]   2> 436856 INFO  (TEST-ChaosMonkeySafeLeaderWithPullReplicasTest.test-seed#[8834A9C1C6EEB85D]) [    ] o.a.s.c.AbstractFullDistribZkTestBase create jetty 2 in directory /home/jenkins/jenkins-slave/workspace/Lucene-Solr-NightlyTests-8.x/checkout/solr/build/solr-core/test/J1/temp/solr.cloud.ChaosMonkeySafeLeaderWithPullReplicasTest_8834A9C1C6EEB85D-001/shard-2-001 of type NRT
   [junit4]   2> 436862 WARN  (closeThreadPool-372-thread-1) [    ] o.e.j.u.s.S.config No Client EndPointIdentificationAlgorithm configured for SslContextFactory@3d50a51[provider=null,keyStore=null,trustStore=null]
   [junit4]   2> 436862 INFO  (closeThreadPool-372-thread-1) [    ] o.a.s.c.ZkContainer Zookeeper client=127.0.0.1:41943/solr
   [junit4]   2> 436878 INFO  (zkConnectionManagerCallback-380-thread-1) [    ] o.a.s.c.c.ConnectionManager zkClient has connected
   [junit4]   2> 436880 WARN  (closeThreadPool-372-thread-2) [    ] o.e.j.s.AbstractConnector Ignoring deprecated socket close linger time
   [junit4]   2> 436881 INFO  (closeThreadPool-372-thread-2) [    ] o.a.s.c.s.e.JettySolrRunner Start Jetty (original configured port=0)
   [junit4]   2> 436881 INFO  (closeThreadPool-372-thread-2) [    ] o.a.s.c.s.e.JettySolrRunner Trying to start Jetty on port 0 try number 1 ...
   [junit4]   2> 436882 INFO  (closeThreadPool-372-thread-2) [    ] o.e.j.s.Server jetty-9.4.14.v20181114; built: 2018-11-14T21:20:31.478Z; git: c4550056e785fb5665914545889f21dc136ad9e6; jvm 1.8.0_191-b12
   [junit4]   2> 436934 INFO  (zkConnectionManagerCallback-382-thread-1) [    ] o.a.s.c.c.ConnectionManager zkClient has connected
   [junit4]   2> 436935 INFO  (closeThreadPool-372-thread-2) [    ] o.e.j.s.session DefaultSessionIdManager workerName=node0
   [junit4]   2> 436935 INFO  (closeThreadPool-372-thread-2) [    ] o.e.j.s.session No SessionScavenger set, using defaults
   [junit4]   2> 436935 INFO  (closeThreadPool-372-thread-2) [    ] o.e.j.s.session node0 Scavenging every 660000ms
   [junit4]   2> 436936 INFO  (closeThreadPool-372-thread-2) [    ] o.e.j.s.h.ContextHandler Started o.e.j.s.ServletContextHandler@26e9d611{/p,null,AVAILABLE}
   [junit4]   2> 436949 INFO  (closeThreadPool-372-thread-1) [n:127.0.0.1:43350_p    ] o.a.s.c.c.ZkStateReader Updated live nodes from ZooKeeper... (0) -> (1)
   [junit4]   2> 436952 INFO  (closeThreadPool-372-thread-1) [n:127.0.0.1:43350_p    ] o.a.s.c.ZkController Publish node=127.0.0.1:43350_p as DOWN
   [junit4]   2> 436957 INFO  (closeThreadPool-372-thread-1) [n:127.0.0.1:43350_p    ] o.a.s.c.TransientSolrCoreCacheDefault Allocating transient cache for 4 transient cores
   [junit4]   2> 436957 INFO  (closeThreadPool-372-thread-1) [n:127.0.0.1:43350_p    ] o.a.s.c.ZkController Register node as live in ZooKeeper:/live_nodes/127.0.0.1:43350_p
   [junit4]   2> 436958 INFO  (zkCallback-358-thread-1) [    ] o.a.s.c.c.ZkStateReader Updated live nodes from ZooKeeper... (1) -> (2)
   [junit4]   2> 436958 INFO  (zkCallback-370-thread-1) [    ] o.a.s.c.c.ZkStateReader Updated live nodes from ZooKeeper... (1) -> (2)
   [junit4]   2> 436958 INFO  (zkCallback-351-thread-2) [    ] o.a.s.c.c.ZkStateReader Updated live nodes from ZooKeeper... (1) -> (2)
   [junit4]   2> 436963 INFO  (zkCallback-381-thread-1) [    ] o.a.s.c.c.ZkStateReader Updated live nodes from ZooKeeper... (1) -> (2)
   [junit4]   2> 436967 INFO  (closeThreadPool-372-thread-2) [    ] o.e.j.s.AbstractConnector Started ServerConnector@270413ab{HTTP/1.1,[http/1.1, h2c]}{127.0.0.1:33205}
   [junit4]   2> 436967 INFO  (closeThreadPool-372-thread-2) [    ] o.e.j.s.Server Started @437188ms
   [junit4]   2> 436968 INFO  (closeThreadPool-372-thread-2) [    ] o.a.s.c.s.e.JettySolrRunner Jetty properties: {solr.data.dir=/home/jenkins/jenkins-slave/workspace/Lucene-Solr-NightlyTests-8.x/checkout/solr/build/solr-core/test/J1/temp/solr.cloud.ChaosMonkeySafeLeaderWithPullReplicasTest_8834A9C1C6EEB85D-001/tempDir-001/jetty2, replicaType=NRT, solrconfig=solrconfig.xml, hostContext=/p, hostPort=33205, coreRootDirectory=/home/jenkins/jenkins-slave/workspace/Lucene-Solr-NightlyTests-8.x/checkout/solr/build/solr-core/test/J1/../../../../../../../../../../../home/jenkins/jenkins-slave/workspace/Lucene-Solr-NightlyTests-8.x/checkout/solr/build/solr-core/test/J1/temp/solr.cloud.ChaosMonkeySafeLeaderWithPullReplicasTest_8834A9C1C6EEB85D-001/shard-2-001/cores}
   [junit4]   2> 436968 ERROR (closeThreadPool-372-thread-2) [    ] o.a.s.u.StartupLoggingUtils Missing Java Option solr.log.dir. Logging may be missing or incomplete.
   [junit4]   2> 436968 INFO  (closeThreadPool-372-thread-2) [    ] o.a.s.s.SolrDispatchFilter Using logger factory org.apache.logging.slf4j.Log4jLoggerFactory
   [junit4]   2> 436968 INFO  (closeThreadPool-372-thread-2) [    ] o.a.s.s.SolrDispatchFilter  ___      _       Welcome to Apache Solr™ version 8.1.0
   [junit4]   2> 436968 INFO  (closeThreadPool-372-thread-2) [    ] o.a.s.s.SolrDispatchFilter / __| ___| |_ _   Starting in cloud mode on port null
   [junit4]   2> 436968 INFO  (closeThreadPool-372-thread-2) [    ] o.a.s.s.SolrDispatchFilter \__ \/ _ \ | '_|  Install dir: null
   [junit4]   2> 436968 INFO  (closeThreadPool-372-thread-2) [    ] o.a.s.s.SolrDispatchFilter |___/\___/_|_|    Start time: 2019-02-22T18:55:16.825Z
   [junit4]   2> 436990 INFO  (zkConnectionManagerCallback-386-thread-1) [    ] o.a.s.c.c.ConnectionManager zkClient has connected
   [junit4]   2> 436993 INFO  (closeThreadPool-372-thread-2) [    ] o.a.s.s.SolrDispatchFilter Loading solr.xml from SolrHome (not found in ZooKeeper)
   [junit4]   2> 436993 INFO  (closeThreadPool-372-thread-2) [    ] o.a.s.c.SolrXmlConfig Loading container configuration from /home/jenkins/jenkins-slave/workspace/Lucene-Solr-NightlyTests-8.x/checkout/solr/build/solr-core/test/J1/temp/solr.cloud.ChaosMonkeySafeLeaderWithPullReplicasTest_8834A9C1C6EEB85D-001/shard-2-001/solr.xml
   [junit4]   2> 436997 INFO  (closeThreadPool-372-thread-2) [    ] o.a.s.c.SolrXmlConfig Configuration parameter autoReplicaFailoverWorkLoopDelay is ignored
   [junit4]   2> 436997 INFO  (closeThreadPool-372-thread-2) [    ] o.a.s.c.SolrXmlConfig Configuration parameter autoReplicaFailoverBadNodeExpiration is ignored
   [junit4]   2> 436999 INFO  (closeThreadPool-372-thread-2) [    ] o.a.s.c.SolrXmlConfig MBean server found: com.sun.jmx.mbeanserver.JmxMBeanServer@493d1327, but no JMX reporters were configured - adding default JMX reporter.
   [junit4]   2> 437070 INFO  (zkConnectionManagerCallback-391-thread-1) [    ] o.a.s.c.c.ConnectionManager zkClient has connected
   [junit4]   2> 437078 INFO  (closeThreadPool-372-thread-1) [n:127.0.0.1:43350_p    ] o.a.s.c.c.ZkStateReader Updated live nodes from ZooKeeper... (0) -> (2)
   [junit4]   2> 437079 INFO  (closeThreadPool-372-thread-1) [n:127.0.0.1:43350_p    ] o.a.s.c.s.i.ZkClientClusterStateProvider Cluster at 127.0.0.1:41943/solr ready
   [junit4]   2> 437102 INFO  (closeThreadPool-372-thread-1) [n:127.0.0.1:43350_p    ] o.a.s.h.a.MetricsHistoryHandler No .system collection, keeping metrics history in memory.
   [junit4]   2> 437117 INFO  (closeThreadPool-372-thread-1) [n:127.0.0.1:43350_p    ] o.a.s.m.r.SolrJmxReporter JMX monitoring for 'solr.node' (registry 'solr.node') enabled at server: com.sun.jmx.mbeanserver.JmxMBeanServer@493d1327
   [junit4]   2> 437125 INFO  (closeThreadPool-372-thread-1) [n:127.0.0.1:43350_p    ] o.a.s.m.r.SolrJmxReporter JMX monitoring for 'solr.jvm' (registry 'solr.jvm') enabled at server: com.sun.jmx.mbeanserver.JmxMBeanServer@493d1327
   [junit4]   2> 437125 INFO  (closeThreadPool-372-thread-1) [n:127.0.0.1:43350_p    ] o.a.s.m.r.SolrJmxReporter JMX monitoring for 'solr.jetty' (registry 'solr.jetty') enabled at server: com.sun.jmx.mbeanserver.JmxMBeanServer@493d1327
   [junit4]   2> 437126 INFO  (closeThreadPool-372-thread-1) [n:127.0.0.1:43350_p    ] o.a.s.c.CorePropertiesLocator Found 0 core definitions underneath /home/jenkins/jenkins-slave/workspace/Lucene-Solr-NightlyTests-8.x/checkout/solr/build/solr-core/test/J1/../../../../../../../../../../../home/jenkins/jenkins-slave/workspace/Lucene-Solr-NightlyTests-8.x/checkout/solr/build/solr-core/test/J1/temp/solr.cloud.ChaosMonkeySafeLeaderWithPullReplicasTest_8834A9C1C6EEB85D-001/shard-1-001/cores
   [junit4]   2> 437128 INFO  (TEST-ChaosMonkeySafeLeaderWithPullReplicasTest.test-seed#[8834A9C1C6EEB85D]) [    ] o.a.s.c.AbstractFullDistribZkTestBase create jetty 3 in directory /home/jenkins/jenkins-slave/workspace/Lucene-Solr-NightlyTests-8.x/checkout/solr/build/solr-core/test/J1/temp/solr.cloud.ChaosMonkeySafeLeaderWithPullReplicasTest_8834A9C1C6EEB85D-001/shard-3-001 of type PULL
   [junit4]   2> 437150 WARN  (closeThreadPool-372-thread-3) [    ] o.e.j.s.AbstractConnector Ignoring deprecated socket close linger time
   [junit4]   2> 437157 INFO  (closeThreadPool-372-thread-3) [    ] o.a.s.c.s.e.JettySolrRunner Start Jetty (original configured port=0)
   [junit4]   2> 437157 INFO  (closeThreadPool-372-thread-3) [    ] o.a.s.c.s.e.JettySolrRunner Trying to start Jetty on port 0 try number 1 ...
   [junit4]   2> 437157 INFO  (closeThreadPool-372-thread-3) [    ] o.e.j.s.Server jetty-9.4.14.v20181114; built: 2018-11-14T21:20:31.478Z; git: c4550056e785fb5665914545889f21dc136ad9e6; jvm 1.8.0_191-b12
   [junit4]   2> 437158 INFO  (closeThreadPool-372-thread-3) [    ] o.e.j.s.session DefaultSessionIdManager workerName=node0
   [junit4]   2> 437158 INFO  (closeThreadPool-372-thread-3) [    ] o.e.j.s.session No SessionScavenger set, using defaults
   [junit4]   2> 437158 INFO  (closeThreadPool-372-thread-3) [    ] o.e.j.s.session node0 Scavenging every 600000ms
   [junit4]   2> 437159 INFO  (closeThreadPool-372-thread-3) [    ] o.e.j.s.h.ContextHandler Started o.e.j.s.ServletContextHandler@688bd9f5{/p,null,AVAILABLE}
   [junit4]   2> 437166 INFO  (closeThreadPool-372-thread-3) [    ] o.e.j.s.AbstractConnector Started ServerConnector@70a6100c{HTTP/1.1,[http/1.1, h2c]}{127.0.0.1:33941}
   [junit4]   2> 437166 INFO  (closeThreadPool-372-thread-3) [    ] o.e.j.s.Server Started @437387ms
   [junit4]   2> 437166 INFO  (closeThreadPool-372-thread-3) [    ] o.a.s.c.s.e.JettySolrRunner Jetty properties: {solr.data.dir=/home/jenkins/jenkins-slave/workspace/Lucene-Solr-NightlyTests-8.x/checkout/solr/build/solr-core/test/J1/temp/solr.cloud.ChaosMonkeySafeLeaderWithPullReplicasTest_8834A9C1C6EEB85D-001/tempDir-001/jetty3, replicaType=PULL, solrconfig=solrconfig.xml, hostContext=/p, hostPort=33941, coreRootDirectory=/home/jenkins/jenkins-slave/workspace/Lucene-Solr-NightlyTests-8.x/checkout/solr/build/solr-core/test/J1/../../../../../../../../../../../home/jenkins/jenkins-slave/workspace/Lucene-Solr-NightlyTests-8.x/checkout/solr/build/solr-core/test/J1/temp/solr.cloud.ChaosMonkeySafeLeaderWithPullReplicasTest_8834A9C1C6EEB85D-001/shard-3-001/cores}
   [junit4]   2> 437166 ERROR (closeThreadPool-372-thread-3) [    ] o.a.s.u.StartupLoggingUtils Missing Java Option solr.log.dir. Logging may be missing or incomplete.
   [junit4]   2> 437166 INFO  (closeThreadPool-372-thread-3) [    ] o.a.s.s.SolrDispatchFilter Using logger factory org.apache.logging.slf4j.Log4jLoggerFactory
   [junit4]   2> 437166 INFO  (closeThreadPool-372-thread-3) [    ] o.a.s.s.SolrDispatchFilter  ___      _       Welcome to Apache Solr™ version 8.1.0
   [junit4]   2> 437166 INFO  (closeThreadPool-372-thread-3) [    ] o.a.s.s.SolrDispatchFilter / __| ___| |_ _   Starting in cloud mode on port null
   [junit4]   2> 437166 INFO  (closeThreadPool-372-thread-3) [    ] o.a.s.s.SolrDispatchFilter \__ \/ _ \ | '_|  Install dir: null
   [junit4]   2> 437166 INFO  (closeThreadPool-372-thread-3) [    ] o.a.s.s.SolrDispatchFilter |___/\___/_|_|    Start time: 2019-02-22T18:55:17.023Z
   [junit4]   2> 437197 INFO  (closeThreadPool-372-thread-2) [    ] o.a.s.h.c.HttpShardHandlerFactory Host whitelist initialized: WhitelistHostChecker [whitelistHosts=null, whitelistHostCheckingEnabled=false]
   [junit4]   2> 437198 INFO  (zkConnectionManagerCallback-394-thread-1) [    ] o.a.s.c.c.Connectio

[...truncated too long message...]

source] Do not set property disallowed.ivy.jars.list as its length is 0.

-ivy-fail-disallowed-ivy-version:

ivy-fail:

ivy-configure:
[ivy:configure] :: loading settings :: file = /home/jenkins/jenkins-slave/workspace/Lucene-Solr-NightlyTests-8.x/checkout/lucene/top-level-ivy-settings.xml

resolve:

ivy-availability-check:
[loadresource] Do not set property disallowed.ivy.jars.list as its length is 0.

-ivy-fail-disallowed-ivy-version:

ivy-fail:

ivy-fail:

ivy-configure:
[ivy:configure] :: loading settings :: file = /home/jenkins/jenkins-slave/workspace/Lucene-Solr-NightlyTests-8.x/checkout/lucene/top-level-ivy-settings.xml

resolve:

ivy-availability-check:
[loadresource] Do not set property disallowed.ivy.jars.list as its length is 0.

-ivy-fail-disallowed-ivy-version:

ivy-fail:

ivy-configure:
[ivy:configure] :: loading settings :: file = /home/jenkins/jenkins-slave/workspace/Lucene-Solr-NightlyTests-8.x/checkout/lucene/top-level-ivy-settings.xml

resolve:

ivy-availability-check:
[loadresource] Do not set property disallowed.ivy.jars.list as its length is 0.

-ivy-fail-disallowed-ivy-version:

ivy-fail:

ivy-fail:

ivy-configure:
[ivy:configure] :: loading settings :: file = /home/jenkins/jenkins-slave/workspace/Lucene-Solr-NightlyTests-8.x/checkout/lucene/top-level-ivy-settings.xml

resolve:

ivy-availability-check:
[loadresource] Do not set property disallowed.ivy.jars.list as its length is 0.

-ivy-fail-disallowed-ivy-version:

ivy-fail:

ivy-fail:

ivy-configure:
[ivy:configure] :: loading settings :: file = /home/jenkins/jenkins-slave/workspace/Lucene-Solr-NightlyTests-8.x/checkout/lucene/top-level-ivy-settings.xml

resolve:

ivy-availability-check:
[loadresource] Do not set property disallowed.ivy.jars.list as its length is 0.

-ivy-fail-disallowed-ivy-version:

ivy-fail:

ivy-fail:

ivy-configure:
[ivy:configure] :: loading settings :: file = /home/jenkins/jenkins-slave/workspace/Lucene-Solr-NightlyTests-8.x/checkout/lucene/top-level-ivy-settings.xml

resolve:

ivy-availability-check:
[loadresource] Do not set property disallowed.ivy.jars.list as its length is 0.

-ivy-fail-disallowed-ivy-version:

ivy-fail:

ivy-fail:

ivy-configure:
[ivy:configure] :: loading settings :: file = /home/jenkins/jenkins-slave/workspace/Lucene-Solr-NightlyTests-8.x/checkout/lucene/top-level-ivy-settings.xml

resolve:

ivy-availability-check:
[loadresource] Do not set property disallowed.ivy.jars.list as its length is 0.

-ivy-fail-disallowed-ivy-version:

ivy-fail:

ivy-fail:

ivy-configure:
[ivy:configure] :: loading settings :: file = /home/jenkins/jenkins-slave/workspace/Lucene-Solr-NightlyTests-8.x/checkout/lucene/top-level-ivy-settings.xml

resolve:

ivy-availability-check:
[loadresource] Do not set property disallowed.ivy.jars.list as its length is 0.

-ivy-fail-disallowed-ivy-version:

ivy-fail:

ivy-fail:

ivy-configure:
[ivy:configure] :: loading settings :: file = /home/jenkins/jenkins-slave/workspace/Lucene-Solr-NightlyTests-8.x/checkout/lucene/top-level-ivy-settings.xml

resolve:

ivy-availability-check:
[loadresource] Do not set property disallowed.ivy.jars.list as its length is 0.

-ivy-fail-disallowed-ivy-version:

ivy-fail:

ivy-fail:

ivy-configure:
[ivy:configure] :: loading settings :: file = /home/jenkins/jenkins-slave/workspace/Lucene-Solr-NightlyTests-8.x/checkout/lucene/top-level-ivy-settings.xml

resolve:

ivy-availability-check:
[loadresource] Do not set property disallowed.ivy.jars.list as its length is 0.

-ivy-fail-disallowed-ivy-version:

ivy-fail:

ivy-fail:

ivy-configure:
[ivy:configure] :: loading settings :: file = /home/jenkins/jenkins-slave/workspace/Lucene-Solr-NightlyTests-8.x/checkout/lucene/top-level-ivy-settings.xml

resolve:

ivy-availability-check:
[loadresource] Do not set property disallowed.ivy.jars.list as its length is 0.

-ivy-fail-disallowed-ivy-version:

ivy-fail:

ivy-fail:

ivy-configure:
[ivy:configure] :: loading settings :: file = /home/jenkins/jenkins-slave/workspace/Lucene-Solr-NightlyTests-8.x/checkout/lucene/top-level-ivy-settings.xml

resolve:

ivy-availability-check:
[loadresource] Do not set property disallowed.ivy.jars.list as its length is 0.

-ivy-fail-disallowed-ivy-version:

ivy-fail:

ivy-fail:

ivy-configure:
[ivy:configure] :: loading settings :: file = /home/jenkins/jenkins-slave/workspace/Lucene-Solr-NightlyTests-8.x/checkout/lucene/top-level-ivy-settings.xml

resolve:

jar-checksums:
    [mkdir] Created dir: /home/jenkins/jenkins-slave/workspace/Lucene-Solr-NightlyTests-8.x/checkout/solr/null188885709
     [copy] Copying 238 files to /home/jenkins/jenkins-slave/workspace/Lucene-Solr-NightlyTests-8.x/checkout/solr/null188885709
   [delete] Deleting directory /home/jenkins/jenkins-slave/workspace/Lucene-Solr-NightlyTests-8.x/checkout/solr/null188885709

check-working-copy:
[ivy:cachepath] :: resolving dependencies :: org.eclipse.jgit#org.eclipse.jgit-caller;working
[ivy:cachepath] 	confs: [default]
[ivy:cachepath] 	found org.eclipse.jgit#org.eclipse.jgit;4.6.0.201612231935-r in public
[ivy:cachepath] 	found com.jcraft#jsch;0.1.53 in public
[ivy:cachepath] 	found com.googlecode.javaewah#JavaEWAH;1.1.6 in public
[ivy:cachepath] 	found org.apache.httpcomponents#httpclient;4.3.6 in public
[ivy:cachepath] 	found org.apache.httpcomponents#httpcore;4.3.3 in public
[ivy:cachepath] 	found commons-logging#commons-logging;1.1.3 in public
[ivy:cachepath] 	found commons-codec#commons-codec;1.6 in public
[ivy:cachepath] 	found org.slf4j#slf4j-api;1.7.2 in public
[ivy:cachepath] :: resolution report :: resolve 71ms :: artifacts dl 3ms
	---------------------------------------------------------------------
	|                  |            modules            ||   artifacts   |
	|       conf       | number| search|dwnlded|evicted|| number|dwnlded|
	---------------------------------------------------------------------
	|      default     |   8   |   0   |   0   |   0   ||   8   |   0   |
	---------------------------------------------------------------------
[wc-checker] Initializing working copy...
[wc-checker] SLF4J: Failed to load class "org.slf4j.impl.StaticLoggerBinder".
[wc-checker] SLF4J: Defaulting to no-operation (NOP) logger implementation
[wc-checker] SLF4J: See http://www.slf4j.org/codes.html#StaticLoggerBinder for further details.
[wc-checker] Checking working copy status...

-jenkins-base:

BUILD SUCCESSFUL
Total time: 556 minutes 39 seconds
Archiving artifacts
java.lang.InterruptedException: no matches found within 10000
	at hudson.FilePath$ValidateAntFileMask.hasMatch(FilePath.java:2847)
	at hudson.FilePath$ValidateAntFileMask.invoke(FilePath.java:2726)
	at hudson.FilePath$ValidateAntFileMask.invoke(FilePath.java:2707)
	at hudson.FilePath$FileCallableWrapper.call(FilePath.java:3086)
Also:   hudson.remoting.Channel$CallSiteStackTrace: Remote call to lucene2
		at hudson.remoting.Channel.attachCallSiteStackTrace(Channel.java:1741)
		at hudson.remoting.UserRequest$ExceptionResponse.retrieve(UserRequest.java:357)
		at hudson.remoting.Channel.call(Channel.java:955)
		at hudson.FilePath.act(FilePath.java:1072)
		at hudson.FilePath.act(FilePath.java:1061)
		at hudson.FilePath.validateAntFileMask(FilePath.java:2705)
		at hudson.tasks.ArtifactArchiver.perform(ArtifactArchiver.java:243)
		at hudson.tasks.BuildStepCompatibilityLayer.perform(BuildStepCompatibilityLayer.java:81)
		at hudson.tasks.BuildStepMonitor$1.perform(BuildStepMonitor.java:20)
		at hudson.model.AbstractBuild$AbstractBuildExecution.perform(AbstractBuild.java:744)
		at hudson.model.AbstractBuild$AbstractBuildExecution.performAllBuildSteps(AbstractBuild.java:690)
		at hudson.model.Build$BuildExecution.post2(Build.java:186)
		at hudson.model.AbstractBuild$AbstractBuildExecution.post(AbstractBuild.java:635)
		at hudson.model.Run.execute(Run.java:1835)
		at hudson.model.FreeStyleBuild.run(FreeStyleBuild.java:43)
		at hudson.model.ResourceController.execute(ResourceController.java:97)
		at hudson.model.Executor.run(Executor.java:429)
Caused: hudson.FilePath$TunneledInterruptedException
	at hudson.FilePath$FileCallableWrapper.call(FilePath.java:3088)
	at hudson.remoting.UserRequest.perform(UserRequest.java:212)
	at hudson.remoting.UserRequest.perform(UserRequest.java:54)
	at hudson.remoting.Request$2.run(Request.java:369)
	at hudson.remoting.InterceptingExecutorService$1.call(InterceptingExecutorService.java:72)
	at java.util.concurrent.FutureTask.run(FutureTask.java:266)
	at java.util.concurrent.ThreadPoolExecutor.runWorker(ThreadPoolExecutor.java:1142)
	at java.util.concurrent.ThreadPoolExecutor$Worker.run(ThreadPoolExecutor.java:617)
	at java.lang.Thread.run(Thread.java:748)
Caused: java.lang.InterruptedException: java.lang.InterruptedException: no matches found within 10000
	at hudson.FilePath.act(FilePath.java:1074)
	at hudson.FilePath.act(FilePath.java:1061)
	at hudson.FilePath.validateAntFileMask(FilePath.java:2705)
	at hudson.tasks.ArtifactArchiver.perform(ArtifactArchiver.java:243)
	at hudson.tasks.BuildStepCompatibilityLayer.perform(BuildStepCompatibilityLayer.java:81)
	at hudson.tasks.BuildStepMonitor$1.perform(BuildStepMonitor.java:20)
	at hudson.model.AbstractBuild$AbstractBuildExecution.perform(AbstractBuild.java:744)
	at hudson.model.AbstractBuild$AbstractBuildExecution.performAllBuildSteps(AbstractBuild.java:690)
	at hudson.model.Build$BuildExecution.post2(Build.java:186)
	at hudson.model.AbstractBuild$AbstractBuildExecution.post(AbstractBuild.java:635)
	at hudson.model.Run.execute(Run.java:1835)
	at hudson.model.FreeStyleBuild.run(FreeStyleBuild.java:43)
	at hudson.model.ResourceController.execute(ResourceController.java:97)
	at hudson.model.Executor.run(Executor.java:429)
No artifacts found that match the file pattern "**/*.events,heapdumps/**,**/hs_err_pid*". Configuration error?
Recording test results
Build step 'Publish JUnit test result report' changed build result to UNSTABLE
Email was triggered for: Unstable (Test Failures)
Sending email for trigger: Unstable (Test Failures)

Mime
View raw message