lucene-dev mailing list archives

Site index · List index
Message view « Date » · « Thread »
Top « Date » · « Thread »
From Apache Jenkins Server <jenk...@builds.apache.org>
Subject [JENKINS] Lucene-Solr-BadApples-NightlyTests-7.x - Build # 47 - Still unstable
Date Thu, 07 Feb 2019 03:21:30 GMT
Build: https://builds.apache.org/job/Lucene-Solr-BadApples-NightlyTests-7.x/47/

6 tests failed.
FAILED:  org.apache.solr.cloud.LIROnShardRestartTest.testAllReplicasInLIR

Error Message:
Error from server at http://127.0.0.1:33114/solr: KeeperErrorCode = Session expired for /overseer/collection-queue-work/qnr-

Stack Trace:
org.apache.solr.client.solrj.impl.HttpSolrClient$RemoteSolrException: Error from server at http://127.0.0.1:33114/solr: KeeperErrorCode = Session expired for /overseer/collection-queue-work/qnr-
	at __randomizedtesting.SeedInfo.seed([10B31070AB4A4496:4A2B2AB6D5CA2371]:0)
	at org.apache.solr.client.solrj.impl.HttpSolrClient.executeMethod(HttpSolrClient.java:643)
	at org.apache.solr.client.solrj.impl.HttpSolrClient.request(HttpSolrClient.java:255)
	at org.apache.solr.client.solrj.impl.HttpSolrClient.request(HttpSolrClient.java:244)
	at org.apache.solr.client.solrj.impl.LBHttpSolrClient.doRequest(LBHttpSolrClient.java:484)
	at org.apache.solr.client.solrj.impl.LBHttpSolrClient.request(LBHttpSolrClient.java:414)
	at org.apache.solr.client.solrj.impl.CloudSolrClient.sendRequest(CloudSolrClient.java:1110)
	at org.apache.solr.client.solrj.impl.CloudSolrClient.requestWithRetryOnStaleState(CloudSolrClient.java:884)
	at org.apache.solr.client.solrj.impl.CloudSolrClient.request(CloudSolrClient.java:817)
	at org.apache.solr.client.solrj.SolrRequest.process(SolrRequest.java:194)
	at org.apache.solr.client.solrj.SolrRequest.process(SolrRequest.java:211)
	at org.apache.solr.cloud.LIROnShardRestartTest.testAllReplicasInLIR(LIROnShardRestartTest.java:175)
	at sun.reflect.NativeMethodAccessorImpl.invoke0(Native Method)
	at sun.reflect.NativeMethodAccessorImpl.invoke(NativeMethodAccessorImpl.java:62)
	at sun.reflect.DelegatingMethodAccessorImpl.invoke(DelegatingMethodAccessorImpl.java:43)
	at java.lang.reflect.Method.invoke(Method.java:498)
	at com.carrotsearch.randomizedtesting.RandomizedRunner.invoke(RandomizedRunner.java:1750)
	at com.carrotsearch.randomizedtesting.RandomizedRunner$8.evaluate(RandomizedRunner.java:938)
	at com.carrotsearch.randomizedtesting.RandomizedRunner$9.evaluate(RandomizedRunner.java:974)
	at com.carrotsearch.randomizedtesting.RandomizedRunner$10.evaluate(RandomizedRunner.java:988)
	at com.carrotsearch.randomizedtesting.rules.SystemPropertiesRestoreRule$1.evaluate(SystemPropertiesRestoreRule.java:57)
	at org.apache.lucene.util.TestRuleSetupTeardownChained$1.evaluate(TestRuleSetupTeardownChained.java:49)
	at org.apache.lucene.util.AbstractBeforeAfterRule$1.evaluate(AbstractBeforeAfterRule.java:45)
	at org.apache.lucene.util.TestRuleThreadAndTestName$1.evaluate(TestRuleThreadAndTestName.java:48)
	at org.apache.lucene.util.TestRuleIgnoreAfterMaxFailures$1.evaluate(TestRuleIgnoreAfterMaxFailures.java:64)
	at org.apache.lucene.util.TestRuleMarkFailure$1.evaluate(TestRuleMarkFailure.java:47)
	at com.carrotsearch.randomizedtesting.rules.StatementAdapter.evaluate(StatementAdapter.java:36)
	at com.carrotsearch.randomizedtesting.ThreadLeakControl$StatementRunner.run(ThreadLeakControl.java:368)
	at com.carrotsearch.randomizedtesting.ThreadLeakControl.forkTimeoutingTask(ThreadLeakControl.java:817)
	at com.carrotsearch.randomizedtesting.ThreadLeakControl$3.evaluate(ThreadLeakControl.java:468)
	at com.carrotsearch.randomizedtesting.RandomizedRunner.runSingleTest(RandomizedRunner.java:947)
	at com.carrotsearch.randomizedtesting.RandomizedRunner$5.evaluate(RandomizedRunner.java:832)
	at com.carrotsearch.randomizedtesting.RandomizedRunner$6.evaluate(RandomizedRunner.java:883)
	at com.carrotsearch.randomizedtesting.RandomizedRunner$7.evaluate(RandomizedRunner.java:894)
	at com.carrotsearch.randomizedtesting.rules.StatementAdapter.evaluate(StatementAdapter.java:36)
	at com.carrotsearch.randomizedtesting.rules.SystemPropertiesRestoreRule$1.evaluate(SystemPropertiesRestoreRule.java:57)
	at org.apache.lucene.util.AbstractBeforeAfterRule$1.evaluate(AbstractBeforeAfterRule.java:45)
	at com.carrotsearch.randomizedtesting.rules.StatementAdapter.evaluate(StatementAdapter.java:36)
	at org.apache.lucene.util.TestRuleStoreClassName$1.evaluate(TestRuleStoreClassName.java:41)
	at com.carrotsearch.randomizedtesting.rules.NoShadowingOrOverridesOnMethodsRule$1.evaluate(NoShadowingOrOverridesOnMethodsRule.java:40)
	at com.carrotsearch.randomizedtesting.rules.NoShadowingOrOverridesOnMethodsRule$1.evaluate(NoShadowingOrOverridesOnMethodsRule.java:40)
	at com.carrotsearch.randomizedtesting.rules.StatementAdapter.evaluate(StatementAdapter.java:36)
	at com.carrotsearch.randomizedtesting.rules.StatementAdapter.evaluate(StatementAdapter.java:36)
	at com.carrotsearch.randomizedtesting.rules.StatementAdapter.evaluate(StatementAdapter.java:36)
	at org.apache.lucene.util.TestRuleAssertionsRequired$1.evaluate(TestRuleAssertionsRequired.java:53)
	at org.apache.lucene.util.TestRuleMarkFailure$1.evaluate(TestRuleMarkFailure.java:47)
	at org.apache.lucene.util.TestRuleIgnoreAfterMaxFailures$1.evaluate(TestRuleIgnoreAfterMaxFailures.java:64)
	at org.apache.lucene.util.TestRuleIgnoreTestSuites$1.evaluate(TestRuleIgnoreTestSuites.java:54)
	at com.carrotsearch.randomizedtesting.rules.StatementAdapter.evaluate(StatementAdapter.java:36)
	at com.carrotsearch.randomizedtesting.ThreadLeakControl$StatementRunner.run(ThreadLeakControl.java:368)
	at java.lang.Thread.run(Thread.java:748)


FAILED:  org.apache.solr.cloud.LIROnShardRestartTest.testSeveralReplicasInLIR

Error Message:
Error from server at http://127.0.0.1:45478/solr: Cannot create collection severalReplicasInLIR. Value of maxShardsPerNode is 1, and the number of nodes currently live or live and part of your createNodeSet is 1. This allows a maximum of 1 to be created. Value of numShards is 1, value of nrtReplicas is 3, value of tlogReplicas is 0 and value of pullReplicas is 0. This requires 3 shards to be created (higher than the allowed number)

Stack Trace:
org.apache.solr.client.solrj.impl.HttpSolrClient$RemoteSolrException: Error from server at http://127.0.0.1:45478/solr: Cannot create collection severalReplicasInLIR. Value of maxShardsPerNode is 1, and the number of nodes currently live or live and part of your createNodeSet is 1. This allows a maximum of 1 to be created. Value of numShards is 1, value of nrtReplicas is 3, value of tlogReplicas is 0 and value of pullReplicas is 0. This requires 3 shards to be created (higher than the allowed number)
	at __randomizedtesting.SeedInfo.seed([10B31070AB4A4496:96E987448B1009CF]:0)
	at org.apache.solr.client.solrj.impl.HttpSolrClient.executeMethod(HttpSolrClient.java:643)
	at org.apache.solr.client.solrj.impl.HttpSolrClient.request(HttpSolrClient.java:255)
	at org.apache.solr.client.solrj.impl.HttpSolrClient.request(HttpSolrClient.java:244)
	at org.apache.solr.client.solrj.impl.LBHttpSolrClient.doRequest(LBHttpSolrClient.java:484)
	at org.apache.solr.client.solrj.impl.LBHttpSolrClient.request(LBHttpSolrClient.java:414)
	at org.apache.solr.client.solrj.impl.CloudSolrClient.sendRequest(CloudSolrClient.java:1110)
	at org.apache.solr.client.solrj.impl.CloudSolrClient.requestWithRetryOnStaleState(CloudSolrClient.java:884)
	at org.apache.solr.client.solrj.impl.CloudSolrClient.request(CloudSolrClient.java:817)
	at org.apache.solr.client.solrj.SolrRequest.process(SolrRequest.java:194)
	at org.apache.solr.client.solrj.SolrRequest.process(SolrRequest.java:211)
	at org.apache.solr.cloud.LIROnShardRestartTest.testSeveralReplicasInLIR(LIROnShardRestartTest.java:190)
	at sun.reflect.NativeMethodAccessorImpl.invoke0(Native Method)
	at sun.reflect.NativeMethodAccessorImpl.invoke(NativeMethodAccessorImpl.java:62)
	at sun.reflect.DelegatingMethodAccessorImpl.invoke(DelegatingMethodAccessorImpl.java:43)
	at java.lang.reflect.Method.invoke(Method.java:498)
	at com.carrotsearch.randomizedtesting.RandomizedRunner.invoke(RandomizedRunner.java:1750)
	at com.carrotsearch.randomizedtesting.RandomizedRunner$8.evaluate(RandomizedRunner.java:938)
	at com.carrotsearch.randomizedtesting.RandomizedRunner$9.evaluate(RandomizedRunner.java:974)
	at com.carrotsearch.randomizedtesting.RandomizedRunner$10.evaluate(RandomizedRunner.java:988)
	at com.carrotsearch.randomizedtesting.rules.SystemPropertiesRestoreRule$1.evaluate(SystemPropertiesRestoreRule.java:57)
	at org.apache.lucene.util.TestRuleSetupTeardownChained$1.evaluate(TestRuleSetupTeardownChained.java:49)
	at org.apache.lucene.util.AbstractBeforeAfterRule$1.evaluate(AbstractBeforeAfterRule.java:45)
	at org.apache.lucene.util.TestRuleThreadAndTestName$1.evaluate(TestRuleThreadAndTestName.java:48)
	at org.apache.lucene.util.TestRuleIgnoreAfterMaxFailures$1.evaluate(TestRuleIgnoreAfterMaxFailures.java:64)
	at org.apache.lucene.util.TestRuleMarkFailure$1.evaluate(TestRuleMarkFailure.java:47)
	at com.carrotsearch.randomizedtesting.rules.StatementAdapter.evaluate(StatementAdapter.java:36)
	at com.carrotsearch.randomizedtesting.ThreadLeakControl$StatementRunner.run(ThreadLeakControl.java:368)
	at com.carrotsearch.randomizedtesting.ThreadLeakControl.forkTimeoutingTask(ThreadLeakControl.java:817)
	at com.carrotsearch.randomizedtesting.ThreadLeakControl$3.evaluate(ThreadLeakControl.java:468)
	at com.carrotsearch.randomizedtesting.RandomizedRunner.runSingleTest(RandomizedRunner.java:947)
	at com.carrotsearch.randomizedtesting.RandomizedRunner$5.evaluate(RandomizedRunner.java:832)
	at com.carrotsearch.randomizedtesting.RandomizedRunner$6.evaluate(RandomizedRunner.java:883)
	at com.carrotsearch.randomizedtesting.RandomizedRunner$7.evaluate(RandomizedRunner.java:894)
	at com.carrotsearch.randomizedtesting.rules.StatementAdapter.evaluate(StatementAdapter.java:36)
	at com.carrotsearch.randomizedtesting.rules.SystemPropertiesRestoreRule$1.evaluate(SystemPropertiesRestoreRule.java:57)
	at org.apache.lucene.util.AbstractBeforeAfterRule$1.evaluate(AbstractBeforeAfterRule.java:45)
	at com.carrotsearch.randomizedtesting.rules.StatementAdapter.evaluate(StatementAdapter.java:36)
	at org.apache.lucene.util.TestRuleStoreClassName$1.evaluate(TestRuleStoreClassName.java:41)
	at com.carrotsearch.randomizedtesting.rules.NoShadowingOrOverridesOnMethodsRule$1.evaluate(NoShadowingOrOverridesOnMethodsRule.java:40)
	at com.carrotsearch.randomizedtesting.rules.NoShadowingOrOverridesOnMethodsRule$1.evaluate(NoShadowingOrOverridesOnMethodsRule.java:40)
	at com.carrotsearch.randomizedtesting.rules.StatementAdapter.evaluate(StatementAdapter.java:36)
	at com.carrotsearch.randomizedtesting.rules.StatementAdapter.evaluate(StatementAdapter.java:36)
	at com.carrotsearch.randomizedtesting.rules.StatementAdapter.evaluate(StatementAdapter.java:36)
	at org.apache.lucene.util.TestRuleAssertionsRequired$1.evaluate(TestRuleAssertionsRequired.java:53)
	at org.apache.lucene.util.TestRuleMarkFailure$1.evaluate(TestRuleMarkFailure.java:47)
	at org.apache.lucene.util.TestRuleIgnoreAfterMaxFailures$1.evaluate(TestRuleIgnoreAfterMaxFailures.java:64)
	at org.apache.lucene.util.TestRuleIgnoreTestSuites$1.evaluate(TestRuleIgnoreTestSuites.java:54)
	at com.carrotsearch.randomizedtesting.rules.StatementAdapter.evaluate(StatementAdapter.java:36)
	at com.carrotsearch.randomizedtesting.ThreadLeakControl$StatementRunner.run(ThreadLeakControl.java:368)
	at java.lang.Thread.run(Thread.java:748)


FAILED:  junit.framework.TestSuite.org.apache.solr.cloud.RestartWhileUpdatingTest

Error Message:
ObjectTracker found 1 object(s) that were not released!!! [TransactionLog] org.apache.solr.common.util.ObjectReleaseTracker$ObjectTrackerException: org.apache.solr.update.TransactionLog  at org.apache.solr.common.util.ObjectReleaseTracker.track(ObjectReleaseTracker.java:42)  at org.apache.solr.update.TransactionLog.<init>(TransactionLog.java:188)  at org.apache.solr.update.UpdateLog.newTransactionLog(UpdateLog.java:468)  at org.apache.solr.update.UpdateLog.ensureLog(UpdateLog.java:1329)  at org.apache.solr.update.UpdateLog.add(UpdateLog.java:572)  at org.apache.solr.update.UpdateLog.add(UpdateLog.java:552)  at org.apache.solr.update.DirectUpdateHandler2.doNormalUpdate(DirectUpdateHandler2.java:350)  at org.apache.solr.update.DirectUpdateHandler2.addDoc0(DirectUpdateHandler2.java:288)  at org.apache.solr.update.DirectUpdateHandler2.addDoc(DirectUpdateHandler2.java:235)  at org.apache.solr.update.processor.RunUpdateProcessor.processAdd(RunUpdateProcessorFactory.java:67)  at org.apache.solr.update.processor.UpdateRequestProcessor.processAdd(UpdateRequestProcessor.java:55)  at org.apache.solr.update.processor.DistributedUpdateProcessor.doLocalAdd(DistributedUpdateProcessor.java:1001)  at org.apache.solr.update.processor.DistributedUpdateProcessor.versionAdd(DistributedUpdateProcessor.java:1222)  at org.apache.solr.update.processor.DistributedUpdateProcessor.processAdd(DistributedUpdateProcessor.java:693)  at org.apache.solr.update.processor.LogUpdateProcessorFactory$LogUpdateProcessor.processAdd(LogUpdateProcessorFactory.java:103)  at org.apache.solr.handler.loader.JavabinLoader$1.update(JavabinLoader.java:110)  at org.apache.solr.client.solrj.request.JavaBinUpdateRequestCodec$StreamingCodec.readOuterMostDocIterator(JavaBinUpdateRequestCodec.java:327)  at org.apache.solr.client.solrj.request.JavaBinUpdateRequestCodec$StreamingCodec.readIterator(JavaBinUpdateRequestCodec.java:280)  at org.apache.solr.common.util.JavaBinCodec.readObject(JavaBinCodec.java:333)  at org.apache.solr.common.util.JavaBinCodec.readVal(JavaBinCodec.java:278)  at org.apache.solr.client.solrj.request.JavaBinUpdateRequestCodec$StreamingCodec.readNamedList(JavaBinUpdateRequestCodec.java:235)  at org.apache.solr.common.util.JavaBinCodec.readObject(JavaBinCodec.java:298)  at org.apache.solr.common.util.JavaBinCodec.readVal(JavaBinCodec.java:278)  at org.apache.solr.common.util.JavaBinCodec.unmarshal(JavaBinCodec.java:191)  at org.apache.solr.client.solrj.request.JavaBinUpdateRequestCodec.unmarshal(JavaBinUpdateRequestCodec.java:126)  at org.apache.solr.handler.loader.JavabinLoader.parseAndLoadDocs(JavabinLoader.java:123)  at org.apache.solr.handler.loader.JavabinLoader.load(JavabinLoader.java:70)  at org.apache.solr.handler.UpdateRequestHandler$1.load(UpdateRequestHandler.java:97)  at org.apache.solr.handler.ContentStreamHandlerBase.handleRequestBody(ContentStreamHandlerBase.java:68)  at org.apache.solr.handler.RequestHandlerBase.handleRequest(RequestHandlerBase.java:199)  at org.apache.solr.core.SolrCore.execute(SolrCore.java:2551)  at org.apache.solr.servlet.HttpSolrCall.execute(HttpSolrCall.java:710)  at org.apache.solr.servlet.HttpSolrCall.call(HttpSolrCall.java:516)  at org.apache.solr.servlet.SolrDispatchFilter.doFilter(SolrDispatchFilter.java:395)  at org.apache.solr.servlet.SolrDispatchFilter.doFilter(SolrDispatchFilter.java:341)  at org.eclipse.jetty.servlet.ServletHandler$CachedChain.doFilter(ServletHandler.java:1610)  at org.apache.solr.client.solrj.embedded.JettySolrRunner$DebugFilter.doFilter(JettySolrRunner.java:158)  at org.eclipse.jetty.servlet.ServletHandler$CachedChain.doFilter(ServletHandler.java:1610)  at org.eclipse.jetty.servlet.ServletHandler.doHandle(ServletHandler.java:540)  at org.eclipse.jetty.server.handler.ScopedHandler.nextHandle(ScopedHandler.java:255)  at org.eclipse.jetty.server.session.SessionHandler.doHandle(SessionHandler.java:1588)  at org.eclipse.jetty.server.handler.ScopedHandler.nextHandle(ScopedHandler.java:255)  at org.eclipse.jetty.server.handler.ContextHandler.doHandle(ContextHandler.java:1345)  at org.eclipse.jetty.server.handler.ScopedHandler.nextScope(ScopedHandler.java:203)  at org.eclipse.jetty.servlet.ServletHandler.doScope(ServletHandler.java:480)  at org.eclipse.jetty.server.session.SessionHandler.doScope(SessionHandler.java:1557)  at org.eclipse.jetty.server.handler.ScopedHandler.nextScope(ScopedHandler.java:201)  at org.eclipse.jetty.server.handler.ContextHandler.doScope(ContextHandler.java:1247)  at org.eclipse.jetty.server.handler.ScopedHandler.handle(ScopedHandler.java:144)  at org.eclipse.jetty.server.handler.gzip.GzipHandler.handle(GzipHandler.java:703)  at org.eclipse.jetty.server.handler.HandlerWrapper.handle(HandlerWrapper.java:132)  at org.eclipse.jetty.server.Server.handle(Server.java:502)  at org.eclipse.jetty.server.HttpChannel.handle(HttpChannel.java:364)  at org.eclipse.jetty.server.HttpConnection.onFillable(HttpConnection.java:260)  at org.eclipse.jetty.io.AbstractConnection$ReadCallback.succeeded(AbstractConnection.java:305)  at org.eclipse.jetty.io.FillInterest.fillable(FillInterest.java:103)  at org.eclipse.jetty.io.ChannelEndPoint$2.run(ChannelEndPoint.java:118)  at org.eclipse.jetty.util.thread.QueuedThreadPool.runJob(QueuedThreadPool.java:765)  at org.eclipse.jetty.util.thread.QueuedThreadPool$2.run(QueuedThreadPool.java:683)  at java.lang.Thread.run(Thread.java:748)   expected null, but was:<ObjectTracker found 1 object(s) that were not released!!! [TransactionLog] org.apache.solr.common.util.ObjectReleaseTracker$ObjectTrackerException: org.apache.solr.update.TransactionLog  at org.apache.solr.common.util.ObjectReleaseTracker.track(ObjectReleaseTracker.java:42)  at org.apache.solr.update.TransactionLog.<init>(TransactionLog.java:188)  at org.apache.solr.update.UpdateLog.newTransactionLog(UpdateLog.java:468)  at org.apache.solr.update.UpdateLog.ensureLog(UpdateLog.java:1329)  at org.apache.solr.update.UpdateLog.add(UpdateLog.java:572)  at org.apache.solr.update.UpdateLog.add(UpdateLog.java:552)  at org.apache.solr.update.DirectUpdateHandler2.doNormalUpdate(DirectUpdateHandler2.java:350)  at org.apache.solr.update.DirectUpdateHandler2.addDoc0(DirectUpdateHandler2.java:288)  at org.apache.solr.update.DirectUpdateHandler2.addDoc(DirectUpdateHandler2.java:235)  at org.apache.solr.update.processor.RunUpdateProcessor.processAdd(RunUpdateProcessorFactory.java:67)  at org.apache.solr.update.processor.UpdateRequestProcessor.processAdd(UpdateRequestProcessor.java:55)  at org.apache.solr.update.processor.DistributedUpdateProcessor.doLocalAdd(DistributedUpdateProcessor.java:1001)  at org.apache.solr.update.processor.DistributedUpdateProcessor.versionAdd(DistributedUpdateProcessor.java:1222)  at org.apache.solr.update.processor.DistributedUpdateProcessor.processAdd(DistributedUpdateProcessor.java:693)  at org.apache.solr.update.processor.LogUpdateProcessorFactory$LogUpdateProcessor.processAdd(LogUpdateProcessorFactory.java:103)  at org.apache.solr.handler.loader.JavabinLoader$1.update(JavabinLoader.java:110)  at org.apache.solr.client.solrj.request.JavaBinUpdateRequestCodec$StreamingCodec.readOuterMostDocIterator(JavaBinUpdateRequestCodec.java:327)  at org.apache.solr.client.solrj.request.JavaBinUpdateRequestCodec$StreamingCodec.readIterator(JavaBinUpdateRequestCodec.java:280)  at org.apache.solr.common.util.JavaBinCodec.readObject(JavaBinCodec.java:333)  at org.apache.solr.common.util.JavaBinCodec.readVal(JavaBinCodec.java:278)  at org.apache.solr.client.solrj.request.JavaBinUpdateRequestCodec$StreamingCodec.readNamedList(JavaBinUpdateRequestCodec.java:235)  at org.apache.solr.common.util.JavaBinCodec.readObject(JavaBinCodec.java:298)  at org.apache.solr.common.util.JavaBinCodec.readVal(JavaBinCodec.java:278)  at org.apache.solr.common.util.JavaBinCodec.unmarshal(JavaBinCodec.java:191)  at org.apache.solr.client.solrj.request.JavaBinUpdateRequestCodec.unmarshal(JavaBinUpdateRequestCodec.java:126)  at org.apache.solr.handler.loader.JavabinLoader.parseAndLoadDocs(JavabinLoader.java:123)  at org.apache.solr.handler.loader.JavabinLoader.load(JavabinLoader.java:70)  at org.apache.solr.handler.UpdateRequestHandler$1.load(UpdateRequestHandler.java:97)  at org.apache.solr.handler.ContentStreamHandlerBase.handleRequestBody(ContentStreamHandlerBase.java:68)  at org.apache.solr.handler.RequestHandlerBase.handleRequest(RequestHandlerBase.java:199)  at org.apache.solr.core.SolrCore.execute(SolrCore.java:2551)  at org.apache.solr.servlet.HttpSolrCall.execute(HttpSolrCall.java:710)  at org.apache.solr.servlet.HttpSolrCall.call(HttpSolrCall.java:516)  at org.apache.solr.servlet.SolrDispatchFilter.doFilter(SolrDispatchFilter.java:395)  at org.apache.solr.servlet.SolrDispatchFilter.doFilter(SolrDispatchFilter.java:341)  at org.eclipse.jetty.servlet.ServletHandler$CachedChain.doFilter(ServletHandler.java:1610)  at org.apache.solr.client.solrj.embedded.JettySolrRunner$DebugFilter.doFilter(JettySolrRunner.java:158)  at org.eclipse.jetty.servlet.ServletHandler$CachedChain.doFilter(ServletHandler.java:1610)  at org.eclipse.jetty.servlet.ServletHandler.doHandle(ServletHandler.java:540)  at org.eclipse.jetty.server.handler.ScopedHandler.nextHandle(ScopedHandler.java:255)  at org.eclipse.jetty.server.session.SessionHandler.doHandle(SessionHandler.java:1588)  at org.eclipse.jetty.server.handler.ScopedHandler.nextHandle(ScopedHandler.java:255)  at org.eclipse.jetty.server.handler.ContextHandler.doHandle(ContextHandler.java:1345)  at org.eclipse.jetty.server.handler.ScopedHandler.nextScope(ScopedHandler.java:203)  at org.eclipse.jetty.servlet.ServletHandler.doScope(ServletHandler.java:480)  at org.eclipse.jetty.server.session.SessionHandler.doScope(SessionHandler.java:1557)  at org.eclipse.jetty.server.handler.ScopedHandler.nextScope(ScopedHandler.java:201)  at org.eclipse.jetty.server.handler.ContextHandler.doScope(ContextHandler.java:1247)  at org.eclipse.jetty.server.handler.ScopedHandler.handle(ScopedHandler.java:144)  at org.eclipse.jetty.server.handler.gzip.GzipHandler.handle(GzipHandler.java:703)  at org.eclipse.jetty.server.handler.HandlerWrapper.handle(HandlerWrapper.java:132)  at org.eclipse.jetty.server.Server.handle(Server.java:502)  at org.eclipse.jetty.server.HttpChannel.handle(HttpChannel.java:364)  at org.eclipse.jetty.server.HttpConnection.onFillable(HttpConnection.java:260)  at org.eclipse.jetty.io.AbstractConnection$ReadCallback.succeeded(AbstractConnection.java:305)  at org.eclipse.jetty.io.FillInterest.fillable(FillInterest.java:103)  at org.eclipse.jetty.io.ChannelEndPoint$2.run(ChannelEndPoint.java:118)  at org.eclipse.jetty.util.thread.QueuedThreadPool.runJob(QueuedThreadPool.java:765)  at org.eclipse.jetty.util.thread.QueuedThreadPool$2.run(QueuedThreadPool.java:683)  at java.lang.Thread.run(Thread.java:748)  >

Stack Trace:
java.lang.AssertionError: ObjectTracker found 1 object(s) that were not released!!! [TransactionLog]
org.apache.solr.common.util.ObjectReleaseTracker$ObjectTrackerException: org.apache.solr.update.TransactionLog
	at org.apache.solr.common.util.ObjectReleaseTracker.track(ObjectReleaseTracker.java:42)
	at org.apache.solr.update.TransactionLog.<init>(TransactionLog.java:188)
	at org.apache.solr.update.UpdateLog.newTransactionLog(UpdateLog.java:468)
	at org.apache.solr.update.UpdateLog.ensureLog(UpdateLog.java:1329)
	at org.apache.solr.update.UpdateLog.add(UpdateLog.java:572)
	at org.apache.solr.update.UpdateLog.add(UpdateLog.java:552)
	at org.apache.solr.update.DirectUpdateHandler2.doNormalUpdate(DirectUpdateHandler2.java:350)
	at org.apache.solr.update.DirectUpdateHandler2.addDoc0(DirectUpdateHandler2.java:288)
	at org.apache.solr.update.DirectUpdateHandler2.addDoc(DirectUpdateHandler2.java:235)
	at org.apache.solr.update.processor.RunUpdateProcessor.processAdd(RunUpdateProcessorFactory.java:67)
	at org.apache.solr.update.processor.UpdateRequestProcessor.processAdd(UpdateRequestProcessor.java:55)
	at org.apache.solr.update.processor.DistributedUpdateProcessor.doLocalAdd(DistributedUpdateProcessor.java:1001)
	at org.apache.solr.update.processor.DistributedUpdateProcessor.versionAdd(DistributedUpdateProcessor.java:1222)
	at org.apache.solr.update.processor.DistributedUpdateProcessor.processAdd(DistributedUpdateProcessor.java:693)
	at org.apache.solr.update.processor.LogUpdateProcessorFactory$LogUpdateProcessor.processAdd(LogUpdateProcessorFactory.java:103)
	at org.apache.solr.handler.loader.JavabinLoader$1.update(JavabinLoader.java:110)
	at org.apache.solr.client.solrj.request.JavaBinUpdateRequestCodec$StreamingCodec.readOuterMostDocIterator(JavaBinUpdateRequestCodec.java:327)
	at org.apache.solr.client.solrj.request.JavaBinUpdateRequestCodec$StreamingCodec.readIterator(JavaBinUpdateRequestCodec.java:280)
	at org.apache.solr.common.util.JavaBinCodec.readObject(JavaBinCodec.java:333)
	at org.apache.solr.common.util.JavaBinCodec.readVal(JavaBinCodec.java:278)
	at org.apache.solr.client.solrj.request.JavaBinUpdateRequestCodec$StreamingCodec.readNamedList(JavaBinUpdateRequestCodec.java:235)
	at org.apache.solr.common.util.JavaBinCodec.readObject(JavaBinCodec.java:298)
	at org.apache.solr.common.util.JavaBinCodec.readVal(JavaBinCodec.java:278)
	at org.apache.solr.common.util.JavaBinCodec.unmarshal(JavaBinCodec.java:191)
	at org.apache.solr.client.solrj.request.JavaBinUpdateRequestCodec.unmarshal(JavaBinUpdateRequestCodec.java:126)
	at org.apache.solr.handler.loader.JavabinLoader.parseAndLoadDocs(JavabinLoader.java:123)
	at org.apache.solr.handler.loader.JavabinLoader.load(JavabinLoader.java:70)
	at org.apache.solr.handler.UpdateRequestHandler$1.load(UpdateRequestHandler.java:97)
	at org.apache.solr.handler.ContentStreamHandlerBase.handleRequestBody(ContentStreamHandlerBase.java:68)
	at org.apache.solr.handler.RequestHandlerBase.handleRequest(RequestHandlerBase.java:199)
	at org.apache.solr.core.SolrCore.execute(SolrCore.java:2551)
	at org.apache.solr.servlet.HttpSolrCall.execute(HttpSolrCall.java:710)
	at org.apache.solr.servlet.HttpSolrCall.call(HttpSolrCall.java:516)
	at org.apache.solr.servlet.SolrDispatchFilter.doFilter(SolrDispatchFilter.java:395)
	at org.apache.solr.servlet.SolrDispatchFilter.doFilter(SolrDispatchFilter.java:341)
	at org.eclipse.jetty.servlet.ServletHandler$CachedChain.doFilter(ServletHandler.java:1610)
	at org.apache.solr.client.solrj.embedded.JettySolrRunner$DebugFilter.doFilter(JettySolrRunner.java:158)
	at org.eclipse.jetty.servlet.ServletHandler$CachedChain.doFilter(ServletHandler.java:1610)
	at org.eclipse.jetty.servlet.ServletHandler.doHandle(ServletHandler.java:540)
	at org.eclipse.jetty.server.handler.ScopedHandler.nextHandle(ScopedHandler.java:255)
	at org.eclipse.jetty.server.session.SessionHandler.doHandle(SessionHandler.java:1588)
	at org.eclipse.jetty.server.handler.ScopedHandler.nextHandle(ScopedHandler.java:255)
	at org.eclipse.jetty.server.handler.ContextHandler.doHandle(ContextHandler.java:1345)
	at org.eclipse.jetty.server.handler.ScopedHandler.nextScope(ScopedHandler.java:203)
	at org.eclipse.jetty.servlet.ServletHandler.doScope(ServletHandler.java:480)
	at org.eclipse.jetty.server.session.SessionHandler.doScope(SessionHandler.java:1557)
	at org.eclipse.jetty.server.handler.ScopedHandler.nextScope(ScopedHandler.java:201)
	at org.eclipse.jetty.server.handler.ContextHandler.doScope(ContextHandler.java:1247)
	at org.eclipse.jetty.server.handler.ScopedHandler.handle(ScopedHandler.java:144)
	at org.eclipse.jetty.server.handler.gzip.GzipHandler.handle(GzipHandler.java:703)
	at org.eclipse.jetty.server.handler.HandlerWrapper.handle(HandlerWrapper.java:132)
	at org.eclipse.jetty.server.Server.handle(Server.java:502)
	at org.eclipse.jetty.server.HttpChannel.handle(HttpChannel.java:364)
	at org.eclipse.jetty.server.HttpConnection.onFillable(HttpConnection.java:260)
	at org.eclipse.jetty.io.AbstractConnection$ReadCallback.succeeded(AbstractConnection.java:305)
	at org.eclipse.jetty.io.FillInterest.fillable(FillInterest.java:103)
	at org.eclipse.jetty.io.ChannelEndPoint$2.run(ChannelEndPoint.java:118)
	at org.eclipse.jetty.util.thread.QueuedThreadPool.runJob(QueuedThreadPool.java:765)
	at org.eclipse.jetty.util.thread.QueuedThreadPool$2.run(QueuedThreadPool.java:683)
	at java.lang.Thread.run(Thread.java:748)

 expected null, but was:<ObjectTracker found 1 object(s) that were not released!!! [TransactionLog]
org.apache.solr.common.util.ObjectReleaseTracker$ObjectTrackerException: org.apache.solr.update.TransactionLog
	at org.apache.solr.common.util.ObjectReleaseTracker.track(ObjectReleaseTracker.java:42)
	at org.apache.solr.update.TransactionLog.<init>(TransactionLog.java:188)
	at org.apache.solr.update.UpdateLog.newTransactionLog(UpdateLog.java:468)
	at org.apache.solr.update.UpdateLog.ensureLog(UpdateLog.java:1329)
	at org.apache.solr.update.UpdateLog.add(UpdateLog.java:572)
	at org.apache.solr.update.UpdateLog.add(UpdateLog.java:552)
	at org.apache.solr.update.DirectUpdateHandler2.doNormalUpdate(DirectUpdateHandler2.java:350)
	at org.apache.solr.update.DirectUpdateHandler2.addDoc0(DirectUpdateHandler2.java:288)
	at org.apache.solr.update.DirectUpdateHandler2.addDoc(DirectUpdateHandler2.java:235)
	at org.apache.solr.update.processor.RunUpdateProcessor.processAdd(RunUpdateProcessorFactory.java:67)
	at org.apache.solr.update.processor.UpdateRequestProcessor.processAdd(UpdateRequestProcessor.java:55)
	at org.apache.solr.update.processor.DistributedUpdateProcessor.doLocalAdd(DistributedUpdateProcessor.java:1001)
	at org.apache.solr.update.processor.DistributedUpdateProcessor.versionAdd(DistributedUpdateProcessor.java:1222)
	at org.apache.solr.update.processor.DistributedUpdateProcessor.processAdd(DistributedUpdateProcessor.java:693)
	at org.apache.solr.update.processor.LogUpdateProcessorFactory$LogUpdateProcessor.processAdd(LogUpdateProcessorFactory.java:103)
	at org.apache.solr.handler.loader.JavabinLoader$1.update(JavabinLoader.java:110)
	at org.apache.solr.client.solrj.request.JavaBinUpdateRequestCodec$StreamingCodec.readOuterMostDocIterator(JavaBinUpdateRequestCodec.java:327)
	at org.apache.solr.client.solrj.request.JavaBinUpdateRequestCodec$StreamingCodec.readIterator(JavaBinUpdateRequestCodec.java:280)
	at org.apache.solr.common.util.JavaBinCodec.readObject(JavaBinCodec.java:333)
	at org.apache.solr.common.util.JavaBinCodec.readVal(JavaBinCodec.java:278)
	at org.apache.solr.client.solrj.request.JavaBinUpdateRequestCodec$StreamingCodec.readNamedList(JavaBinUpdateRequestCodec.java:235)
	at org.apache.solr.common.util.JavaBinCodec.readObject(JavaBinCodec.java:298)
	at org.apache.solr.common.util.JavaBinCodec.readVal(JavaBinCodec.java:278)
	at org.apache.solr.common.util.JavaBinCodec.unmarshal(JavaBinCodec.java:191)
	at org.apache.solr.client.solrj.request.JavaBinUpdateRequestCodec.unmarshal(JavaBinUpdateRequestCodec.java:126)
	at org.apache.solr.handler.loader.JavabinLoader.parseAndLoadDocs(JavabinLoader.java:123)
	at org.apache.solr.handler.loader.JavabinLoader.load(JavabinLoader.java:70)
	at org.apache.solr.handler.UpdateRequestHandler$1.load(UpdateRequestHandler.java:97)
	at org.apache.solr.handler.ContentStreamHandlerBase.handleRequestBody(ContentStreamHandlerBase.java:68)
	at org.apache.solr.handler.RequestHandlerBase.handleRequest(RequestHandlerBase.java:199)
	at org.apache.solr.core.SolrCore.execute(SolrCore.java:2551)
	at org.apache.solr.servlet.HttpSolrCall.execute(HttpSolrCall.java:710)
	at org.apache.solr.servlet.HttpSolrCall.call(HttpSolrCall.java:516)
	at org.apache.solr.servlet.SolrDispatchFilter.doFilter(SolrDispatchFilter.java:395)
	at org.apache.solr.servlet.SolrDispatchFilter.doFilter(SolrDispatchFilter.java:341)
	at org.eclipse.jetty.servlet.ServletHandler$CachedChain.doFilter(ServletHandler.java:1610)
	at org.apache.solr.client.solrj.embedded.JettySolrRunner$DebugFilter.doFilter(JettySolrRunner.java:158)
	at org.eclipse.jetty.servlet.ServletHandler$CachedChain.doFilter(ServletHandler.java:1610)
	at org.eclipse.jetty.servlet.ServletHandler.doHandle(ServletHandler.java:540)
	at org.eclipse.jetty.server.handler.ScopedHandler.nextHandle(ScopedHandler.java:255)
	at org.eclipse.jetty.server.session.SessionHandler.doHandle(SessionHandler.java:1588)
	at org.eclipse.jetty.server.handler.ScopedHandler.nextHandle(ScopedHandler.java:255)
	at org.eclipse.jetty.server.handler.ContextHandler.doHandle(ContextHandler.java:1345)
	at org.eclipse.jetty.server.handler.ScopedHandler.nextScope(ScopedHandler.java:203)
	at org.eclipse.jetty.servlet.ServletHandler.doScope(ServletHandler.java:480)
	at org.eclipse.jetty.server.session.SessionHandler.doScope(SessionHandler.java:1557)
	at org.eclipse.jetty.server.handler.ScopedHandler.nextScope(ScopedHandler.java:201)
	at org.eclipse.jetty.server.handler.ContextHandler.doScope(ContextHandler.java:1247)
	at org.eclipse.jetty.server.handler.ScopedHandler.handle(ScopedHandler.java:144)
	at org.eclipse.jetty.server.handler.gzip.GzipHandler.handle(GzipHandler.java:703)
	at org.eclipse.jetty.server.handler.HandlerWrapper.handle(HandlerWrapper.java:132)
	at org.eclipse.jetty.server.Server.handle(Server.java:502)
	at org.eclipse.jetty.server.HttpChannel.handle(HttpChannel.java:364)
	at org.eclipse.jetty.server.HttpConnection.onFillable(HttpConnection.java:260)
	at org.eclipse.jetty.io.AbstractConnection$ReadCallback.succeeded(AbstractConnection.java:305)
	at org.eclipse.jetty.io.FillInterest.fillable(FillInterest.java:103)
	at org.eclipse.jetty.io.ChannelEndPoint$2.run(ChannelEndPoint.java:118)
	at org.eclipse.jetty.util.thread.QueuedThreadPool.runJob(QueuedThreadPool.java:765)
	at org.eclipse.jetty.util.thread.QueuedThreadPool$2.run(QueuedThreadPool.java:683)
	at java.lang.Thread.run(Thread.java:748)

>
	at __randomizedtesting.SeedInfo.seed([10B31070AB4A4496]:0)
	at org.junit.Assert.fail(Assert.java:88)
	at org.junit.Assert.failNotNull(Assert.java:755)
	at org.junit.Assert.assertNull(Assert.java:737)
	at org.apache.solr.SolrTestCaseJ4.teardownTestCases(SolrTestCaseJ4.java:320)
	at sun.reflect.GeneratedMethodAccessor45.invoke(Unknown Source)
	at sun.reflect.DelegatingMethodAccessorImpl.invoke(DelegatingMethodAccessorImpl.java:43)
	at java.lang.reflect.Method.invoke(Method.java:498)
	at com.carrotsearch.randomizedtesting.RandomizedRunner.invoke(RandomizedRunner.java:1750)
	at com.carrotsearch.randomizedtesting.RandomizedRunner$7.evaluate(RandomizedRunner.java:901)
	at com.carrotsearch.randomizedtesting.rules.StatementAdapter.evaluate(StatementAdapter.java:36)
	at com.carrotsearch.randomizedtesting.rules.SystemPropertiesRestoreRule$1.evaluate(SystemPropertiesRestoreRule.java:57)
	at org.apache.lucene.util.AbstractBeforeAfterRule$1.evaluate(AbstractBeforeAfterRule.java:45)
	at com.carrotsearch.randomizedtesting.rules.StatementAdapter.evaluate(StatementAdapter.java:36)
	at org.apache.lucene.util.TestRuleStoreClassName$1.evaluate(TestRuleStoreClassName.java:41)
	at com.carrotsearch.randomizedtesting.rules.NoShadowingOrOverridesOnMethodsRule$1.evaluate(NoShadowingOrOverridesOnMethodsRule.java:40)
	at com.carrotsearch.randomizedtesting.rules.NoShadowingOrOverridesOnMethodsRule$1.evaluate(NoShadowingOrOverridesOnMethodsRule.java:40)
	at com.carrotsearch.randomizedtesting.rules.StatementAdapter.evaluate(StatementAdapter.java:36)
	at com.carrotsearch.randomizedtesting.rules.StatementAdapter.evaluate(StatementAdapter.java:36)
	at com.carrotsearch.randomizedtesting.rules.StatementAdapter.evaluate(StatementAdapter.java:36)
	at org.apache.lucene.util.TestRuleAssertionsRequired$1.evaluate(TestRuleAssertionsRequired.java:53)
	at org.apache.lucene.util.TestRuleMarkFailure$1.evaluate(TestRuleMarkFailure.java:47)
	at org.apache.lucene.util.TestRuleIgnoreAfterMaxFailures$1.evaluate(TestRuleIgnoreAfterMaxFailures.java:64)
	at org.apache.lucene.util.TestRuleIgnoreTestSuites$1.evaluate(TestRuleIgnoreTestSuites.java:54)
	at com.carrotsearch.randomizedtesting.rules.StatementAdapter.evaluate(StatementAdapter.java:36)
	at com.carrotsearch.randomizedtesting.ThreadLeakControl$StatementRunner.run(ThreadLeakControl.java:368)
	at java.lang.Thread.run(Thread.java:748)


FAILED:  org.apache.solr.cloud.UnloadDistributedZkTest.test

Error Message:
Captured an uncaught exception in thread: Thread[id=100968, name=testExecutor-12500-thread-15, state=RUNNABLE, group=TGRP-UnloadDistributedZkTest]

Stack Trace:
com.carrotsearch.randomizedtesting.UncaughtExceptionError: Captured an uncaught exception in thread: Thread[id=100968, name=testExecutor-12500-thread-15, state=RUNNABLE, group=TGRP-UnloadDistributedZkTest]
Caused by: java.lang.RuntimeException: org.apache.solr.client.solrj.SolrServerException: Timeout occured while waiting response from server at: http://127.0.0.1:41000
	at __randomizedtesting.SeedInfo.seed([10B31070AB4A4496]:0)
	at org.apache.solr.cloud.BasicDistributedZkTest.lambda$createCollectionInOneInstance$1(BasicDistributedZkTest.java:659)
	at org.apache.solr.common.util.ExecutorUtil$MDCAwareThreadPoolExecutor.lambda$execute$0(ExecutorUtil.java:209)
	at java.util.concurrent.ThreadPoolExecutor.runWorker(ThreadPoolExecutor.java:1149)
	at java.util.concurrent.ThreadPoolExecutor$Worker.run(ThreadPoolExecutor.java:624)
	at java.lang.Thread.run(Thread.java:748)
Caused by: org.apache.solr.client.solrj.SolrServerException: Timeout occured while waiting response from server at: http://127.0.0.1:41000
	at org.apache.solr.client.solrj.impl.HttpSolrClient.executeMethod(HttpSolrClient.java:654)
	at org.apache.solr.client.solrj.impl.HttpSolrClient.request(HttpSolrClient.java:255)
	at org.apache.solr.client.solrj.impl.HttpSolrClient.request(HttpSolrClient.java:244)
	at org.apache.solr.client.solrj.SolrRequest.process(SolrRequest.java:194)
	at org.apache.solr.client.solrj.SolrRequest.process(SolrRequest.java:211)
	at org.apache.solr.cloud.BasicDistributedZkTest.lambda$createCollectionInOneInstance$1(BasicDistributedZkTest.java:657)
	... 4 more
Caused by: java.net.SocketTimeoutException: Read timed out
	at java.net.SocketInputStream.socketRead0(Native Method)
	at java.net.SocketInputStream.socketRead(SocketInputStream.java:116)
	at java.net.SocketInputStream.read(SocketInputStream.java:171)
	at java.net.SocketInputStream.read(SocketInputStream.java:141)
	at org.apache.http.impl.io.SessionInputBufferImpl.streamRead(SessionInputBufferImpl.java:137)
	at org.apache.http.impl.io.SessionInputBufferImpl.fillBuffer(SessionInputBufferImpl.java:153)
	at org.apache.http.impl.io.SessionInputBufferImpl.readLine(SessionInputBufferImpl.java:282)
	at org.apache.http.impl.conn.DefaultHttpResponseParser.parseHead(DefaultHttpResponseParser.java:138)
	at org.apache.http.impl.conn.DefaultHttpResponseParser.parseHead(DefaultHttpResponseParser.java:56)
	at org.apache.http.impl.io.AbstractMessageParser.parse(AbstractMessageParser.java:259)
	at org.apache.http.impl.DefaultBHttpClientConnection.receiveResponseHeader(DefaultBHttpClientConnection.java:163)
	at org.apache.http.impl.conn.CPoolProxy.receiveResponseHeader(CPoolProxy.java:165)
	at org.apache.http.protocol.HttpRequestExecutor.doReceiveResponse(HttpRequestExecutor.java:273)
	at org.apache.http.protocol.HttpRequestExecutor.execute(HttpRequestExecutor.java:125)
	at org.apache.http.impl.execchain.MainClientExec.execute(MainClientExec.java:272)
	at org.apache.http.impl.execchain.ProtocolExec.execute(ProtocolExec.java:185)
	at org.apache.http.impl.execchain.RetryExec.execute(RetryExec.java:89)
	at org.apache.http.impl.execchain.RedirectExec.execute(RedirectExec.java:110)
	at org.apache.http.impl.client.InternalHttpClient.doExecute(InternalHttpClient.java:185)
	at org.apache.http.impl.client.CloseableHttpClient.execute(CloseableHttpClient.java:83)
	at org.apache.http.impl.client.CloseableHttpClient.execute(CloseableHttpClient.java:56)
	at org.apache.solr.client.solrj.impl.HttpSolrClient.executeMethod(HttpSolrClient.java:542)
	... 9 more


FAILED:  org.apache.solr.cloud.hdfs.HdfsUnloadDistributedZkTest.test

Error Message:
Captured an uncaught exception in thread: Thread[id=143738, name=testExecutor-18480-thread-8, state=RUNNABLE, group=TGRP-HdfsUnloadDistributedZkTest]

Stack Trace:
com.carrotsearch.randomizedtesting.UncaughtExceptionError: Captured an uncaught exception in thread: Thread[id=143738, name=testExecutor-18480-thread-8, state=RUNNABLE, group=TGRP-HdfsUnloadDistributedZkTest]
Caused by: java.lang.RuntimeException: org.apache.solr.client.solrj.SolrServerException: Timeout occured while waiting response from server at: http://127.0.0.1:43166
	at __randomizedtesting.SeedInfo.seed([10B31070AB4A4496]:0)
	at org.apache.solr.cloud.BasicDistributedZkTest.lambda$createCollectionInOneInstance$1(BasicDistributedZkTest.java:659)
	at org.apache.solr.common.util.ExecutorUtil$MDCAwareThreadPoolExecutor.lambda$execute$0(ExecutorUtil.java:209)
	at java.util.concurrent.ThreadPoolExecutor.runWorker(ThreadPoolExecutor.java:1149)
	at java.util.concurrent.ThreadPoolExecutor$Worker.run(ThreadPoolExecutor.java:624)
	at java.lang.Thread.run(Thread.java:748)
Caused by: org.apache.solr.client.solrj.SolrServerException: Timeout occured while waiting response from server at: http://127.0.0.1:43166
	at org.apache.solr.client.solrj.impl.HttpSolrClient.executeMethod(HttpSolrClient.java:654)
	at org.apache.solr.client.solrj.impl.HttpSolrClient.request(HttpSolrClient.java:255)
	at org.apache.solr.client.solrj.impl.HttpSolrClient.request(HttpSolrClient.java:244)
	at org.apache.solr.client.solrj.SolrRequest.process(SolrRequest.java:194)
	at org.apache.solr.client.solrj.SolrRequest.process(SolrRequest.java:211)
	at org.apache.solr.cloud.BasicDistributedZkTest.lambda$createCollectionInOneInstance$1(BasicDistributedZkTest.java:657)
	... 4 more
Caused by: java.net.SocketTimeoutException: Read timed out
	at java.net.SocketInputStream.socketRead0(Native Method)
	at java.net.SocketInputStream.socketRead(SocketInputStream.java:116)
	at java.net.SocketInputStream.read(SocketInputStream.java:171)
	at java.net.SocketInputStream.read(SocketInputStream.java:141)
	at org.apache.http.impl.io.SessionInputBufferImpl.streamRead(SessionInputBufferImpl.java:137)
	at org.apache.http.impl.io.SessionInputBufferImpl.fillBuffer(SessionInputBufferImpl.java:153)
	at org.apache.http.impl.io.SessionInputBufferImpl.readLine(SessionInputBufferImpl.java:282)
	at org.apache.http.impl.conn.DefaultHttpResponseParser.parseHead(DefaultHttpResponseParser.java:138)
	at org.apache.http.impl.conn.DefaultHttpResponseParser.parseHead(DefaultHttpResponseParser.java:56)
	at org.apache.http.impl.io.AbstractMessageParser.parse(AbstractMessageParser.java:259)
	at org.apache.http.impl.DefaultBHttpClientConnection.receiveResponseHeader(DefaultBHttpClientConnection.java:163)
	at org.apache.http.impl.conn.CPoolProxy.receiveResponseHeader(CPoolProxy.java:165)
	at org.apache.http.protocol.HttpRequestExecutor.doReceiveResponse(HttpRequestExecutor.java:273)
	at org.apache.http.protocol.HttpRequestExecutor.execute(HttpRequestExecutor.java:125)
	at org.apache.http.impl.execchain.MainClientExec.execute(MainClientExec.java:272)
	at org.apache.http.impl.execchain.ProtocolExec.execute(ProtocolExec.java:185)
	at org.apache.http.impl.execchain.RetryExec.execute(RetryExec.java:89)
	at org.apache.http.impl.execchain.RedirectExec.execute(RedirectExec.java:110)
	at org.apache.http.impl.client.InternalHttpClient.doExecute(InternalHttpClient.java:185)
	at org.apache.http.impl.client.CloseableHttpClient.execute(CloseableHttpClient.java:83)
	at org.apache.http.impl.client.CloseableHttpClient.execute(CloseableHttpClient.java:56)
	at org.apache.solr.client.solrj.impl.HttpSolrClient.executeMethod(HttpSolrClient.java:542)
	... 9 more


FAILED:  org.apache.solr.cloud.hdfs.HdfsRestartWhileUpdatingTest.test

Error Message:
There are still nodes recoverying - waited for 320 seconds

Stack Trace:
java.lang.AssertionError: There are still nodes recoverying - waited for 320 seconds
	at __randomizedtesting.SeedInfo.seed([10B31070AB4A4496:98E72FAA05B6296E]:0)
	at org.junit.Assert.fail(Assert.java:88)
	at org.apache.solr.cloud.AbstractDistribZkTestBase.waitForRecoveriesToFinish(AbstractDistribZkTestBase.java:195)
	at org.apache.solr.cloud.AbstractFullDistribZkTestBase.waitForRecoveriesToFinish(AbstractFullDistribZkTestBase.java:1014)
	at org.apache.solr.cloud.AbstractFullDistribZkTestBase.waitForThingsToLevelOut(AbstractFullDistribZkTestBase.java:1571)
	at org.apache.solr.cloud.RestartWhileUpdatingTest.test(RestartWhileUpdatingTest.java:144)
	at sun.reflect.NativeMethodAccessorImpl.invoke0(Native Method)
	at sun.reflect.NativeMethodAccessorImpl.invoke(NativeMethodAccessorImpl.java:62)
	at sun.reflect.DelegatingMethodAccessorImpl.invoke(DelegatingMethodAccessorImpl.java:43)
	at java.lang.reflect.Method.invoke(Method.java:498)
	at com.carrotsearch.randomizedtesting.RandomizedRunner.invoke(RandomizedRunner.java:1750)
	at com.carrotsearch.randomizedtesting.RandomizedRunner$8.evaluate(RandomizedRunner.java:938)
	at com.carrotsearch.randomizedtesting.RandomizedRunner$9.evaluate(RandomizedRunner.java:974)
	at com.carrotsearch.randomizedtesting.RandomizedRunner$10.evaluate(RandomizedRunner.java:988)
	at org.apache.solr.BaseDistributedSearchTestCase$ShardsRepeatRule$ShardsFixedStatement.callStatement(BaseDistributedSearchTestCase.java:1075)
	at org.apache.solr.BaseDistributedSearchTestCase$ShardsRepeatRule$ShardsStatement.evaluate(BaseDistributedSearchTestCase.java:1047)
	at com.carrotsearch.randomizedtesting.rules.SystemPropertiesRestoreRule$1.evaluate(SystemPropertiesRestoreRule.java:57)
	at org.apache.lucene.util.TestRuleSetupTeardownChained$1.evaluate(TestRuleSetupTeardownChained.java:49)
	at org.apache.lucene.util.AbstractBeforeAfterRule$1.evaluate(AbstractBeforeAfterRule.java:45)
	at org.apache.lucene.util.TestRuleThreadAndTestName$1.evaluate(TestRuleThreadAndTestName.java:48)
	at org.apache.lucene.util.TestRuleIgnoreAfterMaxFailures$1.evaluate(TestRuleIgnoreAfterMaxFailures.java:64)
	at org.apache.lucene.util.TestRuleMarkFailure$1.evaluate(TestRuleMarkFailure.java:47)
	at com.carrotsearch.randomizedtesting.rules.StatementAdapter.evaluate(StatementAdapter.java:36)
	at com.carrotsearch.randomizedtesting.ThreadLeakControl$StatementRunner.run(ThreadLeakControl.java:368)
	at com.carrotsearch.randomizedtesting.ThreadLeakControl.forkTimeoutingTask(ThreadLeakControl.java:817)
	at com.carrotsearch.randomizedtesting.ThreadLeakControl$3.evaluate(ThreadLeakControl.java:468)
	at com.carrotsearch.randomizedtesting.RandomizedRunner.runSingleTest(RandomizedRunner.java:947)
	at com.carrotsearch.randomizedtesting.RandomizedRunner$5.evaluate(RandomizedRunner.java:832)
	at com.carrotsearch.randomizedtesting.RandomizedRunner$6.evaluate(RandomizedRunner.java:883)
	at com.carrotsearch.randomizedtesting.RandomizedRunner$7.evaluate(RandomizedRunner.java:894)
	at com.carrotsearch.randomizedtesting.rules.StatementAdapter.evaluate(StatementAdapter.java:36)
	at com.carrotsearch.randomizedtesting.rules.SystemPropertiesRestoreRule$1.evaluate(SystemPropertiesRestoreRule.java:57)
	at org.apache.lucene.util.AbstractBeforeAfterRule$1.evaluate(AbstractBeforeAfterRule.java:45)
	at com.carrotsearch.randomizedtesting.rules.StatementAdapter.evaluate(StatementAdapter.java:36)
	at org.apache.lucene.util.TestRuleStoreClassName$1.evaluate(TestRuleStoreClassName.java:41)
	at com.carrotsearch.randomizedtesting.rules.NoShadowingOrOverridesOnMethodsRule$1.evaluate(NoShadowingOrOverridesOnMethodsRule.java:40)
	at com.carrotsearch.randomizedtesting.rules.NoShadowingOrOverridesOnMethodsRule$1.evaluate(NoShadowingOrOverridesOnMethodsRule.java:40)
	at com.carrotsearch.randomizedtesting.rules.StatementAdapter.evaluate(StatementAdapter.java:36)
	at com.carrotsearch.randomizedtesting.rules.StatementAdapter.evaluate(StatementAdapter.java:36)
	at com.carrotsearch.randomizedtesting.rules.StatementAdapter.evaluate(StatementAdapter.java:36)
	at org.apache.lucene.util.TestRuleAssertionsRequired$1.evaluate(TestRuleAssertionsRequired.java:53)
	at org.apache.lucene.util.TestRuleMarkFailure$1.evaluate(TestRuleMarkFailure.java:47)
	at org.apache.lucene.util.TestRuleIgnoreAfterMaxFailures$1.evaluate(TestRuleIgnoreAfterMaxFailures.java:64)
	at org.apache.lucene.util.TestRuleIgnoreTestSuites$1.evaluate(TestRuleIgnoreTestSuites.java:54)
	at com.carrotsearch.randomizedtesting.rules.StatementAdapter.evaluate(StatementAdapter.java:36)
	at com.carrotsearch.randomizedtesting.ThreadLeakControl$StatementRunner.run(ThreadLeakControl.java:368)
	at java.lang.Thread.run(Thread.java:748)




Build Log:
[...truncated 13434 lines...]
   [junit4] Suite: org.apache.solr.cloud.hdfs.HdfsRestartWhileUpdatingTest
   [junit4]   2> 566938 INFO  (SUITE-HdfsRestartWhileUpdatingTest-seed#[10B31070AB4A4496]-worker) [    ] o.a.s.SolrTestCaseJ4 SecureRandom sanity checks: test.solr.allowed.securerandom=null & java.security.egd=file:/dev/./urandom
   [junit4]   2> Creating dataDir: /home/jenkins/jenkins-slave/workspace/Lucene-Solr-BadApples-NightlyTests-7.x/checkout/solr/build/solr-core/test/J1/temp/solr.cloud.hdfs.HdfsRestartWhileUpdatingTest_10B31070AB4A4496-001/init-core-data-001
   [junit4]   2> 566938 INFO  (SUITE-HdfsRestartWhileUpdatingTest-seed#[10B31070AB4A4496]-worker) [    ] o.a.s.SolrTestCaseJ4 Using PointFields (NUMERIC_POINTS_SYSPROP=true) w/NUMERIC_DOCVALUES_SYSPROP=true
   [junit4]   2> 566939 INFO  (SUITE-HdfsRestartWhileUpdatingTest-seed#[10B31070AB4A4496]-worker) [    ] o.a.s.SolrTestCaseJ4 Randomized ssl (true) and clientAuth (false) via: @org.apache.solr.util.RandomizeSSL(reason=, ssl=NaN, value=NaN, clientAuth=NaN)
   [junit4]   2> 566940 INFO  (SUITE-HdfsRestartWhileUpdatingTest-seed#[10B31070AB4A4496]-worker) [    ] o.a.s.BaseDistributedSearchTestCase Setting hostContext system property: /
   [junit4]   2> 571683 WARN  (SUITE-HdfsRestartWhileUpdatingTest-seed#[10B31070AB4A4496]-worker) [    ] o.a.h.u.NativeCodeLoader Unable to load native-hadoop library for your platform... using builtin-java classes where applicable
   [junit4]   1> Formatting using clusterid: testClusterID
   [junit4]   2> 576984 WARN  (SUITE-HdfsRestartWhileUpdatingTest-seed#[10B31070AB4A4496]-worker) [    ] o.a.h.m.i.MetricsConfig Cannot locate configuration: tried hadoop-metrics2-namenode.properties,hadoop-metrics2.properties
   [junit4]   2> 579252 INFO  (SUITE-HdfsRestartWhileUpdatingTest-seed#[10B31070AB4A4496]-worker) [    ] o.m.log Logging to org.apache.logging.slf4j.Log4jLogger@34186ff7 via org.mortbay.log.Slf4jLog
   [junit4]   2> 579688 WARN  (SUITE-HdfsRestartWhileUpdatingTest-seed#[10B31070AB4A4496]-worker) [    ] o.a.h.h.HttpRequestLog Jetty request log can only be enabled using Log4j
   [junit4]   2> 582171 INFO  (SUITE-HdfsRestartWhileUpdatingTest-seed#[10B31070AB4A4496]-worker) [    ] o.m.log jetty-6.1.26
   [junit4]   2> 582520 INFO  (SUITE-HdfsRestartWhileUpdatingTest-seed#[10B31070AB4A4496]-worker) [    ] o.m.log Extract jar:file:/home/jenkins/.ivy2/cache/org.apache.hadoop/hadoop-hdfs/tests/hadoop-hdfs-2.7.4-tests.jar!/webapps/hdfs to ./temp/Jetty_lucene2.us.west_apache_org_40695_hdfs____dmmt6o/webapp
   [junit4]   2> 585699 INFO  (SUITE-HdfsRestartWhileUpdatingTest-seed#[10B31070AB4A4496]-worker) [    ] o.m.log Started HttpServer2$SelectChannelConnectorWithSafeStartup@lucene2-us-west.apache.org:40695
   [junit4]   2> 600417 WARN  (SUITE-HdfsRestartWhileUpdatingTest-seed#[10B31070AB4A4496]-worker) [    ] o.a.h.h.HttpRequestLog Jetty request log can only be enabled using Log4j
   [junit4]   2> 600599 INFO  (SUITE-HdfsRestartWhileUpdatingTest-seed#[10B31070AB4A4496]-worker) [    ] o.m.log jetty-6.1.26
   [junit4]   2> 600783 INFO  (SUITE-HdfsRestartWhileUpdatingTest-seed#[10B31070AB4A4496]-worker) [    ] o.m.log Extract jar:file:/home/jenkins/.ivy2/cache/org.apache.hadoop/hadoop-hdfs/tests/hadoop-hdfs-2.7.4-tests.jar!/webapps/datanode to ./temp/Jetty_localhost_40081_datanode____cfhcwk/webapp
   [junit4]   2> 602441 INFO  (SUITE-HdfsRestartWhileUpdatingTest-seed#[10B31070AB4A4496]-worker) [    ] o.m.log Started HttpServer2$SelectChannelConnectorWithSafeStartup@localhost:40081
   [junit4]   2> 606228 WARN  (SUITE-HdfsRestartWhileUpdatingTest-seed#[10B31070AB4A4496]-worker) [    ] o.a.h.h.HttpRequestLog Jetty request log can only be enabled using Log4j
   [junit4]   2> 606298 INFO  (SUITE-HdfsRestartWhileUpdatingTest-seed#[10B31070AB4A4496]-worker) [    ] o.m.log jetty-6.1.26
   [junit4]   2> 606420 INFO  (SUITE-HdfsRestartWhileUpdatingTest-seed#[10B31070AB4A4496]-worker) [    ] o.m.log Extract jar:file:/home/jenkins/.ivy2/cache/org.apache.hadoop/hadoop-hdfs/tests/hadoop-hdfs-2.7.4-tests.jar!/webapps/datanode to ./temp/Jetty_localhost_44109_datanode____vnp74x/webapp
   [junit4]   2> 608567 INFO  (SUITE-HdfsRestartWhileUpdatingTest-seed#[10B31070AB4A4496]-worker) [    ] o.m.log Started HttpServer2$SelectChannelConnectorWithSafeStartup@localhost:44109
   [junit4]   2> 614329 ERROR (DataNode: [[[DISK]file:/home/jenkins/jenkins-slave/workspace/Lucene-Solr-BadApples-NightlyTests-7.x/checkout/solr/build/solr-core/test/J1/temp/solr.cloud.hdfs.HdfsRestartWhileUpdatingTest_10B31070AB4A4496-001/tempDir-001/hdfsBaseDir/data/data1/, [DISK]file:/home/jenkins/jenkins-slave/workspace/Lucene-Solr-BadApples-NightlyTests-7.x/checkout/solr/build/solr-core/test/J1/temp/solr.cloud.hdfs.HdfsRestartWhileUpdatingTest_10B31070AB4A4496-001/tempDir-001/hdfsBaseDir/data/data2/]]  heartbeating to lucene2-us-west.apache.org/127.0.0.1:33938) [    ] o.a.h.h.s.d.DirectoryScanner dfs.datanode.directoryscan.throttle.limit.ms.per.sec set to value below 1 ms/sec. Assuming default value of 1000
   [junit4]   2> 614348 ERROR (DataNode: [[[DISK]file:/home/jenkins/jenkins-slave/workspace/Lucene-Solr-BadApples-NightlyTests-7.x/checkout/solr/build/solr-core/test/J1/temp/solr.cloud.hdfs.HdfsRestartWhileUpdatingTest_10B31070AB4A4496-001/tempDir-001/hdfsBaseDir/data/data3/, [DISK]file:/home/jenkins/jenkins-slave/workspace/Lucene-Solr-BadApples-NightlyTests-7.x/checkout/solr/build/solr-core/test/J1/temp/solr.cloud.hdfs.HdfsRestartWhileUpdatingTest_10B31070AB4A4496-001/tempDir-001/hdfsBaseDir/data/data4/]]  heartbeating to lucene2-us-west.apache.org/127.0.0.1:33938) [    ] o.a.h.h.s.d.DirectoryScanner dfs.datanode.directoryscan.throttle.limit.ms.per.sec set to value below 1 ms/sec. Assuming default value of 1000
   [junit4]   2> 616090 INFO  (Block report processor) [    ] BlockStateChange BLOCK* processReport 0x711a3cec76e947: from storage DS-fc958893-024f-47e9-9d19-7712f74302f0 node DatanodeRegistration(127.0.0.1:43912, datanodeUuid=c321208d-6bbc-42e2-a6a0-9f3eb9756dd4, infoPort=43350, infoSecurePort=0, ipcPort=36125, storageInfo=lv=-56;cid=testClusterID;nsid=1860620963;c=0), blocks: 0, hasStaleStorage: true, processing time: 55 msecs
   [junit4]   2> 616162 INFO  (Block report processor) [    ] BlockStateChange BLOCK* processReport 0x711a3ceeee0d6e: from storage DS-0a9acec4-a6ff-4661-a490-1e967f8e23d4 node DatanodeRegistration(127.0.0.1:46416, datanodeUuid=64ca8841-b86c-4d4f-8e19-4bd820e16be2, infoPort=37275, infoSecurePort=0, ipcPort=38228, storageInfo=lv=-56;cid=testClusterID;nsid=1860620963;c=0), blocks: 0, hasStaleStorage: true, processing time: 72 msecs
   [junit4]   2> 616163 INFO  (Block report processor) [    ] BlockStateChange BLOCK* processReport 0x711a3cec76e947: from storage DS-137b782c-e791-4dc0-b111-88cb739c555a node DatanodeRegistration(127.0.0.1:43912, datanodeUuid=c321208d-6bbc-42e2-a6a0-9f3eb9756dd4, infoPort=43350, infoSecurePort=0, ipcPort=36125, storageInfo=lv=-56;cid=testClusterID;nsid=1860620963;c=0), blocks: 0, hasStaleStorage: false, processing time: 0 msecs
   [junit4]   2> 616219 INFO  (Block report processor) [    ] BlockStateChange BLOCK* processReport 0x711a3ceeee0d6e: from storage DS-b1961a59-5899-4129-8bf1-de6a381ff774 node DatanodeRegistration(127.0.0.1:46416, datanodeUuid=64ca8841-b86c-4d4f-8e19-4bd820e16be2, infoPort=37275, infoSecurePort=0, ipcPort=38228, storageInfo=lv=-56;cid=testClusterID;nsid=1860620963;c=0), blocks: 0, hasStaleStorage: false, processing time: 0 msecs
   [junit4]   2> 618325 INFO  (TEST-HdfsRestartWhileUpdatingTest.test-seed#[10B31070AB4A4496]) [    ] o.a.s.c.ZkTestServer STARTING ZK TEST SERVER
   [junit4]   2> 618326 INFO  (ZkTestServer Run Thread) [    ] o.a.s.c.ZkTestServer client port:0.0.0.0/0.0.0.0:0
   [junit4]   2> 618326 INFO  (ZkTestServer Run Thread) [    ] o.a.s.c.ZkTestServer Starting server
   [junit4]   2> 618435 INFO  (TEST-HdfsRestartWhileUpdatingTest.test-seed#[10B31070AB4A4496]) [    ] o.a.s.c.ZkTestServer start zk server on port:38116
   [junit4]   2> 618435 INFO  (TEST-HdfsRestartWhileUpdatingTest.test-seed#[10B31070AB4A4496]) [    ] o.a.s.c.ZkTestServer parse host and port list: 127.0.0.1:38116
   [junit4]   2> 618435 INFO  (TEST-HdfsRestartWhileUpdatingTest.test-seed#[10B31070AB4A4496]) [    ] o.a.s.c.ZkTestServer connecting to 127.0.0.1 38116
   [junit4]   2> 618622 INFO  (zkConnectionManagerCallback-3166-thread-1) [    ] o.a.s.c.c.ConnectionManager zkClient has connected
   [junit4]   2> 618658 INFO  (zkConnectionManagerCallback-3168-thread-1) [    ] o.a.s.c.c.ConnectionManager zkClient has connected
   [junit4]   2> 618660 INFO  (TEST-HdfsRestartWhileUpdatingTest.test-seed#[10B31070AB4A4496]) [    ] o.a.s.c.ZkTestServer put /home/jenkins/jenkins-slave/workspace/Lucene-Solr-BadApples-NightlyTests-7.x/checkout/solr/core/src/test-files/solr/collection1/conf/solrconfig-tlog.xml to /configs/conf1/solrconfig.xml
   [junit4]   2> 618661 INFO  (TEST-HdfsRestartWhileUpdatingTest.test-seed#[10B31070AB4A4496]) [    ] o.a.s.c.ZkTestServer put /home/jenkins/jenkins-slave/workspace/Lucene-Solr-BadApples-NightlyTests-7.x/checkout/solr/core/src/test-files/solr/collection1/conf/schema15.xml to /configs/conf1/schema.xml
   [junit4]   2> 618662 INFO  (TEST-HdfsRestartWhileUpdatingTest.test-seed#[10B31070AB4A4496]) [    ] o.a.s.c.ZkTestServer put /home/jenkins/jenkins-slave/workspace/Lucene-Solr-BadApples-NightlyTests-7.x/checkout/solr/core/src/test-files/solr/collection1/conf/solrconfig.snippet.randomindexconfig.xml to /configs/conf1/solrconfig.snippet.randomindexconfig.xml
   [junit4]   2> 618699 INFO  (TEST-HdfsRestartWhileUpdatingTest.test-seed#[10B31070AB4A4496]) [    ] o.a.s.c.ZkTestServer put /home/jenkins/jenkins-slave/workspace/Lucene-Solr-BadApples-NightlyTests-7.x/checkout/solr/core/src/test-files/solr/collection1/conf/stopwords.txt to /configs/conf1/stopwords.txt
   [junit4]   2> 618700 INFO  (TEST-HdfsRestartWhileUpdatingTest.test-seed#[10B31070AB4A4496]) [    ] o.a.s.c.ZkTestServer put /home/jenkins/jenkins-slave/workspace/Lucene-Solr-BadApples-NightlyTests-7.x/checkout/solr/core/src/test-files/solr/collection1/conf/protwords.txt to /configs/conf1/protwords.txt
   [junit4]   2> 618701 INFO  (TEST-HdfsRestartWhileUpdatingTest.test-seed#[10B31070AB4A4496]) [    ] o.a.s.c.ZkTestServer put /home/jenkins/jenkins-slave/workspace/Lucene-Solr-BadApples-NightlyTests-7.x/checkout/solr/core/src/test-files/solr/collection1/conf/currency.xml to /configs/conf1/currency.xml
   [junit4]   2> 618702 INFO  (TEST-HdfsRestartWhileUpdatingTest.test-seed#[10B31070AB4A4496]) [    ] o.a.s.c.ZkTestServer put /home/jenkins/jenkins-slave/workspace/Lucene-Solr-BadApples-NightlyTests-7.x/checkout/solr/core/src/test-files/solr/collection1/conf/enumsConfig.xml to /configs/conf1/enumsConfig.xml
   [junit4]   2> 618752 INFO  (TEST-HdfsRestartWhileUpdatingTest.test-seed#[10B31070AB4A4496]) [    ] o.a.s.c.ZkTestServer put /home/jenkins/jenkins-slave/workspace/Lucene-Solr-BadApples-NightlyTests-7.x/checkout/solr/core/src/test-files/solr/collection1/conf/open-exchange-rates.json to /configs/conf1/open-exchange-rates.json
   [junit4]   2> 618753 INFO  (TEST-HdfsRestartWhileUpdatingTest.test-seed#[10B31070AB4A4496]) [    ] o.a.s.c.ZkTestServer put /home/jenkins/jenkins-slave/workspace/Lucene-Solr-BadApples-NightlyTests-7.x/checkout/solr/core/src/test-files/solr/collection1/conf/mapping-ISOLatin1Accent.txt to /configs/conf1/mapping-ISOLatin1Accent.txt
   [junit4]   2> 618754 INFO  (TEST-HdfsRestartWhileUpdatingTest.test-seed#[10B31070AB4A4496]) [    ] o.a.s.c.ZkTestServer put /home/jenkins/jenkins-slave/workspace/Lucene-Solr-BadApples-NightlyTests-7.x/checkout/solr/core/src/test-files/solr/collection1/conf/old_synonyms.txt to /configs/conf1/old_synonyms.txt
   [junit4]   2> 618755 INFO  (TEST-HdfsRestartWhileUpdatingTest.test-seed#[10B31070AB4A4496]) [    ] o.a.s.c.ZkTestServer put /home/jenkins/jenkins-slave/workspace/Lucene-Solr-BadApples-NightlyTests-7.x/checkout/solr/core/src/test-files/solr/collection1/conf/synonyms.txt to /configs/conf1/synonyms.txt
   [junit4]   2> 618881 INFO  (zkConnectionManagerCallback-3172-thread-1) [    ] o.a.s.c.c.ConnectionManager zkClient has connected
   [junit4]   2> 618884 INFO  (TEST-HdfsRestartWhileUpdatingTest.test-seed#[10B31070AB4A4496]) [    ] o.a.s.c.AbstractFullDistribZkTestBase Will use NRT replicas unless explicitly asked otherwise
   [junit4]   2> 620845 WARN  (TEST-HdfsRestartWhileUpdatingTest.test-seed#[10B31070AB4A4496]) [    ] o.e.j.s.AbstractConnector Ignoring deprecated socket close linger time
   [junit4]   2> 620846 INFO  (TEST-HdfsRestartWhileUpdatingTest.test-seed#[10B31070AB4A4496]) [    ] o.a.s.c.s.e.JettySolrRunner Start Jetty (original configured port=0)
   [junit4]   2> 620846 INFO  (TEST-HdfsRestartWhileUpdatingTest.test-seed#[10B31070AB4A4496]) [    ] o.a.s.c.s.e.JettySolrRunner Trying to start Jetty on port 0 try number 1 ...
   [junit4]   2> 620864 INFO  (TEST-HdfsRestartWhileUpdatingTest.test-seed#[10B31070AB4A4496]) [    ] o.e.j.s.Server jetty-9.4.14.v20181114; built: 2018-11-14T21:20:31.478Z; git: c4550056e785fb5665914545889f21dc136ad9e6; jvm 1.8.0_191-b12
   [junit4]   2> 620865 INFO  (TEST-HdfsRestartWhileUpdatingTest.test-seed#[10B31070AB4A4496]) [    ] o.e.j.s.session DefaultSessionIdManager workerName=node0
   [junit4]   2> 620865 INFO  (TEST-HdfsRestartWhileUpdatingTest.test-seed#[10B31070AB4A4496]) [    ] o.e.j.s.session No SessionScavenger set, using defaults
   [junit4]   2> 620865 INFO  (TEST-HdfsRestartWhileUpdatingTest.test-seed#[10B31070AB4A4496]) [    ] o.e.j.s.session node0 Scavenging every 600000ms
   [junit4]   2> 620866 INFO  (TEST-HdfsRestartWhileUpdatingTest.test-seed#[10B31070AB4A4496]) [    ] o.e.j.s.h.ContextHandler Started o.e.j.s.ServletContextHandler@10117b4f{/,null,AVAILABLE}
   [junit4]   2> 620882 WARN  (TEST-HdfsRestartWhileUpdatingTest.test-seed#[10B31070AB4A4496]) [    ] o.e.j.u.s.S.config No Client EndPointIdentificationAlgorithm configured for SslContextFactory@25932159[provider=null,keyStore=null,trustStore=null]
   [junit4]   2> 620972 INFO  (TEST-HdfsRestartWhileUpdatingTest.test-seed#[10B31070AB4A4496]) [    ] o.e.j.s.AbstractConnector Started ServerConnector@21d34744{SSL,[ssl, http/1.1]}{127.0.0.1:41518}
   [junit4]   2> 620972 INFO  (TEST-HdfsRestartWhileUpdatingTest.test-seed#[10B31070AB4A4496]) [    ] o.e.j.s.Server Started @621136ms
   [junit4]   2> 620972 INFO  (TEST-HdfsRestartWhileUpdatingTest.test-seed#[10B31070AB4A4496]) [    ] o.a.s.c.s.e.JettySolrRunner Jetty properties: {solr.data.dir=hdfs://lucene2-us-west.apache.org:33938/hdfs__lucene2-us-west.apache.org_33938__home_jenkins_jenkins-slave_workspace_Lucene-Solr-BadApples-NightlyTests-7.x_checkout_solr_build_solr-core_test_J1_temp_solr.cloud.hdfs.HdfsRestartWhileUpdatingTest_10B31070AB4A4496-001_tempDir-002_control_data, hostContext=/, hostPort=41518, coreRootDirectory=/home/jenkins/jenkins-slave/workspace/Lucene-Solr-BadApples-NightlyTests-7.x/checkout/solr/build/solr-core/test/J1/../../../../../../../../../../../home/jenkins/jenkins-slave/workspace/Lucene-Solr-BadApples-NightlyTests-7.x/checkout/solr/build/solr-core/test/J1/temp/solr.cloud.hdfs.HdfsRestartWhileUpdatingTest_10B31070AB4A4496-001/control-001/cores}
   [junit4]   2> 620973 ERROR (TEST-HdfsRestartWhileUpdatingTest.test-seed#[10B31070AB4A4496]) [    ] o.a.s.u.StartupLoggingUtils Missing Java Option solr.log.dir. Logging may be missing or incomplete.
   [junit4]   2> 620973 INFO  (TEST-HdfsRestartWhileUpdatingTest.test-seed#[10B31070AB4A4496]) [    ] o.a.s.s.SolrDispatchFilter Using logger factory org.apache.logging.slf4j.Log4jLoggerFactory
   [junit4]   2> 620973 INFO  (TEST-HdfsRestartWhileUpdatingTest.test-seed#[10B31070AB4A4496]) [    ] o.a.s.s.SolrDispatchFilter  ___      _       Welcome to Apache Solr™ version 7.8.0
   [junit4]   2> 620973 INFO  (TEST-HdfsRestartWhileUpdatingTest.test-seed#[10B31070AB4A4496]) [    ] o.a.s.s.SolrDispatchFilter / __| ___| |_ _   Starting in cloud mode on port null
   [junit4]   2> 620973 INFO  (TEST-HdfsRestartWhileUpdatingTest.test-seed#[10B31070AB4A4496]) [    ] o.a.s.s.SolrDispatchFilter \__ \/ _ \ | '_|  Install dir: null
   [junit4]   2> 620973 INFO  (TEST-HdfsRestartWhileUpdatingTest.test-seed#[10B31070AB4A4496]) [    ] o.a.s.s.SolrDispatchFilter |___/\___/_|_|    Start time: 2019-02-07T00:08:45.469Z
   [junit4]   2> 621027 INFO  (zkConnectionManagerCallback-3174-thread-1) [    ] o.a.s.c.c.ConnectionManager zkClient has connected
   [junit4]   2> 621033 INFO  (TEST-HdfsRestartWhileUpdatingTest.test-seed#[10B31070AB4A4496]) [    ] o.a.s.s.SolrDispatchFilter Loading solr.xml from SolrHome (not found in ZooKeeper)
   [junit4]   2> 621033 INFO  (TEST-HdfsRestartWhileUpdatingTest.test-seed#[10B31070AB4A4496]) [    ] o.a.s.c.SolrXmlConfig Loading container configuration from /home/jenkins/jenkins-slave/workspace/Lucene-Solr-BadApples-NightlyTests-7.x/checkout/solr/build/solr-core/test/J1/temp/solr.cloud.hdfs.HdfsRestartWhileUpdatingTest_10B31070AB4A4496-001/control-001/solr.xml
   [junit4]   2> 621050 INFO  (TEST-HdfsRestartWhileUpdatingTest.test-seed#[10B31070AB4A4496]) [    ] o.a.s.c.SolrXmlConfig Configuration parameter autoReplicaFailoverWorkLoopDelay is ignored
   [junit4]   2> 621050 INFO  (TEST-HdfsRestartWhileUpdatingTest.test-seed#[10B31070AB4A4496]) [    ] o.a.s.c.SolrXmlConfig Configuration parameter autoReplicaFailoverBadNodeExpiration is ignored
   [junit4]   2> 621159 INFO  (TEST-HdfsRestartWhileUpdatingTest.test-seed#[10B31070AB4A4496]) [    ] o.a.s.c.SolrXmlConfig MBean server found: com.sun.jmx.mbeanserver.JmxMBeanServer@552b16eb, but no JMX reporters were configured - adding default JMX reporter.
   [junit4]   2> 622421 INFO  (TEST-HdfsRestartWhileUpdatingTest.test-seed#[10B31070AB4A4496]) [    ] o.a.s.h.c.HttpShardHandlerFactory Host whitelist initialized: WhitelistHostChecker [whitelistHosts=null, whitelistHostCheckingEnabled=false]
   [junit4]   2> 622528 INFO  (TEST-HdfsRestartWhileUpdatingTest.test-seed#[10B31070AB4A4496]) [    ] o.a.s.c.ZkContainer Zookeeper client=127.0.0.1:38116/solr
   [junit4]   2> 622600 INFO  (zkConnectionManagerCallback-3178-thread-1) [    ] o.a.s.c.c.ConnectionManager zkClient has connected
   [junit4]   2> 622648 INFO  (zkConnectionManagerCallback-3180-thread-1) [    ] o.a.s.c.c.ConnectionManager zkClient has connected
   [junit4]   2> 622947 INFO  (TEST-HdfsRestartWhileUpdatingTest.test-seed#[10B31070AB4A4496]) [n:127.0.0.1:41518_    ] o.a.s.c.OverseerElectionContext I am going to be the leader 127.0.0.1:41518_
   [junit4]   2> 622948 INFO  (TEST-HdfsRestartWhileUpdatingTest.test-seed#[10B31070AB4A4496]) [n:127.0.0.1:41518_    ] o.a.s.c.Overseer Overseer (id=74143966924308485-127.0.0.1:41518_-n_0000000000) starting
   [junit4]   2> 623072 INFO  (zkConnectionManagerCallback-3187-thread-1) [    ] o.a.s.c.c.ConnectionManager zkClient has connected
   [junit4]   2> 623088 INFO  (TEST-HdfsRestartWhileUpdatingTest.test-seed#[10B31070AB4A4496]) [n:127.0.0.1:41518_    ] o.a.s.c.s.i.ZkClientClusterStateProvider Cluster at 127.0.0.1:38116/solr ready
   [junit4]   2> 623089 INFO  (OverseerStateUpdate-74143966924308485-127.0.0.1:41518_-n_0000000000) [n:127.0.0.1:41518_    ] o.a.s.c.Overseer Starting to work on the main queue : 127.0.0.1:41518_
   [junit4]   2> 623139 INFO  (TEST-HdfsRestartWhileUpdatingTest.test-seed#[10B31070AB4A4496]) [n:127.0.0.1:41518_    ] o.a.s.c.ZkController Register node as live in ZooKeeper:/live_nodes/127.0.0.1:41518_
   [junit4]   2> 623163 INFO  (zkCallback-3179-thread-1) [    ] o.a.s.c.c.ZkStateReader Updated live nodes from ZooKeeper... (0) -> (1)
   [junit4]   2> 623179 INFO  (zkCallback-3186-thread-1) [    ] o.a.s.c.c.ZkStateReader Updated live nodes from ZooKeeper... (0) -> (1)
   [junit4]   2> 623256 INFO  (TEST-HdfsRestartWhileUpdatingTest.test-seed#[10B31070AB4A4496]) [n:127.0.0.1:41518_    ] o.a.s.h.a.MetricsHistoryHandler No .system collection, keeping metrics history in memory.
   [junit4]   2> 623350 INFO  (TEST-HdfsRestartWhileUpdatingTest.test-seed#[10B31070AB4A4496]) [n:127.0.0.1:41518_    ] o.a.s.m.r.SolrJmxReporter JMX monitoring for 'solr.node' (registry 'solr.node') enabled at server: com.sun.jmx.mbeanserver.JmxMBeanServer@552b16eb
   [junit4]   2> 623387 INFO  (TEST-HdfsRestartWhileUpdatingTest.test-seed#[10B31070AB4A4496]) [n:127.0.0.1:41518_    ] o.a.s.m.r.SolrJmxReporter JMX monitoring for 'solr.jvm' (registry 'solr.jvm') enabled at server: com.sun.jmx.mbeanserver.JmxMBeanServer@552b16eb
   [junit4]   2> 623387 INFO  (TEST-HdfsRestartWhileUpdatingTest.test-seed#[10B31070AB4A4496]) [n:127.0.0.1:41518_    ] o.a.s.m.r.SolrJmxReporter JMX monitoring for 'solr.jetty' (registry 'solr.jetty') enabled at server: com.sun.jmx.mbeanserver.JmxMBeanServer@552b16eb
   [junit4]   2> 623389 INFO  (TEST-HdfsRestartWhileUpdatingTest.test-seed#[10B31070AB4A4496]) [n:127.0.0.1:41518_    ] o.a.s.c.CorePropertiesLocator Found 0 core definitions underneath /home/jenkins/jenkins-slave/workspace/Lucene-Solr-BadApples-NightlyTests-7.x/checkout/solr/build/solr-core/test/J1/../../../../../../../../../../../home/jenkins/jenkins-slave/workspace/Lucene-Solr-BadApples-NightlyTests-7.x/checkout/solr/build/solr-core/test/J1/temp/solr.cloud.hdfs.HdfsRestartWhileUpdatingTest_10B31070AB4A4496-001/control-001/cores
   [junit4]   2> 623520 INFO  (zkConnectionManagerCallback-3193-thread-1) [    ] o.a.s.c.c.ConnectionManager zkClient has connected
   [junit4]   2> 623521 INFO  (TEST-HdfsRestartWhileUpdatingTest.test-seed#[10B31070AB4A4496]) [    ] o.a.s.c.c.ZkStateReader Updated live nodes from ZooKeeper... (0) -> (1)
   [junit4]   2> 623521 INFO  (TEST-HdfsRestartWhileUpdatingTest.test-seed#[10B31070AB4A4496]) [    ] o.a.s.c.s.i.ZkClientClusterStateProvider Cluster at 127.0.0.1:38116/solr ready
   [junit4]   2> 623830 INFO  (qtp947836002-4633) [n:127.0.0.1:41518_    ] o.a.s.h.a.CollectionsHandler Invoked Collection Action :create with params collection.configName=conf1&name=control_collection&nrtReplicas=1&action=CREATE&numShards=1&createNodeSet=127.0.0.1:41518_&wt=javabin&version=2 and sendToOCPQueue=true
   [junit4]   2> 623864 INFO  (OverseerThreadFactory-1034-thread-1-processing-n:127.0.0.1:41518_) [n:127.0.0.1:41518_    ] o.a.s.c.a.c.CreateCollectionCmd Create collection control_collection
   [junit4]   2> 624109 INFO  (qtp947836002-4631) [n:127.0.0.1:41518_    ] o.a.s.s.HttpSolrCall [admin] webapp=null path=/admin/metrics params={prefix=CONTAINER.fs.usableSpace,CONTAINER.fs.totalSpace,CORE.coreName&wt=javabin&version=2&group=solr.node,solr.core} status=0 QTime=0
   [junit4]   2> 624116 INFO  (qtp947836002-4632) [n:127.0.0.1:41518_    ] o.a.s.s.HttpSolrCall [admin] webapp=null path=/admin/metrics params={prefix=CONTAINER.fs.usableSpace,CONTAINER.fs.totalSpace,CORE.coreName&wt=javabin&version=2&group=solr.node,solr.core} status=0 QTime=0
   [junit4]   2> 624136 INFO  (qtp947836002-4634) [n:127.0.0.1:41518_    ] o.a.s.s.HttpSolrCall [admin] webapp=null path=/admin/metrics params={prefix=CONTAINER.fs.usableSpace,CONTAINER.fs.totalSpace,CORE.coreName&wt=javabin&version=2&group=solr.node,solr.core} status=0 QTime=0
   [junit4]   2> 624137 INFO  (qtp947836002-4630) [n:127.0.0.1:41518_    ] o.a.s.s.HttpSolrCall [admin] webapp=null path=/admin/metrics params={prefix=CONTAINER.fs.usableSpace,CONTAINER.fs.totalSpace,CORE.coreName&wt=javabin&version=2&group=solr.node,solr.core} status=0 QTime=0
   [junit4]   2> 624144 INFO  (qtp947836002-4631) [n:127.0.0.1:41518_    ] o.a.s.s.HttpSolrCall [admin] webapp=null path=/admin/metrics params={prefix=CONTAINER.fs.usableSpace,CONTAINER.fs.totalSpace,CORE.coreName&wt=javabin&version=2&group=solr.node,solr.core} status=0 QTime=0
   [junit4]   2> 624241 INFO  (qtp947836002-4632) [n:127.0.0.1:41518_    x:control_collection_shard1_replica_n1] o.a.s.h.a.CoreAdminOperation core create command qt=/admin/cores&collection.configName=conf1&newCollection=true&name=control_collection_shard1_replica_n1&action=CREATE&numShards=1&collection=control_collection&shard=shard1&wt=javabin&version=2&replicaType=NRT
   [junit4]   2> 624242 INFO  (qtp947836002-4632) [n:127.0.0.1:41518_    x:control_collection_shard1_replica_n1] o.a.s.c.TransientSolrCoreCacheDefault Allocating transient cache for 4 transient cores
   [junit4]   2> 625381 INFO  (qtp947836002-4632) [n:127.0.0.1:41518_ c:control_collection s:shard1  x:control_collection_shard1_replica_n1] o.a.s.c.SolrConfig Using Lucene MatchVersion: 7.8.0
   [junit4]   2> 625450 INFO  (qtp947836002-4632) [n:127.0.0.1:41518_ c:control_collection s:shard1  x:control_collection_shard1_replica_n1] o.a.s.s.IndexSchema [control_collection_shard1_replica_n1] Schema name=test
   [junit4]   2> 626136 INFO  (qtp947836002-4632) [n:127.0.0.1:41518_ c:control_collection s:shard1  x:control_collection_shard1_replica_n1] o.a.s.s.IndexSchema Loaded schema test/1.6 with uniqueid field id
   [junit4]   2> 626250 INFO  (qtp947836002-4632) [n:127.0.0.1:41518_ c:control_collection s:shard1  x:control_collection_shard1_replica_n1] o.a.s.c.CoreContainer Creating SolrCore 'control_collection_shard1_replica_n1' using configuration from collection control_collection, trusted=true
   [junit4]   2> 626251 INFO  (qtp947836002-4632) [n:127.0.0.1:41518_ c:control_collection s:shard1  x:control_collection_shard1_replica_n1] o.a.s.m.r.SolrJmxReporter JMX monitoring for 'solr.core.control_collection.shard1.replica_n1' (registry 'solr.core.control_collection.shard1.replica_n1') enabled at server: com.sun.jmx.mbeanserver.JmxMBeanServer@552b16eb
   [junit4]   2> 626251 INFO  (qtp947836002-4632) [n:127.0.0.1:41518_ c:control_collection s:shard1  x:control_collection_shard1_replica_n1] o.a.s.c.SolrCore [[control_collection_shard1_replica_n1] ] Opening new SolrCore at [/home/jenkins/jenkins-slave/workspace/Lucene-Solr-BadApples-NightlyTests-7.x/checkout/solr/build/solr-core/test/J1/temp/solr.cloud.hdfs.HdfsRestartWhileUpdatingTest_10B31070AB4A4496-001/control-001/cores/control_collection_shard1_replica_n1], dataDir=[/home/jenkins/jenkins-slave/workspace/Lucene-Solr-BadApples-NightlyTests-7.x/checkout/solr/build/solr-core/test/J1/../../../../../../../../../../../home/jenkins/jenkins-slave/workspace/Lucene-Solr-BadApples-NightlyTests-7.x/checkout/solr/build/solr-core/test/J1/temp/solr.cloud.hdfs.HdfsRestartWhileUpdatingTest_10B31070AB4A4496-001/control-001/cores/control_collection_shard1_replica_n1/data/]
   [junit4]   2> 626255 INFO  (qtp947836002-4632) [n:127.0.0.1:41518_ c:control_collection s:shard1  x:control_collection_shard1_replica_n1] o.a.s.u.RandomMergePolicy RandomMergePolicy wrapping class org.apache.lucene.index.MockRandomMergePolicy: org.apache.lucene.index.MockRandomMergePolicy@29852cbf
   [junit4]   2> 626324 WARN  (qtp947836002-4632) [n:127.0.0.1:41518_ c:control_collection s:shard1  x:control_collection_shard1_replica_n1] o.a.s.c.RequestHandlers INVALID paramSet a in requestHandler {type = requestHandler,name = /dump,class = DumpRequestHandler,attributes = {initParams=a, name=/dump, class=DumpRequestHandler},args = {defaults={a=A,b=B}}}
   [junit4]   2> 626570 INFO  (qtp947836002-4632) [n:127.0.0.1:41518_ c:control_collection s:shard1  x:control_collection_shard1_replica_n1] o.a.s.u.UpdateHandler Using UpdateLog implementation: org.apache.solr.update.UpdateLog
   [junit4]   2> 626571 INFO  (qtp947836002-4632) [n:127.0.0.1:41518_ c:control_collection s:shard1  x:control_collection_shard1_replica_n1] o.a.s.u.UpdateLog Initializing UpdateLog: dataDir= defaultSyncLevel=FLUSH numRecordsToKeep=100 maxNumLogsToKeep=10 numVersionBuckets=65536
   [junit4]   2> 626696 INFO  (qtp947836002-4632) [n:127.0.0.1:41518_ c:control_collection s:shard1  x:control_collection_shard1_replica_n1] o.a.s.u.CommitTracker Hard AutoCommit: if uncommitted for 30000ms; 
   [junit4]   2> 626696 INFO  (qtp947836002-4632) [n:127.0.0.1:41518_ c:control_collection s:shard1  x:control_collection_shard1_replica_n1] o.a.s.u.CommitTracker Soft AutoCommit: if uncommitted for 3000ms; 
   [junit4]   2> 626698 INFO  (qtp947836002-4632) [n:127.0.0.1:41518_ c:control_collection s:shard1  x:control_collection_shard1_replica_n1] o.a.s.u.RandomMergePolicy RandomMergePolicy wrapping class org.apache.lucene.index.AlcoholicMergePolicy: [AlcoholicMergePolicy: minMergeSize=0, mergeFactor=10, maxMergeSize=181496574, maxMergeSizeForForcedMerge=9223372036854775807, calibrateSizeByDeletes=true, maxMergeDocs=2147483647, maxCFSSegmentSizeMB=8.796093022207999E12, noCFSRatio=0.1]
   [junit4]   2> 626740 INFO  (qtp947836002-4632) [n:127.0.0.1:41518_ c:control_collection s:shard1  x:control_collection_shard1_replica_n1] o.a.s.s.SolrIndexSearcher Opening [Searcher@70d0db8c[control_collection_shard1_replica_n1] main]
   [junit4]   2> 626741 INFO  (qtp947836002-4632) [n:127.0.0.1:41518_ c:control_collection s:shard1  x:control_collection_shard1_replica_n1] o.a.s.r.ManagedResourceStorage Configured ZooKeeperStorageIO with znodeBase: /configs/conf1
   [junit4]   2> 626742 INFO  (qtp947836002-4632) [n:127.0.0.1:41518_ c:control_collection s:shard1  x:control_collection_shard1_replica_n1] o.a.s.r.ManagedResourceStorage Loaded null at path _rest_managed.json using ZooKeeperStorageIO:path=/configs/conf1
   [junit4]   2> 626743 INFO  (qtp947836002-4632) [n:127.0.0.1:41518_ c:control_collection s:shard1  x:control_collection_shard1_replica_n1] o.a.s.h.ReplicationHandler Commits will be reserved for 10000ms.
   [junit4]   2> 626743 INFO  (qtp947836002-4632) [n:127.0.0.1:41518_ c:control_collection s:shard1  x:control_collection_shard1_replica_n1] o.a.s.u.UpdateLog Could not find max version in index or recent updates, using new clock 1624766552462065664
   [junit4]   2> 626758 INFO  (searcherExecutor-1039-thread-1-processing-n:127.0.0.1:41518_ x:control_collection_shard1_replica_n1 c:control_collection s:shard1) [n:127.0.0.1:41518_ c:control_collection s:shard1  x:control_collection_shard1_replica_n1] o.a.s.c.SolrCore [control_collection_shard1_replica_n1] Registered new searcher Searcher@70d0db8c[control_collection_shard1_replica_n1] main{ExitableDirectoryReader(UninvertingDirectoryReader())}
   [junit4]   2> 626795 INFO  (qtp947836002-4632) [n:127.0.0.1:41518_ c:control_collection s:shard1  x:control_collection_shard1_replica_n1] o.a.s.c.ZkShardTerms Successful update of terms at /collections/control_collection/terms/shard1 to Terms{values={core_node2=0}, version=0}
   [junit4]   2> 626795 INFO  (qtp947836002-4632) [n:127.0.0.1:41518_ c:control_collection s:shard1  x:control_collection_shard1_replica_n1] o.a.s.c.ShardLeaderElectionContextBase make sure parent is created /collections/control_collection/leaders/shard1
   [junit4]   2> 626814 INFO  (qtp947836002-4632) [n:127.0.0.1:41518_ c:control_collection s:shard1  x:control_collection_shard1_replica_n1] o.a.s.c.ShardLeaderElectionContext Enough replicas found to continue.
   [junit4]   2> 626814 INFO  (qtp947836002-4632) [n:127.0.0.1:41518_ c:control_collection s:shard1  x:control_collection_shard1_replica_n1] o.a.s.c.ShardLeaderElectionContext I may be the new leader - try and sync
   [junit4]   2> 626814 INFO  (qtp947836002-4632) [n:127.0.0.1:41518_ c:control_collection s:shard1  x:control_collection_shard1_replica_n1] o.a.s.c.SyncStrategy Sync replicas to https://127.0.0.1:41518/control_collection_shard1_replica_n1/
   [junit4]   2> 626814 INFO  (qtp947836002-4632) [n:127.0.0.1:41518_ c:control_collection s:shard1  x:control_collection_shard1_replica_n1] o.a.s.c.SyncStrategy Sync Success - now sync replicas to me
   [junit4]   2> 626815 INFO  (qtp947836002-4632) [n:127.0.0.1:41518_ c:control_collection s:shard1  x:control_collection_shard1_replica_n1] o.a.s.c.SyncStrategy https://127.0.0.1:41518/control_collection_shard1_replica_n1/ has no replicas
   [junit4]   2> 626815 INFO  (qtp947836002-4632) [n:127.0.0.1:41518_ c:control_collection s:shard1  x:control_collection_shard1_replica_n1] o.a.s.c.ShardLeaderElectionContext Found all replicas participating in election, clear LIR
   [junit4]   2> 626815 INFO  (qtp947836002-4632) [n:127.0.0.1:41518_ c:control_collection s:shard1  x:control_collection_shard1_replica_n1] o.a.s.c.ShardLeaderElectionContextBase Creating leader registration node /collections/control_collection/leaders/shard1/leader after winning as /collections/control_collection/leader_elect/shard1/election/74143966924308485-core_node2-n_0000000000
   [junit4]   2> 626817 INFO  (qtp947836002-4632) [n:127.0.0.1:41518_ c:control_collection s:shard1  x:control_collection_shard1_replica_n1] o.a.s.c.ShardLeaderElectionContext I am the new leader: https://127.0.0.1:41518/control_collection_shard1_replica_n1/ shard1
   [junit4]   2> 626899 INFO  (zkCallback-3179-thread-1) [    ] o.a.s.c.c.ZkStateReader A cluster state change: [WatchedEvent state:SyncConnected type:NodeDataChanged path:/collections/control_collection/state.json] for collection [control_collection] has occurred - updating... (live nodes size: [1])
   [junit4]   2> 626901 INFO  (qtp947836002-4632) [n:127.0.0.1:41518_ c:control_collection s:shard1  x:control_collection_shard1_replica_n1] o.a.s.c.ZkController I am the leader, no recovery necessary
   [junit4]   2> 626903 INFO  (qtp947836002-4632) [n:127.0.0.1:41518_ c:control_collection s:shard1  x:control_collection_shard1_replica_n1] o.a.s.s.HttpSolrCall [admin] webapp=null path=/admin/cores params={qt=/admin/cores&collection.configName=conf1&newCollection=true&name=control_collection_shard1_replica_n1&action=CREATE&numShards=1&collection=control_collection&shard=shard1&wt=javabin&version=2&replicaType=NRT} status=0 QTime=2662
   [junit4]   2> 626991 INFO  (qtp947836002-4633) [n:127.0.0.1:41518_    ] o.a.s.h.a.CollectionsHandler Wait for new collection to be active for at most 45 seconds. Check all shard replicas
   [junit4]   2> 627008 INFO  (zkCallback-3179-thread-2) [    ] o.a.s.c.c.ZkStateReader A cluster state change: [WatchedEvent state:SyncConnected type:NodeDataChanged path:/collections/control_collection/state.json] for collection [control_collection] has occurred - updating... (live nodes size: [1])
   [junit4]   2> 627008 INFO  (zkCallback-3179-thread-3) [    ] o.a.s.c.c.ZkStateReader A cluster state change: [WatchedEvent state:SyncConnected type:NodeDataChanged path:/collections/control_collection/state.json] for collection [control_collection] has occurred - updating... (live nodes size: [1])
   [junit4]   2> 627009 INFO  (qtp947836002-4633) [n:127.0.0.1:41518_    ] o.a.s.s.HttpSolrCall [admin] webapp=null path=/admin/collections params={collection.configName=conf1&name=control_collection&nrtReplicas=1&action=CREATE&numShards=1&createNodeSet=127.0.0.1:41518_&wt=javabin&version=2} status=0 QTime=3178
   [junit4]   2> 627125 INFO  (zkConnectionManagerCallback-3198-thread-1) [    ] o.a.s.c.c.ConnectionManager zkClient has connected
   [junit4]   2> 627137 INFO  (TEST-HdfsRestartWhileUpdatingTest.test-seed#[10B31070AB4A4496]) [    ] o.a.s.c.c.ZkStateReader Updated live nodes from ZooKeeper... (0) -> (1)
   [junit4]   2> 627138 INFO  (TEST-HdfsRestartWhileUpdatingTest.test-seed#[10B31070AB4A4496]) [    ] o.a.s.c.s.i.ZkClientClusterStateProvider Cluster at 127.0.0.1:38116/solr ready
   [junit4]   2> 627138 INFO  (TEST-HdfsRestartWhileUpdatingTest.test-seed#[10B31070AB4A4496]) [    ] o.a.s.c.ChaosMonkey monkey: init - expire sessions:false cause connection loss:false
   [junit4]   2> 627288 INFO  (qtp947836002-4633) [n:127.0.0.1:41518_    ] o.a.s.h.a.CollectionsHandler Invoked Collection Action :create with params collection.configName=conf1&name=collection1&nrtReplicas=1&action=CREATE&numShards=1&createNodeSet=&stateFormat=2&wt=javabin&version=2 and sendToOCPQueue=true
   [junit4]   2> 627409 INFO  (OverseerCollectionConfigSetProcessor-74143966924308485-127.0.0.1:41518_-n_0000000000) [n:127.0.0.1:41518_    ] o.a.s.c.OverseerTaskQueue Response ZK path: /overseer/collection-queue-work/qnr-0000000000 doesn't exist.  Requestor may have disconnected from ZooKeeper
   [junit4]   2> 627409 INFO  (OverseerThreadFactory-1034-thread-2-processing-n:127.0.0.1:41518_) [n:127.0.0.1:41518_    ] o.a.s.c.a.c.CreateCollectionCmd Create collection collection1
   [junit4]   2> 627811 WARN  (OverseerThreadFactory-1034-thread-2-processing-n:127.0.0.1:41518_) [n:127.0.0.1:41518_    ] o.a.s.c.a.c.CreateCollectionCmd It is unusual to create a collection (collection1) without cores.
   [junit4]   2> 627848 INFO  (qtp947836002-4633) [n:127.0.0.1:41518_    ] o.a.s.h.a.CollectionsHandler Wait for new collection to be active for at most 45 seconds. Check all shard replicas
   [junit4]   2> 627848 INFO  (qtp947836002-4633) [n:127.0.0.1:41518_    ] o.a.s.s.HttpSolrCall [admin] webapp=null path=/admin/collections params={collection.configName=conf1&name=collection1&nrtReplicas=1&action=CREATE&numShards=1&createNodeSet=&stateFormat=2&wt=javabin&version=2} status=0 QTime=559
   [junit4]   2> 627866 INFO  (TEST-HdfsRestartWhileUpdatingTest.test-seed#[10B31070AB4A4496]) [    ] o.a.s.c.AbstractFullDistribZkTestBase Creating jetty instances pullReplicaCount=0 numOtherReplicas=3
   [junit4]   2> 628414 INFO  (TEST-HdfsRestartWhileUpdatingTest.test-seed#[10B31070AB4A4496]) [    ] o.a.s.c.AbstractFullDistribZkTestBase create jetty 1 in directory /home/jenkins/jenkins-slave/workspace/Lucene-Solr-BadApples-NightlyTests-7.x/checkout/solr/build/solr-core/test/J1/temp/solr.cloud.hdfs.HdfsRestartWhileUpdatingTest_10B31070AB4A4496-001/shard-1-001 of type NRT
   [junit4]   2> 628419 WARN  (closeThreadPool-3199-thread-1) [    ] o.e.j.s.AbstractConnector Ignoring deprecated socket close linger time
   [junit4]   2> 628419 INFO  (closeThreadPool-3199-thread-1) [    ] o.a.s.c.s.e.JettySolrRunner Start Jetty (original configured port=0)
   [junit4]   2> 628419 INFO  (closeThreadPool-3199-thread-1) [    ] o.a.s.c.s.e.JettySolrRunner Trying to start Jetty on port 0 try number 1 ...
   [junit4]   2> 628419 INFO  (closeThreadPool-3199-thread-1) [    ] o.e.j.s.Server jetty-9.4.14.v20181114; built: 2018-11-14T21:20:31.478Z; git: c4550056e785fb5665914545889f21dc136ad9e6; jvm 1.8.0_191-b12
   [junit4]   2> 628420 INFO  (closeThreadPool-3199-thread-1) [    ] o.e.j.s.session DefaultSessionIdManager workerName=node0
   [junit4]   2> 628420 INFO  (closeThreadPool-3199-thread-1) [    ] o.e.j.s.session No SessionScavenger set, using defaults
   [junit4]   2> 628420 INFO  (closeThreadPool-3199-thread-1) [    ] o.e.j.s.session node0 Scavenging every 660000ms
   [junit4]   2> 628420 INFO  (closeThreadPool-3199-thread-1) [    ] o.e.j.s.h.ContextHandler Started o.e.j.s.ServletContextHandler@43432d90{/,null,AVAILABLE}
   [junit4]   2> 628421 WARN  (closeThreadPool-3199-thread-1) [    ] o.e.j.u.s.S.config No Client EndPointIdentificationAlgorithm configured for SslContextFactory@4562816b[provider=null,keyStore=null,trustStore=null]
   [junit4]   2> 628522 INFO  (closeThreadPool-3199-thread-1) [    ] o.e.j.s.AbstractConnector Started ServerConnector@33250f3b{SSL,[ssl, http/1.1]}{127.0.0.1:42678}
   [junit4]   2> 628523 INFO  (closeThreadPool-3199-thread-1) [    ] o.e.j.s.Server Started @628687ms
   [junit4]   2> 628523 INFO  (closeThreadPool-3199-thread-1) [    ] o.a.s.c.s.e.JettySolrRunner Jetty properties: {solr.data.dir=hdfs://lucene2-us-west.apache.org:33938/hdfs__lucene2-us-west.apache.org_33938__home_jenkins_jenkins-slave_workspace_Lucene-Solr-BadApples-NightlyTests-7.x_checkout_solr_build_solr-core_test_J1_temp_solr.cloud.hdfs.HdfsRestartWhileUpdatingTest_10B31070AB4A4496-001_tempDir-002_jetty1, replicaType=NRT, solrconfig=solrconfig.xml, hostContext=/, hostPort=42678, coreRootDirectory=/home/jenkins/jenkins-slave/workspace/Lucene-Solr-BadApples-NightlyTests-7.x/checkout/solr/build/solr-core/test/J1/../../../../../../../../../../../home/jenkins/jenkins-slave/workspace/Lucene-Solr-BadApples-NightlyTests-7.x/checkout/solr/build/solr-core/test/J1/temp/solr.cloud.hdfs.HdfsRestartWhileUpdatingTest_10B31070AB4A4496-001/shard-1-001/cores}
   [junit4]   2> 628523 ERROR (closeThreadPool-3199-thread-1) [    ] o.a.s.u.StartupLoggingUtils Missing Java Option solr.log.dir. Logging may be missing or incomplete.
   [junit4]   2> 628523 INFO  (closeThreadPool-3199-thread-1) [    ] o.a.s.s.SolrDispatchFilter Using logger factory org.apache.logging.slf4j.Log4jLoggerFactory
   [junit4]   2> 628523 INFO  (closeThreadPool-3199-thread-1) [    ] o.a.s.s.SolrDispatchFilter  ___      _       Welcome to Apache Solr™ version 7.8.0
   [junit4]   2> 628523 INFO  (closeThreadPool-3199-thread-1) [    ] o.a.s.s.SolrDispatchFilter / __| ___| |_ _   Starting in cloud mode on port null
   [junit4]   2> 628523 INFO  (closeThreadPool-3199-thread-1) [    ] o.a.s.s.SolrDispatchFilter \__ \/ _ \ | '_|  Install dir: null
   [junit4]   2> 628523 INFO  (closeThreadPool-3199-thread-1) [    ] o.a.s.s.SolrDispatchFilter |___/\___/_|_|    Start time: 2019-02-07T00:08:53.019Z
   [junit4]   2> 628583 INFO  (zkConnectionManagerCallback-3201-thread-1) [    ] o.a.s.c.c.ConnectionManager zkClient has connected
   [junit4]   2> 628584 INFO  (closeThreadPool-3199-thread-1) [    ] o.a.s.s.SolrDispatchFilter Loading solr.xml from SolrHome (not found in ZooKeeper)
   [junit4]   2> 628584 INFO  (closeThreadPool-3199-thread-1) [    ] o.a.s.c.SolrXmlConfig Loading container configuration from /home/jenkins/jenkins-slave/workspace/Lucene-Solr-BadApples-NightlyTests-7.x/checkout/solr/build/solr-core/test/J1/temp/solr.cloud.hdfs.HdfsRestartWhileUpdatingTest_10B31070AB4A4496-001/shard-1-001/solr.xml
   [junit4]   2> 628588 INFO  (closeThreadPool-3199-thread-1) [    ] o.a.s.c.SolrXmlConfig Configuration parameter autoReplicaFailoverWorkLoopDelay is ignored
   [junit4]   2> 628589 INFO  (closeThreadPool-3199-thread-1) [    ] o.a.s.c.SolrXmlConfig Configuration parameter autoReplicaFailoverBadNodeExpiration is ignored
   [junit4]   2> 628604 INFO  (closeThreadPool-3199-thread-1) [    ] o.a.s.c.SolrXmlConfig MBean server found: com.sun.jmx.mbeanserver.JmxMBeanServer@552b16eb, but no JMX reporters were configured - adding default JMX reporter.
   [junit4]   2> 628975 INFO  (closeThreadPool-3199-thread-1) [    ] o.a.s.h.c.HttpShardHandlerF

[...truncated too long message...]

ading settings :: file = /home/jenkins/jenkins-slave/workspace/Lucene-Solr-BadApples-NightlyTests-7.x/checkout/lucene/top-level-ivy-settings.xml

resolve:

ivy-availability-check:
[loadresource] Do not set property disallowed.ivy.jars.list as its length is 0.

-ivy-fail-disallowed-ivy-version:

ivy-fail:

ivy-fail:

ivy-configure:
[ivy:configure] :: loading settings :: file = /home/jenkins/jenkins-slave/workspace/Lucene-Solr-BadApples-NightlyTests-7.x/checkout/lucene/top-level-ivy-settings.xml

resolve:

ivy-availability-check:
[loadresource] Do not set property disallowed.ivy.jars.list as its length is 0.

-ivy-fail-disallowed-ivy-version:

ivy-fail:

ivy-configure:
[ivy:configure] :: loading settings :: file = /home/jenkins/jenkins-slave/workspace/Lucene-Solr-BadApples-NightlyTests-7.x/checkout/lucene/top-level-ivy-settings.xml

resolve:

ivy-availability-check:
[loadresource] Do not set property disallowed.ivy.jars.list as its length is 0.

-ivy-fail-disallowed-ivy-version:

ivy-fail:

ivy-fail:

ivy-configure:
[ivy:configure] :: loading settings :: file = /home/jenkins/jenkins-slave/workspace/Lucene-Solr-BadApples-NightlyTests-7.x/checkout/lucene/top-level-ivy-settings.xml

resolve:

ivy-availability-check:
[loadresource] Do not set property disallowed.ivy.jars.list as its length is 0.

-ivy-fail-disallowed-ivy-version:

ivy-fail:

ivy-fail:

ivy-configure:
[ivy:configure] :: loading settings :: file = /home/jenkins/jenkins-slave/workspace/Lucene-Solr-BadApples-NightlyTests-7.x/checkout/lucene/top-level-ivy-settings.xml

resolve:

ivy-availability-check:
[loadresource] Do not set property disallowed.ivy.jars.list as its length is 0.

-ivy-fail-disallowed-ivy-version:

ivy-fail:

ivy-fail:

ivy-configure:
[ivy:configure] :: loading settings :: file = /home/jenkins/jenkins-slave/workspace/Lucene-Solr-BadApples-NightlyTests-7.x/checkout/lucene/top-level-ivy-settings.xml

resolve:

ivy-availability-check:
[loadresource] Do not set property disallowed.ivy.jars.list as its length is 0.

-ivy-fail-disallowed-ivy-version:

ivy-fail:

ivy-fail:

ivy-configure:
[ivy:configure] :: loading settings :: file = /home/jenkins/jenkins-slave/workspace/Lucene-Solr-BadApples-NightlyTests-7.x/checkout/lucene/top-level-ivy-settings.xml

resolve:

ivy-availability-check:
[loadresource] Do not set property disallowed.ivy.jars.list as its length is 0.

-ivy-fail-disallowed-ivy-version:

ivy-fail:

ivy-fail:

ivy-configure:
[ivy:configure] :: loading settings :: file = /home/jenkins/jenkins-slave/workspace/Lucene-Solr-BadApples-NightlyTests-7.x/checkout/lucene/top-level-ivy-settings.xml

resolve:

ivy-availability-check:
[loadresource] Do not set property disallowed.ivy.jars.list as its length is 0.

-ivy-fail-disallowed-ivy-version:

ivy-fail:

ivy-fail:

ivy-configure:
[ivy:configure] :: loading settings :: file = /home/jenkins/jenkins-slave/workspace/Lucene-Solr-BadApples-NightlyTests-7.x/checkout/lucene/top-level-ivy-settings.xml

resolve:

ivy-availability-check:
[loadresource] Do not set property disallowed.ivy.jars.list as its length is 0.

-ivy-fail-disallowed-ivy-version:

ivy-fail:

ivy-fail:

ivy-configure:
[ivy:configure] :: loading settings :: file = /home/jenkins/jenkins-slave/workspace/Lucene-Solr-BadApples-NightlyTests-7.x/checkout/lucene/top-level-ivy-settings.xml

resolve:

ivy-availability-check:
[loadresource] Do not set property disallowed.ivy.jars.list as its length is 0.

-ivy-fail-disallowed-ivy-version:

ivy-fail:

ivy-fail:

ivy-configure:
[ivy:configure] :: loading settings :: file = /home/jenkins/jenkins-slave/workspace/Lucene-Solr-BadApples-NightlyTests-7.x/checkout/lucene/top-level-ivy-settings.xml

resolve:

ivy-availability-check:
[loadresource] Do not set property disallowed.ivy.jars.list as its length is 0.

-ivy-fail-disallowed-ivy-version:

ivy-fail:

ivy-fail:

ivy-configure:
[ivy:configure] :: loading settings :: file = /home/jenkins/jenkins-slave/workspace/Lucene-Solr-BadApples-NightlyTests-7.x/checkout/lucene/top-level-ivy-settings.xml

resolve:

ivy-availability-check:
[loadresource] Do not set property disallowed.ivy.jars.list as its length is 0.

-ivy-fail-disallowed-ivy-version:

ivy-fail:

ivy-fail:

ivy-configure:
[ivy:configure] :: loading settings :: file = /home/jenkins/jenkins-slave/workspace/Lucene-Solr-BadApples-NightlyTests-7.x/checkout/lucene/top-level-ivy-settings.xml

resolve:

jar-checksums:
    [mkdir] Created dir: /home/jenkins/jenkins-slave/workspace/Lucene-Solr-BadApples-NightlyTests-7.x/checkout/solr/null39566830
     [copy] Copying 242 files to /home/jenkins/jenkins-slave/workspace/Lucene-Solr-BadApples-NightlyTests-7.x/checkout/solr/null39566830
   [delete] Deleting directory /home/jenkins/jenkins-slave/workspace/Lucene-Solr-BadApples-NightlyTests-7.x/checkout/solr/null39566830

check-working-copy:
[ivy:cachepath] :: resolving dependencies :: org.eclipse.jgit#org.eclipse.jgit-caller;working
[ivy:cachepath] 	confs: [default]
[ivy:cachepath] 	found org.eclipse.jgit#org.eclipse.jgit;4.6.0.201612231935-r in public
[ivy:cachepath] 	found com.jcraft#jsch;0.1.53 in public
[ivy:cachepath] 	found com.googlecode.javaewah#JavaEWAH;1.1.6 in public
[ivy:cachepath] 	found org.apache.httpcomponents#httpclient;4.3.6 in public
[ivy:cachepath] 	found org.apache.httpcomponents#httpcore;4.3.3 in public
[ivy:cachepath] 	found commons-logging#commons-logging;1.1.3 in public
[ivy:cachepath] 	found commons-codec#commons-codec;1.6 in public
[ivy:cachepath] 	found org.slf4j#slf4j-api;1.7.2 in public
[ivy:cachepath] :: resolution report :: resolve 37ms :: artifacts dl 3ms
	---------------------------------------------------------------------
	|                  |            modules            ||   artifacts   |
	|       conf       | number| search|dwnlded|evicted|| number|dwnlded|
	---------------------------------------------------------------------
	|      default     |   8   |   0   |   0   |   0   ||   8   |   0   |
	---------------------------------------------------------------------
[wc-checker] Initializing working copy...
[wc-checker] SLF4J: Failed to load class "org.slf4j.impl.StaticLoggerBinder".
[wc-checker] SLF4J: Defaulting to no-operation (NOP) logger implementation
[wc-checker] SLF4J: See http://www.slf4j.org/codes.html#StaticLoggerBinder for further details.
[wc-checker] Checking working copy status...

-jenkins-base:

BUILD SUCCESSFUL
Total time: 509 minutes 3 seconds
Archiving artifacts
java.lang.InterruptedException: no matches found within 10000
	at hudson.FilePath$ValidateAntFileMask.hasMatch(FilePath.java:2847)
	at hudson.FilePath$ValidateAntFileMask.invoke(FilePath.java:2726)
	at hudson.FilePath$ValidateAntFileMask.invoke(FilePath.java:2707)
	at hudson.FilePath$FileCallableWrapper.call(FilePath.java:3086)
Also:   hudson.remoting.Channel$CallSiteStackTrace: Remote call to lucene2
		at hudson.remoting.Channel.attachCallSiteStackTrace(Channel.java:1741)
		at hudson.remoting.UserRequest$ExceptionResponse.retrieve(UserRequest.java:357)
		at hudson.remoting.Channel.call(Channel.java:955)
		at hudson.FilePath.act(FilePath.java:1072)
		at hudson.FilePath.act(FilePath.java:1061)
		at hudson.FilePath.validateAntFileMask(FilePath.java:2705)
		at hudson.tasks.ArtifactArchiver.perform(ArtifactArchiver.java:243)
		at hudson.tasks.BuildStepCompatibilityLayer.perform(BuildStepCompatibilityLayer.java:81)
		at hudson.tasks.BuildStepMonitor$1.perform(BuildStepMonitor.java:20)
		at hudson.model.AbstractBuild$AbstractBuildExecution.perform(AbstractBuild.java:744)
		at hudson.model.AbstractBuild$AbstractBuildExecution.performAllBuildSteps(AbstractBuild.java:690)
		at hudson.model.Build$BuildExecution.post2(Build.java:186)
		at hudson.model.AbstractBuild$AbstractBuildExecution.post(AbstractBuild.java:635)
		at hudson.model.Run.execute(Run.java:1835)
		at hudson.model.FreeStyleBuild.run(FreeStyleBuild.java:43)
		at hudson.model.ResourceController.execute(ResourceController.java:97)
		at hudson.model.Executor.run(Executor.java:429)
Caused: hudson.FilePath$TunneledInterruptedException
	at hudson.FilePath$FileCallableWrapper.call(FilePath.java:3088)
	at hudson.remoting.UserRequest.perform(UserRequest.java:212)
	at hudson.remoting.UserRequest.perform(UserRequest.java:54)
	at hudson.remoting.Request$2.run(Request.java:369)
	at hudson.remoting.InterceptingExecutorService$1.call(InterceptingExecutorService.java:72)
	at java.util.concurrent.FutureTask.run(FutureTask.java:266)
	at java.util.concurrent.ThreadPoolExecutor.runWorker(ThreadPoolExecutor.java:1142)
	at java.util.concurrent.ThreadPoolExecutor$Worker.run(ThreadPoolExecutor.java:617)
	at java.lang.Thread.run(Thread.java:748)
Caused: java.lang.InterruptedException: java.lang.InterruptedException: no matches found within 10000
	at hudson.FilePath.act(FilePath.java:1074)
	at hudson.FilePath.act(FilePath.java:1061)
	at hudson.FilePath.validateAntFileMask(FilePath.java:2705)
	at hudson.tasks.ArtifactArchiver.perform(ArtifactArchiver.java:243)
	at hudson.tasks.BuildStepCompatibilityLayer.perform(BuildStepCompatibilityLayer.java:81)
	at hudson.tasks.BuildStepMonitor$1.perform(BuildStepMonitor.java:20)
	at hudson.model.AbstractBuild$AbstractBuildExecution.perform(AbstractBuild.java:744)
	at hudson.model.AbstractBuild$AbstractBuildExecution.performAllBuildSteps(AbstractBuild.java:690)
	at hudson.model.Build$BuildExecution.post2(Build.java:186)
	at hudson.model.AbstractBuild$AbstractBuildExecution.post(AbstractBuild.java:635)
	at hudson.model.Run.execute(Run.java:1835)
	at hudson.model.FreeStyleBuild.run(FreeStyleBuild.java:43)
	at hudson.model.ResourceController.execute(ResourceController.java:97)
	at hudson.model.Executor.run(Executor.java:429)
No artifacts found that match the file pattern "**/*.events,heapdumps/**,**/hs_err_pid*". Configuration error?
Recording test results
Build step 'Publish JUnit test result report' changed build result to UNSTABLE
Email was triggered for: Unstable (Test Failures)
Sending email for trigger: Unstable (Test Failures)

Mime
View raw message