lucene-dev mailing list archives

Site index · List index
Message view « Date » · « Thread »
Top « Date » · « Thread »
From Apache Jenkins Server <jenk...@builds.apache.org>
Subject [JENKINS] Lucene-Solr-NightlyTests-8.x - Build # 68 - Unstable
Date Wed, 10 Apr 2019 03:48:18 GMT
Build: https://builds.apache.org/job/Lucene-Solr-NightlyTests-8.x/68/

1 tests failed.
FAILED:  org.apache.solr.cloud.BasicDistributedZkTest.test

Error Message:
Error from server at http://127.0.0.1:36080/cw_/u/collection1: Server error writing document id 255 to the index

Stack Trace:
org.apache.solr.client.solrj.impl.HttpSolrClient$RemoteSolrException: Error from server at http://127.0.0.1:36080/cw_/u/collection1: Server error writing document id 255 to the index
	at __randomizedtesting.SeedInfo.seed([7953E3FA6BE6649E:F107DC20C51A0966]:0)
	at org.apache.solr.client.solrj.impl.HttpSolrClient.executeMethod(HttpSolrClient.java:649)
	at org.apache.solr.client.solrj.impl.HttpSolrClient.request(HttpSolrClient.java:255)
	at org.apache.solr.client.solrj.impl.HttpSolrClient.request(HttpSolrClient.java:244)
	at org.apache.solr.client.solrj.SolrRequest.process(SolrRequest.java:207)
	at org.apache.solr.client.solrj.SolrRequest.process(SolrRequest.java:224)
	at org.apache.solr.BaseDistributedSearchTestCase.add(BaseDistributedSearchTestCase.java:576)
	at org.apache.solr.cloud.BasicDistributedZkTest.testUpdateProcessorsRunOnlyOnce(BasicDistributedZkTest.java:746)
	at org.apache.solr.cloud.BasicDistributedZkTest.test(BasicDistributedZkTest.java:424)
	at sun.reflect.NativeMethodAccessorImpl.invoke0(Native Method)
	at sun.reflect.NativeMethodAccessorImpl.invoke(NativeMethodAccessorImpl.java:62)
	at sun.reflect.DelegatingMethodAccessorImpl.invoke(DelegatingMethodAccessorImpl.java:43)
	at java.lang.reflect.Method.invoke(Method.java:498)
	at com.carrotsearch.randomizedtesting.RandomizedRunner.invoke(RandomizedRunner.java:1750)
	at com.carrotsearch.randomizedtesting.RandomizedRunner$8.evaluate(RandomizedRunner.java:938)
	at com.carrotsearch.randomizedtesting.RandomizedRunner$9.evaluate(RandomizedRunner.java:974)
	at com.carrotsearch.randomizedtesting.RandomizedRunner$10.evaluate(RandomizedRunner.java:988)
	at org.apache.solr.BaseDistributedSearchTestCase$ShardsRepeatRule$ShardsFixedStatement.callStatement(BaseDistributedSearchTestCase.java:1082)
	at org.apache.solr.BaseDistributedSearchTestCase$ShardsRepeatRule$ShardsStatement.evaluate(BaseDistributedSearchTestCase.java:1054)
	at com.carrotsearch.randomizedtesting.rules.SystemPropertiesRestoreRule$1.evaluate(SystemPropertiesRestoreRule.java:57)
	at org.apache.lucene.util.TestRuleSetupTeardownChained$1.evaluate(TestRuleSetupTeardownChained.java:49)
	at org.apache.lucene.util.AbstractBeforeAfterRule$1.evaluate(AbstractBeforeAfterRule.java:45)
	at org.apache.lucene.util.TestRuleThreadAndTestName$1.evaluate(TestRuleThreadAndTestName.java:48)
	at org.apache.lucene.util.TestRuleIgnoreAfterMaxFailures$1.evaluate(TestRuleIgnoreAfterMaxFailures.java:64)
	at org.apache.lucene.util.TestRuleMarkFailure$1.evaluate(TestRuleMarkFailure.java:47)
	at com.carrotsearch.randomizedtesting.rules.StatementAdapter.evaluate(StatementAdapter.java:36)
	at com.carrotsearch.randomizedtesting.ThreadLeakControl$StatementRunner.run(ThreadLeakControl.java:368)
	at com.carrotsearch.randomizedtesting.ThreadLeakControl.forkTimeoutingTask(ThreadLeakControl.java:817)
	at com.carrotsearch.randomizedtesting.ThreadLeakControl$3.evaluate(ThreadLeakControl.java:468)
	at com.carrotsearch.randomizedtesting.RandomizedRunner.runSingleTest(RandomizedRunner.java:947)
	at com.carrotsearch.randomizedtesting.RandomizedRunner$5.evaluate(RandomizedRunner.java:832)
	at com.carrotsearch.randomizedtesting.RandomizedRunner$6.evaluate(RandomizedRunner.java:883)
	at com.carrotsearch.randomizedtesting.RandomizedRunner$7.evaluate(RandomizedRunner.java:894)
	at com.carrotsearch.randomizedtesting.rules.StatementAdapter.evaluate(StatementAdapter.java:36)
	at com.carrotsearch.randomizedtesting.rules.SystemPropertiesRestoreRule$1.evaluate(SystemPropertiesRestoreRule.java:57)
	at org.apache.lucene.util.AbstractBeforeAfterRule$1.evaluate(AbstractBeforeAfterRule.java:45)
	at com.carrotsearch.randomizedtesting.rules.StatementAdapter.evaluate(StatementAdapter.java:36)
	at org.apache.lucene.util.TestRuleStoreClassName$1.evaluate(TestRuleStoreClassName.java:41)
	at com.carrotsearch.randomizedtesting.rules.NoShadowingOrOverridesOnMethodsRule$1.evaluate(NoShadowingOrOverridesOnMethodsRule.java:40)
	at com.carrotsearch.randomizedtesting.rules.NoShadowingOrOverridesOnMethodsRule$1.evaluate(NoShadowingOrOverridesOnMethodsRule.java:40)
	at com.carrotsearch.randomizedtesting.rules.StatementAdapter.evaluate(StatementAdapter.java:36)
	at com.carrotsearch.randomizedtesting.rules.StatementAdapter.evaluate(StatementAdapter.java:36)
	at com.carrotsearch.randomizedtesting.rules.StatementAdapter.evaluate(StatementAdapter.java:36)
	at org.apache.lucene.util.TestRuleAssertionsRequired$1.evaluate(TestRuleAssertionsRequired.java:53)
	at org.apache.lucene.util.TestRuleMarkFailure$1.evaluate(TestRuleMarkFailure.java:47)
	at org.apache.lucene.util.TestRuleIgnoreAfterMaxFailures$1.evaluate(TestRuleIgnoreAfterMaxFailures.java:64)
	at org.apache.lucene.util.TestRuleIgnoreTestSuites$1.evaluate(TestRuleIgnoreTestSuites.java:54)
	at com.carrotsearch.randomizedtesting.rules.StatementAdapter.evaluate(StatementAdapter.java:36)
	at com.carrotsearch.randomizedtesting.ThreadLeakControl$StatementRunner.run(ThreadLeakControl.java:368)
	at java.lang.Thread.run(Thread.java:748)




Build Log:
[...truncated 14160 lines...]
   [junit4] Suite: org.apache.solr.cloud.BasicDistributedZkTest
   [junit4]   2> Creating dataDir: /x1/jenkins/jenkins-slave/workspace/Lucene-Solr-NightlyTests-8.x/checkout/solr/build/solr-core/test/J0/temp/solr.cloud.BasicDistributedZkTest_7953E3FA6BE6649E-001/init-core-data-001
   [junit4]   2> 2020508 WARN  (SUITE-BasicDistributedZkTest-seed#[7953E3FA6BE6649E]-worker) [    ] o.a.s.SolrTestCaseJ4 startTrackingSearchers: numOpens=52 numCloses=52
   [junit4]   2> 2020508 INFO  (SUITE-BasicDistributedZkTest-seed#[7953E3FA6BE6649E]-worker) [    ] o.a.s.SolrTestCaseJ4 Using PointFields (NUMERIC_POINTS_SYSPROP=true) w/NUMERIC_DOCVALUES_SYSPROP=false
   [junit4]   2> 2020511 INFO  (SUITE-BasicDistributedZkTest-seed#[7953E3FA6BE6649E]-worker) [    ] o.a.s.SolrTestCaseJ4 Randomized ssl (false) and clientAuth (false) via: @org.apache.solr.SolrTestCaseJ4$SuppressSSL(bugUrl=https://issues.apache.org/jira/browse/SOLR-5776)
   [junit4]   2> 2020511 INFO  (SUITE-BasicDistributedZkTest-seed#[7953E3FA6BE6649E]-worker) [    ] o.a.s.SolrTestCaseJ4 SecureRandom sanity checks: test.solr.allowed.securerandom=null & java.security.egd=file:/dev/./urandom
   [junit4]   2> 2020511 INFO  (SUITE-BasicDistributedZkTest-seed#[7953E3FA6BE6649E]-worker) [    ] o.a.s.BaseDistributedSearchTestCase Setting hostContext system property: /cw_/u
   [junit4]   2> 2020514 INFO  (TEST-BasicDistributedZkTest.test-seed#[7953E3FA6BE6649E]) [    ] o.a.s.c.ZkTestServer STARTING ZK TEST SERVER
   [junit4]   2> 2020515 INFO  (ZkTestServer Run Thread) [    ] o.a.s.c.ZkTestServer client port:0.0.0.0/0.0.0.0:0
   [junit4]   2> 2020515 INFO  (ZkTestServer Run Thread) [    ] o.a.s.c.ZkTestServer Starting server
   [junit4]   2> 2020615 INFO  (TEST-BasicDistributedZkTest.test-seed#[7953E3FA6BE6649E]) [    ] o.a.s.c.ZkTestServer start zk server on port:45881
   [junit4]   2> 2020615 INFO  (TEST-BasicDistributedZkTest.test-seed#[7953E3FA6BE6649E]) [    ] o.a.s.c.ZkTestServer parse host and port list: 127.0.0.1:45881
   [junit4]   2> 2020615 INFO  (TEST-BasicDistributedZkTest.test-seed#[7953E3FA6BE6649E]) [    ] o.a.s.c.ZkTestServer connecting to 127.0.0.1 45881
   [junit4]   2> 2020620 INFO  (zkConnectionManagerCallback-7634-thread-1) [    ] o.a.s.c.c.ConnectionManager zkClient has connected
   [junit4]   2> 2020623 INFO  (zkConnectionManagerCallback-7636-thread-1) [    ] o.a.s.c.c.ConnectionManager zkClient has connected
   [junit4]   2> 2020625 INFO  (TEST-BasicDistributedZkTest.test-seed#[7953E3FA6BE6649E]) [    ] o.a.s.c.ZkTestServer put /x1/jenkins/jenkins-slave/workspace/Lucene-Solr-NightlyTests-8.x/checkout/solr/core/src/test-files/solr/collection1/conf/solrconfig-tlog.xml to /configs/conf1/solrconfig.xml
   [junit4]   2> 2020626 INFO  (TEST-BasicDistributedZkTest.test-seed#[7953E3FA6BE6649E]) [    ] o.a.s.c.ZkTestServer put /x1/jenkins/jenkins-slave/workspace/Lucene-Solr-NightlyTests-8.x/checkout/solr/core/src/test-files/solr/collection1/conf/schema.xml to /configs/conf1/schema.xml
   [junit4]   2> 2020628 INFO  (TEST-BasicDistributedZkTest.test-seed#[7953E3FA6BE6649E]) [    ] o.a.s.c.ZkTestServer put /x1/jenkins/jenkins-slave/workspace/Lucene-Solr-NightlyTests-8.x/checkout/solr/core/src/test-files/solr/collection1/conf/solrconfig.snippet.randomindexconfig.xml to /configs/conf1/solrconfig.snippet.randomindexconfig.xml
   [junit4]   2> 2020630 INFO  (TEST-BasicDistributedZkTest.test-seed#[7953E3FA6BE6649E]) [    ] o.a.s.c.ZkTestServer put /x1/jenkins/jenkins-slave/workspace/Lucene-Solr-NightlyTests-8.x/checkout/solr/core/src/test-files/solr/collection1/conf/stopwords.txt to /configs/conf1/stopwords.txt
   [junit4]   2> 2020631 INFO  (TEST-BasicDistributedZkTest.test-seed#[7953E3FA6BE6649E]) [    ] o.a.s.c.ZkTestServer put /x1/jenkins/jenkins-slave/workspace/Lucene-Solr-NightlyTests-8.x/checkout/solr/core/src/test-files/solr/collection1/conf/protwords.txt to /configs/conf1/protwords.txt
   [junit4]   2> 2020632 INFO  (TEST-BasicDistributedZkTest.test-seed#[7953E3FA6BE6649E]) [    ] o.a.s.c.ZkTestServer put /x1/jenkins/jenkins-slave/workspace/Lucene-Solr-NightlyTests-8.x/checkout/solr/core/src/test-files/solr/collection1/conf/currency.xml to /configs/conf1/currency.xml
   [junit4]   2> 2020633 INFO  (TEST-BasicDistributedZkTest.test-seed#[7953E3FA6BE6649E]) [    ] o.a.s.c.ZkTestServer put /x1/jenkins/jenkins-slave/workspace/Lucene-Solr-NightlyTests-8.x/checkout/solr/core/src/test-files/solr/collection1/conf/enumsConfig.xml to /configs/conf1/enumsConfig.xml
   [junit4]   2> 2020635 INFO  (TEST-BasicDistributedZkTest.test-seed#[7953E3FA6BE6649E]) [    ] o.a.s.c.ZkTestServer put /x1/jenkins/jenkins-slave/workspace/Lucene-Solr-NightlyTests-8.x/checkout/solr/core/src/test-files/solr/collection1/conf/open-exchange-rates.json to /configs/conf1/open-exchange-rates.json
   [junit4]   2> 2020636 INFO  (TEST-BasicDistributedZkTest.test-seed#[7953E3FA6BE6649E]) [    ] o.a.s.c.ZkTestServer put /x1/jenkins/jenkins-slave/workspace/Lucene-Solr-NightlyTests-8.x/checkout/solr/core/src/test-files/solr/collection1/conf/mapping-ISOLatin1Accent.txt to /configs/conf1/mapping-ISOLatin1Accent.txt
   [junit4]   2> 2020637 INFO  (TEST-BasicDistributedZkTest.test-seed#[7953E3FA6BE6649E]) [    ] o.a.s.c.ZkTestServer put /x1/jenkins/jenkins-slave/workspace/Lucene-Solr-NightlyTests-8.x/checkout/solr/core/src/test-files/solr/collection1/conf/old_synonyms.txt to /configs/conf1/old_synonyms.txt
   [junit4]   2> 2020638 INFO  (TEST-BasicDistributedZkTest.test-seed#[7953E3FA6BE6649E]) [    ] o.a.s.c.ZkTestServer put /x1/jenkins/jenkins-slave/workspace/Lucene-Solr-NightlyTests-8.x/checkout/solr/core/src/test-files/solr/collection1/conf/synonyms.txt to /configs/conf1/synonyms.txt
   [junit4]   2> 2020640 INFO  (TEST-BasicDistributedZkTest.test-seed#[7953E3FA6BE6649E]) [    ] o.a.s.c.AbstractFullDistribZkTestBase Will use NRT replicas unless explicitly asked otherwise
   [junit4]   2> 2020825 WARN  (TEST-BasicDistributedZkTest.test-seed#[7953E3FA6BE6649E]) [    ] o.e.j.s.AbstractConnector Ignoring deprecated socket close linger time
   [junit4]   2> 2020826 INFO  (TEST-BasicDistributedZkTest.test-seed#[7953E3FA6BE6649E]) [    ] o.a.s.c.s.e.JettySolrRunner Start Jetty (original configured port=0)
   [junit4]   2> 2020826 INFO  (TEST-BasicDistributedZkTest.test-seed#[7953E3FA6BE6649E]) [    ] o.a.s.c.s.e.JettySolrRunner Trying to start Jetty on port 0 try number 1 ...
   [junit4]   2> 2020826 INFO  (TEST-BasicDistributedZkTest.test-seed#[7953E3FA6BE6649E]) [    ] o.e.j.s.Server jetty-9.4.14.v20181114; built: 2018-11-14T21:20:31.478Z; git: c4550056e785fb5665914545889f21dc136ad9e6; jvm 1.8.0_191-b12
   [junit4]   2> 2020837 INFO  (TEST-BasicDistributedZkTest.test-seed#[7953E3FA6BE6649E]) [    ] o.e.j.s.session DefaultSessionIdManager workerName=node0
   [junit4]   2> 2020837 INFO  (TEST-BasicDistributedZkTest.test-seed#[7953E3FA6BE6649E]) [    ] o.e.j.s.session No SessionScavenger set, using defaults
   [junit4]   2> 2020837 INFO  (TEST-BasicDistributedZkTest.test-seed#[7953E3FA6BE6649E]) [    ] o.e.j.s.session node0 Scavenging every 600000ms
   [junit4]   2> 2020839 INFO  (TEST-BasicDistributedZkTest.test-seed#[7953E3FA6BE6649E]) [    ] o.e.j.s.h.ContextHandler Started o.e.j.s.ServletContextHandler@6e283666{/cw_/u,null,AVAILABLE}
   [junit4]   2> 2020841 INFO  (TEST-BasicDistributedZkTest.test-seed#[7953E3FA6BE6649E]) [    ] o.e.j.s.AbstractConnector Started ServerConnector@1c8db494{HTTP/1.1,[http/1.1, h2c]}{127.0.0.1:41095}
   [junit4]   2> 2020841 INFO  (TEST-BasicDistributedZkTest.test-seed#[7953E3FA6BE6649E]) [    ] o.e.j.s.Server Started @2020954ms
   [junit4]   2> 2020841 INFO  (TEST-BasicDistributedZkTest.test-seed#[7953E3FA6BE6649E]) [    ] o.a.s.c.s.e.JettySolrRunner Jetty properties: {solr.data.dir=/x1/jenkins/jenkins-slave/workspace/Lucene-Solr-NightlyTests-8.x/checkout/solr/build/solr-core/test/J0/temp/solr.cloud.BasicDistributedZkTest_7953E3FA6BE6649E-001/tempDir-001/control/data, hostContext=/cw_/u, hostPort=41095, coreRootDirectory=/x1/jenkins/jenkins-slave/workspace/Lucene-Solr-NightlyTests-8.x/checkout/solr/build/solr-core/test/J0/temp/solr.cloud.BasicDistributedZkTest_7953E3FA6BE6649E-001/control-001/cores}
   [junit4]   2> 2020842 ERROR (TEST-BasicDistributedZkTest.test-seed#[7953E3FA6BE6649E]) [    ] o.a.s.u.StartupLoggingUtils Missing Java Option solr.log.dir. Logging may be missing or incomplete.
   [junit4]   2> 2020842 INFO  (TEST-BasicDistributedZkTest.test-seed#[7953E3FA6BE6649E]) [    ] o.a.s.s.SolrDispatchFilter Using logger factory org.apache.logging.slf4j.Log4jLoggerFactory
   [junit4]   2> 2020842 INFO  (TEST-BasicDistributedZkTest.test-seed#[7953E3FA6BE6649E]) [    ] o.a.s.s.SolrDispatchFilter  ___      _       Welcome to Apache Solr™ version 8.1.0
   [junit4]   2> 2020842 INFO  (TEST-BasicDistributedZkTest.test-seed#[7953E3FA6BE6649E]) [    ] o.a.s.s.SolrDispatchFilter / __| ___| |_ _   Starting in cloud mode on port null
   [junit4]   2> 2020842 INFO  (TEST-BasicDistributedZkTest.test-seed#[7953E3FA6BE6649E]) [    ] o.a.s.s.SolrDispatchFilter \__ \/ _ \ | '_|  Install dir: null
   [junit4]   2> 2020842 INFO  (TEST-BasicDistributedZkTest.test-seed#[7953E3FA6BE6649E]) [    ] o.a.s.s.SolrDispatchFilter |___/\___/_|_|    Start time: 2019-04-10T02:18:30.206Z
   [junit4]   2> 2020844 INFO  (zkConnectionManagerCallback-7638-thread-1) [    ] o.a.s.c.c.ConnectionManager zkClient has connected
   [junit4]   2> 2020845 INFO  (TEST-BasicDistributedZkTest.test-seed#[7953E3FA6BE6649E]) [    ] o.a.s.s.SolrDispatchFilter Loading solr.xml from SolrHome (not found in ZooKeeper)
   [junit4]   2> 2020846 INFO  (TEST-BasicDistributedZkTest.test-seed#[7953E3FA6BE6649E]) [    ] o.a.s.c.SolrXmlConfig Loading container configuration from /x1/jenkins/jenkins-slave/workspace/Lucene-Solr-NightlyTests-8.x/checkout/solr/build/solr-core/test/J0/temp/solr.cloud.BasicDistributedZkTest_7953E3FA6BE6649E-001/control-001/solr.xml
   [junit4]   2> 2020850 INFO  (TEST-BasicDistributedZkTest.test-seed#[7953E3FA6BE6649E]) [    ] o.a.s.c.SolrXmlConfig Configuration parameter autoReplicaFailoverWorkLoopDelay is ignored
   [junit4]   2> 2020850 INFO  (TEST-BasicDistributedZkTest.test-seed#[7953E3FA6BE6649E]) [    ] o.a.s.c.SolrXmlConfig Configuration parameter autoReplicaFailoverBadNodeExpiration is ignored
   [junit4]   2> 2020852 INFO  (TEST-BasicDistributedZkTest.test-seed#[7953E3FA6BE6649E]) [    ] o.a.s.c.SolrXmlConfig MBean server found: com.sun.jmx.mbeanserver.JmxMBeanServer@137ff20a, but no JMX reporters were configured - adding default JMX reporter.
   [junit4]   2> 2020910 INFO  (TEST-BasicDistributedZkTest.test-seed#[7953E3FA6BE6649E]) [    ] o.a.s.h.c.HttpShardHandlerFactory Host whitelist initialized: WhitelistHostChecker [whitelistHosts=null, whitelistHostCheckingEnabled=false]
   [junit4]   2> 2020912 WARN  (TEST-BasicDistributedZkTest.test-seed#[7953E3FA6BE6649E]) [    ] o.e.j.u.s.S.config No Client EndPointIdentificationAlgorithm configured for SslContextFactory@3187f71b[provider=null,keyStore=null,trustStore=null]
   [junit4]   2> 2020917 WARN  (TEST-BasicDistributedZkTest.test-seed#[7953E3FA6BE6649E]) [    ] o.e.j.u.s.S.config No Client EndPointIdentificationAlgorithm configured for SslContextFactory@1ec82fa[provider=null,keyStore=null,trustStore=null]
   [junit4]   2> 2020918 INFO  (TEST-BasicDistributedZkTest.test-seed#[7953E3FA6BE6649E]) [    ] o.a.s.c.ZkContainer Zookeeper client=127.0.0.1:45881/solr
   [junit4]   2> 2020919 INFO  (zkConnectionManagerCallback-7645-thread-1) [    ] o.a.s.c.c.ConnectionManager zkClient has connected
   [junit4]   2> 2020922 INFO  (zkConnectionManagerCallback-7647-thread-1) [    ] o.a.s.c.c.ConnectionManager zkClient has connected
   [junit4]   2> 2021013 INFO  (TEST-BasicDistributedZkTest.test-seed#[7953E3FA6BE6649E]) [n:127.0.0.1:41095_cw_%2Fu    ] o.a.s.c.OverseerElectionContext I am going to be the leader 127.0.0.1:41095_cw_%2Fu
   [junit4]   2> 2021014 INFO  (TEST-BasicDistributedZkTest.test-seed#[7953E3FA6BE6649E]) [n:127.0.0.1:41095_cw_%2Fu    ] o.a.s.c.Overseer Overseer (id=73106003766804484-127.0.0.1:41095_cw_%2Fu-n_0000000000) starting
   [junit4]   2> 2021026 INFO  (zkConnectionManagerCallback-7654-thread-1) [    ] o.a.s.c.c.ConnectionManager zkClient has connected
   [junit4]   2> 2021029 INFO  (TEST-BasicDistributedZkTest.test-seed#[7953E3FA6BE6649E]) [n:127.0.0.1:41095_cw_%2Fu    ] o.a.s.c.s.i.ZkClientClusterStateProvider Cluster at 127.0.0.1:45881/solr ready
   [junit4]   2> 2021030 INFO  (TEST-BasicDistributedZkTest.test-seed#[7953E3FA6BE6649E]) [n:127.0.0.1:41095_cw_%2Fu    ] o.a.s.c.ZkController Register node as live in ZooKeeper:/live_nodes/127.0.0.1:41095_cw_%2Fu
   [junit4]   2> 2021030 INFO  (OverseerStateUpdate-73106003766804484-127.0.0.1:41095_cw_%2Fu-n_0000000000) [n:127.0.0.1:41095_cw_%2Fu    ] o.a.s.c.Overseer Starting to work on the main queue : 127.0.0.1:41095_cw_%2Fu
   [junit4]   2> 2021033 INFO  (zkCallback-7653-thread-1) [    ] o.a.s.c.c.ZkStateReader Updated live nodes from ZooKeeper... (0) -> (1)
   [junit4]   2> 2021040 INFO  (OverseerStateUpdate-73106003766804484-127.0.0.1:41095_cw_%2Fu-n_0000000000) [n:127.0.0.1:41095_cw_%2Fu    ] o.a.s.c.c.ZkStateReader Updated live nodes from ZooKeeper... (0) -> (1)
   [junit4]   2> 2021060 INFO  (TEST-BasicDistributedZkTest.test-seed#[7953E3FA6BE6649E]) [n:127.0.0.1:41095_cw_%2Fu    ] o.a.s.h.a.MetricsHistoryHandler No .system collection, keeping metrics history in memory.
   [junit4]   2> 2021088 INFO  (TEST-BasicDistributedZkTest.test-seed#[7953E3FA6BE6649E]) [n:127.0.0.1:41095_cw_%2Fu    ] o.a.s.m.r.SolrJmxReporter JMX monitoring for 'solr.node' (registry 'solr.node') enabled at server: com.sun.jmx.mbeanserver.JmxMBeanServer@137ff20a
   [junit4]   2> 2021104 INFO  (TEST-BasicDistributedZkTest.test-seed#[7953E3FA6BE6649E]) [n:127.0.0.1:41095_cw_%2Fu    ] o.a.s.m.r.SolrJmxReporter JMX monitoring for 'solr.jvm' (registry 'solr.jvm') enabled at server: com.sun.jmx.mbeanserver.JmxMBeanServer@137ff20a
   [junit4]   2> 2021104 INFO  (TEST-BasicDistributedZkTest.test-seed#[7953E3FA6BE6649E]) [n:127.0.0.1:41095_cw_%2Fu    ] o.a.s.m.r.SolrJmxReporter JMX monitoring for 'solr.jetty' (registry 'solr.jetty') enabled at server: com.sun.jmx.mbeanserver.JmxMBeanServer@137ff20a
   [junit4]   2> 2021106 INFO  (TEST-BasicDistributedZkTest.test-seed#[7953E3FA6BE6649E]) [n:127.0.0.1:41095_cw_%2Fu    ] o.a.s.c.CorePropertiesLocator Found 0 core definitions underneath /x1/jenkins/jenkins-slave/workspace/Lucene-Solr-NightlyTests-8.x/checkout/solr/build/solr-core/test/J0/temp/solr.cloud.BasicDistributedZkTest_7953E3FA6BE6649E-001/control-001/cores
   [junit4]   2> 2021137 INFO  (zkConnectionManagerCallback-7660-thread-1) [    ] o.a.s.c.c.ConnectionManager zkClient has connected
   [junit4]   2> 2021138 INFO  (TEST-BasicDistributedZkTest.test-seed#[7953E3FA6BE6649E]) [    ] o.a.s.c.c.ZkStateReader Updated live nodes from ZooKeeper... (0) -> (1)
   [junit4]   2> 2021139 INFO  (TEST-BasicDistributedZkTest.test-seed#[7953E3FA6BE6649E]) [    ] o.a.s.c.s.i.ZkClientClusterStateProvider Cluster at 127.0.0.1:45881/solr ready
   [junit4]   2> 2021141 INFO  (qtp1572877782-37533) [n:127.0.0.1:41095_cw_%2Fu    ] o.a.s.h.a.CollectionsHandler Invoked Collection Action :create with params collection.configName=conf1&name=control_collection&nrtReplicas=1&action=CREATE&numShards=1&createNodeSet=127.0.0.1:41095_cw_%252Fu&wt=javabin&version=2 and sendToOCPQueue=true
   [junit4]   2> 2021145 INFO  (OverseerThreadFactory-8188-thread-1-processing-n:127.0.0.1:41095_cw_%2Fu) [n:127.0.0.1:41095_cw_%2Fu    ] o.a.s.c.a.c.CreateCollectionCmd Create collection control_collection
   [junit4]   2> 2021255 INFO  (qtp1572877782-37535) [n:127.0.0.1:41095_cw_%2Fu    x:control_collection_shard1_replica_n1] o.a.s.h.a.CoreAdminOperation core create command qt=/admin/cores&collection.configName=conf1&newCollection=true&name=control_collection_shard1_replica_n1&action=CREATE&numShards=1&collection=control_collection&shard=shard1&wt=javabin&version=2&replicaType=NRT
   [junit4]   2> 2021256 INFO  (qtp1572877782-37535) [n:127.0.0.1:41095_cw_%2Fu    x:control_collection_shard1_replica_n1] o.a.s.c.TransientSolrCoreCacheDefault Allocating transient cache for 4 transient cores
   [junit4]   2> 2022277 INFO  (qtp1572877782-37535) [n:127.0.0.1:41095_cw_%2Fu c:control_collection s:shard1  x:control_collection_shard1_replica_n1] o.a.s.c.SolrConfig Using Lucene MatchVersion: 8.1.0
   [junit4]   2> 2022296 INFO  (qtp1572877782-37535) [n:127.0.0.1:41095_cw_%2Fu c:control_collection s:shard1  x:control_collection_shard1_replica_n1] o.a.s.s.IndexSchema [control_collection_shard1_replica_n1] Schema name=test
   [junit4]   2> 2022439 INFO  (qtp1572877782-37535) [n:127.0.0.1:41095_cw_%2Fu c:control_collection s:shard1  x:control_collection_shard1_replica_n1] o.a.s.s.IndexSchema Loaded schema test/1.0 with uniqueid field id
   [junit4]   2> 2022459 INFO  (qtp1572877782-37535) [n:127.0.0.1:41095_cw_%2Fu c:control_collection s:shard1  x:control_collection_shard1_replica_n1] o.a.s.c.CoreContainer Creating SolrCore 'control_collection_shard1_replica_n1' using configuration from collection control_collection, trusted=true
   [junit4]   2> 2022460 INFO  (qtp1572877782-37535) [n:127.0.0.1:41095_cw_%2Fu c:control_collection s:shard1  x:control_collection_shard1_replica_n1] o.a.s.m.r.SolrJmxReporter JMX monitoring for 'solr.core.control_collection.shard1.replica_n1' (registry 'solr.core.control_collection.shard1.replica_n1') enabled at server: com.sun.jmx.mbeanserver.JmxMBeanServer@137ff20a
   [junit4]   2> 2022460 INFO  (qtp1572877782-37535) [n:127.0.0.1:41095_cw_%2Fu c:control_collection s:shard1  x:control_collection_shard1_replica_n1] o.a.s.c.SolrCore [[control_collection_shard1_replica_n1] ] Opening new SolrCore at [/x1/jenkins/jenkins-slave/workspace/Lucene-Solr-NightlyTests-8.x/checkout/solr/build/solr-core/test/J0/temp/solr.cloud.BasicDistributedZkTest_7953E3FA6BE6649E-001/control-001/cores/control_collection_shard1_replica_n1], dataDir=[/x1/jenkins/jenkins-slave/workspace/Lucene-Solr-NightlyTests-8.x/checkout/solr/build/solr-core/test/J0/temp/solr.cloud.BasicDistributedZkTest_7953E3FA6BE6649E-001/control-001/cores/control_collection_shard1_replica_n1/data/]
   [junit4]   2> 2022464 INFO  (qtp1572877782-37535) [n:127.0.0.1:41095_cw_%2Fu c:control_collection s:shard1  x:control_collection_shard1_replica_n1] o.a.s.u.RandomMergePolicy RandomMergePolicy wrapping class org.apache.lucene.index.AlcoholicMergePolicy: [AlcoholicMergePolicy: minMergeSize=0, mergeFactor=10, maxMergeSize=1621904239, maxMergeSizeForForcedMerge=9223372036854775807, calibrateSizeByDeletes=true, maxMergeDocs=2147483647, maxCFSSegmentSizeMB=8.796093022207999E12, noCFSRatio=0.1]
   [junit4]   2> 2022469 WARN  (qtp1572877782-37535) [n:127.0.0.1:41095_cw_%2Fu c:control_collection s:shard1  x:control_collection_shard1_replica_n1] o.a.s.c.RequestHandlers INVALID paramSet a in requestHandler {type = requestHandler,name = /dump,class = DumpRequestHandler,attributes = {initParams=a, name=/dump, class=DumpRequestHandler},args = {defaults={a=A,b=B}}}
   [junit4]   2> 2022545 INFO  (qtp1572877782-37535) [n:127.0.0.1:41095_cw_%2Fu c:control_collection s:shard1  x:control_collection_shard1_replica_n1] o.a.s.u.UpdateHandler Using UpdateLog implementation: org.apache.solr.update.UpdateLog
   [junit4]   2> 2022545 INFO  (qtp1572877782-37535) [n:127.0.0.1:41095_cw_%2Fu c:control_collection s:shard1  x:control_collection_shard1_replica_n1] o.a.s.u.UpdateLog Initializing UpdateLog: dataDir= defaultSyncLevel=FLUSH numRecordsToKeep=100 maxNumLogsToKeep=10 numVersionBuckets=65536
   [junit4]   2> 2022547 INFO  (qtp1572877782-37535) [n:127.0.0.1:41095_cw_%2Fu c:control_collection s:shard1  x:control_collection_shard1_replica_n1] o.a.s.u.CommitTracker Hard AutoCommit: disabled
   [junit4]   2> 2022547 INFO  (qtp1572877782-37535) [n:127.0.0.1:41095_cw_%2Fu c:control_collection s:shard1  x:control_collection_shard1_replica_n1] o.a.s.u.CommitTracker Soft AutoCommit: disabled
   [junit4]   2> 2022549 INFO  (qtp1572877782-37535) [n:127.0.0.1:41095_cw_%2Fu c:control_collection s:shard1  x:control_collection_shard1_replica_n1] o.a.s.u.RandomMergePolicy RandomMergePolicy wrapping class org.apache.lucene.index.TieredMergePolicy: [TieredMergePolicy: maxMergeAtOnce=3, maxMergeAtOnceExplicit=9, maxMergedSegmentMB=75.861328125, floorSegmentMB=1.556640625, forceMergeDeletesPctAllowed=3.940884174935909, segmentsPerTier=40.0, maxCFSSegmentSizeMB=8.796093022207999E12, noCFSRatio=0.0, deletesPctAllowed=23.39088656989974
   [junit4]   2> 2022550 INFO  (qtp1572877782-37535) [n:127.0.0.1:41095_cw_%2Fu c:control_collection s:shard1  x:control_collection_shard1_replica_n1] o.a.s.s.SolrIndexSearcher Opening [Searcher@59fb6674[control_collection_shard1_replica_n1] main]
   [junit4]   2> 2022552 INFO  (qtp1572877782-37535) [n:127.0.0.1:41095_cw_%2Fu c:control_collection s:shard1  x:control_collection_shard1_replica_n1] o.a.s.r.ManagedResourceStorage Configured ZooKeeperStorageIO with znodeBase: /configs/conf1
   [junit4]   2> 2022552 INFO  (qtp1572877782-37535) [n:127.0.0.1:41095_cw_%2Fu c:control_collection s:shard1  x:control_collection_shard1_replica_n1] o.a.s.r.ManagedResourceStorage Loaded null at path _rest_managed.json using ZooKeeperStorageIO:path=/configs/conf1
   [junit4]   2> 2022553 INFO  (qtp1572877782-37535) [n:127.0.0.1:41095_cw_%2Fu c:control_collection s:shard1  x:control_collection_shard1_replica_n1] o.a.s.h.ReplicationHandler Commits will be reserved for 10000ms.
   [junit4]   2> 2022553 INFO  (qtp1572877782-37535) [n:127.0.0.1:41095_cw_%2Fu c:control_collection s:shard1  x:control_collection_shard1_replica_n1] o.a.s.u.UpdateLog Could not find max version in index or recent updates, using new clock 1630391723011080192
   [junit4]   2> 2022557 INFO  (searcherExecutor-8193-thread-1-processing-n:127.0.0.1:41095_cw_%2Fu x:control_collection_shard1_replica_n1 c:control_collection s:shard1) [n:127.0.0.1:41095_cw_%2Fu c:control_collection s:shard1  x:control_collection_shard1_replica_n1] o.a.s.c.SolrCore [control_collection_shard1_replica_n1] Registered new searcher Searcher@59fb6674[control_collection_shard1_replica_n1] main{ExitableDirectoryReader(UninvertingDirectoryReader())}
   [junit4]   2> 2022559 INFO  (qtp1572877782-37535) [n:127.0.0.1:41095_cw_%2Fu c:control_collection s:shard1  x:control_collection_shard1_replica_n1] o.a.s.c.ZkShardTerms Successful update of terms at /collections/control_collection/terms/shard1 to Terms{values={core_node2=0}, version=0}
   [junit4]   2> 2022560 INFO  (qtp1572877782-37535) [n:127.0.0.1:41095_cw_%2Fu c:control_collection s:shard1  x:control_collection_shard1_replica_n1] o.a.s.c.ShardLeaderElectionContextBase make sure parent is created /collections/control_collection/leaders/shard1
   [junit4]   2> 2022564 INFO  (qtp1572877782-37535) [n:127.0.0.1:41095_cw_%2Fu c:control_collection s:shard1  x:control_collection_shard1_replica_n1] o.a.s.c.ShardLeaderElectionContext Enough replicas found to continue.
   [junit4]   2> 2022564 INFO  (qtp1572877782-37535) [n:127.0.0.1:41095_cw_%2Fu c:control_collection s:shard1  x:control_collection_shard1_replica_n1] o.a.s.c.ShardLeaderElectionContext I may be the new leader - try and sync
   [junit4]   2> 2022564 INFO  (qtp1572877782-37535) [n:127.0.0.1:41095_cw_%2Fu c:control_collection s:shard1  x:control_collection_shard1_replica_n1] o.a.s.c.SyncStrategy Sync replicas to http://127.0.0.1:41095/cw_/u/control_collection_shard1_replica_n1/
   [junit4]   2> 2022564 INFO  (qtp1572877782-37535) [n:127.0.0.1:41095_cw_%2Fu c:control_collection s:shard1  x:control_collection_shard1_replica_n1] o.a.s.c.SyncStrategy Sync Success - now sync replicas to me
   [junit4]   2> 2022564 INFO  (qtp1572877782-37535) [n:127.0.0.1:41095_cw_%2Fu c:control_collection s:shard1  x:control_collection_shard1_replica_n1] o.a.s.c.SyncStrategy http://127.0.0.1:41095/cw_/u/control_collection_shard1_replica_n1/ has no replicas
   [junit4]   2> 2022564 INFO  (qtp1572877782-37535) [n:127.0.0.1:41095_cw_%2Fu c:control_collection s:shard1  x:control_collection_shard1_replica_n1] o.a.s.c.ShardLeaderElectionContextBase Creating leader registration node /collections/control_collection/leaders/shard1/leader after winning as /collections/control_collection/leader_elect/shard1/election/73106003766804484-core_node2-n_0000000000
   [junit4]   2> 2022567 INFO  (qtp1572877782-37535) [n:127.0.0.1:41095_cw_%2Fu c:control_collection s:shard1  x:control_collection_shard1_replica_n1] o.a.s.c.ShardLeaderElectionContext I am the new leader: http://127.0.0.1:41095/cw_/u/control_collection_shard1_replica_n1/ shard1
   [junit4]   2> 2022668 INFO  (zkCallback-7646-thread-1) [    ] o.a.s.c.c.ZkStateReader A cluster state change: [WatchedEvent state:SyncConnected type:NodeDataChanged path:/collections/control_collection/state.json] for collection [control_collection] has occurred - updating... (live nodes size: [1])
   [junit4]   2> 2022669 INFO  (zkCallback-7646-thread-2) [    ] o.a.s.c.c.ZkStateReader A cluster state change: [WatchedEvent state:SyncConnected type:NodeDataChanged path:/collections/control_collection/state.json] for collection [control_collection] has occurred - updating... (live nodes size: [1])
   [junit4]   2> 2022670 INFO  (qtp1572877782-37535) [n:127.0.0.1:41095_cw_%2Fu c:control_collection s:shard1  x:control_collection_shard1_replica_n1] o.a.s.c.ZkController I am the leader, no recovery necessary
   [junit4]   2> 2022673 INFO  (qtp1572877782-37535) [n:127.0.0.1:41095_cw_%2Fu c:control_collection s:shard1  x:control_collection_shard1_replica_n1] o.a.s.s.HttpSolrCall [admin] webapp=null path=/admin/cores params={qt=/admin/cores&collection.configName=conf1&newCollection=true&name=control_collection_shard1_replica_n1&action=CREATE&numShards=1&collection=control_collection&shard=shard1&wt=javabin&version=2&replicaType=NRT} status=0 QTime=1418
   [junit4]   2> 2022676 INFO  (qtp1572877782-37533) [n:127.0.0.1:41095_cw_%2Fu    ] o.a.s.h.a.CollectionsHandler Wait for new collection to be active for at most 45 seconds. Check all shard replicas
   [junit4]   2> 2022773 INFO  (zkCallback-7646-thread-1) [    ] o.a.s.c.c.ZkStateReader A cluster state change: [WatchedEvent state:SyncConnected type:NodeDataChanged path:/collections/control_collection/state.json] for collection [control_collection] has occurred - updating... (live nodes size: [1])
   [junit4]   2> 2022773 INFO  (zkCallback-7646-thread-2) [    ] o.a.s.c.c.ZkStateReader A cluster state change: [WatchedEvent state:SyncConnected type:NodeDataChanged path:/collections/control_collection/state.json] for collection [control_collection] has occurred - updating... (live nodes size: [1])
   [junit4]   2> 2022773 INFO  (zkCallback-7646-thread-3) [    ] o.a.s.c.c.ZkStateReader A cluster state change: [WatchedEvent state:SyncConnected type:NodeDataChanged path:/collections/control_collection/state.json] for collection [control_collection] has occurred - updating... (live nodes size: [1])
   [junit4]   2> 2022773 INFO  (qtp1572877782-37533) [n:127.0.0.1:41095_cw_%2Fu    ] o.a.s.s.HttpSolrCall [admin] webapp=null path=/admin/collections params={collection.configName=conf1&name=control_collection&nrtReplicas=1&action=CREATE&numShards=1&createNodeSet=127.0.0.1:41095_cw_%252Fu&wt=javabin&version=2} status=0 QTime=1632
   [junit4]   2> 2022780 INFO  (zkConnectionManagerCallback-7666-thread-1) [    ] o.a.s.c.c.ConnectionManager zkClient has connected
   [junit4]   2> 2022782 INFO  (TEST-BasicDistributedZkTest.test-seed#[7953E3FA6BE6649E]) [    ] o.a.s.c.c.ZkStateReader Updated live nodes from ZooKeeper... (0) -> (1)
   [junit4]   2> 2022783 INFO  (TEST-BasicDistributedZkTest.test-seed#[7953E3FA6BE6649E]) [    ] o.a.s.c.s.i.ZkClientClusterStateProvider Cluster at 127.0.0.1:45881/solr ready
   [junit4]   2> 2022783 INFO  (TEST-BasicDistributedZkTest.test-seed#[7953E3FA6BE6649E]) [    ] o.a.s.c.ChaosMonkey monkey: init - expire sessions:false cause connection loss:false
   [junit4]   2> 2022784 INFO  (qtp1572877782-37535) [n:127.0.0.1:41095_cw_%2Fu    ] o.a.s.h.a.CollectionsHandler Invoked Collection Action :create with params collection.configName=conf1&name=collection1&nrtReplicas=1&action=CREATE&numShards=2&createNodeSet=&stateFormat=2&wt=javabin&version=2 and sendToOCPQueue=true
   [junit4]   2> 2022788 INFO  (OverseerThreadFactory-8188-thread-2-processing-n:127.0.0.1:41095_cw_%2Fu) [n:127.0.0.1:41095_cw_%2Fu    ] o.a.s.c.a.c.CreateCollectionCmd Create collection collection1
   [junit4]   2> 2022789 INFO  (OverseerCollectionConfigSetProcessor-73106003766804484-127.0.0.1:41095_cw_%2Fu-n_0000000000) [n:127.0.0.1:41095_cw_%2Fu    ] o.a.s.c.OverseerTaskQueue Response ZK path: /overseer/collection-queue-work/qnr-0000000000 doesn't exist.  Requestor may have disconnected from ZooKeeper
   [junit4]   2> 2022993 WARN  (OverseerThreadFactory-8188-thread-2-processing-n:127.0.0.1:41095_cw_%2Fu) [n:127.0.0.1:41095_cw_%2Fu    ] o.a.s.c.a.c.CreateCollectionCmd It is unusual to create a collection (collection1) without cores.
   [junit4]   2> 2022995 INFO  (qtp1572877782-37535) [n:127.0.0.1:41095_cw_%2Fu    ] o.a.s.h.a.CollectionsHandler Wait for new collection to be active for at most 45 seconds. Check all shard replicas
   [junit4]   2> 2022996 INFO  (qtp1572877782-37535) [n:127.0.0.1:41095_cw_%2Fu    ] o.a.s.s.HttpSolrCall [admin] webapp=null path=/admin/collections params={collection.configName=conf1&name=collection1&nrtReplicas=1&action=CREATE&numShards=2&createNodeSet=&stateFormat=2&wt=javabin&version=2} status=0 QTime=211
   [junit4]   2> 2022997 INFO  (TEST-BasicDistributedZkTest.test-seed#[7953E3FA6BE6649E]) [    ] o.a.s.c.AbstractFullDistribZkTestBase Creating jetty instances pullReplicaCount=0 numOtherReplicas=4
   [junit4]   2> 2023183 INFO  (TEST-BasicDistributedZkTest.test-seed#[7953E3FA6BE6649E]) [    ] o.a.s.c.AbstractFullDistribZkTestBase create jetty 1 in directory /x1/jenkins/jenkins-slave/workspace/Lucene-Solr-NightlyTests-8.x/checkout/solr/build/solr-core/test/J0/temp/solr.cloud.BasicDistributedZkTest_7953E3FA6BE6649E-001/shard-1-001 of type NRT
   [junit4]   2> 2023184 WARN  (closeThreadPool-7667-thread-1) [    ] o.e.j.s.AbstractConnector Ignoring deprecated socket close linger time
   [junit4]   2> 2023184 INFO  (closeThreadPool-7667-thread-1) [    ] o.a.s.c.s.e.JettySolrRunner Start Jetty (original configured port=0)
   [junit4]   2> 2023184 INFO  (closeThreadPool-7667-thread-1) [    ] o.a.s.c.s.e.JettySolrRunner Trying to start Jetty on port 0 try number 1 ...
   [junit4]   2> 2023184 INFO  (closeThreadPool-7667-thread-1) [    ] o.e.j.s.Server jetty-9.4.14.v20181114; built: 2018-11-14T21:20:31.478Z; git: c4550056e785fb5665914545889f21dc136ad9e6; jvm 1.8.0_191-b12
   [junit4]   2> 2023185 INFO  (closeThreadPool-7667-thread-1) [    ] o.e.j.s.session DefaultSessionIdManager workerName=node0
   [junit4]   2> 2023185 INFO  (closeThreadPool-7667-thread-1) [    ] o.e.j.s.session No SessionScavenger set, using defaults
   [junit4]   2> 2023185 INFO  (closeThreadPool-7667-thread-1) [    ] o.e.j.s.session node0 Scavenging every 600000ms
   [junit4]   2> 2023186 INFO  (closeThreadPool-7667-thread-1) [    ] o.e.j.s.h.ContextHandler Started o.e.j.s.ServletContextHandler@3343586b{/cw_/u,null,AVAILABLE}
   [junit4]   2> 2023186 INFO  (closeThreadPool-7667-thread-1) [    ] o.e.j.s.AbstractConnector Started ServerConnector@300faead{HTTP/1.1,[http/1.1, h2c]}{127.0.0.1:37430}
   [junit4]   2> 2023186 INFO  (closeThreadPool-7667-thread-1) [    ] o.e.j.s.Server Started @2023298ms
   [junit4]   2> 2023186 INFO  (closeThreadPool-7667-thread-1) [    ] o.a.s.c.s.e.JettySolrRunner Jetty properties: {solr.data.dir=/x1/jenkins/jenkins-slave/workspace/Lucene-Solr-NightlyTests-8.x/checkout/solr/build/solr-core/test/J0/temp/solr.cloud.BasicDistributedZkTest_7953E3FA6BE6649E-001/tempDir-001/jetty1, solrconfig=solrconfig.xml, hostContext=/cw_/u, hostPort=37430, coreRootDirectory=/x1/jenkins/jenkins-slave/workspace/Lucene-Solr-NightlyTests-8.x/checkout/solr/build/solr-core/test/J0/../../../../../../../../../../../x1/jenkins/jenkins-slave/workspace/Lucene-Solr-NightlyTests-8.x/checkout/solr/build/solr-core/test/J0/temp/solr.cloud.BasicDistributedZkTest_7953E3FA6BE6649E-001/shard-1-001/cores}
   [junit4]   2> 2023187 ERROR (closeThreadPool-7667-thread-1) [    ] o.a.s.u.StartupLoggingUtils Missing Java Option solr.log.dir. Logging may be missing or incomplete.
   [junit4]   2> 2023187 INFO  (closeThreadPool-7667-thread-1) [    ] o.a.s.s.SolrDispatchFilter Using logger factory org.apache.logging.slf4j.Log4jLoggerFactory
   [junit4]   2> 2023187 INFO  (closeThreadPool-7667-thread-1) [    ] o.a.s.s.SolrDispatchFilter  ___      _       Welcome to Apache Solr™ version 8.1.0
   [junit4]   2> 2023187 INFO  (closeThreadPool-7667-thread-1) [    ] o.a.s.s.SolrDispatchFilter / __| ___| |_ _   Starting in cloud mode on port null
   [junit4]   2> 2023187 INFO  (closeThreadPool-7667-thread-1) [    ] o.a.s.s.SolrDispatchFilter \__ \/ _ \ | '_|  Install dir: null
   [junit4]   2> 2023187 INFO  (closeThreadPool-7667-thread-1) [    ] o.a.s.s.SolrDispatchFilter |___/\___/_|_|    Start time: 2019-04-10T02:18:32.551Z
   [junit4]   2> 2023190 INFO  (zkConnectionManagerCallback-7669-thread-1) [    ] o.a.s.c.c.ConnectionManager zkClient has connected
   [junit4]   2> 2023192 INFO  (closeThreadPool-7667-thread-1) [    ] o.a.s.s.SolrDispatchFilter Loading solr.xml from SolrHome (not found in ZooKeeper)
   [junit4]   2> 2023193 INFO  (closeThreadPool-7667-thread-1) [    ] o.a.s.c.SolrXmlConfig Loading container configuration from /x1/jenkins/jenkins-slave/workspace/Lucene-Solr-NightlyTests-8.x/checkout/solr/build/solr-core/test/J0/temp/solr.cloud.BasicDistributedZkTest_7953E3FA6BE6649E-001/shard-1-001/solr.xml
   [junit4]   2> 2023197 INFO  (closeThreadPool-7667-thread-1) [    ] o.a.s.c.SolrXmlConfig Configuration parameter autoReplicaFailoverWorkLoopDelay is ignored
   [junit4]   2> 2023197 INFO  (closeThreadPool-7667-thread-1) [    ] o.a.s.c.SolrXmlConfig Configuration parameter autoReplicaFailoverBadNodeExpiration is ignored
   [junit4]   2> 2023199 INFO  (closeThreadPool-7667-thread-1) [    ] o.a.s.c.SolrXmlConfig MBean server found: com.sun.jmx.mbeanserver.JmxMBeanServer@137ff20a, but no JMX reporters were configured - adding default JMX reporter.
   [junit4]   2> 2023366 INFO  (TEST-BasicDistributedZkTest.test-seed#[7953E3FA6BE6649E]) [    ] o.a.s.c.AbstractFullDistribZkTestBase create jetty 2 in directory /x1/jenkins/jenkins-slave/workspace/Lucene-Solr-NightlyTests-8.x/checkout/solr/build/solr-core/test/J0/temp/solr.cloud.BasicDistributedZkTest_7953E3FA6BE6649E-001/shard-2-001 of type NRT
   [junit4]   2> 2023367 WARN  (closeThreadPool-7667-thread-2) [    ] o.e.j.s.AbstractConnector Ignoring deprecated socket close linger time
   [junit4]   2> 2023367 INFO  (closeThreadPool-7667-thread-2) [    ] o.a.s.c.s.e.JettySolrRunner Start Jetty (original configured port=0)
   [junit4]   2> 2023367 INFO  (closeThreadPool-7667-thread-2) [    ] o.a.s.c.s.e.JettySolrRunner Trying to start Jetty on port 0 try number 1 ...
   [junit4]   2> 2023367 INFO  (closeThreadPool-7667-thread-2) [    ] o.e.j.s.Server jetty-9.4.14.v20181114; built: 2018-11-14T21:20:31.478Z; git: c4550056e785fb5665914545889f21dc136ad9e6; jvm 1.8.0_191-b12
   [junit4]   2> 2023368 INFO  (closeThreadPool-7667-thread-2) [    ] o.e.j.s.session DefaultSessionIdManager workerName=node0
   [junit4]   2> 2023368 INFO  (closeThreadPool-7667-thread-2) [    ] o.e.j.s.session No SessionScavenger set, using defaults
   [junit4]   2> 2023368 INFO  (closeThreadPool-7667-thread-2) [    ] o.e.j.s.session node0 Scavenging every 660000ms
   [junit4]   2> 2023369 INFO  (closeThreadPool-7667-thread-2) [    ] o.e.j.s.h.ContextHandler Started o.e.j.s.ServletContextHandler@21a46f50{/cw_/u,null,AVAILABLE}
   [junit4]   2> 2023369 INFO  (closeThreadPool-7667-thread-2) [    ] o.e.j.s.AbstractConnector Started ServerConnector@6c9bb349{HTTP/1.1,[http/1.1, h2c]}{127.0.0.1:42367}
   [junit4]   2> 2023369 INFO  (closeThreadPool-7667-thread-2) [    ] o.e.j.s.Server Started @2023481ms
   [junit4]   2> 2023369 INFO  (closeThreadPool-7667-thread-2) [    ] o.a.s.c.s.e.JettySolrRunner Jetty properties: {solr.data.dir=/x1/jenkins/jenkins-slave/workspace/Lucene-Solr-NightlyTests-8.x/checkout/solr/build/solr-core/test/J0/temp/solr.cloud.BasicDistributedZkTest_7953E3FA6BE6649E-001/tempDir-001/jetty2, solrconfig=solrconfig.xml, hostContext=/cw_/u, hostPort=42367, coreRootDirectory=/x1/jenkins/jenkins-slave/workspace/Lucene-Solr-NightlyTests-8.x/checkout/solr/build/solr-core/test/J0/../../../../../../../../../../../x1/jenkins/jenkins-slave/workspace/Lucene-Solr-NightlyTests-8.x/checkout/solr/build/solr-core/test/J0/temp/solr.cloud.BasicDistributedZkTest_7953E3FA6BE6649E-001/shard-2-001/cores}
   [junit4]   2> 2023370 ERROR (closeThreadPool-7667-thread-2) [    ] o.a.s.u.StartupLoggingUtils Missing Java Option solr.log.dir. Logging may be missing or incomplete.
   [junit4]   2> 2023370 INFO  (closeThreadPool-7667-thread-2) [    ] o.a.s.s.SolrDispatchFilter Using logger factory org.apache.logging.slf4j.Log4jLoggerFactory
   [junit4]   2> 2023370 INFO  (closeThreadPool-7667-thread-2) [    ] o.a.s.s.SolrDispatchFilter  ___      _       Welcome to Apache Solr™ version 8.1.0
   [junit4]   2> 2023370 INFO  (closeThreadPool-7667-thread-2) [    ] o.a.s.s.SolrDispatchFilter / __| ___| |_ _   Starting in cloud mode on port null
   [junit4]   2> 2023370 INFO  (closeThreadPool-7667-thread-2) [    ] o.a.s.s.SolrDispatchFilter \__ \/ _ \ | '_|  Install dir: null
   [junit4]   2> 2023370 INFO  (closeThreadPool-7667-thread-2) [    ] o.a.s.s.SolrDispatchFilter |___/\___/_|_|    Start time: 2019-04-10T02:18:32.734Z
   [junit4]   2> 2023372 INFO  (zkConnectionManagerCallback-7672-thread-1) [    ] o.a.s.c.c.ConnectionManager zkClient has connected
   [junit4]   2> 2023373 INFO  (closeThreadPool-7667-thread-2) [    ] o.a.s.s.SolrDispatchFilter Loading solr.xml from SolrHome (not found in ZooKeeper)
   [junit4]   2> 2023373 INFO  (closeThreadPool-7667-thread-2) [    ] o.a.s.c.SolrXmlConfig Loading container configuration from /x1/jenkins/jenkins-slave/workspace/Lucene-Solr-NightlyTests-8.x/checkout/solr/build/solr-core/test/J0/temp/solr.cloud.BasicDistributedZkTest_7953E3FA6BE6649E-001/shard-2-001/solr.xml
   [junit4]   2> 2023378 INFO  (closeThreadPool-7667-thread-2) [    ] o.a.s.c.SolrXmlConfig Configuration parameter autoReplicaFailoverWorkLoopDelay is ignored
   [junit4]   2> 2023378 INFO  (closeThreadPool-7667-thread-2) [    ] o.a.s.c.SolrXmlConfig Configuration parameter autoReplicaFailoverBadNodeExpiration is ignored
   [junit4]   2> 2023380 INFO  (closeThreadPool-7667-thread-2) [    ] o.a.s.c.SolrXmlConfig MBean server found: com.sun.jmx.mbeanserver.JmxMBeanServer@137ff20a, but no JMX reporters were configured - adding default JMX reporter.
   [junit4]   2> 2023534 INFO  (closeThreadPool-7667-thread-2) [    ] o.a.s.h.c.HttpShardHandlerFactory Host whitelist initialized: WhitelistHostChecker [whitelistHosts=null, whitelistHostCheckingEnabled=false]
   [junit4]   2> 2023536 WARN  (closeThreadPool-7667-thread-2) [    ] o.e.j.u.s.S.config No Client EndPointIdentificationAlgorithm configured for SslContextFactory@746ab88d[provider=null,keyStore=null,trustStore=null]
   [junit4]   2> 2023540 INFO  (closeThreadPool-7667-thread-1) [    ] o.a.s.h.c.HttpShardHandlerFactory Host whitelist initialized: WhitelistHostChecker [whitelistHosts=null, whitelistHostCheckingEnabled=false]
   [junit4]   2> 2023543 WARN  (closeThreadPool-7667-thread-2) [    ] o.e.j.u.s.S.config No Client EndPointIdentificationAlgorithm configured for SslContextFactory@65643b34[provider=null,keyStore=null,trustStore=null]
   [junit4]   2> 2023543 WARN  (closeThreadPool-7667-thread-1) [    ] o.e.j.u.s.S.config No Client EndPointIdentificationAlgorithm configured for SslContextFactory@76a71084[provider=null,keyStore=null,trustStore=null]
   [junit4]   2> 2023544 INFO  (closeThreadPool-7667-thread-2) [    ] o.a.s.c.ZkContainer Zookeeper client=127.0.0.1:45881/solr
   [junit4]   2> 2023548 INFO  (zkConnectionManagerCallback-7681-thread-1) [    ] o.a.s.c.c.ConnectionManager zkClient has connected
   [junit4]   2> 2023550 WARN  (closeThreadPool-7667-thread-1) [    ] o.e.j.u.s.S.config No Client EndPointIdentificationAlgorithm configured for SslContextFactory@7bcbe7de[provider=null,keyStore=null,trustStore=null]
   [junit4]   2> 2023551 INFO  (closeThreadPool-7667-thread-1) [    ] o.a.s.c.ZkContainer Zookeeper client=127.0.0.1:45881/solr
   [junit4]   2> 2023558 INFO  (zkConnectionManagerCallback-7685-thread-1) [    ] o.a.s.c.c.ConnectionManager zkClient has connected
   [junit4]   2> 2023563 INFO  (zkConnectionManagerCallback-7687-thread-1) [    ] o.a.s.c.c.ConnectionManager zkClient has connected
   [junit4]   2> 2023568 INFO  (zkConnectionManagerCallback-7689-thread-1) [    ] o.a.s.c.c.ConnectionManager zkClient has connected
   [junit4]   2> 2023581 INFO  (TEST-BasicDistributedZkTest.test-seed#[7953E3FA6BE6649E]) [    ] o.a.s.c.AbstractFullDistribZkTestBase create jetty 3 in directory /x1/jenkins/jenkins-slave/workspace/Lucene-Solr-NightlyTests-8.x/checkout/solr/build/solr-core/test/J0/temp/solr.cloud.BasicDistributedZkTest_7953E3FA6BE6649E-001/shard-3-001 of type NRT
   [junit4]   2> 2023584 INFO  (closeThreadPool-7667-thread-1) [n:127.0.0.1:37430_cw_%2Fu    ] o.a.s.c.c.ZkStateReader Updated live nodes from ZooKeeper... (0) -> (1)
   [junit4]   2> 2023585 INFO  (closeThreadPool-7667-thread-2) [n:127.0.0.1:42367_cw_%2Fu    ] o.a.s.c.c.ZkStateReader Updated live nodes from ZooKeeper... (0) -> (1)
   [junit4]   2> 2023587 WARN  (closeThreadPool-7667-thread-3) [    ] o.e.j.s.AbstractConnector Ignoring deprecated socket close linger time
   [junit4]   2> 2023587 INFO  (closeThreadPool-7667-thread-3) [    ] o.a.s.c.s.e.JettySolrRunner Start Jetty (original configured port=0)
   [junit4]   2> 2023587 INFO  (closeThreadPool-7667-thread-3) [    ] o.a.s.c.s.e.JettySolrRunner Trying to start Jetty on port 0 try number 1 ...
   [junit4]   2> 2023587 INFO  (closeThreadPool-7667-thread-3) [    ] o.e.j.s.Server jetty-9.4.14.v20181114; built: 2018-11-14T21:20:31.478Z; git: c4550056e785fb5665914545889f21dc136ad9e6; jvm 1.8.0_191-b12
   [junit4]   2> 2023593 INFO  (closeThreadPool-7667-thread-1) [n:127.0.0.1:37430_cw_%2Fu    ] o.a.s.c.ZkController Publish node=127.0.0.1:37430_cw_%2Fu as DOWN
   [junit4]   2> 2023593 INFO  (closeThreadPool-7667-thread-2) [n:127.0.0.1:42367_cw_%2Fu    ] o.a.s.c.ZkController Publish node=127.0.0.1:42367_cw_%2Fu as DOWN
   [junit4]   2> 2023595 INFO  (closeThreadPool-7667-thread-1) [n:127.0.0.1:37430_cw_%2Fu    ] o.a.s.c.TransientSolrCoreCacheDefault Allocating transient cache for 4 transient cores
   [junit4]   2> 2023595 INFO  (closeThreadPool-7667-thread-1) [n:127.0.0.1:37430_cw_%2Fu    ] o.a.s.c.ZkController Register node as live in ZooKeeper:/live_nodes/127.0.0.1:37430_cw_%2Fu
   [junit4]   2> 2023596 INFO  (closeThreadPool-7667-thread-2) [n:127.0.0.1:42367_cw_%2Fu    ] o.a.s.c.TransientSolrCoreCacheDefault Allocating transient cache for 4 transient cores
   [junit4]   2> 2023596 INFO  (closeThreadPool-7667-thread-2) [n:127.0.0.1:42367_cw_%2Fu    ] o.a.s.c.ZkController Register node as live in ZooKeeper:/live_nodes/127.0.0.1:42367_cw_%2Fu
   [junit4]   2> 2023600 INFO  (zkCallback-7646-thread-3) [    ] o.a.s.c.c.ZkStateReader Updated live nodes from ZooKeeper... (1) -> (3)
   [junit4]   2> 2023612 INFO  (zkCallback-7665-thread-1) [    ] o.a.s.c.c.ZkStateReader Updated live nodes from ZooKeeper... (1) -> (3)
   [junit4]   2> 2023616 INFO  (zkCallback-7653-thread-1) [    ] o.a.s.c.c.ZkStateReader Updated live nodes from ZooKeeper... (1) -> (3)
   [junit4]   2> 2023616 INFO  (closeThreadPool-7667-thread-3) [    ] o.e.j.s.session DefaultSessionIdManager workerName=node0
   [junit4]   2> 2023616 INFO  (closeThreadPool-7667-thread-3) [    ] o.e.j.s.session No SessionScavenger set, using defaults
   [junit4]   2> 2023616 INFO  (closeThreadPool-7667-thread-3) [    ] o.e.j.s.session node0 Scavenging every 660000ms
   [junit4]   2> 2023617 INFO  (closeThreadPool-7667-thread-3) [    ] o.e.j.s.h.ContextHandler Started o.e.j.s.ServletContextHandler@528e0fba{/cw_/u,null,AVAILABLE}
   [junit4]   2> 2023617 INFO  (closeThreadPool-7667-thread-3) [    ] o.e.j.s.AbstractConnector Started ServerConnector@76a890ac{HTTP/1.1,[http/1.1, h2c]}{127.0.0.1:43553}
   [junit4]   2> 2023617 INFO  (closeThreadPool-7667-thread-3) [    ] o.e.j.s.Server Started @2023729ms
   [junit4]   2> 2023617 INFO  (closeThreadPool-7667-thread-3) [    ] o.a.s.c.s.e.JettySolrRunner Jetty properties: {solr.data.dir=/x1/jenkins/jenkins-slave/workspace/Lucene-Solr-NightlyTests-8.x/checkout/solr/build/solr-core/test/J0/temp/solr.cloud.BasicDistributedZkTest_7953E3FA6BE6649E-001/tempDir-001/jetty3, solrconfig=solrconfig.xml, hostContext=/cw_/u, hostPort=43553, coreRootDirectory=/x1/jenkins/jenkins-slave/workspace/Lucene-Solr-NightlyTests-8.x/checkout/solr/build/solr-core/test/J0/../../../../../../../../../../../x1/jenkins/jenkins-slave/workspace/Lucene-Solr-NightlyTests-8.x/checkout/solr/build/solr-core/test/J0/temp/solr.cloud.BasicDistributedZkTest_7953E3FA6BE6649E-001/shard-3-001/cores}
   [junit4]   2> 2023617 ERROR (closeThreadPool-7667-thread-3) [    ] o.a.s.u.StartupLoggingUtils Missing Java Option solr.log.dir. Logging may be missing or incomplete.
   [junit4]   2> 2023617 INFO  (closeThreadPool-7667-thread-3) [    ] o.a.s.s.SolrDispatchFilter Using logger factory org.apache.logging.slf4j.Log4jLoggerFactory
   [junit4]   2> 2023618 INFO  (closeThreadPool-7667-thread-3) [    ] o.a.s.s.SolrDispatchFilter  ___      _       Welcome to Apache Solr™ version 8.1.0
   [junit4]   2> 2023618 INFO  (closeThreadPool-7667-thread-3) [    ] o.a.s.s.SolrDispatchFilter / __| ___| |_ _   Starting in cloud mode on port null
   [junit4]   2> 2023618 INFO  (closeThreadPool-7667-thread-3) [    ] o.a.s.s.SolrDispatchFilter \__ \/ _ \ | '_|  Install dir: null
   [junit4]   2> 2023618 INFO  (closeThreadPool-7667-thread-3) [    ] o.a.s.s.SolrDispatchFilter |___/\___/_|_|    Start time: 2019-04-10T02:18:32.982Z
   [junit4]   2> 2023618 INFO  (zkCallback-7688-thread-1) [    ] o.a.s.c.c.ZkStateReader Updated live nodes from ZooKeeper... (1) -> (3)
   [junit4]   2> 2023618 INFO  (zkCallback-7686-thread-1) [    ] o.a.s.c.c.ZkStateReader Updated live nodes from ZooKeeper... (1) -> (3)
   [junit4]   2> 2023623 INFO  (zkConnectionManagerCallback-7695-thread-1) [    ] o.a.s.c.c.ConnectionManager zkClient has connected
   [junit4]   2> 2023628 INFO  (closeThreadPool-7667-thread-3) [    ] o.a.s.s.SolrDispatchFilter Loading solr.xml from SolrHome (not found in ZooKeeper)
   [junit4]   2> 2023628 INFO  (closeThreadPool-7667-thread-3) [    ] o.a.s.c.SolrXmlConfig Loading container configuration from /x1/jenkins/jenkins-slave/workspace/Lucene-Solr-NightlyTests-8.x/checkout/solr/build/solr-core/test/J0/temp/solr.cloud.BasicDistributedZkTest_7953E3FA6BE6649E-001/shard-3-001/solr.xml
   [junit4]   2> 2023633 INFO  (closeThreadPool-7667-thread-3) [    ] o.a.s.c.SolrXmlConfig Configuration parameter autoReplicaFailoverWorkLoopDelay is ignored
   [junit4]   2> 2023633 INFO  (closeThreadPool-7667-thread-3) [    ] o.a.s.c.SolrXmlConfig Configuration parameter autoReplicaFailoverBadNodeExpiration is ignored
   [junit4]   2> 2023635 INFO  (closeThreadPool-7667-thread-3) [    ] o.a.s.c.SolrXmlConfig MBean server found: com.sun.jmx.mbeanserver.JmxMBeanServer@137ff20a, but no JMX reporters were configured - adding default JMX reporter.
   [junit4]   2> 2023651 INFO  (zkConnectionManagerCallback-7705-thread-1) [    ] o.a.s.c.c.ConnectionManager zkClient has connected
   [junit4]   2> 2023652 INFO  (closeThreadPool-7667-thread-2) [n:127.0.0.1:42367_cw_%2Fu    ] o.a.s.c.c.ZkStateReader Updated live nodes from ZooKeeper... (0) -> (3)
   [junit4]   2> 2023654 INFO  (closeThreadPool-7667-thread-2) [n:127.0.0.1:42367_cw_%2Fu    ] o.a.s.c.s.i.ZkClientClusterStateProvider Cluster at 127.0.0.1:45881/solr ready
   [junit4]   2> 2023655 INFO  (closeThreadPool-7667-thread-2) [n:127.0.0.1:42367_cw_%2Fu    ] o.a.s.h.a.MetricsHistoryHandler No .system collection, keeping metrics history in memory.
   [junit4]   2> 2023656 INFO  (zkConnectionManagerCallback-7706-thread-1) [    ] o.a.s.c.c.ConnectionManager zkClient has connected
   [junit4]   2> 2023663 INFO  (closeThreadPool-7667-thread-1) [n:127.0.0.1:37430_cw_%2Fu    ] o.a.s.c.c.ZkStateReader Updated live nodes from ZooKeeper... (0) -> (3)
   [junit4]   2> 2023665 INFO  (closeThreadPool-7667-thread-1) [n:127.0.0.1:37430_cw_%2Fu    ] o.a.s.c.s.i.ZkClientClusterStateProvider Cluster at 127.0.0.1:45881/solr ready
   [junit4]   2> 2023666 INFO  (closeThreadPool-7667-thread-1) [n:127.0.0.1:37430_cw_%2Fu    ] o.a.s.h.a.MetricsHistoryHandler No .system collection, keeping metrics history in memory.
   [junit4]   2> 2023722 INFO  (closeThreadPool-7667-thread-2) [n:127.0.0.1:42367_cw_%2Fu    ] o.a.s.m.r.SolrJmxReporter JMX monitoring for 'solr.node' (registry 'solr.node') enabled at server: com.sun.jmx.mbeanserver.JmxMBeanServer@137ff20a
   [junit4]   2> 2023723 INFO  (closeThreadPool-7667-thread-1) [n:127.0.0.1:37430_cw_%2Fu    ] o.a.s.m.r.SolrJmxReporter JMX monitoring for 'solr.node' (registry 'solr.node') enabled at server: com.sun.jmx.mbeanserver.JmxMBeanServer@137ff20a
   [junit4]   2> 2023740 INFO  (closeThreadPool-7667-thread-2) [n:127.0.0.1:42367_cw_%2Fu    ] o.a.s.m.r.SolrJmxReporter JMX monitoring for 'solr.jvm' (registry 'solr.jvm') enabled at server: com.sun.jmx.mbeanserver.JmxMBeanServer@137ff20a
   [junit4]   2> 2023740 INFO  (closeThreadPool-7667-thread-2) [n:127.0.0.1:42367_cw_%2Fu    ] o.a.s.m.r.SolrJmxReporter JMX monitoring for 'solr.jetty' (registry 'solr.jetty') enabled at server: com.sun.jmx.mbeanserver.JmxMBeanServer@137ff20a
   [junit4]   2> 2023742 INFO  (closeThreadPool-7667-thread-2) [n:127.0.0.1:42367_cw_%2Fu    ] o.a.s.c.CorePropertiesLocator Found 0 core definitions underneath /x1/jenkins/jenkins-slave/workspace/Lucene-Solr-NightlyTests-8.x/checkout/solr/build/solr-core/test/J0/../../../../../../../../../../../x1/jenkins/jenkins-slave/workspace/Lucene-Solr-NightlyTests-8.x/checkout/solr/build/solr-core/test/J0/temp/solr.cloud.BasicDistributedZkTest_7953E3FA6BE6649E-001/shard-2-001/cores
   [junit4]   2> 2023751 INFO  (closeThreadPool-7667-thread-1) [n:127.0.0.1:37430_cw_%2Fu    ] o.a.s.m.r.SolrJmxReporter JMX monitoring for 'solr.jvm' (registry 'solr.jvm') enabled at server: com.sun.jmx.mbeanserver.JmxMBeanServer@137ff20a
   [junit4]   2> 2023752 INFO  (closeThreadPool-7667-thread-1) [n:127.0.0.1:37430_cw_%2Fu    ] o.a.s.m.r.SolrJmxReporter JMX monitoring for 'solr.jetty' (registry 'solr.jetty') enabled at server: com.sun.jmx.mbeanserver.JmxMBeanServer@137ff20a
   [junit4]   2> 2023755 INFO  (closeThreadPool-7667-thread-1) [n:127.0.0.1:37430_cw_%2Fu    ] o.a.s.c.CorePropertiesLocator Found 0 core definitions underneath /x1/jenkins/jenkins-slave/workspace/Lucene-Solr-NightlyTests-8.x/checkout/solr/build/solr-core/test/J0/../../../../../../../../../../../x1/jenkins/jenkins-slave/workspace/Lucene-Solr-NightlyTests-8.x/checkout/solr/build/solr-core/test/J0/temp/solr.cloud.BasicDistributedZkTest_7953E3FA6BE6649E-001/shard-1-001/cores
   [junit4]   2> 2023872 INFO  (TEST-BasicDistributedZkTest.test-seed#[7953E3FA6BE6649E]) [    ] o.a.s.c.AbstractFullDistribZkTestBase create jetty 4 in directory /x1/jenkins/jenkins-slave/workspace/Lucene-Solr-NightlyTests-8.x/checkout/solr/build/solr-core/test/J0/temp/solr.cloud.BasicDistributedZkTest_7953E3FA6BE6649E-001/shard-4-001 of type NRT
   [junit4]   2> 2023873 WARN  (closeThreadPool-7667-thread-2) [    ] o.e.j.s.AbstractConnector Ignoring deprecated socket close linger time
   [junit4]   2> 2023873 INFO  (closeThreadPool-7667-thread-2) [    ] o.a.s.c.s.e.JettySolrRunner Start Jetty (original configured port=0)
   [junit4]   2> 2023873 INFO  (closeThreadPool-7667-thread-2) [    ] o.a.s.c.s.e.JettySolrRunner Trying to start Jetty on port 0 try number 1 ...
   [junit4]   2> 2023873 INFO  (closeThreadPool-7667-thread-2) [    ] o.e.j.s.Server jetty-9.4.14.v20181114; built: 2018-11-14T21:20:31.478Z; git: c4550056e785fb5665914545889f21dc136ad9e6; jvm 1.8.0_191-b12
   [junit4]   2> 2023875 INFO  (closeThreadPool-7667-thread-2) [    ] o.e.j.s.session DefaultSessionIdManager workerName=node0
   [junit4]   2> 2023875 INFO  (closeThreadPool-7667-thread-2) [    ] o.e.j.s.session No SessionScavenger set, using defaults
   [junit4]   2> 2023875 INFO  (closeThreadPool-7667-thread-2) [    ] o.e.j.s.session node0 Scavenging every 600000ms
   [junit4]   2> 2023875 INFO  (closeThreadPool-7667-thread-2) [    ] o.e.j.s.h.ContextHandler Started o.e.j.s.ServletContextHandler@497a3816{/cw_/u,null,AVAILABLE}
   [junit4]   2> 2023875 INFO  (closeThreadPool-7667-thread-2) [    ] o.e.j.s.AbstractConnector Started ServerConnector@459e632d{HTTP/1.1,[http/1.1, h2c]}{127.0.0.1:36080}
   [junit4]   2> 2023875 INFO  (closeThreadPool-7667-thread-2) [    ] o.e.j.s.Server Started @2023988ms
   [junit4]   2> 2023875 INFO  (closeThreadPool-7667-thread-2) [    ] o.a.s.c.s.e.JettySolrRunner Jetty properties: {solr.data.dir=/x1/jenkins/jenkins-slave/workspace/Lucene-Solr-NightlyTests-8.x/checkout/solr/build/solr-core/test/J0/temp/solr.cloud.BasicDistributedZkTest_7953E3FA6BE6649E-001/tempDir-001/jetty4, replicaType=NRT, solrconfig=solrconfig.xml, hostContext=/cw_/u, hostPort=36080, coreRootDirectory=/x1/jenkins/jenkins-slave/workspace/Lucene-Solr-NightlyTests-8.x/checkout/solr/build/solr-core/test/J0/temp/solr.cloud.BasicDistributedZkTest_7953E3FA6BE6649E-001/shard-4-001/cores}
   [junit4]   2> 2023876 ERROR (closeThreadPool-7667-thread-2) [    ] o.a.s.u.StartupLoggingUtils Missing Java Option solr.log.dir. Logging may be missing or incomplete.
   [junit4]   2> 2023876 INFO  (closeThreadPool-7667-thread-2) [    ] o.a.s.s.SolrDispatchFilter Using logger factory org.apache.logging.slf4j.Log4jLoggerFactory
   [junit4]   2> 2023876 INFO  (closeThreadPool-7667-thread-2) [    ] o.a.s.s.SolrDispatchFilter  ___      _       Welcome to Apache Solr™ version 8.1.0
   [junit4]   2> 2023876 INFO  (closeThreadPool-7667-thread-2) [    ] o.a.s.s.SolrDispatchFilter / __| ___| |_ _   Starting in cloud mode on port null
   [junit4]   2> 2023876 INFO  (closeThreadPool-7667-thread-2) [    ] o.a.s.s.SolrDispatchFilter \__ \/ _ \ | '_|  Install dir: null
   [junit4]   2> 2023876 INFO  (closeThreadPool-7667-thread-2) [    ] o.a.s.s.SolrDispatchFilter |___/\___/_|_|    Start time: 2019-04-10T02:18:33.240Z
   [junit4]   2> 2023878 INFO  (zkConnectionManagerCallback-7710-thread-1) [    ] o.a.s.c.c.ConnectionManager zkClient has connected
   [junit4]   2> 2023879 INFO  (closeThreadPool-7667-thread-2) [    ] o.a.s.s.SolrDispatchFilter Loading solr.xml from SolrHome (not found in ZooKeeper)
   [junit4]   2> 2023879 INFO  (closeThreadPool-7667-thread-2) [    ] o.a.s.c.SolrXmlConfig Loading container configuration from /x1/jenkins/jenkins-slave/workspace/Lucene-Solr-NightlyTests-8.x/checkout/solr/build/solr-core/test/J0/temp/solr.cloud.BasicDistributedZkTest_7953E3FA6BE6649E-001/shard-4-001/solr.xml
   [junit4]   2> 2023884 INFO  (closeThreadPool-7667-thread-2) [    ] o.a.s.c.SolrXmlConfig Configuration parameter autoReplicaFailoverWorkLoopDelay is ignored
   [junit4]   2> 2023884 INFO  (closeThreadPool-7667-thread-2) [    ] o.a.s.c.SolrXmlConfig Configuration parameter autoReplicaFailoverBadNodeExpiration is ignored
   [junit4]   2> 2023886 INFO  (closeThreadPool-7667-thread-2) [    ] o.a.s.c.SolrXmlConfig MBean server found: com.sun.jmx.mbeanserver.JmxMBeanServer@137ff20a, but no JMX reporters were configured - adding default JMX reporter.
   [junit4]   2> 2023911 INFO  (closeThreadPool-7667-thread-3) [    ] o.a.s.h.c.HttpShardHandlerFactory Host whitelist initialized: WhitelistHostChecker [whitelistHosts=null, whitelistHostCheckingEnabled=false]
   [junit4]   2> 2023913 WARN  (closeThreadPool-7667-thread-3) [    ] o.e.j.u.s.S.config No Client EndPointIdentificationAlgorithm configured for SslContextFactory@3903724d[provider=null,keyStore=null,trustStore=null]
   [junit4]   2> 2023917 WARN  (closeThreadPool-7667-thread-3) [    ] o.e.j.u.s.S.config No Client EndPointIdentificationAlgorithm configured for SslContextFactory@146c804a[provider=null,keyStore=null,trustStore=null]
   [junit4]   2> 2023918 INFO  (closeThreadPool-7667-thread-3) [    ] o.a.s.c.ZkContainer Zookeeper client=127.0.0.1:45881/solr
   [junit4]   2> 2023919 INFO  (zkConnectionManagerCallback-7717-thread-1) [    ] o.a.s.c.c.ConnectionManager zkClient has connected
   [junit4]   2> 2023922 INFO  (zkConnectionManagerCallback-7719-thread-1) [    ] o.a.s.c.c.ConnectionManager zkClient has connected
   [junit4]   2> 2023927 INFO  (closeThreadPool-7667-thread-3) [n:127.0.0.1:43553_cw_%2Fu    ] o.a.s.c.c.ZkStateReader Updated live nodes from ZooKeeper... (0) -> (3)
   [junit4]   2> 2023932 INFO  (closeThreadPool-7667-thread-3) [n:127.0.0.1:43553_cw_%2Fu    ] o.a.s.c.ZkController Publish node=127.0.0.1:43553_cw_%2Fu as DOWN
   [junit4]   2> 2023933 INFO  (closeThreadPool-7667-thread-3) [n:127.0.0.1:43553_cw_%2Fu    ] o.a.s.c.TransientSolrCoreCacheDefault Allocating transient cache for 4 transient cores
   [junit4]   2> 2023933 INFO  (closeThreadPool-7667-thread-3) [n:127.0.0.1:43553_cw_%2Fu    ] o.a.s.c.ZkController Register node as live in ZooKeeper:/live_nodes/127.0.0.1:43553_cw_%2Fu
   [junit4]   2> 2023934 INFO  (zkCallback-7653-thread-1) [    ] o.a.s.c.c.ZkStateReader Updated live nodes from ZooKeeper... (3) -> (4)
   [junit4]   2> 2023934 INFO  (zkCallback-7646-thread-3) [    ] o.a.s.c.c.ZkStateReader Updated live nodes from ZooKeeper... (3) -> (4)
   [junit4]   2> 2023934 INFO  (zkCallback-7688-thread-1) [    ] o.a.s.c.c.ZkStateReader Updated live nodes from ZooKeeper... (3) -> (4)
   [junit4]   2> 2023940 INFO  (zkCallback-7718-thread-1) [    ] o.a.s.c.c.ZkStateReader Updated live nodes from ZooKeeper... (3) -> (4)
   [junit4]   2> 2023941 INFO  (zkCallback-7665-thread-1) [    ] o.a.s.c.c.ZkStateReader Updated live nodes from ZooKeeper... (3) -> (4)
   [junit4]   2> 2023941 INFO  (zkCallback-7686-thread-1) [    ] o.a.s.c.c.ZkStateReader Updated live nodes from ZooKeeper... (3) -> (4)
   [junit4]   2> 2023941 INFO  (zkCallback-7704-thread-1) [    ] o.a.s.c.c.ZkStateReader Updated live nodes from ZooKeeper... (3) -> (4)
   [junit4]   2> 2023941 INFO  (zkCallback-7703-thread-1) [    ] o.a.s.c.c.ZkStateReader Updated live nodes from ZooKeeper... (3) -> (4)
   [junit4]   2> 2023964 INFO  (zkConnectionManagerCallback-7726-thread-1) [    ] o.a.s.c.c.ConnectionManager zkClient has connected
   [junit4]   2> 2023965 INFO  (closeThreadPool-7667-thread-3) [n:127.0.0.1:43553_cw_%2Fu    ] o.a.s.c.c.ZkStateReader Updated live nodes from ZooKeeper... (0) -> (4)
   [junit4]   2> 2023966 INFO  (closeThreadPool-7667-thread-3) [n:127.0.0.1:43553_cw_%2Fu    ] o.a.s.c.s.i.ZkClientClusterStateProvider Cluster at 127.0.0.1:45881/solr ready
   [junit4]   2> 2023967 INFO  (closeThreadPool-7667-thread-3) [n:127.0.0.1:43553_cw_%2Fu    ] o.a.s.h.a.MetricsHistoryHandler No .system collection, keeping metrics history in memory.
   [junit4]   2> 2023996 INFO  (closeThreadPool-7667-thread-3) [n:127.0.0.1:43553_cw_%2Fu    ] o.a.s.m.r.SolrJmxReporter JMX monitoring for 'solr.node' (registry 'solr.node') enabled at server: com.sun.jmx.mbeanserver.JmxMBeanServer@137ff20a
   [junit4]   2> 2024013 INFO  (closeThreadPool-7667-thread-3) [n:127.0.0.1:43553_cw_%2Fu    ] o.a.s.m.r.SolrJmxReporter JMX monitoring for 'solr.jvm' (registry 'solr.jvm') enabled at server: com.sun.jmx.mbeanserver.JmxMBeanServer@137ff20a
   [junit4]   2> 2024013 INFO  (closeThreadPool-7667-thread-3) [n:127.0.0.1:43553_cw_%2Fu    ] o.a.s.m.r.SolrJmxReporter JMX monitoring for 'solr.jetty' (registry 'solr.jetty') enabled at server: com.sun.jmx.mbeanserver.JmxMBeanServer@137ff20a
   [junit4]   2> 2024015 INFO  (closeThreadPool-7667-thread-3) [n:127.0.0.1:43553_cw_%2Fu    ] o.a.s.c.CorePropertiesLocator Found 0 core definitions underneath /x1/jenkins/jenkins-slave/workspace/Lucene-Solr-NightlyTests-8.x/checkout/solr/build/solr-core/test/J0/../../../../../../../../../../../x1/jenkins/jenkins-slave/workspace/Lucene-Solr-NightlyTests-8.x/checkout/solr/build/solr-core/test/J0/temp/solr.cloud.BasicDistributedZkTest_7953E3FA6BE6649E-001/shard-3-001/cores
   [junit4]   2> 2024234 INFO  (closeThreadPool-7667-thread-2) [    ] o.a.s.h.c.HttpShardHandlerFactory Host whitelist initialized: WhitelistHostChecker [whitelistHosts=null, whitelistHostCheckingEnabled=false]
   [junit4]   2> 2024236 WARN  (closeThreadPool-7667-thread-2) [    ] o.e.j.u.s.S.config No Client EndPointIdentificationAlgorithm configured for SslContextFactory@71786477[provider=null,keyStore=null,trustStore=null]
   [junit4]   2> 2024241 WARN  (closeThreadPool-7667-thread-2) [    ] o.e.j.u.s.S.config No Client EndPointIdentificationAlgorithm configured for SslContextFactory@2ec7a730[provider=null,keyStore=null,trustStore=null]
   [junit4]   2> 2024242 INFO  (closeThreadPool-7667-thread-2) [    ] o.a.s.c.ZkContainer Zookeeper client=127.0.0.1:45881/solr
   [junit4]   2> 2024244 INFO  (zkConnectionManagerCallback-7733-thread-1) [    ] o.a.s.c.c.ConnectionManager zkClient has connected
   [junit4]   2> 2024251 INFO  (zkConnectionManagerCallback-7735-thread-1) [    ] o.a.s.c.c.ConnectionManager zkClient has connected
   [junit4]   2> 2024268 INFO  (closeThreadPool-7667-thread-2) [    ] o.a.s.c.c.ZkStateReader Updated live nodes from ZooKeeper... (0) -> (4)
   [junit4]   2> 2024273 INFO  (closeThreadPool-7667-thread-2) [    ] o.a.s.c.ZkController Publish node=127.0.0.1:36080_cw_%2Fu as DOWN
   [junit4]   2> 2024276 INFO  (closeThreadPool-7667-thread-2) [    ] o.a.s.c.TransientSolrCoreCacheDefault Allocating transient cache for 4 transient cores
   [junit4]   2> 2024276 INFO  (closeThreadPool-7667-thread-2) [    ] o.a.s.c.ZkController Register node as live in ZooKeeper:/live_nodes/127.0.0.1:36080_cw_%2Fu
   [junit4]   2> 2024279 INFO  (zkCallback-7665-thread-1) [    ] o.a.s.c.c.ZkStateReader Updated live nodes from ZooKeeper... (4) -> (5)
   [junit4]   2> 2024279 INFO  (zkCallback-7653-thread-1) [    ] o.a.s.c.c.ZkStateReader Updated live nodes from ZooKeeper... (4) -> (5)
   [junit4]   2> 2024279 INFO  (zkCallback-7703-thread-1) [    ] o.a.s.c.c.ZkStateReader Updated live nodes from ZooKeeper... (4) -> (5)
   [junit4]   2> 2024279 INFO  (zkCallback-7688-thread-1) [    ] o.a.s.c.c.ZkStateReader Updated live nodes from ZooKeeper... (4) -> (5)
   [junit4]   2> 2024279 INFO  (zkCallback-7646-thread-3) [    ] o.a.s.c.c.ZkStateReader Updated live nodes from ZooKeeper... (4) -> (5)
   [junit4]   2> 2024279 INFO  (zkCallback-7704-thread-1) [    ] o.a.s.c.c.ZkStateReader Updated live nodes from ZooKeeper... (4) -> (5)
   [junit4]   2> 2024279 INFO  (zkCallback-7686-thread-1) [    ] o.a.s.c.c.ZkStateReader Updated live nodes from ZooKeeper... (4) -> (5)
   [junit4]   2> 2024279 INFO  (zkCallback-7718-thread-1) [    ] o.a.s.c.c.ZkStateReader Updated live nodes from ZooKeeper... (4) -> (5)
   [junit4]   2> 2024280 INFO  (zkCallback-7725-thread-1) [    ] o.a.s.c.c.ZkStateReader Updated live nodes from ZooKeeper... (4) -> (5)
   [junit4]   2> 2024280 INFO  (zkCallback-7734-thread-1) [    ] o.a.s.c.c.ZkStateReader Updated live nodes from ZooKeeper... (4) -> (5)
   [junit4]   2> 2024311 INFO  (zkConnectionManagerCallback-7742-thread-1) [    ] o.a.s.c.c.ConnectionManager zkClient has connected
   [junit4]   2> 2024312 INFO  (closeThreadPool-7667-thread-2) [    ] o.a.s.c.c.ZkStateReader Updated live nodes from ZooKeeper... (0) -> (5)
   [junit4]   2> 2024314 INFO  (closeThreadPool-7667-thread-2) [    ] o.a.s.c.s.i.ZkClientClusterStateProvider Cluster at 127.0.0.1:45881/solr ready
   [junit4]   2> 2024314 INFO  (closeThreadPool-7667-thread-2) [    ] o.a.s.h.a.MetricsHistoryHandler No .system collection, keeping metrics history in memory.
   [junit4]   2> 2024345 INFO  (closeThreadPool-7667-thread-2) [    ] o.a.s.m.r.SolrJmxReporter JMX monitoring for 'solr.node' (registry 'solr.node') enabled at server: com.sun.jmx.mbeanserver.JmxMBeanServer@137ff20a
   [junit4]   2> 2024361 INFO  (closeThreadPool-7667-thread-2) [    ] o.a.s.m.r.SolrJmxReporter JMX monitoring for 'solr.jvm' (registry 'solr.jvm') enabled at server: com.sun.jmx.mbeanserver.JmxMBeanServer@137ff20a
   [junit4]   2> 2024362 INFO  (closeThreadPool-7667-thread-2) [    ] o.a.s.m.r.SolrJmxReporter JMX monitoring for 'solr.jetty' (registry 'solr.jetty') enabled at server: com.sun.jmx.mbeanserver.JmxMBeanServer@137ff20a
   [junit4]   2> 2024363 INFO  (closeThreadPool-7667-thread-2) [    ] o.a.s.c.CorePropertiesLocator Found 0 core definitions underneath /x1/jenkins/jenkins-slave/workspace/Lucene-Solr-NightlyTests-8.x/checkout/solr/build/solr-core/test/J0/temp/solr.cloud.BasicDistributedZkTest_7953E3FA6BE6649E-001/shard-4-001/cores
   [junit4]   2> 2024451 INFO  (qtp1551901270-37673) [n:127.0.0.1:36080_cw_%2Fu    ] o.a.s.h.a.CollectionsHandler Invoked Collection Action :addreplica with params node=127.0.0.1:42367_cw_%252Fu&action=ADDREPLICA&collection=collection1&shard=shard1&type=NRT&wt=javabin&version=2 and sendToOCPQueue=true
   [junit4]   2> 2024453 INFO  (qtp1551901270-37672) [n:127.0.0.1:36080_cw_%2Fu    ] o.a.s.h.a.CollectionsHandler Invoked Collection Action :addreplica with params node=127.0.0.1:43553_cw_%252Fu&action=ADDREPLICA&collection=collection1&shard=shard2&type=NRT&wt=javabin&version=2 and sendToOCPQueue=true
   [junit4]   2> 2024454 INFO  (qtp1551901270-37671) [n:127.0.0.1:36080_cw_%2Fu    ] o.a.s.h.a.CollectionsHandler Invoked Collection Action :addreplica with params node=127.0.0.1:37430_cw_%252Fu&action=ADDREPLICA&collection=collection1&shard=shard2&type=NRT&wt=javabin&version=2 and sendToOCPQueue=true
   [junit4]   2> 2024454 INFO  (qtp1551901270-37675) [n:127.0.0.1:36080_cw_%2Fu    ] o.a.s.h.a.CollectionsHandler Invoked Collection Action :addreplica with params node=127.0.0.1:36080_cw_%252Fu&action=ADDREPLICA&collection=collection1&shard=shard1&type=NRT&wt=javabin&version=2 and sendToOCPQueue=true
   [junit4]   2> 2024459 INFO  (OverseerCollectionConfigSetProcessor-73106003766804484-127.0.0.1:41095_cw_%2Fu-n_0000000000) [n:127.0.0.1:41095_cw_%2Fu    ] o.a.s.c.OverseerTaskQueue Response ZK path: /overseer/collection-queue-work/qnr-0000000002 doesn't exist.  Requestor may have disconnected from ZooKeeper
   [junit4]   2> 2024465 INFO  (OverseerThreadFactory-8188-thread-4-processing-n:127.0.0.1:41095_cw_%2Fu) [n:127.0.0.1:41095_cw_%2Fu c:collection1 s:shard2  ] o.a.s.c.a.c.AddReplicaCmd Node Identified 127.0.0.1:43553_cw_%2Fu for creating new replica of shard shard2 for collection collection1
   [junit4]   2> 2024465 INFO  (OverseerThreadFactory-8188-thread-3-processing-n:127.0.0.1:41095_cw_%2Fu) [n:127.0.0.1:41095_cw_%2Fu c:collection1 s:shard1  ] o.a.s.c.a.c.AddReplicaCmd Node Identified 127.0.0.1:42367_cw_%2Fu for creating new replica of shard shard1 for collection collection1
   [junit4]   2> 2024468 INFO  (OverseerThreadFactory-8188-thread-4-processing-n:127.0.0.1:41095_cw_%2Fu) [n:127.0.0.1:41095_cw_%2Fu c:collection1 s:shard2  ] o.a.s.c.a.c.AddReplicaCmd Returning CreateReplica command.
   [junit4]   2> 2024469 INFO  (OverseerThreadFactory-8188-thread-3-processing-n:127.0.0.1:41095_cw_%2Fu) [n:127.0.0.1:41095_cw_%2Fu c:collection1 s:shard1  ] o.a.s.c.a.c.AddReplicaCmd Returning CreateReplica command.
   [junit4]   2> 2024484 INFO  (qtp1593382716-37644) [n:127.0.0.1:43553_cw_%2Fu    x:collection1_shard2_replica_n1] o.a.s.h.a.CoreAdminOperation core create command qt=/admin/cores&collection.configName=conf1&name=collection1_shard2_replica_n1&action=CREATE&collection=collection1&shard=shard2&wt=javabin&version=2&replicaType=NRT
   [junit4]   2> 2024489 INFO  (qtp1209393835-37607) [n:127.0.0.1:42367_cw_%2Fu    x:collection1_shard1_replica_n2] o.a.s.h.a.CoreAdminOperation core create command qt=/admin/cores&collection.configName=conf1&name=collection1_shard1_replica_n2&action=CREATE&collection=collection1&shard=shard1&wt=javabin&version=2&replicaType=NRT
   [junit4]   2> 2025510 INFO  (qtp1593382716-37644) [n:127.0.0.1:43553_cw_%2Fu c:collection1 s:shard2  x:collection1_shard2_replica_n1] o.a.s.c.SolrConfig Using Lucene MatchVersion: 8.1.0
   [junit4]   2> 2025510 INFO  (qtp1209393835-37607) [n:127.0.0.1:42367_cw_%2Fu c:collection1 s:shard1  x:collection1_shard1_replica_n2] o.a.s.c.SolrConfig Using Lucene MatchVersion: 8.1.0
   [junit4]   2> 2025526 INFO  (qtp1593382716-37644) [n:127.0.0.1:43553_cw_%2Fu c:collection1 s:shard2  x:collection1_shard2_replica_n1] o.a.s.s.IndexSchema [collection1_shard2_replica_n1] Schema name=test
   [junit4]   2> 2025534 INFO  (qtp1209393835-37607) [n:127.0.0.1:42367_cw_%2Fu c:collection1 s:shard1  x:collection1_shard1_replica_n2] o.a.s.s.IndexSchema [collection1_shard1_replica_n2] Schema name=test
   [junit4]   2> 2025691 INFO  (qtp1593382716-37644) [n:127.0.0.1:43553_cw_%2Fu c:collection1 s:shard2  x:collection1_shard2_replica_n1] o.a.s.s.IndexSchema Loaded schema test/1.0 with uniqueid field id
   [junit4]   2> 2025706 INFO  (qtp1209393835-37607) [n:127.0.0.1:42367_cw_%2Fu c:collection1 s:shard1  x:collection1_shard1_replica_n2] o.a.s.s.IndexSchema Loaded schema test/1.0 with uniqueid field id
   [junit4]   2> 2025718 INFO  (qtp1593382716-37644) [n:127.0.0.1:43553_cw_%2Fu c:collection1 s:shard2  x:collection1_shard2_replica_n1] o.a.s.c.CoreContainer Creating SolrCore 'collection1_shard2_replica_n1' using configuration from collection collection1, trusted=true
   [junit4]   2> 2025718 INFO  (qtp1593382716-37644) [n:127.0.0.1:43553_cw_%2Fu c:collection1 s:shard2  x:collection1_shard2_replica_n1] o.a.s.m.r.SolrJmxReporter JMX monitoring for 'solr.core.collection1.shard2.replica_n1' (registry 'solr.core.collection1.shard2.replica_n1') enabled at server: com.sun.jmx.mbeanserver.JmxMBeanServer@137ff20a
   [junit4]   2> 2025719 INFO  (qtp1593382716-37644) [n:127.0.0.1:43553_cw_%2Fu c:collection1 s:shard2  x:collection1_shard2_replica_n1] o.a.s.c.SolrCore [[collection1_shard2_replica_n1] ] Opening new SolrCore at [/x1/jenkins/jenkins-slave/workspace/Lucene-Solr-NightlyTests-8.x/checkout/solr/build/solr-core/test/J0/temp/solr.cloud.BasicDistributedZkTest_7953E3FA6BE6649E-001/shard-3-001/cores/collection1_shard2_replica_n1], dataDir=[/x1/jenkins/jenkins-slave/workspace/Lucene-Solr-NightlyTests-8.x/checkout/solr/build/solr-core/test/J0/../../../../../../../../../../../x1/jenkins/jenkins-slave/workspace/Lucene-Solr-NightlyTests-8.x/checkout/solr/build/solr-core/test/J0/temp/solr.cloud.BasicDistributedZkTest_7953E3FA6BE6649E-001/shard-3-001/cores/collection1_shard2_replica_n1/data/]
   [junit4]   2> 2025741 INFO  (qtp1593382716-37644) [n:127.0.0.1:43553_cw_%2Fu c:collection1 s:shard2  x:collection1_shard2_replica_n1] o.a.s.u.RandomMergePolicy RandomMergePolicy wrapping class org.apache.lucene.index.AlcoholicMergePolicy: [AlcoholicMergePolicy: minMergeSize=0, mergeFactor=10, maxMergeSize=1621904239, maxMergeSizeForForcedMerge=9223372036854775807, calibrateSizeByDeletes=true, maxMergeDocs=2147483647, maxCFSSegmentSizeMB=8.796093022207999E12, noCFSRatio=0.1]
   [junit4]   2> 2025745 WARN  (qtp1593382716-37644) [n:127.0.0.1:43553_cw_%2Fu c:collection1 s:shard2  x:collection1_shard2_replica_n1] o.a.s.c.RequestHandlers INVALID paramSet a in requestHandler {type = requestHandler,name = /dump,class = DumpRequestHandler,attributes = {initParams=a, name=/dump, class=DumpRequestHandler},args = {defaults={a=A,b=B}}}
   [junit4]   2> 2025760 INFO  (qtp1209393835-37607) [n:127.0.0.1:42367_cw_%2Fu c:collection1 s:shard1  x:collection1_shard1_replica_n2] o.a.s.c.CoreContainer Creating SolrCore 'collection1_shard1_replica_n2' using configuration from collection collection1, trusted=true
   [junit4]   2> 2025761 INFO  (qtp1209393835-37607) [n:127.0.0.1:42367_cw_%2Fu c:collection1 s:shard1  x:collection1_shard1_replica_n2] o.a.s.m.r.SolrJmxReporter JMX monitoring for 'solr.core.collection1.shard1.replica_n2' (registry 'solr.core.collection1.shard1.replica_n2') enabled at server: com.sun.jmx.mbeanserver.JmxMBeanServer@137ff20a
   [junit4]   2> 2025762 INFO  (qtp1209393835-37607) [n:127.0.0.1:42367_cw_%2Fu c:collection1 s:shard1  x:collection1_shard1_replica_n2] o.a.s.c.SolrCore [[collection1_shard1_replica_n2] ] Opening new SolrCore at [/x1/jenkins/jenkins-slave/workspace/Lucene-Solr-NightlyTests-8.x/checkout/solr/build/solr-core/test/J0/temp/solr.cloud.BasicDistributedZkTest_7953E3FA6BE6649E-001/shard-2-001/cores/collection1_shard1_replica_n2], dataDir=[/x1/jenkins/jenkins-slave/workspace/Lucene-Solr-NightlyTests-8.x/checkout/solr/build/solr-core/test/J0/../../../../../../../../../../../x1/jenkins/jenkins-slave/workspace/Lucene-Solr-NightlyTests-8.x/checkout/solr/build/solr-core/test/J0/temp/solr.cloud.BasicDistributedZkTest_7953E3FA6BE6649E-001/shard-2-001/cores/collection1_shard1_replica_n2/data/]
   [junit4]   2> 2025766 INFO  (qtp1209393835-37607) [n:127.0.0.1:42367_cw_%2Fu c:collection1 s:shard1  x:collection1_shard1_replica_n2] o.a.s.u.RandomMergePolicy RandomMergePolicy wrapping class org.apache.lucene.index.AlcoholicMergePolicy: [AlcoholicMergePolicy: minMergeSize=0, mergeFactor=10, maxMergeSize=1621904239, maxMergeSizeForForcedMerge=9223372036854775807, calibrateSizeByDeletes=true, maxMergeDocs=2147483647, maxCFSSegmentSizeMB=8.796093022207999E12, noCFSRatio=0.1]
   [junit4]   2> 2025773 WARN  (qtp1209393835-37607) [n:127.0.0.1:42367_cw_%2Fu c:collection1 s:shard1  x:collection1_shard1_replica_n2] o.a.s.c.RequestHandlers INVALID paramSet a in requestHandler {type = requestHandler,name = /dump,class = DumpRequestHandler,attributes = {initParams=a, name=/dump, class=DumpRequestHandler},args = {defaults={a=A,b=B}}}
   [junit4]   2> 2025843 INFO  (qtp1593382716-37644) [n:127.0.0.1:43553_cw_%2Fu c:collection1 s:shard2  x:collection1_shard2_replica_n1] o.a.s.u.UpdateHandler Using UpdateLog implementation: org.apache.solr.update.UpdateLog
   [junit4]   2> 2025843 INFO  (qtp1593382716-37644) [n:127.0.0.1:43553_cw_%2Fu c:collection1 s:shard2  x:collection1_shard2_replica_n1] o.a.s.u.UpdateLog Initializing UpdateLog: dataDir= defaultSyncLevel=FLUSH numRecordsToKeep=100 maxNumLogsToKeep=10 numVersionBuckets=65536
   [junit4]   2> 2025847 INFO  (qtp1593382716-37644) [n:127.0.0.1:43553_cw_%2Fu c:collection1 s:shard2  x:collection1_shard2_replica_n1] o.a.s.u.CommitTracker Hard AutoCommit: disabled
   [junit4]   2> 2025847 INFO  (qtp1593382716-37644) [n:127.0.0.1:43553_cw_%2Fu c:collection1 s:shard2  x:collection1_shard2_replica_n1] o.a.s.u.CommitTracker Soft AutoCommit: disabled
   [junit4]   2> 2025848 INFO  (qtp1593382716-37644) [n:127.0.0.1:43553_cw_%2Fu c:collection1 s:shard2  x:collection1_shard2_replica_n1] o.a.s.u.RandomMergePolicy RandomMergePolicy wrapping class org.apache.lucene.index.TieredMergePolicy: [TieredMergePolicy: maxMergeAtOnce=3, maxMergeAtOnceExplicit=9, maxMergedSegmentMB=75.861328125, floorSegmentMB=1.556640625, forceMergeDeletesPctAllowed=3.940884174935909, segmentsPerTier=40.0, maxCFSSegmentSizeMB=8.796093022207999E12, noCFSRatio=0.0, deletesPctAllowed=23.39088656989974
   [junit4]   2> 2025850 INFO  (qtp1593382716-37644) [n:127.0.0.1:43553_cw_%2Fu c:collection1 s:shard2  x:collection1_shard2_replica_n1] o.a.s.s.SolrIndexSearcher Opening [Searcher@5e5fbde8[collection1_shard2_replica_n1] main]
   [junit4]   2> 2025852 INFO  (qtp1593382716-37644) [n:127.0.0.1:43553_cw_%2Fu c:collection1 s:shard2  x:collection1_shard2_replica_n1] o.a.s.r.ManagedResourceStorage Configured ZooKeeperStorageIO with znodeBase: /configs/conf1
   [junit4]   2> 2025854 INFO  (qtp1593382716-37644) [n:127.0.0.1:43553_cw_%2Fu c:collection1 s:shard2  x:collection1_shard2_replica_n1] o.a.s.r.ManagedResourceStorage Loaded null at path _rest_managed.json using ZooKeeperStorageIO:path=/configs/conf1
   [junit4]   2> 2025854 INFO  (qtp1593382716-37644) [n:127.0.0.1:43553_cw_%2Fu c:collection1 s:shard2  x:collection1_shard2_replica_n1] o.a.s.h.ReplicationHandler Commits will be reserved for 10000ms.
   [junit4]   2> 2025855 INFO  (qtp1593382716-37644) [n:127.0.0.1:43553_cw_%2Fu c:collection1 s:shard2  x:collection1_shard2_replica_n1] o.a.s.u.UpdateLog Could not find max version in index or recent updates, using new clock 1630391726473478144
   [junit4]   2> 2025859 INFO  (searcherExecutor-8234-thread-1-processing-n:127.0.0.1:43553_cw_%2Fu x:collection1_shard2_replica_n1 c:collection1 s:shard2) [n:127.0.0.1:43553_cw_%2Fu c:collection1 s:shard2  x:collection1_shard2_replica_n1] o.a.s.c.SolrCore [collection1_shard2_replica_n1] Registered new searcher Searcher@5e5fbde8[collection1_shard2_replica_n1] main{ExitableDirectoryReader(UninvertingDirectoryReader())}
   [junit4]   2> 2025865 INFO  (qtp1593382716-37644) [n:127.0.0.1:43553_cw_%2Fu c:collection1 s:shard2  x:collection1_shard2_replica_n1] o.a.s.c.ZkShardTerms Successful update of terms at /collections/collection1/terms/shard2 to Terms{values={core_node3=0}, version=0}
   [junit4]   2> 2025866 INFO  (qtp1593382716-37644) [n:127.0.0.1:43553_cw_%2Fu c:collection1 s:shard2  x:collection1_shard2_replica_n1] o.a.s.c.ShardLeaderElectionContextBase make sure parent is created /collections/collection1/leaders/shard2
   [junit4]   2> 2025870 INFO  (qtp1593382716-37644) [n:127.0.0.1:43553_cw_%2Fu c:collection1 s:shard2  x:collection1_shard2_replica_n1] o.a.s.c.ShardLeaderElectionContext Enough replicas found to continue.
   [junit4]   2> 2025870 INFO  (qtp1593382716-37644) [n:127.0.0.1:43553_cw_%2Fu c:collection1 s:shard2  x:collection1_shard2_replica_n1] o.a.s.c.ShardLeaderElectionContext I may be the new leader - try and sync
   [junit4]   2> 2025870 INFO  (qtp1593382716-37644) [n:127.0.0.1:43553_cw_%2Fu c:collection1 s:shard2  x:collection1_shard2_replica_n1] o.a.s.c.SyncStrategy Sync replicas to http://127.0.0.1:43553/cw_/u/collection1_shard2_replica_n1/
   [junit4]   2> 2025871 INFO  (qtp1593382716-37644) [n:127.0.0.1:43553_cw_%2Fu c:collection1 s:shard2  x:collection1_shard2_replica_n1] o.a.s.c.SyncStrategy Sync Success - now sync replicas to me
   [junit4]   2> 2025871 INFO  (qtp1593382716-37644) [n:127.0.0.1:43553_cw_%2Fu c:collection1 s:shard2  x:collection1_shard2_replica_n1] o.a.s.c.SyncStrategy http://127.0.0.1:43553/cw_/u/collection1_shard2_replica_n1/ has no replicas
   [junit4]   2> 2025871 INFO  (qtp1593382716-37644) [n:127.0.0.1:43553_cw_%2Fu c:collection1 s:shard2  x:collection1_shard2_replica_n1] o.a.s.c.ShardLeaderElectionContextBase Creating leader registration node /collections/collection1/leaders/shard2/leader after winning as /collections/collection1/leader_elect/shard2/election/73106003766804499-core_node3-n_0000000000
   [junit4]   2> 2025874 INFO  (qtp1593382716-37644) [n:127.0.0.1:43553_cw_%2Fu c:collection1 s:shard2  x:collection1_shard2_replica_n1] o.a.s.c.ShardLeaderElectionContext I am the new leader: http://127.0.0.1:43553/cw_/u/collection1_shard2_replica_n1/ shard2
   [junit4]   2> 2025901 INFO  (qtp1209393835-37607) [n:127.0.0.1:42367_cw_%2Fu c:collection1 s:shard1  x:collection1_shard1_replica_n2] o.a.s.u.UpdateHandler Using UpdateLog implementation: org.apache.solr.update.UpdateLog
   [junit4]   2> 2025901 INFO  (qtp1209393835-37607) [n:127.0.0.1:42367_cw_%2Fu c:collection1 s:shard1  x:collection1_shard1_replica_n2] o.a.s.u.UpdateLog Initializing UpdateLog: dataDir= defaultSyncLevel=FLUSH numRecordsToKeep=100 maxNumLogsToKeep=10 numVersionBuckets=65536
   [junit4]   2> 2025904 INFO  (qtp1209393835-37607) [n:127.0.0.1:42367_cw_%2Fu c:collection1 s:shard1  x:collection1_shard1_replica_n2] o.a.s.u.CommitTracker Hard AutoCommit: disabled
   [junit4]   2> 2025904 INFO  (qtp1209393835-37607) [n:127.0.0.1:42367_cw_%2Fu c:collection1 s:shard1  x:collection1_shard1_replica_n2] o.a.s.u.CommitTracker Soft AutoCommit: disabled
   [junit4]   2> 2025905 INFO  (qtp1209393835-37607) [n:127.0.0.1:42367_cw_%2Fu c:collection1 s:shard1  x:collection1_shard1_replica_n2] o.a.s.u.RandomMergePolicy RandomMergePolicy wrapping class org.apache.lucene.index.TieredMergePolicy: [TieredMergePolicy: maxMergeAtOnce=3, maxMergeAtOnceExplicit=9, maxMergedSegmentMB=75.861328125, floorSegmentMB=1.556640625, forceMergeDeletesPctAllowed=3.940884174935909, segmentsPerTier=40.0, maxCFSSegmentSizeMB=8.796093022207999E12, noCFSRatio=0.0, deletesPctAllowed=23.39088656989974
   [junit4]   2> 2025906 INFO  (qtp1209393835-37607) [n:127.0.0.1:42367_cw_%2Fu c:collection1 s:shard1  x:collection1_shard1_replica_n2] o.a.s.s.SolrIndexSearcher Opening [Searcher@6f480d34[collection1_shard1_replica_n2] main]
   [junit4]   2> 2025907 INFO  (qtp1209393835-37607) [n:127.0.0.1:42367_cw_%2Fu c:collection1 s:shard1  x:collection1_shard1_replica_n2] o.a.s.r.ManagedResourceStorage Configured ZooKeeperStorageIO with znodeBase: /configs/conf1
   [junit4]   2> 2025908 INFO  (qtp1209393835-37607) [n:127.0.0.1:42367_cw_%2Fu c:collection1 s:shard1  x:collection1_shard1_replica_n2] o.a.s.r.ManagedResourceStorage Loaded null at path _rest_managed.json using ZooKeeperStorageIO:path=/configs/conf1
   [junit4]   2> 2025909 INFO  (qtp1209393835-37607) [n:127.0.0.1:42367_cw_%2Fu c:collection1 s:shard1  x:collection1_shard1_replica_n2] o.a.s.h.ReplicationHandler Commits will be reserved for 10000ms.
   [junit4]   2> 2025909 INFO  (qtp1209393835-37607) [n:127.0.0.1:42367_cw_%2Fu c:collection1 s:shard1  x:collection1_shard1_replica_n2] o.a.s.u.UpdateLog Could not find max version in index or recent updates, using new clock 1630391726530101248
   [junit4]   2> 2025912 INFO  (searcherExecutor-8235-thread-1-processing-n:127.0.0.1:42367_cw_%2Fu x:collection1_shard1_replica_n2 c:collection1 s:shard1) [n:127.0.0.1:42367_cw_%2Fu c:collection1 s:shard1  x:collection1_shard1_replica_n2] o.a.s.c.SolrCore [collection1_shard1_replica_n2] Registered new searcher Searcher@6f480d34[collection1_shard1_replica_n2] main{ExitableDirectoryReader(UninvertingDirectoryReader())}
   [junit4]   2> 2025917 INFO  (qtp1209393835-37607) [n:127.0.0.1:42367_cw_%2Fu c:collection1 s:shard1  x:collection1_shard1_replica_n2] o.a.s.c.ZkShardTerms Successful update of terms at /collections/collection1/terms/shard1 to Terms{values={core_node4=0}, version=0}
   [junit4]   2> 2025918 INFO  (qtp1209393835-37607) [n:127.0.0.1:42367_cw_%2Fu c:collection1 s:shard1  x:collection1_shard1_replica_n2] o.a.s.c.ShardLeaderElectionContextBase make sure parent is created /collections/collection1/leaders/shard1
   [junit4]   2> 2025922 INFO  (qtp1209393835-37607) [n:127.0.0.1:42367_cw_%2Fu c:collection1 s:shard1  x:collection1_shard1_replica_n2] o.a.s.c.ShardLeaderElectionContext Enough replicas found to continue.
   [junit4]   2> 2025923 INFO  (qtp1209393835-37607) [n:127.0.0.1:42367_cw_%2Fu c:collection1 s:shard1  x:collection1_shard1_replica_n2] o.a.s.c.ShardLeaderElectionContext I may be the new leader - try and sync
   [junit4]   2> 2025923 INFO  (qtp1209393835-37607) [n:127.0.0.1:42367_cw_%2Fu c:collection1 s:shard1  x:collection1_shard1_replica_n2] o.a.s.c.SyncStrategy Sync replicas to http://127.0.0.1:42367/cw_/u/collection1_shard1_replica_n2/
   [junit4]   2> 2025923 INFO  (qtp1209393835-37607) [n:127.0.0.1:42367_cw_%2Fu c:collection1 s:shard1  x:collection1_shard1_replica_n2] o.a.s.c.SyncStrategy Sync Success - now sync replicas to me
   [junit4]   2> 2025923 INFO  (qtp1209393835-37607) [n:127.0.0.1:42367_cw_%2Fu c:collection1 s:shard1  x:collection1_shard1_replica_n2] o.a.s.c.SyncStrategy http://127.0.0.1:42367/cw_/u/collection1_shard1_replica_n2/ has no replicas
   [junit4]   2> 2025923 INFO  (qtp1209393835-37607) [n:127.0.0.1:42367_cw_%2Fu c:collection1 s:shard1  x:collection1_shard1_replica_n2] o.a.s.c.ShardLeaderElectionContextBase Creating leader registration node /collections/collection1/leaders/shard1/leader after winning as /collections/collection1/leader_elect/shard1/election/73106003766804493-core_node4-n_0000000000
   [junit4]   2> 2025926 INFO  (qtp1209393835-37607) [n:127.0.0.1:42367_cw_%2Fu c:collection1 s:shard1  x:collection1_shard1_replica_n2] o.a.s.c.ShardLeaderElectionContext I am the new leader: http://127.0.0.1:42367/cw_/u/collection1_shard1_replica_n2/ shard1
   [junit4]   2> 2026028 INFO  (zkCallback-7718-thread-1) [    ] o.a.s.c.c.ZkStateReader A cluster state change: [WatchedEvent state:SyncConnected type:NodeDataChanged path:/collectio

[...truncated too long message...]



ivy-availability-check:
[loadresource] Do not set property disallowed.ivy.jars.list as its length is 0.

-ivy-fail-disallowed-ivy-version:

ivy-fail:

ivy-configure:
[ivy:configure] :: loading settings :: file = /x1/jenkins/jenkins-slave/workspace/Lucene-Solr-NightlyTests-8.x/checkout/lucene/top-level-ivy-settings.xml

resolve:

ivy-availability-check:
[loadresource] Do not set property disallowed.ivy.jars.list as its length is 0.

-ivy-fail-disallowed-ivy-version:

ivy-fail:

ivy-fail:

ivy-configure:
[ivy:configure] :: loading settings :: file = /x1/jenkins/jenkins-slave/workspace/Lucene-Solr-NightlyTests-8.x/checkout/lucene/top-level-ivy-settings.xml

resolve:

ivy-availability-check:
[loadresource] Do not set property disallowed.ivy.jars.list as its length is 0.

-ivy-fail-disallowed-ivy-version:

ivy-fail:

ivy-configure:
[ivy:configure] :: loading settings :: file = /x1/jenkins/jenkins-slave/workspace/Lucene-Solr-NightlyTests-8.x/checkout/lucene/top-level-ivy-settings.xml

resolve:

ivy-availability-check:
[loadresource] Do not set property disallowed.ivy.jars.list as its length is 0.

-ivy-fail-disallowed-ivy-version:

ivy-fail:

ivy-fail:

ivy-configure:
[ivy:configure] :: loading settings :: file = /x1/jenkins/jenkins-slave/workspace/Lucene-Solr-NightlyTests-8.x/checkout/lucene/top-level-ivy-settings.xml

resolve:

ivy-availability-check:
[loadresource] Do not set property disallowed.ivy.jars.list as its length is 0.

-ivy-fail-disallowed-ivy-version:

ivy-fail:

ivy-fail:

ivy-configure:
[ivy:configure] :: loading settings :: file = /x1/jenkins/jenkins-slave/workspace/Lucene-Solr-NightlyTests-8.x/checkout/lucene/top-level-ivy-settings.xml

resolve:

ivy-availability-check:
[loadresource] Do not set property disallowed.ivy.jars.list as its length is 0.

-ivy-fail-disallowed-ivy-version:

ivy-fail:

ivy-fail:

ivy-configure:
[ivy:configure] :: loading settings :: file = /x1/jenkins/jenkins-slave/workspace/Lucene-Solr-NightlyTests-8.x/checkout/lucene/top-level-ivy-settings.xml

resolve:

ivy-availability-check:
[loadresource] Do not set property disallowed.ivy.jars.list as its length is 0.

-ivy-fail-disallowed-ivy-version:

ivy-fail:

ivy-fail:

ivy-configure:
[ivy:configure] :: loading settings :: file = /x1/jenkins/jenkins-slave/workspace/Lucene-Solr-NightlyTests-8.x/checkout/lucene/top-level-ivy-settings.xml

resolve:

ivy-availability-check:
[loadresource] Do not set property disallowed.ivy.jars.list as its length is 0.

-ivy-fail-disallowed-ivy-version:

ivy-fail:

ivy-fail:

ivy-configure:
[ivy:configure] :: loading settings :: file = /x1/jenkins/jenkins-slave/workspace/Lucene-Solr-NightlyTests-8.x/checkout/lucene/top-level-ivy-settings.xml

resolve:

ivy-availability-check:
[loadresource] Do not set property disallowed.ivy.jars.list as its length is 0.

-ivy-fail-disallowed-ivy-version:

ivy-fail:

ivy-fail:

ivy-configure:
[ivy:configure] :: loading settings :: file = /x1/jenkins/jenkins-slave/workspace/Lucene-Solr-NightlyTests-8.x/checkout/lucene/top-level-ivy-settings.xml

resolve:

ivy-availability-check:
[loadresource] Do not set property disallowed.ivy.jars.list as its length is 0.

-ivy-fail-disallowed-ivy-version:

ivy-fail:

ivy-fail:

ivy-configure:
[ivy:configure] :: loading settings :: file = /x1/jenkins/jenkins-slave/workspace/Lucene-Solr-NightlyTests-8.x/checkout/lucene/top-level-ivy-settings.xml

resolve:

ivy-availability-check:
[loadresource] Do not set property disallowed.ivy.jars.list as its length is 0.

-ivy-fail-disallowed-ivy-version:

ivy-fail:

ivy-fail:

ivy-configure:
[ivy:configure] :: loading settings :: file = /x1/jenkins/jenkins-slave/workspace/Lucene-Solr-NightlyTests-8.x/checkout/lucene/top-level-ivy-settings.xml

resolve:

ivy-availability-check:
[loadresource] Do not set property disallowed.ivy.jars.list as its length is 0.

-ivy-fail-disallowed-ivy-version:

ivy-fail:

ivy-fail:

ivy-configure:
[ivy:configure] :: loading settings :: file = /x1/jenkins/jenkins-slave/workspace/Lucene-Solr-NightlyTests-8.x/checkout/lucene/top-level-ivy-settings.xml

resolve:

ivy-availability-check:
[loadresource] Do not set property disallowed.ivy.jars.list as its length is 0.

-ivy-fail-disallowed-ivy-version:

ivy-fail:

ivy-fail:

ivy-configure:
[ivy:configure] :: loading settings :: file = /x1/jenkins/jenkins-slave/workspace/Lucene-Solr-NightlyTests-8.x/checkout/lucene/top-level-ivy-settings.xml

resolve:

jar-checksums:
    [mkdir] Created dir: /x1/jenkins/jenkins-slave/workspace/Lucene-Solr-NightlyTests-8.x/checkout/solr/null980402615
     [copy] Copying 240 files to /x1/jenkins/jenkins-slave/workspace/Lucene-Solr-NightlyTests-8.x/checkout/solr/null980402615
   [delete] Deleting directory /x1/jenkins/jenkins-slave/workspace/Lucene-Solr-NightlyTests-8.x/checkout/solr/null980402615

check-working-copy:
[ivy:cachepath] :: resolving dependencies :: org.eclipse.jgit#org.eclipse.jgit-caller;working
[ivy:cachepath] 	confs: [default]
[ivy:cachepath] 	found org.eclipse.jgit#org.eclipse.jgit;4.6.0.201612231935-r in public
[ivy:cachepath] 	found com.jcraft#jsch;0.1.53 in public
[ivy:cachepath] 	found com.googlecode.javaewah#JavaEWAH;1.1.6 in public
[ivy:cachepath] 	found org.apache.httpcomponents#httpclient;4.3.6 in public
[ivy:cachepath] 	found org.apache.httpcomponents#httpcore;4.3.3 in public
[ivy:cachepath] 	found commons-logging#commons-logging;1.1.3 in public
[ivy:cachepath] 	found commons-codec#commons-codec;1.6 in public
[ivy:cachepath] 	found org.slf4j#slf4j-api;1.7.2 in public
[ivy:cachepath] :: resolution report :: resolve 74ms :: artifacts dl 9ms
	---------------------------------------------------------------------
	|                  |            modules            ||   artifacts   |
	|       conf       | number| search|dwnlded|evicted|| number|dwnlded|
	---------------------------------------------------------------------
	|      default     |   8   |   0   |   0   |   0   ||   8   |   0   |
	---------------------------------------------------------------------
[wc-checker] Initializing working copy...
[wc-checker] SLF4J: Failed to load class "org.slf4j.impl.StaticLoggerBinder".
[wc-checker] SLF4J: Defaulting to no-operation (NOP) logger implementation
[wc-checker] SLF4J: See http://www.slf4j.org/codes.html#StaticLoggerBinder for further details.
[wc-checker] Checking working copy status...

-jenkins-base:

BUILD SUCCESSFUL
Total time: 309 minutes 12 seconds
Archiving artifacts
java.lang.InterruptedException: no matches found within 10000
	at hudson.FilePath$ValidateAntFileMask.hasMatch(FilePath.java:2847)
	at hudson.FilePath$ValidateAntFileMask.invoke(FilePath.java:2726)
	at hudson.FilePath$ValidateAntFileMask.invoke(FilePath.java:2707)
	at hudson.FilePath$FileCallableWrapper.call(FilePath.java:3086)
Also:   hudson.remoting.Channel$CallSiteStackTrace: Remote call to lucene
		at hudson.remoting.Channel.attachCallSiteStackTrace(Channel.java:1741)
		at hudson.remoting.UserRequest$ExceptionResponse.retrieve(UserRequest.java:357)
		at hudson.remoting.Channel.call(Channel.java:955)
		at hudson.FilePath.act(FilePath.java:1072)
		at hudson.FilePath.act(FilePath.java:1061)
		at hudson.FilePath.validateAntFileMask(FilePath.java:2705)
		at hudson.tasks.ArtifactArchiver.perform(ArtifactArchiver.java:243)
		at hudson.tasks.BuildStepCompatibilityLayer.perform(BuildStepCompatibilityLayer.java:81)
		at hudson.tasks.BuildStepMonitor$1.perform(BuildStepMonitor.java:20)
		at hudson.model.AbstractBuild$AbstractBuildExecution.perform(AbstractBuild.java:744)
		at hudson.model.AbstractBuild$AbstractBuildExecution.performAllBuildSteps(AbstractBuild.java:690)
		at hudson.model.Build$BuildExecution.post2(Build.java:186)
		at hudson.model.AbstractBuild$AbstractBuildExecution.post(AbstractBuild.java:635)
		at hudson.model.Run.execute(Run.java:1835)
		at hudson.model.FreeStyleBuild.run(FreeStyleBuild.java:43)
		at hudson.model.ResourceController.execute(ResourceController.java:97)
		at hudson.model.Executor.run(Executor.java:429)
Caused: hudson.FilePath$TunneledInterruptedException
	at hudson.FilePath$FileCallableWrapper.call(FilePath.java:3088)
	at hudson.remoting.UserRequest.perform(UserRequest.java:212)
	at hudson.remoting.UserRequest.perform(UserRequest.java:54)
	at hudson.remoting.Request$2.run(Request.java:369)
	at hudson.remoting.InterceptingExecutorService$1.call(InterceptingExecutorService.java:72)
	at java.util.concurrent.FutureTask.run(FutureTask.java:266)
	at java.util.concurrent.ThreadPoolExecutor.runWorker(ThreadPoolExecutor.java:1142)
	at java.util.concurrent.ThreadPoolExecutor$Worker.run(ThreadPoolExecutor.java:617)
	at java.lang.Thread.run(Thread.java:748)
Caused: java.lang.InterruptedException: java.lang.InterruptedException: no matches found within 10000
	at hudson.FilePath.act(FilePath.java:1074)
	at hudson.FilePath.act(FilePath.java:1061)
	at hudson.FilePath.validateAntFileMask(FilePath.java:2705)
	at hudson.tasks.ArtifactArchiver.perform(ArtifactArchiver.java:243)
	at hudson.tasks.BuildStepCompatibilityLayer.perform(BuildStepCompatibilityLayer.java:81)
	at hudson.tasks.BuildStepMonitor$1.perform(BuildStepMonitor.java:20)
	at hudson.model.AbstractBuild$AbstractBuildExecution.perform(AbstractBuild.java:744)
	at hudson.model.AbstractBuild$AbstractBuildExecution.performAllBuildSteps(AbstractBuild.java:690)
	at hudson.model.Build$BuildExecution.post2(Build.java:186)
	at hudson.model.AbstractBuild$AbstractBuildExecution.post(AbstractBuild.java:635)
	at hudson.model.Run.execute(Run.java:1835)
	at hudson.model.FreeStyleBuild.run(FreeStyleBuild.java:43)
	at hudson.model.ResourceController.execute(ResourceController.java:97)
	at hudson.model.Executor.run(Executor.java:429)
No artifacts found that match the file pattern "**/*.events,heapdumps/**,**/hs_err_pid*". Configuration error?
Recording test results
Build step 'Publish JUnit test result report' changed build result to UNSTABLE
Email was triggered for: Unstable (Test Failures)
Sending email for trigger: Unstable (Test Failures)

Mime
View raw message