lucene-dev mailing list archives

Site index · List index
Message view « Date » · « Thread »
Top « Date » · « Thread »
From Apache Jenkins Server <jenk...@builds.apache.org>
Subject [JENKINS] Lucene-Solr-BadApples-Tests-master - Build # 326 - Unstable
Date Sun, 07 Apr 2019 01:59:27 GMT
Build: https://builds.apache.org/job/Lucene-Solr-BadApples-Tests-master/326/

1 tests failed.
FAILED:  org.apache.solr.handler.TestReplicationHandlerBackup.doTestBackup

Error Message:
Server returned HTTP response code: 400 for URL: http://127.0.0.1:33482/solr/collection1/replication?wt=xml&command=backup&name=ri

Stack Trace:
java.io.IOException: Server returned HTTP response code: 400 for URL: http://127.0.0.1:33482/solr/collection1/replication?wt=xml&command=backup&name=ri
	at __randomizedtesting.SeedInfo.seed([38F19F1C902C9E8B:797ABF79B7926DC4]:0)
	at sun.net.www.protocol.http.HttpURLConnection.getInputStream0(HttpURLConnection.java:1894)
	at sun.net.www.protocol.http.HttpURLConnection.getInputStream(HttpURLConnection.java:1492)
	at java.net.URL.openStream(URL.java:1045)
	at org.apache.solr.handler.TestReplicationHandlerBackup.runBackupCommand(TestReplicationHandlerBackup.java:274)
	at org.apache.solr.handler.TestReplicationHandlerBackup.doTestBackup(TestReplicationHandlerBackup.java:188)
	at sun.reflect.NativeMethodAccessorImpl.invoke0(Native Method)
	at sun.reflect.NativeMethodAccessorImpl.invoke(NativeMethodAccessorImpl.java:62)
	at sun.reflect.DelegatingMethodAccessorImpl.invoke(DelegatingMethodAccessorImpl.java:43)
	at java.lang.reflect.Method.invoke(Method.java:498)
	at com.carrotsearch.randomizedtesting.RandomizedRunner.invoke(RandomizedRunner.java:1750)
	at com.carrotsearch.randomizedtesting.RandomizedRunner$8.evaluate(RandomizedRunner.java:938)
	at com.carrotsearch.randomizedtesting.RandomizedRunner$9.evaluate(RandomizedRunner.java:974)
	at com.carrotsearch.randomizedtesting.RandomizedRunner$10.evaluate(RandomizedRunner.java:988)
	at com.carrotsearch.randomizedtesting.rules.SystemPropertiesRestoreRule$1.evaluate(SystemPropertiesRestoreRule.java:57)
	at org.apache.lucene.util.TestRuleSetupTeardownChained$1.evaluate(TestRuleSetupTeardownChained.java:49)
	at org.apache.lucene.util.AbstractBeforeAfterRule$1.evaluate(AbstractBeforeAfterRule.java:45)
	at org.apache.lucene.util.TestRuleThreadAndTestName$1.evaluate(TestRuleThreadAndTestName.java:48)
	at org.apache.lucene.util.TestRuleIgnoreAfterMaxFailures$1.evaluate(TestRuleIgnoreAfterMaxFailures.java:64)
	at org.apache.lucene.util.TestRuleMarkFailure$1.evaluate(TestRuleMarkFailure.java:47)
	at com.carrotsearch.randomizedtesting.rules.StatementAdapter.evaluate(StatementAdapter.java:36)
	at com.carrotsearch.randomizedtesting.ThreadLeakControl$StatementRunner.run(ThreadLeakControl.java:368)
	at com.carrotsearch.randomizedtesting.ThreadLeakControl.forkTimeoutingTask(ThreadLeakControl.java:817)
	at com.carrotsearch.randomizedtesting.ThreadLeakControl$3.evaluate(ThreadLeakControl.java:468)
	at com.carrotsearch.randomizedtesting.RandomizedRunner.runSingleTest(RandomizedRunner.java:947)
	at com.carrotsearch.randomizedtesting.RandomizedRunner$5.evaluate(RandomizedRunner.java:832)
	at com.carrotsearch.randomizedtesting.RandomizedRunner$6.evaluate(RandomizedRunner.java:883)
	at com.carrotsearch.randomizedtesting.RandomizedRunner$7.evaluate(RandomizedRunner.java:894)
	at com.carrotsearch.randomizedtesting.rules.StatementAdapter.evaluate(StatementAdapter.java:36)
	at com.carrotsearch.randomizedtesting.rules.SystemPropertiesRestoreRule$1.evaluate(SystemPropertiesRestoreRule.java:57)
	at org.apache.lucene.util.AbstractBeforeAfterRule$1.evaluate(AbstractBeforeAfterRule.java:45)
	at com.carrotsearch.randomizedtesting.rules.StatementAdapter.evaluate(StatementAdapter.java:36)
	at org.apache.lucene.util.TestRuleStoreClassName$1.evaluate(TestRuleStoreClassName.java:41)
	at com.carrotsearch.randomizedtesting.rules.NoShadowingOrOverridesOnMethodsRule$1.evaluate(NoShadowingOrOverridesOnMethodsRule.java:40)
	at com.carrotsearch.randomizedtesting.rules.NoShadowingOrOverridesOnMethodsRule$1.evaluate(NoShadowingOrOverridesOnMethodsRule.java:40)
	at com.carrotsearch.randomizedtesting.rules.StatementAdapter.evaluate(StatementAdapter.java:36)
	at com.carrotsearch.randomizedtesting.rules.StatementAdapter.evaluate(StatementAdapter.java:36)
	at com.carrotsearch.randomizedtesting.rules.StatementAdapter.evaluate(StatementAdapter.java:36)
	at org.apache.lucene.util.TestRuleAssertionsRequired$1.evaluate(TestRuleAssertionsRequired.java:53)
	at org.apache.lucene.util.TestRuleMarkFailure$1.evaluate(TestRuleMarkFailure.java:47)
	at org.apache.lucene.util.TestRuleIgnoreAfterMaxFailures$1.evaluate(TestRuleIgnoreAfterMaxFailures.java:64)
	at org.apache.lucene.util.TestRuleIgnoreTestSuites$1.evaluate(TestRuleIgnoreTestSuites.java:54)
	at com.carrotsearch.randomizedtesting.rules.StatementAdapter.evaluate(StatementAdapter.java:36)
	at com.carrotsearch.randomizedtesting.ThreadLeakControl$StatementRunner.run(ThreadLeakControl.java:368)
	at java.lang.Thread.run(Thread.java:748)




Build Log:
[...truncated 13170 lines...]
   [junit4] Suite: org.apache.solr.handler.TestReplicationHandlerBackup
   [junit4]   2> 591362 INFO  (SUITE-TestReplicationHandlerBackup-seed#[38F19F1C902C9E8B]-worker) [    ] o.a.s.SolrTestCaseJ4 SecureRandom sanity checks: test.solr.allowed.securerandom=null & java.security.egd=file:/dev/./urandom
   [junit4]   2> Creating dataDir: /x1/jenkins/jenkins-slave/workspace/Lucene-Solr-BadApples-Tests-master/solr/build/solr-core/test/J1/temp/solr.handler.TestReplicationHandlerBackup_38F19F1C902C9E8B-001/init-core-data-001
   [junit4]   2> 591362 WARN  (SUITE-TestReplicationHandlerBackup-seed#[38F19F1C902C9E8B]-worker) [    ] o.a.s.SolrTestCaseJ4 startTrackingSearchers: numOpens=17 numCloses=17
   [junit4]   2> 591362 INFO  (SUITE-TestReplicationHandlerBackup-seed#[38F19F1C902C9E8B]-worker) [    ] o.a.s.SolrTestCaseJ4 Using TrieFields (NUMERIC_POINTS_SYSPROP=false) w/NUMERIC_DOCVALUES_SYSPROP=false
   [junit4]   2> 591365 INFO  (SUITE-TestReplicationHandlerBackup-seed#[38F19F1C902C9E8B]-worker) [    ] o.a.s.SolrTestCaseJ4 Randomized ssl (false) and clientAuth (false) via: @org.apache.solr.SolrTestCaseJ4$SuppressSSL(bugUrl=None)
   [junit4]   2> 591367 INFO  (TEST-TestReplicationHandlerBackup.testBackupOnCommit-seed#[38F19F1C902C9E8B]) [    ] o.a.s.SolrTestCaseJ4 ###Starting testBackupOnCommit
   [junit4]   2> 591368 INFO  (TEST-TestReplicationHandlerBackup.testBackupOnCommit-seed#[38F19F1C902C9E8B]) [    ] o.a.s.SolrTestCaseJ4 Writing core.properties file to /x1/jenkins/jenkins-slave/workspace/Lucene-Solr-BadApples-Tests-master/solr/build/solr-core/test/J1/temp/solr.handler.TestReplicationHandlerBackup_38F19F1C902C9E8B-001/solr-instance-001/collection1
   [junit4]   2> 591378 WARN  (TEST-TestReplicationHandlerBackup.testBackupOnCommit-seed#[38F19F1C902C9E8B]) [    ] o.e.j.s.AbstractConnector Ignoring deprecated socket close linger time
   [junit4]   2> 591379 INFO  (TEST-TestReplicationHandlerBackup.testBackupOnCommit-seed#[38F19F1C902C9E8B]) [    ] o.a.s.c.s.e.JettySolrRunner Start Jetty (original configured port=0)
   [junit4]   2> 591379 INFO  (TEST-TestReplicationHandlerBackup.testBackupOnCommit-seed#[38F19F1C902C9E8B]) [    ] o.a.s.c.s.e.JettySolrRunner Trying to start Jetty on port 0 try number 1 ...
   [junit4]   2> 591379 INFO  (TEST-TestReplicationHandlerBackup.testBackupOnCommit-seed#[38F19F1C902C9E8B]) [    ] o.e.j.s.Server jetty-9.4.14.v20181114; built: 2018-11-14T21:20:31.478Z; git: c4550056e785fb5665914545889f21dc136ad9e6; jvm 1.8.0_191-b12
   [junit4]   2> 591380 INFO  (TEST-TestReplicationHandlerBackup.testBackupOnCommit-seed#[38F19F1C902C9E8B]) [    ] o.e.j.s.session DefaultSessionIdManager workerName=node0
   [junit4]   2> 591380 INFO  (TEST-TestReplicationHandlerBackup.testBackupOnCommit-seed#[38F19F1C902C9E8B]) [    ] o.e.j.s.session No SessionScavenger set, using defaults
   [junit4]   2> 591380 INFO  (TEST-TestReplicationHandlerBackup.testBackupOnCommit-seed#[38F19F1C902C9E8B]) [    ] o.e.j.s.session node0 Scavenging every 600000ms
   [junit4]   2> 591380 INFO  (TEST-TestReplicationHandlerBackup.testBackupOnCommit-seed#[38F19F1C902C9E8B]) [    ] o.e.j.s.h.ContextHandler Started o.e.j.s.ServletContextHandler@7aaa40cb{/solr,null,AVAILABLE}
   [junit4]   2> 591382 INFO  (TEST-TestReplicationHandlerBackup.testBackupOnCommit-seed#[38F19F1C902C9E8B]) [    ] o.e.j.s.AbstractConnector Started ServerConnector@2638ba3b{HTTP/1.1,[http/1.1, h2c]}{127.0.0.1:38638}
   [junit4]   2> 591382 INFO  (TEST-TestReplicationHandlerBackup.testBackupOnCommit-seed#[38F19F1C902C9E8B]) [    ] o.e.j.s.Server Started @591469ms
   [junit4]   2> 591382 INFO  (TEST-TestReplicationHandlerBackup.testBackupOnCommit-seed#[38F19F1C902C9E8B]) [    ] o.a.s.c.s.e.JettySolrRunner Jetty properties: {solr.data.dir=/x1/jenkins/jenkins-slave/workspace/Lucene-Solr-BadApples-Tests-master/solr/build/solr-core/test/J1/temp/solr.handler.TestReplicationHandlerBackup_38F19F1C902C9E8B-001/solr-instance-001/collection1/data, hostContext=/solr, hostPort=38638}
   [junit4]   2> 591383 ERROR (TEST-TestReplicationHandlerBackup.testBackupOnCommit-seed#[38F19F1C902C9E8B]) [    ] o.a.s.u.StartupLoggingUtils Missing Java Option solr.log.dir. Logging may be missing or incomplete.
   [junit4]   2> 591383 INFO  (TEST-TestReplicationHandlerBackup.testBackupOnCommit-seed#[38F19F1C902C9E8B]) [    ] o.a.s.s.SolrDispatchFilter Using logger factory org.apache.logging.slf4j.Log4jLoggerFactory
   [junit4]   2> 591383 INFO  (TEST-TestReplicationHandlerBackup.testBackupOnCommit-seed#[38F19F1C902C9E8B]) [    ] o.a.s.s.SolrDispatchFilter  ___      _       Welcome to Apache Solr? version 9.0.0
   [junit4]   2> 591383 INFO  (TEST-TestReplicationHandlerBackup.testBackupOnCommit-seed#[38F19F1C902C9E8B]) [    ] o.a.s.s.SolrDispatchFilter / __| ___| |_ _   Starting in standalone mode on port null
   [junit4]   2> 591383 INFO  (TEST-TestReplicationHandlerBackup.testBackupOnCommit-seed#[38F19F1C902C9E8B]) [    ] o.a.s.s.SolrDispatchFilter \__ \/ _ \ | '_|  Install dir: null
   [junit4]   2> 591383 INFO  (TEST-TestReplicationHandlerBackup.testBackupOnCommit-seed#[38F19F1C902C9E8B]) [    ] o.a.s.s.SolrDispatchFilter |___/\___/_|_|    Start time: 2019-04-07T00:58:01.964Z
   [junit4]   2> 591383 INFO  (TEST-TestReplicationHandlerBackup.testBackupOnCommit-seed#[38F19F1C902C9E8B]) [    ] o.a.s.c.SolrXmlConfig Loading container configuration from /x1/jenkins/jenkins-slave/workspace/Lucene-Solr-BadApples-Tests-master/solr/build/solr-core/test/J1/temp/solr.handler.TestReplicationHandlerBackup_38F19F1C902C9E8B-001/solr-instance-001/solr.xml
   [junit4]   2> 591387 INFO  (TEST-TestReplicationHandlerBackup.testBackupOnCommit-seed#[38F19F1C902C9E8B]) [    ] o.a.s.c.SolrXmlConfig Configuration parameter autoReplicaFailoverWorkLoopDelay is ignored
   [junit4]   2> 591387 INFO  (TEST-TestReplicationHandlerBackup.testBackupOnCommit-seed#[38F19F1C902C9E8B]) [    ] o.a.s.c.SolrXmlConfig Configuration parameter autoReplicaFailoverBadNodeExpiration is ignored
   [junit4]   2> 591389 INFO  (TEST-TestReplicationHandlerBackup.testBackupOnCommit-seed#[38F19F1C902C9E8B]) [    ] o.a.s.c.SolrXmlConfig MBean server found: com.sun.jmx.mbeanserver.JmxMBeanServer@188abcb8, but no JMX reporters were configured - adding default JMX reporter.
   [junit4]   2> 591756 INFO  (TEST-TestReplicationHandlerBackup.testBackupOnCommit-seed#[38F19F1C902C9E8B]) [    ] o.a.s.h.c.HttpShardHandlerFactory Host whitelist initialized: WhitelistHostChecker [whitelistHosts=null, whitelistHostCheckingEnabled=true]
   [junit4]   2> 591758 WARN  (TEST-TestReplicationHandlerBackup.testBackupOnCommit-seed#[38F19F1C902C9E8B]) [    ] o.e.j.u.s.S.config No Client EndPointIdentificationAlgorithm configured for SslContextFactory@3ad76792[provider=null,keyStore=null,trustStore=null]
   [junit4]   2> 591763 WARN  (TEST-TestReplicationHandlerBackup.testBackupOnCommit-seed#[38F19F1C902C9E8B]) [    ] o.e.j.u.s.S.config No Client EndPointIdentificationAlgorithm configured for SslContextFactory@419e483d[provider=null,keyStore=null,trustStore=null]
   [junit4]   2> 591788 INFO  (TEST-TestReplicationHandlerBackup.testBackupOnCommit-seed#[38F19F1C902C9E8B]) [    ] o.a.s.c.TransientSolrCoreCacheDefault Allocating transient cache for 4 transient cores
   [junit4]   2> 591788 INFO  (TEST-TestReplicationHandlerBackup.testBackupOnCommit-seed#[38F19F1C902C9E8B]) [    ] o.a.s.h.a.MetricsHistoryHandler No .system collection, keeping metrics history in memory.
   [junit4]   2> 591814 INFO  (TEST-TestReplicationHandlerBackup.testBackupOnCommit-seed#[38F19F1C902C9E8B]) [    ] o.a.s.m.r.SolrJmxReporter JMX monitoring for 'solr.node' (registry 'solr.node') enabled at server: com.sun.jmx.mbeanserver.JmxMBeanServer@188abcb8
   [junit4]   2> 591828 INFO  (TEST-TestReplicationHandlerBackup.testBackupOnCommit-seed#[38F19F1C902C9E8B]) [    ] o.a.s.m.r.SolrJmxReporter JMX monitoring for 'solr.jvm' (registry 'solr.jvm') enabled at server: com.sun.jmx.mbeanserver.JmxMBeanServer@188abcb8
   [junit4]   2> 591829 INFO  (TEST-TestReplicationHandlerBackup.testBackupOnCommit-seed#[38F19F1C902C9E8B]) [    ] o.a.s.m.r.SolrJmxReporter JMX monitoring for 'solr.jetty' (registry 'solr.jetty') enabled at server: com.sun.jmx.mbeanserver.JmxMBeanServer@188abcb8
   [junit4]   2> 591832 INFO  (TEST-TestReplicationHandlerBackup.testBackupOnCommit-seed#[38F19F1C902C9E8B]) [    ] o.a.s.c.CorePropertiesLocator Found 1 core definitions underneath /x1/jenkins/jenkins-slave/workspace/Lucene-Solr-BadApples-Tests-master/solr/build/solr-core/test/J1/temp/solr.handler.TestReplicationHandlerBackup_38F19F1C902C9E8B-001/solr-instance-001/.
   [junit4]   2> 591832 INFO  (TEST-TestReplicationHandlerBackup.testBackupOnCommit-seed#[38F19F1C902C9E8B]) [    ] o.a.s.c.CorePropertiesLocator Cores are: [collection1]
   [junit4]   2> 591850 INFO  (coreLoadExecutor-2946-thread-1) [    x:collection1] o.a.s.c.SolrConfig Using Lucene MatchVersion: 9.0.0
   [junit4]   2> 591859 INFO  (coreLoadExecutor-2946-thread-1) [    x:collection1] o.a.s.s.IndexSchema [collection1] Schema name=test
   [junit4]   2> 591861 INFO  (coreLoadExecutor-2946-thread-1) [    x:collection1] o.a.s.s.IndexSchema Loaded schema test/1.2 with uniqueid field id
   [junit4]   2> 591861 INFO  (coreLoadExecutor-2946-thread-1) [    x:collection1] o.a.s.c.CoreContainer Creating SolrCore 'collection1' using configuration from instancedir /x1/jenkins/jenkins-slave/workspace/Lucene-Solr-BadApples-Tests-master/solr/build/solr-core/test/J1/temp/solr.handler.TestReplicationHandlerBackup_38F19F1C902C9E8B-001/solr-instance-001/./collection1, trusted=true
   [junit4]   2> 591861 INFO  (coreLoadExecutor-2946-thread-1) [    x:collection1] o.a.s.m.r.SolrJmxReporter JMX monitoring for 'solr.core.collection1' (registry 'solr.core.collection1') enabled at server: com.sun.jmx.mbeanserver.JmxMBeanServer@188abcb8
   [junit4]   2> 591862 INFO  (coreLoadExecutor-2946-thread-1) [    x:collection1] o.a.s.c.SolrCore [[collection1] ] Opening new SolrCore at [/x1/jenkins/jenkins-slave/workspace/Lucene-Solr-BadApples-Tests-master/solr/build/solr-core/test/J1/temp/solr.handler.TestReplicationHandlerBackup_38F19F1C902C9E8B-001/solr-instance-001/collection1], dataDir=[/x1/jenkins/jenkins-slave/workspace/Lucene-Solr-BadApples-Tests-master/solr/build/solr-core/test/J1/temp/solr.handler.TestReplicationHandlerBackup_38F19F1C902C9E8B-001/solr-instance-001/./collection1/data/]
   [junit4]   2> 591866 INFO  (coreLoadExecutor-2946-thread-1) [    x:collection1] o.a.s.u.RandomMergePolicy RandomMergePolicy wrapping class org.apache.lucene.index.TieredMergePolicy: [TieredMergePolicy: maxMergeAtOnce=36, maxMergeAtOnceExplicit=18, maxMergedSegmentMB=95.11328125, floorSegmentMB=0.3125, forceMergeDeletesPctAllowed=12.050444805499968, segmentsPerTier=48.0, maxCFSSegmentSizeMB=8.796093022207999E12, noCFSRatio=1.0, deletesPctAllowed=28.53377165818116
   [junit4]   2> 591921 INFO  (coreLoadExecutor-2946-thread-1) [    x:collection1] o.a.s.u.CommitTracker Hard AutoCommit: disabled
   [junit4]   2> 591921 INFO  (coreLoadExecutor-2946-thread-1) [    x:collection1] o.a.s.u.CommitTracker Soft AutoCommit: disabled
   [junit4]   2> 591923 INFO  (coreLoadExecutor-2946-thread-1) [    x:collection1] o.a.s.u.RandomMergePolicy RandomMergePolicy wrapping class org.apache.lucene.index.TieredMergePolicy: [TieredMergePolicy: maxMergeAtOnce=44, maxMergeAtOnceExplicit=30, maxMergedSegmentMB=31.1171875, floorSegmentMB=0.9140625, forceMergeDeletesPctAllowed=2.5453452317182723, segmentsPerTier=46.0, maxCFSSegmentSizeMB=8.796093022207999E12, noCFSRatio=0.16352688042986507, deletesPctAllowed=27.356078448226732
   [junit4]   2> 591923 INFO  (coreLoadExecutor-2946-thread-1) [    x:collection1] o.a.s.s.SolrIndexSearcher Opening [Searcher@5a46be1e[collection1] main]
   [junit4]   2> 591923 INFO  (coreLoadExecutor-2946-thread-1) [    x:collection1] o.a.s.r.ManagedResourceStorage File-based storage initialized to use dir: /x1/jenkins/jenkins-slave/workspace/Lucene-Solr-BadApples-Tests-master/solr/build/solr-core/test/J1/temp/solr.handler.TestReplicationHandlerBackup_38F19F1C902C9E8B-001/solr-instance-001/collection1/conf
   [junit4]   2> 591924 INFO  (coreLoadExecutor-2946-thread-1) [    x:collection1] o.a.s.h.ReplicationHandler Replication enabled for following config files: schema-replication2.xml:schema.xml
   [junit4]   2> 591924 INFO  (coreLoadExecutor-2946-thread-1) [    x:collection1] o.a.s.h.ReplicationHandler Commits will be reserved for 10000ms.
   [junit4]   2> 591925 INFO  (searcherExecutor-2947-thread-1-processing-x:collection1) [    x:collection1] o.a.s.c.SolrCore [collection1] Registered new searcher Searcher@5a46be1e[collection1] main{ExitableDirectoryReader(UninvertingDirectoryReader())}
   [junit4]   2> 592429 INFO  (qtp1072197595-9187) [    x:collection1] o.a.s.u.DirectUpdateHandler2 [collection1] REMOVING ALL DOCUMENTS FROM INDEX
   [junit4]   2> 592429 INFO  (qtp1072197595-9187) [    x:collection1] o.a.s.u.p.LogUpdateProcessorFactory [collection1]  webapp=/solr path=/update params={wt=javabin&version=2}{deleteByQuery=*:*} 0 0
   [junit4]   2> 592430 INFO  (TEST-TestReplicationHandlerBackup.testBackupOnCommit-seed#[38F19F1C902C9E8B]) [    ] o.a.s.h.BackupRestoreUtils Indexing 44 test docs
   [junit4]   2> 592435 INFO  (qtp1072197595-9188) [    x:collection1] o.a.s.u.p.LogUpdateProcessorFactory [collection1]  webapp=/solr path=/update params={wt=javabin&version=2}{add=[0, 1, 2, 3, 4, 5, 6, 7, 8, 9, ... (44 adds)]} 0 4
   [junit4]   2> 592436 INFO  (qtp1072197595-9189) [    x:collection1] o.a.s.u.DirectUpdateHandler2 start commit{,optimize=false,openSearcher=true,waitSearcher=true,expungeDeletes=false,softCommit=false,prepareCommit=false}
   [junit4]   2> 592436 INFO  (qtp1072197595-9189) [    x:collection1] o.a.s.u.SolrIndexWriter Calling setCommitData with IW:org.apache.solr.update.SolrIndexWriter@36e7bef7 commitCommandVersion:0
   [junit4]   2> 592447 INFO  (Thread-1446) [    ] o.a.s.h.SnapShooter Creating backup snapshot <not named> at file:///x1/jenkins/jenkins-slave/workspace/Lucene-Solr-BadApples-Tests-master/solr/build/solr-core/test/J1/temp/solr.handler.TestReplicationHandlerBackup_38F19F1C902C9E8B-001/solr-instance-001/./collection1/data/
   [junit4]   2> 592451 INFO  (qtp1072197595-9189) [    x:collection1] o.a.s.s.SolrIndexSearcher Opening [Searcher@31b66895[collection1] main]
   [junit4]   2> 592452 INFO  (qtp1072197595-9189) [    x:collection1] o.a.s.u.DirectUpdateHandler2 end_commit_flush
   [junit4]   2> 592453 INFO  (searcherExecutor-2947-thread-1-processing-x:collection1) [    x:collection1] o.a.s.c.SolrCore [collection1] Registered new searcher Searcher@31b66895[collection1] main{ExitableDirectoryReader(UninvertingDirectoryReader(Uninverting(_0(9.0.0):C44:[diagnostics={os=Linux, java.vendor=Oracle Corporation, java.version=1.8.0_191, java.vm.version=25.191-b12, lucene.version=9.0.0, os.arch=amd64, java.runtime.version=1.8.0_191-b12, source=flush, os.version=4.4.0-137-generic, timestamp=1554598683021}]:[attributes={Lucene50PostingsFormat.fstMode=OFF_HEAP, Lucene50StoredFieldsFormat.mode=BEST_SPEED}])))}
   [junit4]   2> 592453 INFO  (qtp1072197595-9189) [    x:collection1] o.a.s.u.p.LogUpdateProcessorFactory [collection1]  webapp=/solr path=/update params={waitSearcher=true&commit=true&softCommit=false&wt=javabin&version=2}{commit=} 0 17
   [junit4]   2> 592455 INFO  (Thread-1446) [    ] o.a.s.h.SnapShooter Done creating backup snapshot: <not named> at file:///x1/jenkins/jenkins-slave/workspace/Lucene-Solr-BadApples-Tests-master/solr/build/solr-core/test/J1/temp/solr.handler.TestReplicationHandlerBackup_38F19F1C902C9E8B-001/solr-instance-001/./collection1/data/
   [junit4]   2> 592459 INFO  (qtp1072197595-9184) [    x:collection1] o.a.s.c.S.Request [collection1]  webapp=/solr path=/replication params={wt=xml&command=details} status=0 QTime=0
   [junit4]   2> 593462 INFO  (TEST-TestReplicationHandlerBackup.testBackupOnCommit-seed#[38F19F1C902C9E8B]) [    ] o.a.s.SolrTestCaseJ4 ###Ending testBackupOnCommit
   [junit4]   2> 593464 INFO  (TEST-TestReplicationHandlerBackup.testBackupOnCommit-seed#[38F19F1C902C9E8B]) [    ] o.a.s.c.CoreContainer Shutting down CoreContainer instance=479245961
   [junit4]   2> 593464 INFO  (coreCloseExecutor-2951-thread-1) [    x:collection1] o.a.s.c.SolrCore [collection1]  CLOSING SolrCore org.apache.solr.core.SolrCore@46d1cce3
   [junit4]   2> 593464 INFO  (coreCloseExecutor-2951-thread-1) [    x:collection1] o.a.s.m.SolrMetricManager Closing metric reporters for registry=solr.core.collection1, tag=46d1cce3
   [junit4]   2> 593464 INFO  (coreCloseExecutor-2951-thread-1) [    x:collection1] o.a.s.m.r.SolrJmxReporter Closing reporter [org.apache.solr.metrics.reporters.SolrJmxReporter@7edfaf07: rootName = null, domain = solr.core.collection1, service url = null, agent id = null] for registry solr.core.collection1 / com.codahale.metrics.MetricRegistry@5504ba0
   [junit4]   2> 593479 INFO  (TEST-TestReplicationHandlerBackup.testBackupOnCommit-seed#[38F19F1C902C9E8B]) [    ] o.a.s.m.SolrMetricManager Closing metric reporters for registry=solr.node, tag=null
   [junit4]   2> 593479 INFO  (TEST-TestReplicationHandlerBackup.testBackupOnCommit-seed#[38F19F1C902C9E8B]) [    ] o.a.s.m.r.SolrJmxReporter Closing reporter [org.apache.solr.metrics.reporters.SolrJmxReporter@3fe792d2: rootName = null, domain = solr.node, service url = null, agent id = null] for registry solr.node / com.codahale.metrics.MetricRegistry@78399bab
   [junit4]   2> 593486 INFO  (TEST-TestReplicationHandlerBackup.testBackupOnCommit-seed#[38F19F1C902C9E8B]) [    ] o.a.s.m.SolrMetricManager Closing metric reporters for registry=solr.jvm, tag=null
   [junit4]   2> 593486 INFO  (TEST-TestReplicationHandlerBackup.testBackupOnCommit-seed#[38F19F1C902C9E8B]) [    ] o.a.s.m.r.SolrJmxReporter Closing reporter [org.apache.solr.metrics.reporters.SolrJmxReporter@4c3d3a62: rootName = null, domain = solr.jvm, service url = null, agent id = null] for registry solr.jvm / com.codahale.metrics.MetricRegistry@5cdc8f4c
   [junit4]   2> 593490 INFO  (TEST-TestReplicationHandlerBackup.testBackupOnCommit-seed#[38F19F1C902C9E8B]) [    ] o.a.s.m.SolrMetricManager Closing metric reporters for registry=solr.jetty, tag=null
   [junit4]   2> 593490 INFO  (TEST-TestReplicationHandlerBackup.testBackupOnCommit-seed#[38F19F1C902C9E8B]) [    ] o.a.s.m.r.SolrJmxReporter Closing reporter [org.apache.solr.metrics.reporters.SolrJmxReporter@60c3f61f: rootName = null, domain = solr.jetty, service url = null, agent id = null] for registry solr.jetty / com.codahale.metrics.MetricRegistry@1053a325
   [junit4]   2> 593491 INFO  (TEST-TestReplicationHandlerBackup.testBackupOnCommit-seed#[38F19F1C902C9E8B]) [    ] o.e.j.s.AbstractConnector Stopped ServerConnector@2638ba3b{HTTP/1.1,[http/1.1, h2c]}{127.0.0.1:0}
   [junit4]   2> 593491 INFO  (TEST-TestReplicationHandlerBackup.testBackupOnCommit-seed#[38F19F1C902C9E8B]) [    ] o.e.j.s.h.ContextHandler Stopped o.e.j.s.ServletContextHandler@7aaa40cb{/solr,null,UNAVAILABLE}
   [junit4]   2> 593491 INFO  (TEST-TestReplicationHandlerBackup.testBackupOnCommit-seed#[38F19F1C902C9E8B]) [    ] o.e.j.s.session node0 Stopped scavenging
   [junit4]   2> 593496 INFO  (TEST-TestReplicationHandlerBackup.doTestBackup-seed#[38F19F1C902C9E8B]) [    ] o.a.s.SolrTestCaseJ4 ###Starting doTestBackup
   [junit4]   2> 593496 INFO  (TEST-TestReplicationHandlerBackup.doTestBackup-seed#[38F19F1C902C9E8B]) [    ] o.a.s.SolrTestCaseJ4 Writing core.properties file to /x1/jenkins/jenkins-slave/workspace/Lucene-Solr-BadApples-Tests-master/solr/build/solr-core/test/J1/temp/solr.handler.TestReplicationHandlerBackup_38F19F1C902C9E8B-001/solr-instance-002/collection1
   [junit4]   2> 593500 WARN  (TEST-TestReplicationHandlerBackup.doTestBackup-seed#[38F19F1C902C9E8B]) [    ] o.e.j.s.AbstractConnector Ignoring deprecated socket close linger time
   [junit4]   2> 593500 INFO  (TEST-TestReplicationHandlerBackup.doTestBackup-seed#[38F19F1C902C9E8B]) [    ] o.a.s.c.s.e.JettySolrRunner Start Jetty (original configured port=0)
   [junit4]   2> 593500 INFO  (TEST-TestReplicationHandlerBackup.doTestBackup-seed#[38F19F1C902C9E8B]) [    ] o.a.s.c.s.e.JettySolrRunner Trying to start Jetty on port 0 try number 1 ...
   [junit4]   2> 593500 INFO  (TEST-TestReplicationHandlerBackup.doTestBackup-seed#[38F19F1C902C9E8B]) [    ] o.e.j.s.Server jetty-9.4.14.v20181114; built: 2018-11-14T21:20:31.478Z; git: c4550056e785fb5665914545889f21dc136ad9e6; jvm 1.8.0_191-b12
   [junit4]   2> 593506 INFO  (TEST-TestReplicationHandlerBackup.doTestBackup-seed#[38F19F1C902C9E8B]) [    ] o.e.j.s.session DefaultSessionIdManager workerName=node0
   [junit4]   2> 593506 INFO  (TEST-TestReplicationHandlerBackup.doTestBackup-seed#[38F19F1C902C9E8B]) [    ] o.e.j.s.session No SessionScavenger set, using defaults
   [junit4]   2> 593506 INFO  (TEST-TestReplicationHandlerBackup.doTestBackup-seed#[38F19F1C902C9E8B]) [    ] o.e.j.s.session node0 Scavenging every 600000ms
   [junit4]   2> 593506 INFO  (TEST-TestReplicationHandlerBackup.doTestBackup-seed#[38F19F1C902C9E8B]) [    ] o.e.j.s.h.ContextHandler Started o.e.j.s.ServletContextHandler@17f915bb{/solr,null,AVAILABLE}
   [junit4]   2> 593506 INFO  (TEST-TestReplicationHandlerBackup.doTestBackup-seed#[38F19F1C902C9E8B]) [    ] o.e.j.s.AbstractConnector Started ServerConnector@748aff50{HTTP/1.1,[http/1.1, h2c]}{127.0.0.1:33482}
   [junit4]   2> 593507 INFO  (TEST-TestReplicationHandlerBackup.doTestBackup-seed#[38F19F1C902C9E8B]) [    ] o.e.j.s.Server Started @593594ms
   [junit4]   2> 593507 INFO  (TEST-TestReplicationHandlerBackup.doTestBackup-seed#[38F19F1C902C9E8B]) [    ] o.a.s.c.s.e.JettySolrRunner Jetty properties: {solr.data.dir=/x1/jenkins/jenkins-slave/workspace/Lucene-Solr-BadApples-Tests-master/solr/build/solr-core/test/J1/temp/solr.handler.TestReplicationHandlerBackup_38F19F1C902C9E8B-001/solr-instance-002/collection1/data, hostContext=/solr, hostPort=33482}
   [junit4]   2> 593507 ERROR (TEST-TestReplicationHandlerBackup.doTestBackup-seed#[38F19F1C902C9E8B]) [    ] o.a.s.u.StartupLoggingUtils Missing Java Option solr.log.dir. Logging may be missing or incomplete.
   [junit4]   2> 593507 INFO  (TEST-TestReplicationHandlerBackup.doTestBackup-seed#[38F19F1C902C9E8B]) [    ] o.a.s.s.SolrDispatchFilter Using logger factory org.apache.logging.slf4j.Log4jLoggerFactory
   [junit4]   2> 593507 INFO  (TEST-TestReplicationHandlerBackup.doTestBackup-seed#[38F19F1C902C9E8B]) [    ] o.a.s.s.SolrDispatchFilter  ___      _       Welcome to Apache Solr? version 9.0.0
   [junit4]   2> 593507 INFO  (TEST-TestReplicationHandlerBackup.doTestBackup-seed#[38F19F1C902C9E8B]) [    ] o.a.s.s.SolrDispatchFilter / __| ___| |_ _   Starting in standalone mode on port null
   [junit4]   2> 593507 INFO  (TEST-TestReplicationHandlerBackup.doTestBackup-seed#[38F19F1C902C9E8B]) [    ] o.a.s.s.SolrDispatchFilter \__ \/ _ \ | '_|  Install dir: null
   [junit4]   2> 593507 INFO  (TEST-TestReplicationHandlerBackup.doTestBackup-seed#[38F19F1C902C9E8B]) [    ] o.a.s.s.SolrDispatchFilter |___/\___/_|_|    Start time: 2019-04-07T00:58:04.088Z
   [junit4]   2> 593507 INFO  (TEST-TestReplicationHandlerBackup.doTestBackup-seed#[38F19F1C902C9E8B]) [    ] o.a.s.c.SolrXmlConfig Loading container configuration from /x1/jenkins/jenkins-slave/workspace/Lucene-Solr-BadApples-Tests-master/solr/build/solr-core/test/J1/temp/solr.handler.TestReplicationHandlerBackup_38F19F1C902C9E8B-001/solr-instance-002/solr.xml
   [junit4]   2> 593512 INFO  (TEST-TestReplicationHandlerBackup.doTestBackup-seed#[38F19F1C902C9E8B]) [    ] o.a.s.c.SolrXmlConfig Configuration parameter autoReplicaFailoverWorkLoopDelay is ignored
   [junit4]   2> 593512 INFO  (TEST-TestReplicationHandlerBackup.doTestBackup-seed#[38F19F1C902C9E8B]) [    ] o.a.s.c.SolrXmlConfig Configuration parameter autoReplicaFailoverBadNodeExpiration is ignored
   [junit4]   2> 593514 INFO  (TEST-TestReplicationHandlerBackup.doTestBackup-seed#[38F19F1C902C9E8B]) [    ] o.a.s.c.SolrXmlConfig MBean server found: com.sun.jmx.mbeanserver.JmxMBeanServer@188abcb8, but no JMX reporters were configured - adding default JMX reporter.
   [junit4]   2> 593704 INFO  (TEST-TestReplicationHandlerBackup.doTestBackup-seed#[38F19F1C902C9E8B]) [    ] o.a.s.h.c.HttpShardHandlerFactory Host whitelist initialized: WhitelistHostChecker [whitelistHosts=null, whitelistHostCheckingEnabled=true]
   [junit4]   2> 593706 WARN  (TEST-TestReplicationHandlerBackup.doTestBackup-seed#[38F19F1C902C9E8B]) [    ] o.e.j.u.s.S.config No Client EndPointIdentificationAlgorithm configured for SslContextFactory@574c60b9[provider=null,keyStore=null,trustStore=null]
   [junit4]   2> 593711 WARN  (TEST-TestReplicationHandlerBackup.doTestBackup-seed#[38F19F1C902C9E8B]) [    ] o.e.j.u.s.S.config No Client EndPointIdentificationAlgorithm configured for SslContextFactory@5e2566e4[provider=null,keyStore=null,trustStore=null]
   [junit4]   2> 593737 INFO  (TEST-TestReplicationHandlerBackup.doTestBackup-seed#[38F19F1C902C9E8B]) [    ] o.a.s.c.TransientSolrCoreCacheDefault Allocating transient cache for 4 transient cores
   [junit4]   2> 593737 INFO  (TEST-TestReplicationHandlerBackup.doTestBackup-seed#[38F19F1C902C9E8B]) [    ] o.a.s.h.a.MetricsHistoryHandler No .system collection, keeping metrics history in memory.
   [junit4]   2> 593763 INFO  (TEST-TestReplicationHandlerBackup.doTestBackup-seed#[38F19F1C902C9E8B]) [    ] o.a.s.m.r.SolrJmxReporter JMX monitoring for 'solr.node' (registry 'solr.node') enabled at server: com.sun.jmx.mbeanserver.JmxMBeanServer@188abcb8
   [junit4]   2> 593777 INFO  (TEST-TestReplicationHandlerBackup.doTestBackup-seed#[38F19F1C902C9E8B]) [    ] o.a.s.m.r.SolrJmxReporter JMX monitoring for 'solr.jvm' (registry 'solr.jvm') enabled at server: com.sun.jmx.mbeanserver.JmxMBeanServer@188abcb8
   [junit4]   2> 593778 INFO  (TEST-TestReplicationHandlerBackup.doTestBackup-seed#[38F19F1C902C9E8B]) [    ] o.a.s.m.r.SolrJmxReporter JMX monitoring for 'solr.jetty' (registry 'solr.jetty') enabled at server: com.sun.jmx.mbeanserver.JmxMBeanServer@188abcb8
   [junit4]   2> 593780 INFO  (TEST-TestReplicationHandlerBackup.doTestBackup-seed#[38F19F1C902C9E8B]) [    ] o.a.s.c.CorePropertiesLocator Found 1 core definitions underneath /x1/jenkins/jenkins-slave/workspace/Lucene-Solr-BadApples-Tests-master/solr/build/solr-core/test/J1/temp/solr.handler.TestReplicationHandlerBackup_38F19F1C902C9E8B-001/solr-instance-002/.
   [junit4]   2> 593781 INFO  (TEST-TestReplicationHandlerBackup.doTestBackup-seed#[38F19F1C902C9E8B]) [    ] o.a.s.c.CorePropertiesLocator Cores are: [collection1]
   [junit4]   2> 593795 INFO  (coreLoadExecutor-2961-thread-1) [    x:collection1] o.a.s.c.SolrConfig Using Lucene MatchVersion: 9.0.0
   [junit4]   2> 593804 INFO  (coreLoadExecutor-2961-thread-1) [    x:collection1] o.a.s.s.IndexSchema [collection1] Schema name=test
   [junit4]   2> 593807 INFO  (coreLoadExecutor-2961-thread-1) [    x:collection1] o.a.s.s.IndexSchema Loaded schema test/1.2 with uniqueid field id
   [junit4]   2> 593807 INFO  (coreLoadExecutor-2961-thread-1) [    x:collection1] o.a.s.c.CoreContainer Creating SolrCore 'collection1' using configuration from instancedir /x1/jenkins/jenkins-slave/workspace/Lucene-Solr-BadApples-Tests-master/solr/build/solr-core/test/J1/temp/solr.handler.TestReplicationHandlerBackup_38F19F1C902C9E8B-001/solr-instance-002/./collection1, trusted=true
   [junit4]   2> 593807 INFO  (coreLoadExecutor-2961-thread-1) [    x:collection1] o.a.s.m.r.SolrJmxReporter JMX monitoring for 'solr.core.collection1' (registry 'solr.core.collection1') enabled at server: com.sun.jmx.mbeanserver.JmxMBeanServer@188abcb8
   [junit4]   2> 593807 INFO  (coreLoadExecutor-2961-thread-1) [    x:collection1] o.a.s.c.SolrCore [[collection1] ] Opening new SolrCore at [/x1/jenkins/jenkins-slave/workspace/Lucene-Solr-BadApples-Tests-master/solr/build/solr-core/test/J1/temp/solr.handler.TestReplicationHandlerBackup_38F19F1C902C9E8B-001/solr-instance-002/collection1], dataDir=[/x1/jenkins/jenkins-slave/workspace/Lucene-Solr-BadApples-Tests-master/solr/build/solr-core/test/J1/temp/solr.handler.TestReplicationHandlerBackup_38F19F1C902C9E8B-001/solr-instance-002/./collection1/data/]
   [junit4]   2> 593810 INFO  (coreLoadExecutor-2961-thread-1) [    x:collection1] o.a.s.u.RandomMergePolicy RandomMergePolicy wrapping class org.apache.lucene.index.TieredMergePolicy: [TieredMergePolicy: maxMergeAtOnce=36, maxMergeAtOnceExplicit=18, maxMergedSegmentMB=95.11328125, floorSegmentMB=0.3125, forceMergeDeletesPctAllowed=12.050444805499968, segmentsPerTier=48.0, maxCFSSegmentSizeMB=8.796093022207999E12, noCFSRatio=1.0, deletesPctAllowed=28.53377165818116
   [junit4]   2> 593867 INFO  (coreLoadExecutor-2961-thread-1) [    x:collection1] o.a.s.u.CommitTracker Hard AutoCommit: disabled
   [junit4]   2> 593867 INFO  (coreLoadExecutor-2961-thread-1) [    x:collection1] o.a.s.u.CommitTracker Soft AutoCommit: disabled
   [junit4]   2> 593869 INFO  (coreLoadExecutor-2961-thread-1) [    x:collection1] o.a.s.u.RandomMergePolicy RandomMergePolicy wrapping class org.apache.lucene.index.TieredMergePolicy: [TieredMergePolicy: maxMergeAtOnce=44, maxMergeAtOnceExplicit=30, maxMergedSegmentMB=31.1171875, floorSegmentMB=0.9140625, forceMergeDeletesPctAllowed=2.5453452317182723, segmentsPerTier=46.0, maxCFSSegmentSizeMB=8.796093022207999E12, noCFSRatio=0.16352688042986507, deletesPctAllowed=27.356078448226732
   [junit4]   2> 593869 INFO  (coreLoadExecutor-2961-thread-1) [    x:collection1] o.a.s.s.SolrIndexSearcher Opening [Searcher@72b4269a[collection1] main]
   [junit4]   2> 593869 INFO  (coreLoadExecutor-2961-thread-1) [    x:collection1] o.a.s.r.ManagedResourceStorage File-based storage initialized to use dir: /x1/jenkins/jenkins-slave/workspace/Lucene-Solr-BadApples-Tests-master/solr/build/solr-core/test/J1/temp/solr.handler.TestReplicationHandlerBackup_38F19F1C902C9E8B-001/solr-instance-002/collection1/conf
   [junit4]   2> 593870 INFO  (coreLoadExecutor-2961-thread-1) [    x:collection1] o.a.s.h.ReplicationHandler Replication enabled for following config files: schema-replication2.xml:schema.xml
   [junit4]   2> 593870 INFO  (coreLoadExecutor-2961-thread-1) [    x:collection1] o.a.s.h.ReplicationHandler Commits will be reserved for 10000ms.
   [junit4]   2> 593871 INFO  (searcherExecutor-2962-thread-1-processing-x:collection1) [    x:collection1] o.a.s.c.SolrCore [collection1] Registered new searcher Searcher@72b4269a[collection1] main{ExitableDirectoryReader(UninvertingDirectoryReader())}
   [junit4]   2> 594374 INFO  (qtp1327802108-9216) [    x:collection1] o.a.s.u.DirectUpdateHandler2 [collection1] REMOVING ALL DOCUMENTS FROM INDEX
   [junit4]   2> 594374 INFO  (qtp1327802108-9216) [    x:collection1] o.a.s.u.p.LogUpdateProcessorFactory [collection1]  webapp=/solr path=/update params={wt=javabin&version=2}{deleteByQuery=*:*} 0 0
   [junit4]   2> 594375 INFO  (TEST-TestReplicationHandlerBackup.doTestBackup-seed#[38F19F1C902C9E8B]) [    ] o.a.s.h.BackupRestoreUtils Indexing 69 test docs
   [junit4]   2> 594379 INFO  (qtp1327802108-9217) [    x:collection1] o.a.s.u.p.LogUpdateProcessorFactory [collection1]  webapp=/solr path=/update params={wt=javabin&version=2}{add=[0, 1, 2, 3, 4, 5, 6, 7, 8, 9, ... (69 adds)]} 0 3
   [junit4]   2> 594379 INFO  (qtp1327802108-9218) [    x:collection1] o.a.s.u.DirectUpdateHandler2 start commit{,optimize=false,openSearcher=true,waitSearcher=true,expungeDeletes=false,softCommit=false,prepareCommit=false}
   [junit4]   2> 594379 INFO  (qtp1327802108-9218) [    x:collection1] o.a.s.u.SolrIndexWriter Calling setCommitData with IW:org.apache.solr.update.SolrIndexWriter@44ada64e commitCommandVersion:0
   [junit4]   2> 594384 INFO  (qtp1327802108-9218) [    x:collection1] o.a.s.s.SolrIndexSearcher Opening [Searcher@7f15e859[collection1] main]
   [junit4]   2> 594384 INFO  (qtp1327802108-9218) [    x:collection1] o.a.s.u.DirectUpdateHandler2 end_commit_flush
   [junit4]   2> 594386 INFO  (searcherExecutor-2962-thread-1-processing-x:collection1) [    x:collection1] o.a.s.c.SolrCore [collection1] Registered new searcher Searcher@7f15e859[collection1] main{ExitableDirectoryReader(UninvertingDirectoryReader(Uninverting(_0(9.0.0):C69:[diagnostics={os=Linux, java.vendor=Oracle Corporation, java.version=1.8.0_191, java.vm.version=25.191-b12, lucene.version=9.0.0, os.arch=amd64, java.runtime.version=1.8.0_191-b12, source=flush, os.version=4.4.0-137-generic, timestamp=1554598684962}]:[attributes={Lucene50PostingsFormat.fstMode=OFF_HEAP, Lucene50StoredFieldsFormat.mode=BEST_SPEED}])))}
   [junit4]   2> 594386 INFO  (qtp1327802108-9218) [    x:collection1] o.a.s.u.p.LogUpdateProcessorFactory [collection1]  webapp=/solr path=/update params={waitSearcher=true&commit=true&softCommit=false&wt=javabin&version=2}{commit=} 0 6
   [junit4]   2> 594386 INFO  (Thread-1457) [    ] o.a.s.h.SnapShooter Creating backup snapshot <not named> at file:///x1/jenkins/jenkins-slave/workspace/Lucene-Solr-BadApples-Tests-master/solr/build/solr-core/test/J1/temp/solr.handler.TestReplicationHandlerBackup_38F19F1C902C9E8B-001/solr-instance-002/./collection1/data/
   [junit4]   2> 594388 INFO  (qtp1327802108-9215) [    x:collection1] o.a.s.c.S.Request [collection1]  webapp=/solr path=/replication params={wt=xml&command=details} status=0 QTime=0
   [junit4]   2> 594389 INFO  (Thread-1457) [    ] o.a.s.h.SnapShooter Done creating backup snapshot: <not named> at file:///x1/jenkins/jenkins-slave/workspace/Lucene-Solr-BadApples-Tests-master/solr/build/solr-core/test/J1/temp/solr.handler.TestReplicationHandlerBackup_38F19F1C902C9E8B-001/solr-instance-002/./collection1/data/
   [junit4]   2> 595389 INFO  (qtp1327802108-9216) [    x:collection1] o.a.s.c.S.Request [collection1]  webapp=/solr path=/replication params={wt=xml&command=details} status=0 QTime=0
   [junit4]   2> 596398 INFO  (qtp1327802108-9218) [    x:collection1] o.a.s.c.S.Request [collection1]  webapp=/solr path=/replication params={name=ri&wt=xml&command=backup} status=0 QTime=0
   [junit4]   2> 596398 INFO  (Thread-1458) [    ] o.a.s.h.SnapShooter Creating backup snapshot ri at file:///x1/jenkins/jenkins-slave/workspace/Lucene-Solr-BadApples-Tests-master/solr/build/solr-core/test/J1/temp/solr.handler.TestReplicationHandlerBackup_38F19F1C902C9E8B-001/solr-instance-002/./collection1/data/
   [junit4]   2> 596402 INFO  (Thread-1458) [    ] o.a.s.h.SnapShooter Done creating backup snapshot: ri at file:///x1/jenkins/jenkins-slave/workspace/Lucene-Solr-BadApples-Tests-master/solr/build/solr-core/test/J1/temp/solr.handler.TestReplicationHandlerBackup_38F19F1C902C9E8B-001/solr-instance-002/./collection1/data/
   [junit4]   2> 596408 INFO  (qtp1327802108-9214) [    x:collection1] o.a.s.c.S.Request [collection1]  webapp=/solr path=/replication params={wt=xml&command=details} status=0 QTime=1
   [junit4]   2> 597413 INFO  (qtp1327802108-9215) [    x:collection1] o.a.s.c.S.Request [collection1]  webapp=/solr path=/replication params={name=sybhdtmttutoofjq&wt=xml&command=backup} status=0 QTime=1
   [junit4]   2> 597413 INFO  (Thread-1459) [    ] o.a.s.h.SnapShooter Creating backup snapshot sybhdtmttutoofjq at file:///x1/jenkins/jenkins-slave/workspace/Lucene-Solr-BadApples-Tests-master/solr/build/solr-core/test/J1/temp/solr.handler.TestReplicationHandlerBackup_38F19F1C902C9E8B-001/solr-instance-002/./collection1/data/
   [junit4]   2> 597415 INFO  (qtp1327802108-9216) [    x:collection1] o.a.s.c.S.Request [collection1]  webapp=/solr path=/replication params={wt=xml&command=details} status=0 QTime=0
   [junit4]   2> 597418 INFO  (Thread-1459) [    ] o.a.s.h.SnapShooter Done creating backup snapshot: sybhdtmttutoofjq at file:///x1/jenkins/jenkins-slave/workspace/Lucene-Solr-BadApples-Tests-master/solr/build/solr-core/test/J1/temp/solr.handler.TestReplicationHandlerBackup_38F19F1C902C9E8B-001/solr-instance-002/./collection1/data/
   [junit4]   2> 598421 ERROR (qtp1327802108-9217) [    x:collection1] o.a.s.h.RequestHandlerBase org.apache.solr.common.SolrException: Snapshot directory already exists: file:///x1/jenkins/jenkins-slave/workspace/Lucene-Solr-BadApples-Tests-master/solr/build/solr-core/test/J1/temp/solr.handler.TestReplicationHandlerBackup_38F19F1C902C9E8B-001/solr-instance-002/./collection1/data/snapshot.ri/
   [junit4]   2> 	at org.apache.solr.handler.SnapShooter.validateCreateSnapshot(SnapShooter.java:146)
   [junit4]   2> 	at org.apache.solr.handler.ReplicationHandler.doSnapShoot(ReplicationHandler.java:581)
   [junit4]   2> 	at org.apache.solr.handler.ReplicationHandler.handleRequestBody(ReplicationHandler.java:277)
   [junit4]   2> 	at org.apache.solr.handler.RequestHandlerBase.handleRequest(RequestHandlerBase.java:199)
   [junit4]   2> 	at org.apache.solr.core.SolrCore.execute(SolrCore.java:2566)
   [junit4]   2> 	at org.apache.solr.servlet.HttpSolrCall.execute(HttpSolrCall.java:744)
   [junit4]   2> 	at org.apache.solr.servlet.HttpSolrCall.call(HttpSolrCall.java:530)
   [junit4]   2> 	at org.apache.solr.servlet.SolrDispatchFilter.doFilter(SolrDispatchFilter.java:397)
   [junit4]   2> 	at org.apache.solr.servlet.SolrDispatchFilter.doFilter(SolrDispatchFilter.java:343)
   [junit4]   2> 	at org.eclipse.jetty.servlet.ServletHandler$CachedChain.doFilter(ServletHandler.java:1610)
   [junit4]   2> 	at org.apache.solr.client.solrj.embedded.JettySolrRunner$DebugFilter.doFilter(JettySolrRunner.java:165)
   [junit4]   2> 	at org.eclipse.jetty.servlet.ServletHandler$CachedChain.doFilter(ServletHandler.java:1610)
   [junit4]   2> 	at org.eclipse.jetty.servlet.ServletHandler.doHandle(ServletHandler.java:540)
   [junit4]   2> 	at org.eclipse.jetty.server.handler.ScopedHandler.nextHandle(ScopedHandler.java:255)
   [junit4]   2> 	at org.eclipse.jetty.server.session.SessionHandler.doHandle(SessionHandler.java:1588)
   [junit4]   2> 	at org.eclipse.jetty.server.handler.ScopedHandler.nextHandle(ScopedHandler.java:255)
   [junit4]   2> 	at org.eclipse.jetty.server.handler.ContextHandler.doHandle(ContextHandler.java:1345)
   [junit4]   2> 	at org.eclipse.jetty.server.handler.ScopedHandler.nextScope(ScopedHandler.java:203)
   [junit4]   2> 	at org.eclipse.jetty.servlet.ServletHandler.doScope(ServletHandler.java:480)
   [junit4]   2> 	at org.eclipse.jetty.server.session.SessionHandler.doScope(SessionHandler.java:1557)
   [junit4]   2> 	at org.eclipse.jetty.server.handler.ScopedHandler.nextScope(ScopedHandler.java:201)
   [junit4]   2> 	at org.eclipse.jetty.server.handler.ContextHandler.doScope(ContextHandler.java:1247)
   [junit4]   2> 	at org.eclipse.jetty.server.handler.ScopedHandler.handle(ScopedHandler.java:144)
   [junit4]   2> 	at org.eclipse.jetty.server.handler.gzip.GzipHandler.handle(GzipHandler.java:753)
   [junit4]   2> 	at org.eclipse.jetty.server.handler.HandlerWrapper.handle(HandlerWrapper.java:132)
   [junit4]   2> 	at org.eclipse.jetty.server.Server.handle(Server.java:502)
   [junit4]   2> 	at org.eclipse.jetty.server.HttpChannel.handle(HttpChannel.java:364)
   [junit4]   2> 	at org.eclipse.jetty.server.HttpConnection.onFillable(HttpConnection.java:260)
   [junit4]   2> 	at org.eclipse.jetty.io.AbstractConnection$ReadCallback.succeeded(AbstractConnection.java:305)
   [junit4]   2> 	at org.eclipse.jetty.io.FillInterest.fillable(FillInterest.java:103)
   [junit4]   2> 	at org.eclipse.jetty.io.ChannelEndPoint$2.run(ChannelEndPoint.java:118)
   [junit4]   2> 	at org.eclipse.jetty.util.thread.QueuedThreadPool.runJob(QueuedThreadPool.java:765)
   [junit4]   2> 	at org.eclipse.jetty.util.thread.QueuedThreadPool$2.run(QueuedThreadPool.java:683)
   [junit4]   2> 	at java.lang.Thread.run(Thread.java:748)
   [junit4]   2> 
   [junit4]   2> 598421 INFO  (qtp1327802108-9217) [    x:collection1] o.a.s.c.S.Request [collection1]  webapp=/solr path=/replication params={name=ri&wt=xml&command=backup} status=400 QTime=1
   [junit4]   2> 598422 INFO  (TEST-TestReplicationHandlerBackup.doTestBackup-seed#[38F19F1C902C9E8B]) [    ] o.a.s.SolrTestCaseJ4 ###Ending doTestBackup
   [junit4]   2> 598424 INFO  (TEST-TestReplicationHandlerBackup.doTestBackup-seed#[38F19F1C902C9E8B]) [    ] o.a.s.c.CoreContainer Shutting down CoreContainer instance=916275887
   [junit4]   2> 598425 INFO  (coreCloseExecutor-2966-thread-1) [    x:collection1] o.a.s.c.SolrCore [collection1]  CLOSING SolrCore org.apache.solr.core.SolrCore@54af8af8
   [junit4]   2> 598425 INFO  (coreCloseExecutor-2966-thread-1) [    x:collection1] o.a.s.m.SolrMetricManager Closing metric reporters for registry=solr.core.collection1, tag=54af8af8
   [junit4]   2> 598425 INFO  (coreCloseExecutor-2966-thread-1) [    x:collection1] o.a.s.m.r.SolrJmxReporter Closing reporter [org.apache.solr.metrics.reporters.SolrJmxReporter@c1d53e3: rootName = null, domain = solr.core.collection1, service url = null, agent id = null] for registry solr.core.collection1 / com.codahale.metrics.MetricRegistry@3cb255ab
   [junit4]   2> 598442 INFO  (TEST-TestReplicationHandlerBackup.doTestBackup-seed#[38F19F1C902C9E8B]) [    ] o.a.s.m.SolrMetricManager Closing metric reporters for registry=solr.node, tag=null
   [junit4]   2> 598442 INFO  (TEST-TestReplicationHandlerBackup.doTestBackup-seed#[38F19F1C902C9E8B]) [    ] o.a.s.m.r.SolrJmxReporter Closing reporter [org.apache.solr.metrics.reporters.SolrJmxReporter@5f0daf18: rootName = null, domain = solr.node, service url = null, agent id = null] for registry solr.node / com.codahale.metrics.MetricRegistry@1550a31d
   [junit4]   2> 598450 INFO  (TEST-TestReplicationHandlerBackup.doTestBackup-seed#[38F19F1C902C9E8B]) [    ] o.a.s.m.SolrMetricManager Closing metric reporters for registry=solr.jvm, tag=null
   [junit4]   2> 598450 INFO  (TEST-TestReplicationHandlerBackup.doTestBackup-seed#[38F19F1C902C9E8B]) [    ] o.a.s.m.r.SolrJmxReporter Closing reporter [org.apache.solr.metrics.reporters.SolrJmxReporter@22a1e514: rootName = null, domain = solr.jvm, service url = null, agent id = null] for registry solr.jvm / com.codahale.metrics.MetricRegistry@5cdc8f4c
   [junit4]   2> 598454 INFO  (TEST-TestReplicationHandlerBackup.doTestBackup-seed#[38F19F1C902C9E8B]) [    ] o.a.s.m.SolrMetricManager Closing metric reporters for registry=solr.jetty, tag=null
   [junit4]   2> 598454 INFO  (TEST-TestReplicationHandlerBackup.doTestBackup-seed#[38F19F1C902C9E8B]) [    ] o.a.s.m.r.SolrJmxReporter Closing reporter [org.apache.solr.metrics.reporters.SolrJmxReporter@45a695da: rootName = null, domain = solr.jetty, service url = null, agent id = null] for registry solr.jetty / com.codahale.metrics.MetricRegistry@1053a325
   [junit4]   2> 598457 INFO  (TEST-TestReplicationHandlerBackup.doTestBackup-seed#[38F19F1C902C9E8B]) [    ] o.e.j.s.AbstractConnector Stopped ServerConnector@748aff50{HTTP/1.1,[http/1.1, h2c]}{127.0.0.1:0}
   [junit4]   2> 598457 INFO  (TEST-TestReplicationHandlerBackup.doTestBackup-seed#[38F19F1C902C9E8B]) [    ] o.e.j.s.h.ContextHandler Stopped o.e.j.s.ServletContextHandler@17f915bb{/solr,null,UNAVAILABLE}
   [junit4]   2> 598457 INFO  (TEST-TestReplicationHandlerBackup.doTestBackup-seed#[38F19F1C902C9E8B]) [    ] o.e.j.s.session node0 Stopped scavenging
   [junit4]   2> NOTE: reproduce with: ant test  -Dtestcase=TestReplicationHandlerBackup -Dtests.method=doTestBackup -Dtests.seed=38F19F1C902C9E8B -Dtests.multiplier=2 -Dtests.slow=true -Dtests.badapples=true -Dtests.locale=be -Dtests.timezone=Asia/Jayapura -Dtests.asserts=true -Dtests.file.encoding=US-ASCII
   [junit4] ERROR   4.97s J1 | TestReplicationHandlerBackup.doTestBackup <<<
   [junit4]    > Throwable #1: java.io.IOException: Server returned HTTP response code: 400 for URL: http://127.0.0.1:33482/solr/collection1/replication?wt=xml&command=backup&name=ri
   [junit4]    > 	at __randomizedtesting.SeedInfo.seed([38F19F1C902C9E8B:797ABF79B7926DC4]:0)
   [junit4]    > 	at sun.net.www.protocol.http.HttpURLConnection.getInputStream0(HttpURLConnection.java:1894)
   [junit4]    > 	at sun.net.www.protocol.http.HttpURLConnection.getInputStream(HttpURLConnection.java:1492)
   [junit4]    > 	at java.net.URL.openStream(URL.java:1045)
   [junit4]    > 	at org.apache.solr.handler.TestReplicationHandlerBackup.runBackupCommand(TestReplicationHandlerBackup.java:274)
   [junit4]    > 	at org.apache.solr.handler.TestReplicationHandlerBackup.doTestBackup(TestReplicationHandlerBackup.java:188)
   [junit4]    > 	at java.lang.Thread.run(Thread.java:748)
   [junit4]   2> NOTE: leaving temporary files on disk at: /x1/jenkins/jenkins-slave/workspace/Lucene-Solr-BadApples-Tests-master/solr/build/solr-core/test/J1/temp/solr.handler.TestReplicationHandlerBackup_38F19F1C902C9E8B-001
   [junit4]   2> NOTE: test params are: codec=CheapBastard, sim=Asserting(org.apache.lucene.search.similarities.AssertingSimilarity@3510b96), locale=be, timezone=Asia/Jayapura
   [junit4]   2> NOTE: Linux 4.4.0-137-generic amd64/Oracle Corporation 1.8.0_191 (64-bit)/cpus=4,threads=1,free=98478216,total=505413632
   [junit4]   2> NOTE: All tests run in this JVM: [MetricsHandlerTest, SolrRrdBackendFactoryTest, TermVectorComponentDistributedTest, HdfsCollectionsAPIDistributedZkTest, TestScoreJoinQPScore, BasicAuthIntegrationTest, RequestHandlersTest, TestFieldTypeResource, SharedFSAutoReplicaFailoverTest, BasicDistributedZk2Test, SolrCoreCheckLockOnStartupTest, HighlighterMaxOffsetTest, SyncSliceTest, TestInPlaceUpdatesDistrib, TestSolrXml, RequestLoggingTest, SpatialHeatmapFacetsTest, TestCloudSchemaless, JWTAuthPluginTest, TestZkChroot, TestDistributedStatsComponentCardinality, TestLuceneMatchVersion, OverseerRolesTest, IndexSchemaTest, TestConfigSets, BaseCdcrDistributedZkTest, SolrSlf4jReporterTest, TestCopyFieldCollectionResource, StatsReloadRaceTest, TestDistribIDF, NoCacheHeaderTest, DistributedFacetPivotWhiteBoxTest, ForceLeaderWithTlogReplicasTest, TestLeaderElectionZkExpiry, FileUtilsTest, PrimUtilsTest, TestRTimerTree, SystemLogListenerTest, TestExtendedDismaxParser, SolrInfoBeanTest, VersionInfoTest, TestCloudPhrasesIdentificationComponent, TestSegmentSorting, TestSolrCloudSnapshots, PluginInfoTest, DistribDocExpirationUpdateProcessorTest, UnloadDistributedZkTest, TestOnReconnectListenerSupport, MinimalSchemaTest, BasicFunctionalityTest, AddBlockUpdateTest, HdfsWriteToMultipleCollectionsTest, RestartWhileUpdatingTest, TestManagedSchemaThreadSafety, TestDocTermOrds, TestPivotHelperCode, ScheduledTriggerTest, TestOverriddenPrefixQueryForCustomFieldType, TestQuerySenderListener, QueryEqualityTest, TestSmileRequest, TransactionLogTest, TestSolrDeletionPolicy1, TestReplicationHandlerBackup]
   [junit4] Completed [174/851 (1!)] on J1 in 7.26s, 2 tests, 1 error <<< FAILURES!

[...truncated 51581 lines...]
[asciidoctor:convert] asciidoctor: ERROR: about-this-guide.adoc: line 1: invalid part, must have at least one section (e.g., chapter, appendix, etc.)
[asciidoctor:convert] asciidoctor: ERROR: solr-glossary.adoc: line 1: invalid part, must have at least one section (e.g., chapter, appendix, etc.)
     [java] Processed 2522 links (2063 relative) to 3350 anchors in 253 files
     [echo] Validated Links & Anchors via: /x1/jenkins/jenkins-slave/workspace/Lucene-Solr-BadApples-Tests-master/solr/build/solr-ref-guide/bare-bones-html/

-documentation-lint:
    [jtidy] Checking for broken html (such as invalid tags)...
   [delete] Deleting directory /x1/jenkins/jenkins-slave/workspace/Lucene-Solr-BadApples-Tests-master/lucene/build/jtidy_tmp
     [echo] Checking for broken links...
     [exec] 
     [exec] Crawl/parse...
     [exec] 
     [exec] Verify...
     [echo] Checking for malformed docs...

jar-checksums:

resolve:

ivy-availability-check:
[loadresource] Do not set property disallowed.ivy.jars.list as its length is 0.

-ivy-fail-disallowed-ivy-version:

ivy-fail:

ivy-configure:
[ivy:configure] :: loading settings :: file = /x1/jenkins/jenkins-slave/workspace/Lucene-Solr-BadApples-Tests-master/lucene/top-level-ivy-settings.xml

resolve:

ivy-availability-check:
[loadresource] Do not set property disallowed.ivy.jars.list as its length is 0.

-ivy-fail-disallowed-ivy-version:

ivy-fail:

ivy-configure:
[ivy:configure] :: loading settings :: file = /x1/jenkins/jenkins-slave/workspace/Lucene-Solr-BadApples-Tests-master/lucene/top-level-ivy-settings.xml

resolve:

resolve:

ivy-availability-check:
[loadresource] Do not set property disallowed.ivy.jars.list as its length is 0.

-ivy-fail-disallowed-ivy-version:

ivy-fail:

ivy-configure:
[ivy:configure] :: loading settings :: file = /x1/jenkins/jenkins-slave/workspace/Lucene-Solr-BadApples-Tests-master/lucene/top-level-ivy-settings.xml

resolve:

ivy-availability-check:
[loadresource] Do not set property disallowed.ivy.jars.list as its length is 0.

-ivy-fail-disallowed-ivy-version:

ivy-fail:

ivy-configure:
[ivy:configure] :: loading settings :: file = /x1/jenkins/jenkins-slave/workspace/Lucene-Solr-BadApples-Tests-master/lucene/top-level-ivy-settings.xml

resolve:

ivy-availability-check:
[loadresource] Do not set property disallowed.ivy.jars.list as its length is 0.

-ivy-fail-disallowed-ivy-version:

ivy-fail:

ivy-configure:
[ivy:configure] :: loading settings :: file = /x1/jenkins/jenkins-slave/workspace/Lucene-Solr-BadApples-Tests-master/lucene/top-level-ivy-settings.xml

resolve:

ivy-availability-check:
[loadresource] Do not set property disallowed.ivy.jars.list as its length is 0.

-ivy-fail-disallowed-ivy-version:

ivy-fail:

ivy-configure:
[ivy:configure] :: loading settings :: file = /x1/jenkins/jenkins-slave/workspace/Lucene-Solr-BadApples-Tests-master/lucene/top-level-ivy-settings.xml

resolve:

ivy-availability-check:
[loadresource] Do not set property disallowed.ivy.jars.list as its length is 0.

-ivy-fail-disallowed-ivy-version:

ivy-fail:

ivy-configure:
[ivy:configure] :: loading settings :: file = /x1/jenkins/jenkins-slave/workspace/Lucene-Solr-BadApples-Tests-master/lucene/top-level-ivy-settings.xml

resolve:

ivy-availability-check:
[loadresource] Do not set property disallowed.ivy.jars.list as its length is 0.

-ivy-fail-disallowed-ivy-version:

ivy-fail:

ivy-configure:
[ivy:configure] :: loading settings :: file = /x1/jenkins/jenkins-slave/workspace/Lucene-Solr-BadApples-Tests-master/lucene/top-level-ivy-settings.xml

resolve:

ivy-availability-check:
[loadresource] Do not set property disallowed.ivy.jars.list as its length is 0.

-ivy-fail-disallowed-ivy-version:

ivy-fail:

ivy-configure:
[ivy:configure] :: loading settings :: file = /x1/jenkins/jenkins-slave/workspace/Lucene-Solr-BadApples-Tests-master/lucene/top-level-ivy-settings.xml

resolve:

ivy-availability-check:
[loadresource] Do not set property disallowed.ivy.jars.list as its length is 0.

-ivy-fail-disallowed-ivy-version:

ivy-fail:

ivy-configure:
[ivy:configure] :: loading settings :: file = /x1/jenkins/jenkins-slave/workspace/Lucene-Solr-BadApples-Tests-master/lucene/top-level-ivy-settings.xml

resolve:

ivy-availability-check:
[loadresource] Do not set property disallowed.ivy.jars.list as its length is 0.

-ivy-fail-disallowed-ivy-version:

ivy-fail:

ivy-configure:
[ivy:configure] :: loading settings :: file = /x1/jenkins/jenkins-slave/workspace/Lucene-Solr-BadApples-Tests-master/lucene/top-level-ivy-settings.xml

resolve:

ivy-availability-check:
[loadresource] Do not set property disallowed.ivy.jars.list as its length is 0.

-ivy-fail-disallowed-ivy-version:

ivy-fail:

ivy-configure:
[ivy:configure] :: loading settings :: file = /x1/jenkins/jenkins-slave/workspace/Lucene-Solr-BadApples-Tests-master/lucene/top-level-ivy-settings.xml

resolve:

ivy-availability-check:
[loadresource] Do not set property disallowed.ivy.jars.list as its length is 0.

-ivy-fail-disallowed-ivy-version:

ivy-fail:

ivy-configure:
[ivy:configure] :: loading settings :: file = /x1/jenkins/jenkins-slave/workspace/Lucene-Solr-BadApples-Tests-master/lucene/top-level-ivy-settings.xml

resolve:

ivy-availability-check:
[loadresource] Do not set property disallowed.ivy.jars.list as its length is 0.

-ivy-fail-disallowed-ivy-version:

ivy-fail:

ivy-configure:
[ivy:configure] :: loading settings :: file = /x1/jenkins/jenkins-slave/workspace/Lucene-Solr-BadApples-Tests-master/lucene/top-level-ivy-settings.xml

resolve:

ivy-availability-check:
[loadresource] Do not set property disallowed.ivy.jars.list as its length is 0.

-ivy-fail-disallowed-ivy-version:

ivy-fail:

ivy-configure:
[ivy:configure] :: loading settings :: file = /x1/jenkins/jenkins-slave/workspace/Lucene-Solr-BadApples-Tests-master/lucene/top-level-ivy-settings.xml

resolve:

ivy-availability-check:
[loadresource] Do not set property disallowed.ivy.jars.list as its length is 0.

-ivy-fail-disallowed-ivy-version:

ivy-fail:

ivy-configure:
[ivy:configure] :: loading settings :: file = /x1/jenkins/jenkins-slave/workspace/Lucene-Solr-BadApples-Tests-master/lucene/top-level-ivy-settings.xml

resolve:

ivy-availability-check:
[loadresource] Do not set property disallowed.ivy.jars.list as its length is 0.

-ivy-fail-disallowed-ivy-version:

ivy-fail:

ivy-configure:
[ivy:configure] :: loading settings :: file = /x1/jenkins/jenkins-slave/workspace/Lucene-Solr-BadApples-Tests-master/lucene/top-level-ivy-settings.xml

resolve:

ivy-availability-check:
[loadresource] Do not set property disallowed.ivy.jars.list as its length is 0.

-ivy-fail-disallowed-ivy-version:

ivy-fail:

ivy-configure:
[ivy:configure] :: loading settings :: file = /x1/jenkins/jenkins-slave/workspace/Lucene-Solr-BadApples-Tests-master/lucene/top-level-ivy-settings.xml

resolve:

ivy-availability-check:
[loadresource] Do not set property disallowed.ivy.jars.list as its length is 0.

-ivy-fail-disallowed-ivy-version:

ivy-fail:

ivy-configure:
[ivy:configure] :: loading settings :: file = /x1/jenkins/jenkins-slave/workspace/Lucene-Solr-BadApples-Tests-master/lucene/top-level-ivy-settings.xml

resolve:

ivy-availability-check:
[loadresource] Do not set property disallowed.ivy.jars.list as its length is 0.

-ivy-fail-disallowed-ivy-version:

ivy-fail:

ivy-configure:
[ivy:configure] :: loading settings :: file = /x1/jenkins/jenkins-slave/workspace/Lucene-Solr-BadApples-Tests-master/lucene/top-level-ivy-settings.xml

resolve:

ivy-availability-check:
[loadresource] Do not set property disallowed.ivy.jars.list as its length is 0.

-ivy-fail-disallowed-ivy-version:

ivy-fail:

ivy-configure:
[ivy:configure] :: loading settings :: file = /x1/jenkins/jenkins-slave/workspace/Lucene-Solr-BadApples-Tests-master/lucene/top-level-ivy-settings.xml

resolve:

ivy-availability-check:
[loadresource] Do not set property disallowed.ivy.jars.list as its length is 0.

-ivy-fail-disallowed-ivy-version:

ivy-fail:

ivy-configure:
[ivy:configure] :: loading settings :: file = /x1/jenkins/jenkins-slave/workspace/Lucene-Solr-BadApples-Tests-master/lucene/top-level-ivy-settings.xml

resolve:

ivy-availability-check:
[loadresource] Do not set property disallowed.ivy.jars.list as its length is 0.

-ivy-fail-disallowed-ivy-version:

ivy-fail:

ivy-configure:
[ivy:configure] :: loading settings :: file = /x1/jenkins/jenkins-slave/workspace/Lucene-Solr-BadApples-Tests-master/lucene/top-level-ivy-settings.xml

resolve:

ivy-availability-check:
[loadresource] Do not set property disallowed.ivy.jars.list as its length is 0.

-ivy-fail-disallowed-ivy-version:

ivy-fail:

ivy-configure:
[ivy:configure] :: loading settings :: file = /x1/jenkins/jenkins-slave/workspace/Lucene-Solr-BadApples-Tests-master/lucene/top-level-ivy-settings.xml

resolve:

ivy-availability-check:
[loadresource] Do not set property disallowed.ivy.jars.list as its length is 0.

-ivy-fail-disallowed-ivy-version:

ivy-fail:

ivy-configure:
[ivy:configure] :: loading settings :: file = /x1/jenkins/jenkins-slave/workspace/Lucene-Solr-BadApples-Tests-master/lucene/top-level-ivy-settings.xml

resolve:

ivy-availability-check:
[loadresource] Do not set property disallowed.ivy.jars.list as its length is 0.

-ivy-fail-disallowed-ivy-version:

ivy-fail:

ivy-configure:
[ivy:configure] :: loading settings :: file = /x1/jenkins/jenkins-slave/workspace/Lucene-Solr-BadApples-Tests-master/lucene/top-level-ivy-settings.xml

common.resolve:

resolve:

ivy-availability-check:
[loadresource] Do not set property disallowed.ivy.jars.list as its length is 0.

-ivy-fail-disallowed-ivy-version:

ivy-fail:

ivy-configure:
[ivy:configure] :: loading settings :: file = /x1/jenkins/jenkins-slave/workspace/Lucene-Solr-BadApples-Tests-master/lucene/top-level-ivy-settings.xml

resolve:

ivy-availability-check:
[loadresource] Do not set property disallowed.ivy.jars.list as its length is 0.

-ivy-fail-disallowed-ivy-version:

ivy-fail:

ivy-configure:
[ivy:configure] :: loading settings :: file = /x1/jenkins/jenkins-slave/workspace/Lucene-Solr-BadApples-Tests-master/lucene/top-level-ivy-settings.xml

resolve:

ivy-availability-check:
[loadresource] Do not set property disallowed.ivy.jars.list as its length is 0.

-ivy-fail-disallowed-ivy-version:

ivy-fail:

ivy-configure:
[ivy:configure] :: loading settings :: file = /x1/jenkins/jenkins-slave/workspace/Lucene-Solr-BadApples-Tests-master/lucene/top-level-ivy-settings.xml

resolve:

ivy-availability-check:
[loadresource] Do not set property disallowed.ivy.jars.list as its length is 0.

-ivy-fail-disallowed-ivy-version:

ivy-fail:

ivy-configure:
[ivy:configure] :: loading settings :: file = /x1/jenkins/jenkins-slave/workspace/Lucene-Solr-BadApples-Tests-master/lucene/top-level-ivy-settings.xml

resolve:

ivy-availability-check:
[loadresource] Do not set property disallowed.ivy.jars.list as its length is 0.

-ivy-fail-disallowed-ivy-version:

ivy-fail:

ivy-configure:
[ivy:configure] :: loading settings :: file = /x1/jenkins/jenkins-slave/workspace/Lucene-Solr-BadApples-Tests-master/lucene/top-level-ivy-settings.xml

resolve:

jar-checksums:
    [mkdir] Created dir: /x1/jenkins/jenkins-slave/workspace/Lucene-Solr-BadApples-Tests-master/lucene/null2072691139
     [copy] Copying 36 files to /x1/jenkins/jenkins-slave/workspace/Lucene-Solr-BadApples-Tests-master/lucene/null2072691139
   [delete] Deleting directory /x1/jenkins/jenkins-slave/workspace/Lucene-Solr-BadApples-Tests-master/lucene/null2072691139

resolve-example:

ivy-availability-check:
[loadresource] Do not set property disallowed.ivy.jars.list as its length is 0.

-ivy-fail-disallowed-ivy-version:

ivy-fail:

ivy-configure:
[ivy:configure] :: loading settings :: file = /x1/jenkins/jenkins-slave/workspace/Lucene-Solr-BadApples-Tests-master/lucene/top-level-ivy-settings.xml

resolve:

resolve-server:

ivy-availability-check:
[loadresource] Do not set property disallowed.ivy.jars.list as its length is 0.

-ivy-fail-disallowed-ivy-version:

ivy-fail:

ivy-fail:

ivy-configure:
[ivy:configure] :: loading settings :: file = /x1/jenkins/jenkins-slave/workspace/Lucene-Solr-BadApples-Tests-master/lucene/top-level-ivy-settings.xml

resolve:

resolve:

ivy-availability-check:
[loadresource] Do not set property disallowed.ivy.jars.list as its length is 0.

-ivy-fail-disallowed-ivy-version:

ivy-fail:

ivy-fail:

ivy-configure:
[ivy:configure] :: loading settings :: file = /x1/jenkins/jenkins-slave/workspace/Lucene-Solr-BadApples-Tests-master/lucene/top-level-ivy-settings.xml

resolve:

ivy-availability-check:
[loadresource] Do not set property disallowed.ivy.jars.list as its length is 0.

-ivy-fail-disallowed-ivy-version:

ivy-fail:

ivy-fail:

ivy-configure:
[ivy:configure] :: loading settings :: file = /x1/jenkins/jenkins-slave/workspace/Lucene-Solr-BadApples-Tests-master/lucene/top-level-ivy-settings.xml

resolve:

ivy-availability-check:
[loadresource] Do not set property disallowed.ivy.jars.list as its length is 0.

-ivy-fail-disallowed-ivy-version:

ivy-fail:

ivy-configure:
[ivy:configure] :: loading settings :: file = /x1/jenkins/jenkins-slave/workspace/Lucene-Solr-BadApples-Tests-master/lucene/top-level-ivy-settings.xml

resolve:

ivy-availability-check:
[loadresource] Do not set property disallowed.ivy.jars.list as its length is 0.

-ivy-fail-disallowed-ivy-version:

ivy-fail:

ivy-fail:

ivy-configure:
[ivy:configure] :: loading settings :: file = /x1/jenkins/jenkins-slave/workspace/Lucene-Solr-BadApples-Tests-master/lucene/top-level-ivy-settings.xml

resolve:

ivy-availability-check:
[loadresource] Do not set property disallowed.ivy.jars.list as its length is 0.

-ivy-fail-disallowed-ivy-version:

ivy-fail:

ivy-configure:
[ivy:configure] :: loading settings :: file = /x1/jenkins/jenkins-slave/workspace/Lucene-Solr-BadApples-Tests-master/lucene/top-level-ivy-settings.xml

resolve:

ivy-availability-check:
[loadresource] Do not set property disallowed.ivy.jars.list as its length is 0.

-ivy-fail-disallowed-ivy-version:

ivy-fail:

ivy-fail:

ivy-configure:
[ivy:configure] :: loading settings :: file = /x1/jenkins/jenkins-slave/workspace/Lucene-Solr-BadApples-Tests-master/lucene/top-level-ivy-settings.xml

resolve:

ivy-availability-check:
[loadresource] Do not set property disallowed.ivy.jars.list as its length is 0.

-ivy-fail-disallowed-ivy-version:

ivy-fail:

ivy-fail:

ivy-configure:
[ivy:configure] :: loading settings :: file = /x1/jenkins/jenkins-slave/workspace/Lucene-Solr-BadApples-Tests-master/lucene/top-level-ivy-settings.xml

resolve:

ivy-availability-check:
[loadresource] Do not set property disallowed.ivy.jars.list as its length is 0.

-ivy-fail-disallowed-ivy-version:

ivy-fail:

ivy-fail:

ivy-configure:
[ivy:configure] :: loading settings :: file = /x1/jenkins/jenkins-slave/workspace/Lucene-Solr-BadApples-Tests-master/lucene/top-level-ivy-settings.xml

resolve:

ivy-availability-check:
[loadresource] Do not set property disallowed.ivy.jars.list as its length is 0.

-ivy-fail-disallowed-ivy-version:

ivy-fail:

ivy-fail:

ivy-configure:
[ivy:configure] :: loading settings :: file = /x1/jenkins/jenkins-slave/workspace/Lucene-Solr-BadApples-Tests-master/lucene/top-level-ivy-settings.xml

resolve:

ivy-availability-check:
[loadresource] Do not set property disallowed.ivy.jars.list as its length is 0.

-ivy-fail-disallowed-ivy-version:

ivy-fail:

ivy-fail:

ivy-configure:
[ivy:configure] :: loading settings :: file = /x1/jenkins/jenkins-slave/workspace/Lucene-Solr-BadApples-Tests-master/lucene/top-level-ivy-settings.xml

resolve:

ivy-availability-check:
[loadresource] Do not set property disallowed.ivy.jars.list as its length is 0.

-ivy-fail-disallowed-ivy-version:

ivy-fail:

ivy-fail:

ivy-configure:
[ivy:configure] :: loading settings :: file = /x1/jenkins/jenkins-slave/workspace/Lucene-Solr-BadApples-Tests-master/lucene/top-level-ivy-settings.xml

resolve:

ivy-availability-check:
[loadresource] Do not set property disallowed.ivy.jars.list as its length is 0.

-ivy-fail-disallowed-ivy-version:

ivy-fail:

ivy-fail:

ivy-configure:
[ivy:configure] :: loading settings :: file = /x1/jenkins/jenkins-slave/workspace/Lucene-Solr-BadApples-Tests-master/lucene/top-level-ivy-settings.xml

resolve:

ivy-availability-check:
[loadresource] Do not set property disallowed.ivy.jars.list as its length is 0.

-ivy-fail-disallowed-ivy-version:

ivy-fail:

ivy-fail:

ivy-configure:
[ivy:configure] :: loading settings :: file = /x1/jenkins/jenkins-slave/workspace/Lucene-Solr-BadApples-Tests-master/lucene/top-level-ivy-settings.xml

resolve:

ivy-availability-check:
[loadresource] Do not set property disallowed.ivy.jars.list as its length is 0.

-ivy-fail-disallowed-ivy-version:

ivy-fail:

ivy-fail:

ivy-configure:
[ivy:configure] :: loading settings :: file = /x1/jenkins/jenkins-slave/workspace/Lucene-Solr-BadApples-Tests-master/lucene/top-level-ivy-settings.xml

resolve:

ivy-availability-check:
[loadresource] Do not set property disallowed.ivy.jars.list as its length is 0.

-ivy-fail-disallowed-ivy-version:

ivy-fail:

ivy-fail:

ivy-configure:
[ivy:configure] :: loading settings :: file = /x1/jenkins/jenkins-slave/workspace/Lucene-Solr-BadApples-Tests-master/lucene/top-level-ivy-settings.xml

resolve:

jar-checksums:
    [mkdir] Created dir: /x1/jenkins/jenkins-slave/workspace/Lucene-Solr-BadApples-Tests-master/solr/null1085179924
     [copy] Copying 240 files to /x1/jenkins/jenkins-slave/workspace/Lucene-Solr-BadApples-Tests-master/solr/null1085179924
   [delete] Deleting directory /x1/jenkins/jenkins-slave/workspace/Lucene-Solr-BadApples-Tests-master/solr/null1085179924

check-working-copy:
[ivy:cachepath] :: resolving dependencies :: org.eclipse.jgit#org.eclipse.jgit-caller;working
[ivy:cachepath] 	confs: [default]
[ivy:cachepath] 	found org.eclipse.jgit#org.eclipse.jgit;4.6.0.201612231935-r in public
[ivy:cachepath] 	found com.jcraft#jsch;0.1.53 in public
[ivy:cachepath] 	found com.googlecode.javaewah#JavaEWAH;1.1.6 in public
[ivy:cachepath] 	found org.apache.httpcomponents#httpclient;4.3.6 in public
[ivy:cachepath] 	found org.apache.httpcomponents#httpcore;4.3.3 in public
[ivy:cachepath] 	found commons-logging#commons-logging;1.1.3 in public
[ivy:cachepath] 	found commons-codec#commons-codec;1.6 in public
[ivy:cachepath] 	found org.slf4j#slf4j-api;1.7.2 in public
[ivy:cachepath] :: resolution report :: resolve 53ms :: artifacts dl 5ms
	---------------------------------------------------------------------
	|                  |            modules            ||   artifacts   |
	|       conf       | number| search|dwnlded|evicted|| number|dwnlded|
	---------------------------------------------------------------------
	|      default     |   8   |   0   |   0   |   0   ||   8   |   0   |
	---------------------------------------------------------------------
[wc-checker] Initializing working copy...
[wc-checker] SLF4J: Failed to load class "org.slf4j.impl.StaticLoggerBinder".
[wc-checker] SLF4J: Defaulting to no-operation (NOP) logger implementation
[wc-checker] SLF4J: See http://www.slf4j.org/codes.html#StaticLoggerBinder for further details.
[wc-checker] Checking working copy status...

-jenkins-base:

BUILD SUCCESSFUL
Total time: 110 minutes 8 seconds
Archiving artifacts
java.lang.InterruptedException: no matches found within 10000
	at hudson.FilePath$ValidateAntFileMask.hasMatch(FilePath.java:2847)
	at hudson.FilePath$ValidateAntFileMask.invoke(FilePath.java:2726)
	at hudson.FilePath$ValidateAntFileMask.invoke(FilePath.java:2707)
	at hudson.FilePath$FileCallableWrapper.call(FilePath.java:3086)
Also:   hudson.remoting.Channel$CallSiteStackTrace: Remote call to lucene
		at hudson.remoting.Channel.attachCallSiteStackTrace(Channel.java:1741)
		at hudson.remoting.UserRequest$ExceptionResponse.retrieve(UserRequest.java:357)
		at hudson.remoting.Channel.call(Channel.java:955)
		at hudson.FilePath.act(FilePath.java:1072)
		at hudson.FilePath.act(FilePath.java:1061)
		at hudson.FilePath.validateAntFileMask(FilePath.java:2705)
		at hudson.tasks.ArtifactArchiver.perform(ArtifactArchiver.java:243)
		at hudson.tasks.BuildStepCompatibilityLayer.perform(BuildStepCompatibilityLayer.java:81)
		at hudson.tasks.BuildStepMonitor$1.perform(BuildStepMonitor.java:20)
		at hudson.model.AbstractBuild$AbstractBuildExecution.perform(AbstractBuild.java:744)
		at hudson.model.AbstractBuild$AbstractBuildExecution.performAllBuildSteps(AbstractBuild.java:690)
		at hudson.model.Build$BuildExecution.post2(Build.java:186)
		at hudson.model.AbstractBuild$AbstractBuildExecution.post(AbstractBuild.java:635)
		at hudson.model.Run.execute(Run.java:1835)
		at hudson.model.FreeStyleBuild.run(FreeStyleBuild.java:43)
		at hudson.model.ResourceController.execute(ResourceController.java:97)
		at hudson.model.Executor.run(Executor.java:429)
Caused: hudson.FilePath$TunneledInterruptedException
	at hudson.FilePath$FileCallableWrapper.call(FilePath.java:3088)
	at hudson.remoting.UserRequest.perform(UserRequest.java:212)
	at hudson.remoting.UserRequest.perform(UserRequest.java:54)
	at hudson.remoting.Request$2.run(Request.java:369)
	at hudson.remoting.InterceptingExecutorService$1.call(InterceptingExecutorService.java:72)
	at java.util.concurrent.FutureTask.run(FutureTask.java:266)
	at java.util.concurrent.ThreadPoolExecutor.runWorker(ThreadPoolExecutor.java:1142)
	at java.util.concurrent.ThreadPoolExecutor$Worker.run(ThreadPoolExecutor.java:617)
	at java.lang.Thread.run(Thread.java:748)
Caused: java.lang.InterruptedException: java.lang.InterruptedException: no matches found within 10000
	at hudson.FilePath.act(FilePath.java:1074)
	at hudson.FilePath.act(FilePath.java:1061)
	at hudson.FilePath.validateAntFileMask(FilePath.java:2705)
	at hudson.tasks.ArtifactArchiver.perform(ArtifactArchiver.java:243)
	at hudson.tasks.BuildStepCompatibilityLayer.perform(BuildStepCompatibilityLayer.java:81)
	at hudson.tasks.BuildStepMonitor$1.perform(BuildStepMonitor.java:20)
	at hudson.model.AbstractBuild$AbstractBuildExecution.perform(AbstractBuild.java:744)
	at hudson.model.AbstractBuild$AbstractBuildExecution.performAllBuildSteps(AbstractBuild.java:690)
	at hudson.model.Build$BuildExecution.post2(Build.java:186)
	at hudson.model.AbstractBuild$AbstractBuildExecution.post(AbstractBuild.java:635)
	at hudson.model.Run.execute(Run.java:1835)
	at hudson.model.FreeStyleBuild.run(FreeStyleBuild.java:43)
	at hudson.model.ResourceController.execute(ResourceController.java:97)
	at hudson.model.Executor.run(Executor.java:429)
No artifacts found that match the file pattern "**/*.events,heapdumps/**,**/hs_err_pid*". Configuration error?
Recording test results
Build step 'Publish JUnit test result report' changed build result to UNSTABLE
Email was triggered for: Unstable (Test Failures)
Sending email for trigger: Unstable (Test Failures)

Mime
View raw message