lucene-dev mailing list archives

Site index · List index
Message view « Date » · « Thread »
Top « Date » · « Thread »
From Apache Jenkins Server <jenk...@builds.apache.org>
Subject [JENKINS] Lucene-Solr-Tests-8.x - Build # 109 - Still Unstable
Date Mon, 08 Apr 2019 17:06:04 GMT
Build: https://builds.apache.org/job/Lucene-Solr-Tests-8.x/109/

5 tests failed.
FAILED:  org.apache.lucene.classification.utils.ConfusionMatrixGeneratorTest.testGetConfusionMatrixWithFLTKNN

Error Message:
expected:<7> but was:<6>

Stack Trace:
java.lang.AssertionError: expected:<7> but was:<6>
	at __randomizedtesting.SeedInfo.seed([FF766BBFDB3E9F17:4AB8A88D43F24098]:0)
	at org.junit.Assert.fail(Assert.java:88)
	at org.junit.Assert.failNotEquals(Assert.java:834)
	at org.junit.Assert.assertEquals(Assert.java:645)
	at org.junit.Assert.assertEquals(Assert.java:631)
	at org.apache.lucene.classification.utils.ConfusionMatrixGeneratorTest.checkCM(ConfusionMatrixGeneratorTest.java:110)
	at org.apache.lucene.classification.utils.ConfusionMatrixGeneratorTest.testGetConfusionMatrixWithFLTKNN(ConfusionMatrixGeneratorTest.java:186)
	at sun.reflect.NativeMethodAccessorImpl.invoke0(Native Method)
	at sun.reflect.NativeMethodAccessorImpl.invoke(NativeMethodAccessorImpl.java:62)
	at sun.reflect.DelegatingMethodAccessorImpl.invoke(DelegatingMethodAccessorImpl.java:43)
	at java.lang.reflect.Method.invoke(Method.java:498)
	at com.carrotsearch.randomizedtesting.RandomizedRunner.invoke(RandomizedRunner.java:1750)
	at com.carrotsearch.randomizedtesting.RandomizedRunner$8.evaluate(RandomizedRunner.java:938)
	at com.carrotsearch.randomizedtesting.RandomizedRunner$9.evaluate(RandomizedRunner.java:974)
	at com.carrotsearch.randomizedtesting.RandomizedRunner$10.evaluate(RandomizedRunner.java:988)
	at org.apache.lucene.util.TestRuleSetupTeardownChained$1.evaluate(TestRuleSetupTeardownChained.java:49)
	at org.apache.lucene.util.AbstractBeforeAfterRule$1.evaluate(AbstractBeforeAfterRule.java:45)
	at org.apache.lucene.util.TestRuleThreadAndTestName$1.evaluate(TestRuleThreadAndTestName.java:48)
	at org.apache.lucene.util.TestRuleIgnoreAfterMaxFailures$1.evaluate(TestRuleIgnoreAfterMaxFailures.java:64)
	at org.apache.lucene.util.TestRuleMarkFailure$1.evaluate(TestRuleMarkFailure.java:47)
	at com.carrotsearch.randomizedtesting.rules.StatementAdapter.evaluate(StatementAdapter.java:36)
	at com.carrotsearch.randomizedtesting.ThreadLeakControl$StatementRunner.run(ThreadLeakControl.java:368)
	at com.carrotsearch.randomizedtesting.ThreadLeakControl.forkTimeoutingTask(ThreadLeakControl.java:817)
	at com.carrotsearch.randomizedtesting.ThreadLeakControl$3.evaluate(ThreadLeakControl.java:468)
	at com.carrotsearch.randomizedtesting.RandomizedRunner.runSingleTest(RandomizedRunner.java:947)
	at com.carrotsearch.randomizedtesting.RandomizedRunner$5.evaluate(RandomizedRunner.java:832)
	at com.carrotsearch.randomizedtesting.RandomizedRunner$6.evaluate(RandomizedRunner.java:883)
	at com.carrotsearch.randomizedtesting.RandomizedRunner$7.evaluate(RandomizedRunner.java:894)
	at org.apache.lucene.util.AbstractBeforeAfterRule$1.evaluate(AbstractBeforeAfterRule.java:45)
	at com.carrotsearch.randomizedtesting.rules.StatementAdapter.evaluate(StatementAdapter.java:36)
	at org.apache.lucene.util.TestRuleStoreClassName$1.evaluate(TestRuleStoreClassName.java:41)
	at com.carrotsearch.randomizedtesting.rules.NoShadowingOrOverridesOnMethodsRule$1.evaluate(NoShadowingOrOverridesOnMethodsRule.java:40)
	at com.carrotsearch.randomizedtesting.rules.NoShadowingOrOverridesOnMethodsRule$1.evaluate(NoShadowingOrOverridesOnMethodsRule.java:40)
	at com.carrotsearch.randomizedtesting.rules.StatementAdapter.evaluate(StatementAdapter.java:36)
	at com.carrotsearch.randomizedtesting.rules.StatementAdapter.evaluate(StatementAdapter.java:36)
	at com.carrotsearch.randomizedtesting.rules.StatementAdapter.evaluate(StatementAdapter.java:36)
	at org.apache.lucene.util.TestRuleAssertionsRequired$1.evaluate(TestRuleAssertionsRequired.java:53)
	at org.apache.lucene.util.TestRuleMarkFailure$1.evaluate(TestRuleMarkFailure.java:47)
	at org.apache.lucene.util.TestRuleIgnoreAfterMaxFailures$1.evaluate(TestRuleIgnoreAfterMaxFailures.java:64)
	at org.apache.lucene.util.TestRuleIgnoreTestSuites$1.evaluate(TestRuleIgnoreTestSuites.java:54)
	at com.carrotsearch.randomizedtesting.rules.StatementAdapter.evaluate(StatementAdapter.java:36)
	at com.carrotsearch.randomizedtesting.ThreadLeakControl$StatementRunner.run(ThreadLeakControl.java:368)
	at java.lang.Thread.run(Thread.java:748)


FAILED:  org.apache.solr.analytics.legacy.LegacyNoFacetCloudTest.sumTest

Error Message:
Error starting up MiniSolrCloudCluster

Stack Trace:
java.lang.Exception: Error starting up MiniSolrCloudCluster
	at org.apache.solr.cloud.MiniSolrCloudCluster.checkForExceptions(MiniSolrCloudCluster.java:652)
	at org.apache.solr.cloud.MiniSolrCloudCluster.<init>(MiniSolrCloudCluster.java:306)
	at org.apache.solr.cloud.SolrCloudTestCase$Builder.build(SolrCloudTestCase.java:212)
	at org.apache.solr.cloud.SolrCloudTestCase$Builder.configure(SolrCloudTestCase.java:204)
	at org.apache.solr.analytics.legacy.LegacyAbstractAnalyticsCloudTest.setupCollection(LegacyAbstractAnalyticsCloudTest.java:49)
	at sun.reflect.NativeMethodAccessorImpl.invoke0(Native Method)
	at sun.reflect.NativeMethodAccessorImpl.invoke(NativeMethodAccessorImpl.java:62)
	at sun.reflect.DelegatingMethodAccessorImpl.invoke(DelegatingMethodAccessorImpl.java:43)
	at java.lang.reflect.Method.invoke(Method.java:498)
	at com.carrotsearch.randomizedtesting.RandomizedRunner.invoke(RandomizedRunner.java:1750)
	at com.carrotsearch.randomizedtesting.RandomizedRunner$9.evaluate(RandomizedRunner.java:972)
	at com.carrotsearch.randomizedtesting.RandomizedRunner$10.evaluate(RandomizedRunner.java:988)
	at com.carrotsearch.randomizedtesting.rules.SystemPropertiesRestoreRule$1.evaluate(SystemPropertiesRestoreRule.java:57)
	at org.apache.lucene.util.TestRuleSetupTeardownChained$1.evaluate(TestRuleSetupTeardownChained.java:49)
	at org.apache.lucene.util.AbstractBeforeAfterRule$1.evaluate(AbstractBeforeAfterRule.java:45)
	at org.apache.lucene.util.TestRuleThreadAndTestName$1.evaluate(TestRuleThreadAndTestName.java:48)
	at org.apache.lucene.util.TestRuleIgnoreAfterMaxFailures$1.evaluate(TestRuleIgnoreAfterMaxFailures.java:64)
	at org.apache.lucene.util.TestRuleMarkFailure$1.evaluate(TestRuleMarkFailure.java:47)
	at com.carrotsearch.randomizedtesting.rules.StatementAdapter.evaluate(StatementAdapter.java:36)
	at com.carrotsearch.randomizedtesting.ThreadLeakControl$StatementRunner.run(ThreadLeakControl.java:368)
	at com.carrotsearch.randomizedtesting.ThreadLeakControl.forkTimeoutingTask(ThreadLeakControl.java:817)
	at com.carrotsearch.randomizedtesting.ThreadLeakControl$3.evaluate(ThreadLeakControl.java:468)
	at com.carrotsearch.randomizedtesting.RandomizedRunner.runSingleTest(RandomizedRunner.java:947)
	at com.carrotsearch.randomizedtesting.RandomizedRunner$5.evaluate(RandomizedRunner.java:832)
	at com.carrotsearch.randomizedtesting.RandomizedRunner$6.evaluate(RandomizedRunner.java:883)
	at com.carrotsearch.randomizedtesting.RandomizedRunner$7.evaluate(RandomizedRunner.java:894)
	at com.carrotsearch.randomizedtesting.rules.StatementAdapter.evaluate(StatementAdapter.java:36)
	at com.carrotsearch.randomizedtesting.rules.SystemPropertiesRestoreRule$1.evaluate(SystemPropertiesRestoreRule.java:57)
	at org.apache.lucene.util.AbstractBeforeAfterRule$1.evaluate(AbstractBeforeAfterRule.java:45)
	at com.carrotsearch.randomizedtesting.rules.StatementAdapter.evaluate(StatementAdapter.java:36)
	at org.apache.lucene.util.TestRuleStoreClassName$1.evaluate(TestRuleStoreClassName.java:41)
	at com.carrotsearch.randomizedtesting.rules.NoShadowingOrOverridesOnMethodsRule$1.evaluate(NoShadowingOrOverridesOnMethodsRule.java:40)
	at com.carrotsearch.randomizedtesting.rules.NoShadowingOrOverridesOnMethodsRule$1.evaluate(NoShadowingOrOverridesOnMethodsRule.java:40)
	at com.carrotsearch.randomizedtesting.rules.StatementAdapter.evaluate(StatementAdapter.java:36)
	at com.carrotsearch.randomizedtesting.rules.StatementAdapter.evaluate(StatementAdapter.java:36)
	at com.carrotsearch.randomizedtesting.rules.StatementAdapter.evaluate(StatementAdapter.java:36)
	at org.apache.lucene.util.TestRuleAssertionsRequired$1.evaluate(TestRuleAssertionsRequired.java:53)
	at org.apache.lucene.util.TestRuleMarkFailure$1.evaluate(TestRuleMarkFailure.java:47)
	at org.apache.lucene.util.TestRuleIgnoreAfterMaxFailures$1.evaluate(TestRuleIgnoreAfterMaxFailures.java:64)
	at org.apache.lucene.util.TestRuleIgnoreTestSuites$1.evaluate(TestRuleIgnoreTestSuites.java:54)
	at com.carrotsearch.randomizedtesting.rules.StatementAdapter.evaluate(StatementAdapter.java:36)
	at com.carrotsearch.randomizedtesting.ThreadLeakControl$StatementRunner.run(ThreadLeakControl.java:368)
	at java.lang.Thread.run(Thread.java:748)
	Suppressed: java.lang.RuntimeException: Jetty/Solr unresponsive
		at org.apache.solr.client.solrj.embedded.JettySolrRunner.start(JettySolrRunner.java:507)
		at org.apache.solr.client.solrj.embedded.JettySolrRunner.start(JettySolrRunner.java:465)
		at org.apache.solr.cloud.MiniSolrCloudCluster.startJettySolrRunner(MiniSolrCloudCluster.java:467)
		at org.apache.solr.cloud.MiniSolrCloudCluster.lambda$new$0(MiniSolrCloudCluster.java:300)
		at java.util.concurrent.FutureTask.run(FutureTask.java:266)
		at org.apache.solr.common.util.ExecutorUtil$MDCAwareThreadPoolExecutor.lambda$execute$0(ExecutorUtil.java:209)
		at java.util.concurrent.ThreadPoolExecutor.runWorker(ThreadPoolExecutor.java:1149)
		at java.util.concurrent.ThreadPoolExecutor$Worker.run(ThreadPoolExecutor.java:624)
		... 1 more


FAILED:  junit.framework.TestSuite.org.apache.solr.analytics.legacy.LegacyNoFacetCloudTest

Error Message:
10 threads leaked from SUITE scope at org.apache.solr.analytics.legacy.LegacyNoFacetCloudTest:     1) Thread[id=2248, name=Scheduler-851174062, state=TIMED_WAITING, group=TGRP-LegacyNoFacetCloudTest]         at sun.misc.Unsafe.park(Native Method)         at java.util.concurrent.locks.LockSupport.parkNanos(LockSupport.java:215)         at java.util.concurrent.locks.AbstractQueuedSynchronizer$ConditionObject.awaitNanos(AbstractQueuedSynchronizer.java:2078)         at java.util.concurrent.ScheduledThreadPoolExecutor$DelayedWorkQueue.take(ScheduledThreadPoolExecutor.java:1093)         at java.util.concurrent.ScheduledThreadPoolExecutor$DelayedWorkQueue.take(ScheduledThreadPoolExecutor.java:809)         at java.util.concurrent.ThreadPoolExecutor.getTask(ThreadPoolExecutor.java:1074)         at java.util.concurrent.ThreadPoolExecutor.runWorker(ThreadPoolExecutor.java:1134)         at java.util.concurrent.ThreadPoolExecutor$Worker.run(ThreadPoolExecutor.java:624)         at java.lang.Thread.run(Thread.java:748)    2) Thread[id=2243, name=qtp1404790099-2243, state=TIMED_WAITING, group=TGRP-LegacyNoFacetCloudTest]         at sun.misc.Unsafe.park(Native Method)         at java.util.concurrent.locks.LockSupport.parkNanos(LockSupport.java:215)         at java.util.concurrent.locks.AbstractQueuedSynchronizer$ConditionObject.awaitNanos(AbstractQueuedSynchronizer.java:2078)         at org.eclipse.jetty.util.BlockingArrayQueue.poll(BlockingArrayQueue.java:392)         at org.eclipse.jetty.util.thread.QueuedThreadPool.idleJobPoll(QueuedThreadPool.java:656)         at org.eclipse.jetty.util.thread.QueuedThreadPool.access$800(QueuedThreadPool.java:46)         at org.eclipse.jetty.util.thread.QueuedThreadPool$2.run(QueuedThreadPool.java:720)         at java.lang.Thread.run(Thread.java:748)    3) Thread[id=2240, name=qtp1404790099-2240, state=RUNNABLE, group=TGRP-LegacyNoFacetCloudTest]         at sun.nio.ch.EPollArrayWrapper.epollWait(Native Method)         at sun.nio.ch.EPollArrayWrapper.poll(EPollArrayWrapper.java:269)         at sun.nio.ch.EPollSelectorImpl.doSelect(EPollSelectorImpl.java:93)         at sun.nio.ch.SelectorImpl.lockAndDoSelect(SelectorImpl.java:86)         at sun.nio.ch.SelectorImpl.select(SelectorImpl.java:97)         at sun.nio.ch.SelectorImpl.select(SelectorImpl.java:101)         at org.eclipse.jetty.io.ManagedSelector$SelectorProducer.select(ManagedSelector.java:423)         at org.eclipse.jetty.io.ManagedSelector$SelectorProducer.produce(ManagedSelector.java:360)         at org.eclipse.jetty.util.thread.strategy.EatWhatYouKill.produceTask(EatWhatYouKill.java:357)         at org.eclipse.jetty.util.thread.strategy.EatWhatYouKill.doProduce(EatWhatYouKill.java:181)         at org.eclipse.jetty.util.thread.strategy.EatWhatYouKill.tryProduce(EatWhatYouKill.java:168)         at org.eclipse.jetty.util.thread.strategy.EatWhatYouKill.produce(EatWhatYouKill.java:132)         at org.eclipse.jetty.io.ManagedSelector$$Lambda$61/1984061638.run(Unknown Source)         at org.eclipse.jetty.util.thread.QueuedThreadPool.runJob(QueuedThreadPool.java:765)         at org.eclipse.jetty.util.thread.QueuedThreadPool$2.run(QueuedThreadPool.java:683)         at java.lang.Thread.run(Thread.java:748)    4) Thread[id=2247, name=qtp1404790099-2247, state=TIMED_WAITING, group=TGRP-LegacyNoFacetCloudTest]         at sun.misc.Unsafe.park(Native Method)         at java.util.concurrent.locks.LockSupport.parkNanos(LockSupport.java:215)         at java.util.concurrent.locks.AbstractQueuedSynchronizer$ConditionObject.awaitNanos(AbstractQueuedSynchronizer.java:2078)         at org.eclipse.jetty.util.BlockingArrayQueue.poll(BlockingArrayQueue.java:392)         at org.eclipse.jetty.util.thread.QueuedThreadPool.idleJobPoll(QueuedThreadPool.java:656)         at org.eclipse.jetty.util.thread.QueuedThreadPool.access$800(QueuedThreadPool.java:46)         at org.eclipse.jetty.util.thread.QueuedThreadPool$2.run(QueuedThreadPool.java:720)         at java.lang.Thread.run(Thread.java:748)    5) Thread[id=2246, name=qtp1404790099-2246, state=TIMED_WAITING, group=TGRP-LegacyNoFacetCloudTest]         at sun.misc.Unsafe.park(Native Method)         at java.util.concurrent.locks.LockSupport.parkNanos(LockSupport.java:215)         at java.util.concurrent.locks.AbstractQueuedSynchronizer$ConditionObject.awaitNanos(AbstractQueuedSynchronizer.java:2078)         at org.eclipse.jetty.util.BlockingArrayQueue.poll(BlockingArrayQueue.java:392)         at org.eclipse.jetty.util.thread.QueuedThreadPool.idleJobPoll(QueuedThreadPool.java:656)         at org.eclipse.jetty.util.thread.QueuedThreadPool.access$800(QueuedThreadPool.java:46)         at org.eclipse.jetty.util.thread.QueuedThreadPool$2.run(QueuedThreadPool.java:720)         at java.lang.Thread.run(Thread.java:748)    6) Thread[id=2321, name=zkConnectionManagerCallback-1096-thread-1, state=WAITING, group=TGRP-LegacyNoFacetCloudTest]         at sun.misc.Unsafe.park(Native Method)         at java.util.concurrent.locks.LockSupport.park(LockSupport.java:175)         at java.util.concurrent.locks.AbstractQueuedSynchronizer$ConditionObject.await(AbstractQueuedSynchronizer.java:2039)         at java.util.concurrent.LinkedBlockingQueue.take(LinkedBlockingQueue.java:442)         at java.util.concurrent.ThreadPoolExecutor.getTask(ThreadPoolExecutor.java:1074)         at java.util.concurrent.ThreadPoolExecutor.runWorker(ThreadPoolExecutor.java:1134)         at java.util.concurrent.ThreadPoolExecutor$Worker.run(ThreadPoolExecutor.java:624)         at java.lang.Thread.run(Thread.java:748)    7) Thread[id=2244, name=qtp1404790099-2244, state=TIMED_WAITING, group=TGRP-LegacyNoFacetCloudTest]         at sun.misc.Unsafe.park(Native Method)         at java.util.concurrent.locks.LockSupport.parkNanos(LockSupport.java:215)         at java.util.concurrent.locks.AbstractQueuedSynchronizer$ConditionObject.awaitNanos(AbstractQueuedSynchronizer.java:2078)         at org.eclipse.jetty.util.BlockingArrayQueue.poll(BlockingArrayQueue.java:392)         at org.eclipse.jetty.util.thread.QueuedThreadPool.idleJobPoll(QueuedThreadPool.java:656)         at org.eclipse.jetty.util.thread.QueuedThreadPool.access$800(QueuedThreadPool.java:46)         at org.eclipse.jetty.util.thread.QueuedThreadPool$2.run(QueuedThreadPool.java:720)         at java.lang.Thread.run(Thread.java:748)    8) Thread[id=2241, name=qtp1404790099-2241, state=RUNNABLE, group=TGRP-LegacyNoFacetCloudTest]         at sun.nio.ch.EPollArrayWrapper.epollWait(Native Method)         at sun.nio.ch.EPollArrayWrapper.poll(EPollArrayWrapper.java:269)         at sun.nio.ch.EPollSelectorImpl.doSelect(EPollSelectorImpl.java:93)         at sun.nio.ch.SelectorImpl.lockAndDoSelect(SelectorImpl.java:86)         at sun.nio.ch.SelectorImpl.select(SelectorImpl.java:97)         at sun.nio.ch.SelectorImpl.select(SelectorImpl.java:101)         at org.eclipse.jetty.io.ManagedSelector$SelectorProducer.select(ManagedSelector.java:423)         at org.eclipse.jetty.io.ManagedSelector$SelectorProducer.produce(ManagedSelector.java:360)         at org.eclipse.jetty.util.thread.strategy.EatWhatYouKill.produceTask(EatWhatYouKill.java:357)         at org.eclipse.jetty.util.thread.strategy.EatWhatYouKill.doProduce(EatWhatYouKill.java:181)         at org.eclipse.jetty.util.thread.strategy.EatWhatYouKill.tryProduce(EatWhatYouKill.java:168)         at org.eclipse.jetty.util.thread.strategy.EatWhatYouKill.produce(EatWhatYouKill.java:132)         at org.eclipse.jetty.io.ManagedSelector$$Lambda$61/1984061638.run(Unknown Source)         at org.eclipse.jetty.util.thread.QueuedThreadPool.runJob(QueuedThreadPool.java:765)         at org.eclipse.jetty.util.thread.QueuedThreadPool$2.run(QueuedThreadPool.java:683)         at java.lang.Thread.run(Thread.java:748)    9) Thread[id=2242, name=qtp1404790099-2242-acceptor-0@408b441-ServerConnector@acf5ab0{HTTP/1.1,[http/1.1, h2c]}{127.0.0.1:39310}, state=RUNNABLE, group=TGRP-LegacyNoFacetCloudTest]         at sun.nio.ch.ServerSocketChannelImpl.accept0(Native Method)         at sun.nio.ch.ServerSocketChannelImpl.accept(ServerSocketChannelImpl.java:422)         at sun.nio.ch.ServerSocketChannelImpl.accept(ServerSocketChannelImpl.java:250)         at org.eclipse.jetty.server.ServerConnector.accept(ServerConnector.java:385)         at org.eclipse.jetty.server.AbstractConnector$Acceptor.run(AbstractConnector.java:648)         at org.eclipse.jetty.util.thread.QueuedThreadPool.runJob(QueuedThreadPool.java:765)         at org.eclipse.jetty.util.thread.QueuedThreadPool$2.run(QueuedThreadPool.java:683)         at java.lang.Thread.run(Thread.java:748)   10) Thread[id=2245, name=qtp1404790099-2245, state=TIMED_WAITING, group=TGRP-LegacyNoFacetCloudTest]         at sun.misc.Unsafe.park(Native Method)         at java.util.concurrent.locks.LockSupport.parkNanos(LockSupport.java:215)         at java.util.concurrent.locks.AbstractQueuedSynchronizer$ConditionObject.awaitNanos(AbstractQueuedSynchronizer.java:2078)         at org.eclipse.jetty.util.BlockingArrayQueue.poll(BlockingArrayQueue.java:392)         at org.eclipse.jetty.util.thread.QueuedThreadPool.idleJobPoll(QueuedThreadPool.java:656)         at org.eclipse.jetty.util.thread.QueuedThreadPool.access$800(QueuedThreadPool.java:46)         at org.eclipse.jetty.util.thread.QueuedThreadPool$2.run(QueuedThreadPool.java:720)         at java.lang.Thread.run(Thread.java:748)

Stack Trace:
com.carrotsearch.randomizedtesting.ThreadLeakError: 10 threads leaked from SUITE scope at org.apache.solr.analytics.legacy.LegacyNoFacetCloudTest: 
   1) Thread[id=2248, name=Scheduler-851174062, state=TIMED_WAITING, group=TGRP-LegacyNoFacetCloudTest]
        at sun.misc.Unsafe.park(Native Method)
        at java.util.concurrent.locks.LockSupport.parkNanos(LockSupport.java:215)
        at java.util.concurrent.locks.AbstractQueuedSynchronizer$ConditionObject.awaitNanos(AbstractQueuedSynchronizer.java:2078)
        at java.util.concurrent.ScheduledThreadPoolExecutor$DelayedWorkQueue.take(ScheduledThreadPoolExecutor.java:1093)
        at java.util.concurrent.ScheduledThreadPoolExecutor$DelayedWorkQueue.take(ScheduledThreadPoolExecutor.java:809)
        at java.util.concurrent.ThreadPoolExecutor.getTask(ThreadPoolExecutor.java:1074)
        at java.util.concurrent.ThreadPoolExecutor.runWorker(ThreadPoolExecutor.java:1134)
        at java.util.concurrent.ThreadPoolExecutor$Worker.run(ThreadPoolExecutor.java:624)
        at java.lang.Thread.run(Thread.java:748)
   2) Thread[id=2243, name=qtp1404790099-2243, state=TIMED_WAITING, group=TGRP-LegacyNoFacetCloudTest]
        at sun.misc.Unsafe.park(Native Method)
        at java.util.concurrent.locks.LockSupport.parkNanos(LockSupport.java:215)
        at java.util.concurrent.locks.AbstractQueuedSynchronizer$ConditionObject.awaitNanos(AbstractQueuedSynchronizer.java:2078)
        at org.eclipse.jetty.util.BlockingArrayQueue.poll(BlockingArrayQueue.java:392)
        at org.eclipse.jetty.util.thread.QueuedThreadPool.idleJobPoll(QueuedThreadPool.java:656)
        at org.eclipse.jetty.util.thread.QueuedThreadPool.access$800(QueuedThreadPool.java:46)
        at org.eclipse.jetty.util.thread.QueuedThreadPool$2.run(QueuedThreadPool.java:720)
        at java.lang.Thread.run(Thread.java:748)
   3) Thread[id=2240, name=qtp1404790099-2240, state=RUNNABLE, group=TGRP-LegacyNoFacetCloudTest]
        at sun.nio.ch.EPollArrayWrapper.epollWait(Native Method)
        at sun.nio.ch.EPollArrayWrapper.poll(EPollArrayWrapper.java:269)
        at sun.nio.ch.EPollSelectorImpl.doSelect(EPollSelectorImpl.java:93)
        at sun.nio.ch.SelectorImpl.lockAndDoSelect(SelectorImpl.java:86)
        at sun.nio.ch.SelectorImpl.select(SelectorImpl.java:97)
        at sun.nio.ch.SelectorImpl.select(SelectorImpl.java:101)
        at org.eclipse.jetty.io.ManagedSelector$SelectorProducer.select(ManagedSelector.java:423)
        at org.eclipse.jetty.io.ManagedSelector$SelectorProducer.produce(ManagedSelector.java:360)
        at org.eclipse.jetty.util.thread.strategy.EatWhatYouKill.produceTask(EatWhatYouKill.java:357)
        at org.eclipse.jetty.util.thread.strategy.EatWhatYouKill.doProduce(EatWhatYouKill.java:181)
        at org.eclipse.jetty.util.thread.strategy.EatWhatYouKill.tryProduce(EatWhatYouKill.java:168)
        at org.eclipse.jetty.util.thread.strategy.EatWhatYouKill.produce(EatWhatYouKill.java:132)
        at org.eclipse.jetty.io.ManagedSelector$$Lambda$61/1984061638.run(Unknown Source)
        at org.eclipse.jetty.util.thread.QueuedThreadPool.runJob(QueuedThreadPool.java:765)
        at org.eclipse.jetty.util.thread.QueuedThreadPool$2.run(QueuedThreadPool.java:683)
        at java.lang.Thread.run(Thread.java:748)
   4) Thread[id=2247, name=qtp1404790099-2247, state=TIMED_WAITING, group=TGRP-LegacyNoFacetCloudTest]
        at sun.misc.Unsafe.park(Native Method)
        at java.util.concurrent.locks.LockSupport.parkNanos(LockSupport.java:215)
        at java.util.concurrent.locks.AbstractQueuedSynchronizer$ConditionObject.awaitNanos(AbstractQueuedSynchronizer.java:2078)
        at org.eclipse.jetty.util.BlockingArrayQueue.poll(BlockingArrayQueue.java:392)
        at org.eclipse.jetty.util.thread.QueuedThreadPool.idleJobPoll(QueuedThreadPool.java:656)
        at org.eclipse.jetty.util.thread.QueuedThreadPool.access$800(QueuedThreadPool.java:46)
        at org.eclipse.jetty.util.thread.QueuedThreadPool$2.run(QueuedThreadPool.java:720)
        at java.lang.Thread.run(Thread.java:748)
   5) Thread[id=2246, name=qtp1404790099-2246, state=TIMED_WAITING, group=TGRP-LegacyNoFacetCloudTest]
        at sun.misc.Unsafe.park(Native Method)
        at java.util.concurrent.locks.LockSupport.parkNanos(LockSupport.java:215)
        at java.util.concurrent.locks.AbstractQueuedSynchronizer$ConditionObject.awaitNanos(AbstractQueuedSynchronizer.java:2078)
        at org.eclipse.jetty.util.BlockingArrayQueue.poll(BlockingArrayQueue.java:392)
        at org.eclipse.jetty.util.thread.QueuedThreadPool.idleJobPoll(QueuedThreadPool.java:656)
        at org.eclipse.jetty.util.thread.QueuedThreadPool.access$800(QueuedThreadPool.java:46)
        at org.eclipse.jetty.util.thread.QueuedThreadPool$2.run(QueuedThreadPool.java:720)
        at java.lang.Thread.run(Thread.java:748)
   6) Thread[id=2321, name=zkConnectionManagerCallback-1096-thread-1, state=WAITING, group=TGRP-LegacyNoFacetCloudTest]
        at sun.misc.Unsafe.park(Native Method)
        at java.util.concurrent.locks.LockSupport.park(LockSupport.java:175)
        at java.util.concurrent.locks.AbstractQueuedSynchronizer$ConditionObject.await(AbstractQueuedSynchronizer.java:2039)
        at java.util.concurrent.LinkedBlockingQueue.take(LinkedBlockingQueue.java:442)
        at java.util.concurrent.ThreadPoolExecutor.getTask(ThreadPoolExecutor.java:1074)
        at java.util.concurrent.ThreadPoolExecutor.runWorker(ThreadPoolExecutor.java:1134)
        at java.util.concurrent.ThreadPoolExecutor$Worker.run(ThreadPoolExecutor.java:624)
        at java.lang.Thread.run(Thread.java:748)
   7) Thread[id=2244, name=qtp1404790099-2244, state=TIMED_WAITING, group=TGRP-LegacyNoFacetCloudTest]
        at sun.misc.Unsafe.park(Native Method)
        at java.util.concurrent.locks.LockSupport.parkNanos(LockSupport.java:215)
        at java.util.concurrent.locks.AbstractQueuedSynchronizer$ConditionObject.awaitNanos(AbstractQueuedSynchronizer.java:2078)
        at org.eclipse.jetty.util.BlockingArrayQueue.poll(BlockingArrayQueue.java:392)
        at org.eclipse.jetty.util.thread.QueuedThreadPool.idleJobPoll(QueuedThreadPool.java:656)
        at org.eclipse.jetty.util.thread.QueuedThreadPool.access$800(QueuedThreadPool.java:46)
        at org.eclipse.jetty.util.thread.QueuedThreadPool$2.run(QueuedThreadPool.java:720)
        at java.lang.Thread.run(Thread.java:748)
   8) Thread[id=2241, name=qtp1404790099-2241, state=RUNNABLE, group=TGRP-LegacyNoFacetCloudTest]
        at sun.nio.ch.EPollArrayWrapper.epollWait(Native Method)
        at sun.nio.ch.EPollArrayWrapper.poll(EPollArrayWrapper.java:269)
        at sun.nio.ch.EPollSelectorImpl.doSelect(EPollSelectorImpl.java:93)
        at sun.nio.ch.SelectorImpl.lockAndDoSelect(SelectorImpl.java:86)
        at sun.nio.ch.SelectorImpl.select(SelectorImpl.java:97)
        at sun.nio.ch.SelectorImpl.select(SelectorImpl.java:101)
        at org.eclipse.jetty.io.ManagedSelector$SelectorProducer.select(ManagedSelector.java:423)
        at org.eclipse.jetty.io.ManagedSelector$SelectorProducer.produce(ManagedSelector.java:360)
        at org.eclipse.jetty.util.thread.strategy.EatWhatYouKill.produceTask(EatWhatYouKill.java:357)
        at org.eclipse.jetty.util.thread.strategy.EatWhatYouKill.doProduce(EatWhatYouKill.java:181)
        at org.eclipse.jetty.util.thread.strategy.EatWhatYouKill.tryProduce(EatWhatYouKill.java:168)
        at org.eclipse.jetty.util.thread.strategy.EatWhatYouKill.produce(EatWhatYouKill.java:132)
        at org.eclipse.jetty.io.ManagedSelector$$Lambda$61/1984061638.run(Unknown Source)
        at org.eclipse.jetty.util.thread.QueuedThreadPool.runJob(QueuedThreadPool.java:765)
        at org.eclipse.jetty.util.thread.QueuedThreadPool$2.run(QueuedThreadPool.java:683)
        at java.lang.Thread.run(Thread.java:748)
   9) Thread[id=2242, name=qtp1404790099-2242-acceptor-0@408b441-ServerConnector@acf5ab0{HTTP/1.1,[http/1.1, h2c]}{127.0.0.1:39310}, state=RUNNABLE, group=TGRP-LegacyNoFacetCloudTest]
        at sun.nio.ch.ServerSocketChannelImpl.accept0(Native Method)
        at sun.nio.ch.ServerSocketChannelImpl.accept(ServerSocketChannelImpl.java:422)
        at sun.nio.ch.ServerSocketChannelImpl.accept(ServerSocketChannelImpl.java:250)
        at org.eclipse.jetty.server.ServerConnector.accept(ServerConnector.java:385)
        at org.eclipse.jetty.server.AbstractConnector$Acceptor.run(AbstractConnector.java:648)
        at org.eclipse.jetty.util.thread.QueuedThreadPool.runJob(QueuedThreadPool.java:765)
        at org.eclipse.jetty.util.thread.QueuedThreadPool$2.run(QueuedThreadPool.java:683)
        at java.lang.Thread.run(Thread.java:748)
  10) Thread[id=2245, name=qtp1404790099-2245, state=TIMED_WAITING, group=TGRP-LegacyNoFacetCloudTest]
        at sun.misc.Unsafe.park(Native Method)
        at java.util.concurrent.locks.LockSupport.parkNanos(LockSupport.java:215)
        at java.util.concurrent.locks.AbstractQueuedSynchronizer$ConditionObject.awaitNanos(AbstractQueuedSynchronizer.java:2078)
        at org.eclipse.jetty.util.BlockingArrayQueue.poll(BlockingArrayQueue.java:392)
        at org.eclipse.jetty.util.thread.QueuedThreadPool.idleJobPoll(QueuedThreadPool.java:656)
        at org.eclipse.jetty.util.thread.QueuedThreadPool.access$800(QueuedThreadPool.java:46)
        at org.eclipse.jetty.util.thread.QueuedThreadPool$2.run(QueuedThreadPool.java:720)
        at java.lang.Thread.run(Thread.java:748)
	at __randomizedtesting.SeedInfo.seed([70F60D4585362678]:0)


FAILED:  junit.framework.TestSuite.org.apache.solr.analytics.legacy.LegacyNoFacetCloudTest

Error Message:
There are still zombie threads that couldn't be terminated:    1) Thread[id=2248, name=Scheduler-851174062, state=TIMED_WAITING, group=TGRP-LegacyNoFacetCloudTest]         at sun.misc.Unsafe.park(Native Method)         at java.util.concurrent.locks.LockSupport.parkNanos(LockSupport.java:215)         at java.util.concurrent.locks.AbstractQueuedSynchronizer$ConditionObject.awaitNanos(AbstractQueuedSynchronizer.java:2078)         at java.util.concurrent.ScheduledThreadPoolExecutor$DelayedWorkQueue.take(ScheduledThreadPoolExecutor.java:1093)         at java.util.concurrent.ScheduledThreadPoolExecutor$DelayedWorkQueue.take(ScheduledThreadPoolExecutor.java:809)         at java.util.concurrent.ThreadPoolExecutor.getTask(ThreadPoolExecutor.java:1074)         at java.util.concurrent.ThreadPoolExecutor.runWorker(ThreadPoolExecutor.java:1134)         at java.util.concurrent.ThreadPoolExecutor$Worker.run(ThreadPoolExecutor.java:624)         at java.lang.Thread.run(Thread.java:748)    2) Thread[id=2240, name=qtp1404790099-2240, state=RUNNABLE, group=TGRP-LegacyNoFacetCloudTest]         at sun.nio.ch.EPollArrayWrapper.epollWait(Native Method)         at sun.nio.ch.EPollArrayWrapper.poll(EPollArrayWrapper.java:269)         at sun.nio.ch.EPollSelectorImpl.doSelect(EPollSelectorImpl.java:93)         at sun.nio.ch.SelectorImpl.lockAndDoSelect(SelectorImpl.java:86)         at sun.nio.ch.SelectorImpl.select(SelectorImpl.java:97)         at sun.nio.ch.SelectorImpl.select(SelectorImpl.java:101)         at org.eclipse.jetty.io.ManagedSelector$SelectorProducer.select(ManagedSelector.java:423)         at org.eclipse.jetty.io.ManagedSelector$SelectorProducer.produce(ManagedSelector.java:360)         at org.eclipse.jetty.util.thread.strategy.EatWhatYouKill.produceTask(EatWhatYouKill.java:357)         at org.eclipse.jetty.util.thread.strategy.EatWhatYouKill.doProduce(EatWhatYouKill.java:181)         at org.eclipse.jetty.util.thread.strategy.EatWhatYouKill.tryProduce(EatWhatYouKill.java:168)         at org.eclipse.jetty.util.thread.strategy.EatWhatYouKill.produce(EatWhatYouKill.java:132)         at org.eclipse.jetty.io.ManagedSelector$$Lambda$61/1984061638.run(Unknown Source)         at org.eclipse.jetty.util.thread.QueuedThreadPool.runJob(QueuedThreadPool.java:765)         at org.eclipse.jetty.util.thread.QueuedThreadPool$2.run(QueuedThreadPool.java:683)         at java.lang.Thread.run(Thread.java:748)    3) Thread[id=2321, name=zkConnectionManagerCallback-1096-thread-1, state=WAITING, group=TGRP-LegacyNoFacetCloudTest]         at sun.misc.Unsafe.park(Native Method)         at java.util.concurrent.locks.LockSupport.park(LockSupport.java:175)         at java.util.concurrent.locks.AbstractQueuedSynchronizer$ConditionObject.await(AbstractQueuedSynchronizer.java:2039)         at java.util.concurrent.LinkedBlockingQueue.take(LinkedBlockingQueue.java:442)         at java.util.concurrent.ThreadPoolExecutor.getTask(ThreadPoolExecutor.java:1074)         at java.util.concurrent.ThreadPoolExecutor.runWorker(ThreadPoolExecutor.java:1134)         at java.util.concurrent.ThreadPoolExecutor$Worker.run(ThreadPoolExecutor.java:624)         at java.lang.Thread.run(Thread.java:748)    4) Thread[id=2241, name=qtp1404790099-2241, state=RUNNABLE, group=TGRP-LegacyNoFacetCloudTest]         at sun.nio.ch.EPollArrayWrapper.epollWait(Native Method)         at sun.nio.ch.EPollArrayWrapper.poll(EPollArrayWrapper.java:269)         at sun.nio.ch.EPollSelectorImpl.doSelect(EPollSelectorImpl.java:93)         at sun.nio.ch.SelectorImpl.lockAndDoSelect(SelectorImpl.java:86)         at sun.nio.ch.SelectorImpl.select(SelectorImpl.java:97)         at sun.nio.ch.SelectorImpl.select(SelectorImpl.java:101)         at org.eclipse.jetty.io.ManagedSelector$SelectorProducer.select(ManagedSelector.java:423)         at org.eclipse.jetty.io.ManagedSelector$SelectorProducer.produce(ManagedSelector.java:360)         at org.eclipse.jetty.util.thread.strategy.EatWhatYouKill.produceTask(EatWhatYouKill.java:357)         at org.eclipse.jetty.util.thread.strategy.EatWhatYouKill.doProduce(EatWhatYouKill.java:181)         at org.eclipse.jetty.util.thread.strategy.EatWhatYouKill.tryProduce(EatWhatYouKill.java:168)         at org.eclipse.jetty.util.thread.strategy.EatWhatYouKill.produce(EatWhatYouKill.java:132)         at org.eclipse.jetty.io.ManagedSelector$$Lambda$61/1984061638.run(Unknown Source)         at org.eclipse.jetty.util.thread.QueuedThreadPool.runJob(QueuedThreadPool.java:765)         at org.eclipse.jetty.util.thread.QueuedThreadPool$2.run(QueuedThreadPool.java:683)         at java.lang.Thread.run(Thread.java:748)

Stack Trace:
com.carrotsearch.randomizedtesting.ThreadLeakError: There are still zombie threads that couldn't be terminated:
   1) Thread[id=2248, name=Scheduler-851174062, state=TIMED_WAITING, group=TGRP-LegacyNoFacetCloudTest]
        at sun.misc.Unsafe.park(Native Method)
        at java.util.concurrent.locks.LockSupport.parkNanos(LockSupport.java:215)
        at java.util.concurrent.locks.AbstractQueuedSynchronizer$ConditionObject.awaitNanos(AbstractQueuedSynchronizer.java:2078)
        at java.util.concurrent.ScheduledThreadPoolExecutor$DelayedWorkQueue.take(ScheduledThreadPoolExecutor.java:1093)
        at java.util.concurrent.ScheduledThreadPoolExecutor$DelayedWorkQueue.take(ScheduledThreadPoolExecutor.java:809)
        at java.util.concurrent.ThreadPoolExecutor.getTask(ThreadPoolExecutor.java:1074)
        at java.util.concurrent.ThreadPoolExecutor.runWorker(ThreadPoolExecutor.java:1134)
        at java.util.concurrent.ThreadPoolExecutor$Worker.run(ThreadPoolExecutor.java:624)
        at java.lang.Thread.run(Thread.java:748)
   2) Thread[id=2240, name=qtp1404790099-2240, state=RUNNABLE, group=TGRP-LegacyNoFacetCloudTest]
        at sun.nio.ch.EPollArrayWrapper.epollWait(Native Method)
        at sun.nio.ch.EPollArrayWrapper.poll(EPollArrayWrapper.java:269)
        at sun.nio.ch.EPollSelectorImpl.doSelect(EPollSelectorImpl.java:93)
        at sun.nio.ch.SelectorImpl.lockAndDoSelect(SelectorImpl.java:86)
        at sun.nio.ch.SelectorImpl.select(SelectorImpl.java:97)
        at sun.nio.ch.SelectorImpl.select(SelectorImpl.java:101)
        at org.eclipse.jetty.io.ManagedSelector$SelectorProducer.select(ManagedSelector.java:423)
        at org.eclipse.jetty.io.ManagedSelector$SelectorProducer.produce(ManagedSelector.java:360)
        at org.eclipse.jetty.util.thread.strategy.EatWhatYouKill.produceTask(EatWhatYouKill.java:357)
        at org.eclipse.jetty.util.thread.strategy.EatWhatYouKill.doProduce(EatWhatYouKill.java:181)
        at org.eclipse.jetty.util.thread.strategy.EatWhatYouKill.tryProduce(EatWhatYouKill.java:168)
        at org.eclipse.jetty.util.thread.strategy.EatWhatYouKill.produce(EatWhatYouKill.java:132)
        at org.eclipse.jetty.io.ManagedSelector$$Lambda$61/1984061638.run(Unknown Source)
        at org.eclipse.jetty.util.thread.QueuedThreadPool.runJob(QueuedThreadPool.java:765)
        at org.eclipse.jetty.util.thread.QueuedThreadPool$2.run(QueuedThreadPool.java:683)
        at java.lang.Thread.run(Thread.java:748)
   3) Thread[id=2321, name=zkConnectionManagerCallback-1096-thread-1, state=WAITING, group=TGRP-LegacyNoFacetCloudTest]
        at sun.misc.Unsafe.park(Native Method)
        at java.util.concurrent.locks.LockSupport.park(LockSupport.java:175)
        at java.util.concurrent.locks.AbstractQueuedSynchronizer$ConditionObject.await(AbstractQueuedSynchronizer.java:2039)
        at java.util.concurrent.LinkedBlockingQueue.take(LinkedBlockingQueue.java:442)
        at java.util.concurrent.ThreadPoolExecutor.getTask(ThreadPoolExecutor.java:1074)
        at java.util.concurrent.ThreadPoolExecutor.runWorker(ThreadPoolExecutor.java:1134)
        at java.util.concurrent.ThreadPoolExecutor$Worker.run(ThreadPoolExecutor.java:624)
        at java.lang.Thread.run(Thread.java:748)
   4) Thread[id=2241, name=qtp1404790099-2241, state=RUNNABLE, group=TGRP-LegacyNoFacetCloudTest]
        at sun.nio.ch.EPollArrayWrapper.epollWait(Native Method)
        at sun.nio.ch.EPollArrayWrapper.poll(EPollArrayWrapper.java:269)
        at sun.nio.ch.EPollSelectorImpl.doSelect(EPollSelectorImpl.java:93)
        at sun.nio.ch.SelectorImpl.lockAndDoSelect(SelectorImpl.java:86)
        at sun.nio.ch.SelectorImpl.select(SelectorImpl.java:97)
        at sun.nio.ch.SelectorImpl.select(SelectorImpl.java:101)
        at org.eclipse.jetty.io.ManagedSelector$SelectorProducer.select(ManagedSelector.java:423)
        at org.eclipse.jetty.io.ManagedSelector$SelectorProducer.produce(ManagedSelector.java:360)
        at org.eclipse.jetty.util.thread.strategy.EatWhatYouKill.produceTask(EatWhatYouKill.java:357)
        at org.eclipse.jetty.util.thread.strategy.EatWhatYouKill.doProduce(EatWhatYouKill.java:181)
        at org.eclipse.jetty.util.thread.strategy.EatWhatYouKill.tryProduce(EatWhatYouKill.java:168)
        at org.eclipse.jetty.util.thread.strategy.EatWhatYouKill.produce(EatWhatYouKill.java:132)
        at org.eclipse.jetty.io.ManagedSelector$$Lambda$61/1984061638.run(Unknown Source)
        at org.eclipse.jetty.util.thread.QueuedThreadPool.runJob(QueuedThreadPool.java:765)
        at org.eclipse.jetty.util.thread.QueuedThreadPool$2.run(QueuedThreadPool.java:683)
        at java.lang.Thread.run(Thread.java:748)
	at __randomizedtesting.SeedInfo.seed([70F60D4585362678]:0)


FAILED:  org.apache.solr.cloud.DeleteReplicaTest.deleteLiveReplicaTest

Error Message:
expected:<0> but was:<1>

Stack Trace:
java.lang.AssertionError: expected:<0> but was:<1>
	at __randomizedtesting.SeedInfo.seed([C06A63DF0E509539:6D0AD7D4136F3D4C]:0)
	at org.junit.Assert.fail(Assert.java:88)
	at org.junit.Assert.failNotEquals(Assert.java:834)
	at org.junit.Assert.assertEquals(Assert.java:645)
	at org.junit.Assert.assertEquals(Assert.java:631)
	at org.apache.solr.cloud.DeleteReplicaTest.deleteLiveReplicaTest(DeleteReplicaTest.java:126)
	at sun.reflect.NativeMethodAccessorImpl.invoke0(Native Method)
	at sun.reflect.NativeMethodAccessorImpl.invoke(NativeMethodAccessorImpl.java:62)
	at sun.reflect.DelegatingMethodAccessorImpl.invoke(DelegatingMethodAccessorImpl.java:43)
	at java.lang.reflect.Method.invoke(Method.java:498)
	at com.carrotsearch.randomizedtesting.RandomizedRunner.invoke(RandomizedRunner.java:1750)
	at com.carrotsearch.randomizedtesting.RandomizedRunner$8.evaluate(RandomizedRunner.java:938)
	at com.carrotsearch.randomizedtesting.RandomizedRunner$9.evaluate(RandomizedRunner.java:974)
	at com.carrotsearch.randomizedtesting.RandomizedRunner$10.evaluate(RandomizedRunner.java:988)
	at com.carrotsearch.randomizedtesting.rules.SystemPropertiesRestoreRule$1.evaluate(SystemPropertiesRestoreRule.java:57)
	at org.apache.lucene.util.TestRuleSetupTeardownChained$1.evaluate(TestRuleSetupTeardownChained.java:49)
	at org.apache.lucene.util.AbstractBeforeAfterRule$1.evaluate(AbstractBeforeAfterRule.java:45)
	at org.apache.lucene.util.TestRuleThreadAndTestName$1.evaluate(TestRuleThreadAndTestName.java:48)
	at org.apache.lucene.util.TestRuleIgnoreAfterMaxFailures$1.evaluate(TestRuleIgnoreAfterMaxFailures.java:64)
	at org.apache.lucene.util.TestRuleMarkFailure$1.evaluate(TestRuleMarkFailure.java:47)
	at com.carrotsearch.randomizedtesting.rules.StatementAdapter.evaluate(StatementAdapter.java:36)
	at com.carrotsearch.randomizedtesting.ThreadLeakControl$StatementRunner.run(ThreadLeakControl.java:368)
	at com.carrotsearch.randomizedtesting.ThreadLeakControl.forkTimeoutingTask(ThreadLeakControl.java:817)
	at com.carrotsearch.randomizedtesting.ThreadLeakControl$3.evaluate(ThreadLeakControl.java:468)
	at com.carrotsearch.randomizedtesting.RandomizedRunner.runSingleTest(RandomizedRunner.java:947)
	at com.carrotsearch.randomizedtesting.RandomizedRunner$5.evaluate(RandomizedRunner.java:832)
	at com.carrotsearch.randomizedtesting.RandomizedRunner$6.evaluate(RandomizedRunner.java:883)
	at com.carrotsearch.randomizedtesting.RandomizedRunner$7.evaluate(RandomizedRunner.java:894)
	at com.carrotsearch.randomizedtesting.rules.StatementAdapter.evaluate(StatementAdapter.java:36)
	at com.carrotsearch.randomizedtesting.rules.SystemPropertiesRestoreRule$1.evaluate(SystemPropertiesRestoreRule.java:57)
	at org.apache.lucene.util.AbstractBeforeAfterRule$1.evaluate(AbstractBeforeAfterRule.java:45)
	at com.carrotsearch.randomizedtesting.rules.StatementAdapter.evaluate(StatementAdapter.java:36)
	at org.apache.lucene.util.TestRuleStoreClassName$1.evaluate(TestRuleStoreClassName.java:41)
	at com.carrotsearch.randomizedtesting.rules.NoShadowingOrOverridesOnMethodsRule$1.evaluate(NoShadowingOrOverridesOnMethodsRule.java:40)
	at com.carrotsearch.randomizedtesting.rules.NoShadowingOrOverridesOnMethodsRule$1.evaluate(NoShadowingOrOverridesOnMethodsRule.java:40)
	at com.carrotsearch.randomizedtesting.rules.StatementAdapter.evaluate(StatementAdapter.java:36)
	at com.carrotsearch.randomizedtesting.rules.StatementAdapter.evaluate(StatementAdapter.java:36)
	at com.carrotsearch.randomizedtesting.rules.StatementAdapter.evaluate(StatementAdapter.java:36)
	at org.apache.lucene.util.TestRuleAssertionsRequired$1.evaluate(TestRuleAssertionsRequired.java:53)
	at org.apache.lucene.util.TestRuleMarkFailure$1.evaluate(TestRuleMarkFailure.java:47)
	at org.apache.lucene.util.TestRuleIgnoreAfterMaxFailures$1.evaluate(TestRuleIgnoreAfterMaxFailures.java:64)
	at org.apache.lucene.util.TestRuleIgnoreTestSuites$1.evaluate(TestRuleIgnoreTestSuites.java:54)
	at com.carrotsearch.randomizedtesting.rules.StatementAdapter.evaluate(StatementAdapter.java:36)
	at com.carrotsearch.randomizedtesting.ThreadLeakControl$StatementRunner.run(ThreadLeakControl.java:368)
	at java.lang.Thread.run(Thread.java:748)




Build Log:
[...truncated 7072 lines...]
   [junit4] Suite: org.apache.lucene.classification.utils.ConfusionMatrixGeneratorTest
   [junit4]   2> NOTE: reproduce with: ant test  -Dtestcase=ConfusionMatrixGeneratorTest -Dtests.method=testGetConfusionMatrixWithFLTKNN -Dtests.seed=FF766BBFDB3E9F17 -Dtests.multiplier=2 -Dtests.slow=true -Dtests.locale=el-GR -Dtests.timezone=Etc/Greenwich -Dtests.asserts=true -Dtests.file.encoding=ISO-8859-1
   [junit4] FAILURE 10.8s J2 | ConfusionMatrixGeneratorTest.testGetConfusionMatrixWithFLTKNN <<<
   [junit4]    > Throwable #1: java.lang.AssertionError: expected:<7> but was:<6>
   [junit4]    > 	at __randomizedtesting.SeedInfo.seed([FF766BBFDB3E9F17:4AB8A88D43F24098]:0)
   [junit4]    > 	at org.apache.lucene.classification.utils.ConfusionMatrixGeneratorTest.checkCM(ConfusionMatrixGeneratorTest.java:110)
   [junit4]    > 	at org.apache.lucene.classification.utils.ConfusionMatrixGeneratorTest.testGetConfusionMatrixWithFLTKNN(ConfusionMatrixGeneratorTest.java:186)
   [junit4]    > 	at java.lang.Thread.run(Thread.java:748)
   [junit4]   2> NOTE: test params are: codec=Asserting(Lucene80): {bool=PostingsFormat(name=Direct), cat=PostingsFormat(name=Direct), text=Lucene50(blocksize=128)}, docValues:{}, maxPointsInLeafNode=602, maxMBSortInHeap=7.150728974079945, sim=Asserting(org.apache.lucene.search.similarities.AssertingSimilarity@78347bd), locale=el-GR, timezone=Etc/Greenwich
   [junit4]   2> NOTE: Linux 4.4.0-112-generic amd64/Oracle Corporation 1.8.0_191 (64-bit)/cpus=4,threads=1,free=261820528,total=333971456
   [junit4]   2> NOTE: All tests run in this JVM: [CachingNaiveBayesClassifierTest, ConfusionMatrixGeneratorTest]
   [junit4] Completed [6/11 (1!)] on J2 in 18.13s, 7 tests, 1 failure <<< FAILURES!

[...truncated 7265 lines...]
   [junit4] Suite: org.apache.solr.cloud.DeleteReplicaTest
   [junit4]   2> 3066863 INFO  (SUITE-DeleteReplicaTest-seed#[C06A63DF0E509539]-worker) [    ] o.a.s.SolrTestCaseJ4 SecureRandom sanity checks: test.solr.allowed.securerandom=null & java.security.egd=file:/dev/./urandom
   [junit4]   2> Creating dataDir: /home/jenkins/jenkins-slave/workspace/Lucene-Solr-Tests-8.x/solr/build/solr-core/test/J1/temp/solr.cloud.DeleteReplicaTest_C06A63DF0E509539-001/init-core-data-001
   [junit4]   2> 3066876 WARN  (SUITE-DeleteReplicaTest-seed#[C06A63DF0E509539]-worker) [    ] o.a.s.SolrTestCaseJ4 startTrackingSearchers: numOpens=2 numCloses=2
   [junit4]   2> 3066876 INFO  (SUITE-DeleteReplicaTest-seed#[C06A63DF0E509539]-worker) [    ] o.a.s.SolrTestCaseJ4 Using PointFields (NUMERIC_POINTS_SYSPROP=true) w/NUMERIC_DOCVALUES_SYSPROP=false
   [junit4]   2> 3066877 INFO  (SUITE-DeleteReplicaTest-seed#[C06A63DF0E509539]-worker) [    ] o.a.s.SolrTestCaseJ4 Randomized ssl (false) and clientAuth (false) via: @org.apache.solr.util.RandomizeSSL(reason=, ssl=NaN, value=NaN, clientAuth=NaN)
   [junit4]   2> 3066896 INFO  (TEST-DeleteReplicaTest.deleteReplicaByCount-seed#[C06A63DF0E509539]) [    ] o.a.s.SolrTestCaseJ4 ###Starting deleteReplicaByCount
   [junit4]   2> 3066897 INFO  (TEST-DeleteReplicaTest.deleteReplicaByCount-seed#[C06A63DF0E509539]) [    ] o.a.s.c.MiniSolrCloudCluster Starting cluster of 4 servers in /home/jenkins/jenkins-slave/workspace/Lucene-Solr-Tests-8.x/solr/build/solr-core/test/J1/temp/solr.cloud.DeleteReplicaTest_C06A63DF0E509539-001/tempDir-001
   [junit4]   2> 3066897 INFO  (TEST-DeleteReplicaTest.deleteReplicaByCount-seed#[C06A63DF0E509539]) [    ] o.a.s.c.ZkTestServer STARTING ZK TEST SERVER
   [junit4]   2> 3066900 INFO  (ZkTestServer Run Thread) [    ] o.a.s.c.ZkTestServer client port:0.0.0.0/0.0.0.0:0
   [junit4]   2> 3066900 INFO  (ZkTestServer Run Thread) [    ] o.a.s.c.ZkTestServer Starting server
   [junit4]   2> 3067001 INFO  (TEST-DeleteReplicaTest.deleteReplicaByCount-seed#[C06A63DF0E509539]) [    ] o.a.s.c.ZkTestServer start zk server on port:39162
   [junit4]   2> 3067001 INFO  (TEST-DeleteReplicaTest.deleteReplicaByCount-seed#[C06A63DF0E509539]) [    ] o.a.s.c.ZkTestServer parse host and port list: 127.0.0.1:39162
   [junit4]   2> 3067001 INFO  (TEST-DeleteReplicaTest.deleteReplicaByCount-seed#[C06A63DF0E509539]) [    ] o.a.s.c.ZkTestServer connecting to 127.0.0.1 39162
   [junit4]   2> 3067005 INFO  (zkConnectionManagerCallback-9758-thread-1) [    ] o.a.s.c.c.ConnectionManager zkClient has connected
   [junit4]   2> 3067074 INFO  (zkConnectionManagerCallback-9760-thread-1) [    ] o.a.s.c.c.ConnectionManager zkClient has connected
   [junit4]   2> 3067076 INFO  (zkConnectionManagerCallback-9762-thread-1) [    ] o.a.s.c.c.ConnectionManager zkClient has connected
   [junit4]   2> 3067077 WARN  (jetty-launcher-9763-thread-1) [    ] o.e.j.s.AbstractConnector Ignoring deprecated socket close linger time
   [junit4]   2> 3067077 INFO  (jetty-launcher-9763-thread-1) [    ] o.a.s.c.s.e.JettySolrRunner Start Jetty (original configured port=0)
   [junit4]   2> 3067077 INFO  (jetty-launcher-9763-thread-1) [    ] o.a.s.c.s.e.JettySolrRunner Trying to start Jetty on port 0 try number 1 ...
   [junit4]   2> 3067078 INFO  (jetty-launcher-9763-thread-1) [    ] o.e.j.s.Server jetty-9.4.14.v20181114; built: 2018-11-14T21:20:31.478Z; git: c4550056e785fb5665914545889f21dc136ad9e6; jvm 1.8.0_191-b12
   [junit4]   2> 3067095 WARN  (jetty-launcher-9763-thread-3) [    ] o.e.j.s.AbstractConnector Ignoring deprecated socket close linger time
   [junit4]   2> 3067095 INFO  (jetty-launcher-9763-thread-3) [    ] o.a.s.c.s.e.JettySolrRunner Start Jetty (original configured port=0)
   [junit4]   2> 3067095 INFO  (jetty-launcher-9763-thread-3) [    ] o.a.s.c.s.e.JettySolrRunner Trying to start Jetty on port 0 try number 1 ...
   [junit4]   2> 3067095 INFO  (jetty-launcher-9763-thread-3) [    ] o.e.j.s.Server jetty-9.4.14.v20181114; built: 2018-11-14T21:20:31.478Z; git: c4550056e785fb5665914545889f21dc136ad9e6; jvm 1.8.0_191-b12
   [junit4]   2> 3067095 WARN  (jetty-launcher-9763-thread-4) [    ] o.e.j.s.AbstractConnector Ignoring deprecated socket close linger time
   [junit4]   2> 3067096 INFO  (jetty-launcher-9763-thread-4) [    ] o.a.s.c.s.e.JettySolrRunner Start Jetty (original configured port=0)
   [junit4]   2> 3067096 INFO  (jetty-launcher-9763-thread-4) [    ] o.a.s.c.s.e.JettySolrRunner Trying to start Jetty on port 0 try number 1 ...
   [junit4]   2> 3067096 INFO  (jetty-launcher-9763-thread-4) [    ] o.e.j.s.Server jetty-9.4.14.v20181114; built: 2018-11-14T21:20:31.478Z; git: c4550056e785fb5665914545889f21dc136ad9e6; jvm 1.8.0_191-b12
   [junit4]   2> 3067111 WARN  (jetty-launcher-9763-thread-2) [    ] o.e.j.s.AbstractConnector Ignoring deprecated socket close linger time
   [junit4]   2> 3067111 INFO  (jetty-launcher-9763-thread-2) [    ] o.a.s.c.s.e.JettySolrRunner Start Jetty (original configured port=0)
   [junit4]   2> 3067111 INFO  (jetty-launcher-9763-thread-2) [    ] o.a.s.c.s.e.JettySolrRunner Trying to start Jetty on port 0 try number 1 ...
   [junit4]   2> 3067111 INFO  (jetty-launcher-9763-thread-2) [    ] o.e.j.s.Server jetty-9.4.14.v20181114; built: 2018-11-14T21:20:31.478Z; git: c4550056e785fb5665914545889f21dc136ad9e6; jvm 1.8.0_191-b12
   [junit4]   2> 3067139 INFO  (jetty-launcher-9763-thread-1) [    ] o.e.j.s.session DefaultSessionIdManager workerName=node0
   [junit4]   2> 3067139 INFO  (jetty-launcher-9763-thread-1) [    ] o.e.j.s.session No SessionScavenger set, using defaults
   [junit4]   2> 3067139 INFO  (jetty-launcher-9763-thread-1) [    ] o.e.j.s.session node0 Scavenging every 600000ms
   [junit4]   2> 3067139 INFO  (jetty-launcher-9763-thread-1) [    ] o.e.j.s.h.ContextHandler Started o.e.j.s.ServletContextHandler@75043b4b{/solr,null,AVAILABLE}
   [junit4]   2> 3067195 INFO  (jetty-launcher-9763-thread-3) [    ] o.e.j.s.session DefaultSessionIdManager workerName=node0
   [junit4]   2> 3067195 INFO  (jetty-launcher-9763-thread-3) [    ] o.e.j.s.session No SessionScavenger set, using defaults
   [junit4]   2> 3067195 INFO  (jetty-launcher-9763-thread-3) [    ] o.e.j.s.session node0 Scavenging every 600000ms
   [junit4]   2> 3067252 INFO  (jetty-launcher-9763-thread-2) [    ] o.e.j.s.session DefaultSessionIdManager workerName=node0
   [junit4]   2> 3067252 INFO  (jetty-launcher-9763-thread-2) [    ] o.e.j.s.session No SessionScavenger set, using defaults
   [junit4]   2> 3067252 INFO  (jetty-launcher-9763-thread-2) [    ] o.e.j.s.session node0 Scavenging every 660000ms
   [junit4]   2> 3067269 INFO  (jetty-launcher-9763-thread-2) [    ] o.e.j.s.h.ContextHandler Started o.e.j.s.ServletContextHandler@23f1266d{/solr,null,AVAILABLE}
   [junit4]   2> 3067269 INFO  (jetty-launcher-9763-thread-3) [    ] o.e.j.s.h.ContextHandler Started o.e.j.s.ServletContextHandler@54d3389{/solr,null,AVAILABLE}
   [junit4]   2> 3067285 INFO  (jetty-launcher-9763-thread-4) [    ] o.e.j.s.session DefaultSessionIdManager workerName=node0
   [junit4]   2> 3067285 INFO  (jetty-launcher-9763-thread-4) [    ] o.e.j.s.session No SessionScavenger set, using defaults
   [junit4]   2> 3067285 INFO  (jetty-launcher-9763-thread-4) [    ] o.e.j.s.session node0 Scavenging every 600000ms
   [junit4]   2> 3067285 INFO  (jetty-launcher-9763-thread-4) [    ] o.e.j.s.h.ContextHandler Started o.e.j.s.ServletContextHandler@7aab2fbf{/solr,null,AVAILABLE}
   [junit4]   2> 3067286 INFO  (jetty-launcher-9763-thread-1) [    ] o.e.j.s.AbstractConnector Started ServerConnector@40ff732d{HTTP/1.1,[http/1.1, h2c]}{127.0.0.1:33253}
   [junit4]   2> 3067342 INFO  (jetty-launcher-9763-thread-1) [    ] o.e.j.s.Server Started @3067398ms
   [junit4]   2> 3067342 INFO  (jetty-launcher-9763-thread-1) [    ] o.a.s.c.s.e.JettySolrRunner Jetty properties: {hostContext=/solr, hostPort=33253}
   [junit4]   2> 3067342 ERROR (jetty-launcher-9763-thread-1) [    ] o.a.s.u.StartupLoggingUtils Missing Java Option solr.log.dir. Logging may be missing or incomplete.
   [junit4]   2> 3067342 INFO  (jetty-launcher-9763-thread-1) [    ] o.a.s.s.SolrDispatchFilter Using logger factory org.apache.logging.slf4j.Log4jLoggerFactory
   [junit4]   2> 3067342 INFO  (jetty-launcher-9763-thread-1) [    ] o.a.s.s.SolrDispatchFilter  ___      _       Welcome to Apache Solr™ version 8.1.0
   [junit4]   2> 3067342 INFO  (jetty-launcher-9763-thread-1) [    ] o.a.s.s.SolrDispatchFilter / __| ___| |_ _   Starting in cloud mode on port null
   [junit4]   2> 3067342 INFO  (jetty-launcher-9763-thread-1) [    ] o.a.s.s.SolrDispatchFilter \__ \/ _ \ | '_|  Install dir: null
   [junit4]   2> 3067342 INFO  (jetty-launcher-9763-thread-1) [    ] o.a.s.s.SolrDispatchFilter |___/\___/_|_|    Start time: 2019-04-08T15:36:44.174Z
   [junit4]   2> 3067378 INFO  (jetty-launcher-9763-thread-4) [    ] o.e.j.s.AbstractConnector Started ServerConnector@17c8d466{HTTP/1.1,[http/1.1, h2c]}{127.0.0.1:38261}
   [junit4]   2> 3067378 INFO  (jetty-launcher-9763-thread-4) [    ] o.e.j.s.Server Started @3067434ms
   [junit4]   2> 3067378 INFO  (jetty-launcher-9763-thread-2) [    ] o.e.j.s.AbstractConnector Started ServerConnector@9900306{HTTP/1.1,[http/1.1, h2c]}{127.0.0.1:40248}
   [junit4]   2> 3067378 INFO  (jetty-launcher-9763-thread-2) [    ] o.e.j.s.Server Started @3067434ms
   [junit4]   2> 3067378 INFO  (jetty-launcher-9763-thread-4) [    ] o.a.s.c.s.e.JettySolrRunner Jetty properties: {hostContext=/solr, hostPort=38261}
   [junit4]   2> 3067378 INFO  (jetty-launcher-9763-thread-2) [    ] o.a.s.c.s.e.JettySolrRunner Jetty properties: {hostContext=/solr, hostPort=40248}
   [junit4]   2> 3067378 INFO  (zkConnectionManagerCallback-9765-thread-1) [    ] o.a.s.c.c.ConnectionManager zkClient has connected
   [junit4]   2> 3067378 ERROR (jetty-launcher-9763-thread-4) [    ] o.a.s.u.StartupLoggingUtils Missing Java Option solr.log.dir. Logging may be missing or incomplete.
   [junit4]   2> 3067378 INFO  (jetty-launcher-9763-thread-4) [    ] o.a.s.s.SolrDispatchFilter Using logger factory org.apache.logging.slf4j.Log4jLoggerFactory
   [junit4]   2> 3067378 ERROR (jetty-launcher-9763-thread-2) [    ] o.a.s.u.StartupLoggingUtils Missing Java Option solr.log.dir. Logging may be missing or incomplete.
   [junit4]   2> 3067378 INFO  (jetty-launcher-9763-thread-2) [    ] o.a.s.s.SolrDispatchFilter Using logger factory org.apache.logging.slf4j.Log4jLoggerFactory
   [junit4]   2> 3067378 INFO  (jetty-launcher-9763-thread-4) [    ] o.a.s.s.SolrDispatchFilter  ___      _       Welcome to Apache Solr™ version 8.1.0
   [junit4]   2> 3067378 INFO  (jetty-launcher-9763-thread-2) [    ] o.a.s.s.SolrDispatchFilter  ___      _       Welcome to Apache Solr™ version 8.1.0
   [junit4]   2> 3067378 INFO  (jetty-launcher-9763-thread-4) [    ] o.a.s.s.SolrDispatchFilter / __| ___| |_ _   Starting in cloud mode on port null
   [junit4]   2> 3067378 INFO  (jetty-launcher-9763-thread-2) [    ] o.a.s.s.SolrDispatchFilter / __| ___| |_ _   Starting in cloud mode on port null
   [junit4]   2> 3067378 INFO  (jetty-launcher-9763-thread-4) [    ] o.a.s.s.SolrDispatchFilter \__ \/ _ \ | '_|  Install dir: null
   [junit4]   2> 3067378 INFO  (jetty-launcher-9763-thread-2) [    ] o.a.s.s.SolrDispatchFilter \__ \/ _ \ | '_|  Install dir: null
   [junit4]   2> 3067378 INFO  (jetty-launcher-9763-thread-4) [    ] o.a.s.s.SolrDispatchFilter |___/\___/_|_|    Start time: 2019-04-08T15:36:44.210Z
   [junit4]   2> 3067378 INFO  (jetty-launcher-9763-thread-2) [    ] o.a.s.s.SolrDispatchFilter |___/\___/_|_|    Start time: 2019-04-08T15:36:44.210Z
   [junit4]   2> 3067379 INFO  (jetty-launcher-9763-thread-3) [    ] o.e.j.s.AbstractConnector Started ServerConnector@6488dae7{HTTP/1.1,[http/1.1, h2c]}{127.0.0.1:43263}
   [junit4]   2> 3067379 INFO  (jetty-launcher-9763-thread-3) [    ] o.e.j.s.Server Started @3067435ms
   [junit4]   2> 3067379 INFO  (jetty-launcher-9763-thread-3) [    ] o.a.s.c.s.e.JettySolrRunner Jetty properties: {hostContext=/solr, hostPort=43263}
   [junit4]   2> 3067379 ERROR (jetty-launcher-9763-thread-3) [    ] o.a.s.u.StartupLoggingUtils Missing Java Option solr.log.dir. Logging may be missing or incomplete.
   [junit4]   2> 3067379 INFO  (jetty-launcher-9763-thread-3) [    ] o.a.s.s.SolrDispatchFilter Using logger factory org.apache.logging.slf4j.Log4jLoggerFactory
   [junit4]   2> 3067379 INFO  (jetty-launcher-9763-thread-3) [    ] o.a.s.s.SolrDispatchFilter  ___      _       Welcome to Apache Solr™ version 8.1.0
   [junit4]   2> 3067379 INFO  (jetty-launcher-9763-thread-3) [    ] o.a.s.s.SolrDispatchFilter / __| ___| |_ _   Starting in cloud mode on port null
   [junit4]   2> 3067379 INFO  (jetty-launcher-9763-thread-3) [    ] o.a.s.s.SolrDispatchFilter \__ \/ _ \ | '_|  Install dir: null
   [junit4]   2> 3067379 INFO  (jetty-launcher-9763-thread-3) [    ] o.a.s.s.SolrDispatchFilter |___/\___/_|_|    Start time: 2019-04-08T15:36:44.211Z
   [junit4]   2> 3067379 INFO  (jetty-launcher-9763-thread-1) [    ] o.a.s.s.SolrDispatchFilter solr.xml found in ZooKeeper. Loading...
   [junit4]   2> 3067495 INFO  (zkConnectionManagerCallback-9769-thread-1) [    ] o.a.s.c.c.ConnectionManager zkClient has connected
   [junit4]   2> 3067496 INFO  (zkConnectionManagerCallback-9771-thread-1) [    ] o.a.s.c.c.ConnectionManager zkClient has connected
   [junit4]   2> 3067524 INFO  (zkConnectionManagerCallback-9767-thread-1) [    ] o.a.s.c.c.ConnectionManager zkClient has connected
   [junit4]   2> 3067532 INFO  (jetty-launcher-9763-thread-4) [    ] o.a.s.s.SolrDispatchFilter solr.xml found in ZooKeeper. Loading...
   [junit4]   2> 3067532 INFO  (jetty-launcher-9763-thread-3) [    ] o.a.s.s.SolrDispatchFilter solr.xml found in ZooKeeper. Loading...
   [junit4]   2> 3067552 INFO  (jetty-launcher-9763-thread-2) [    ] o.a.s.s.SolrDispatchFilter solr.xml found in ZooKeeper. Loading...
   [junit4]   2> 3068097 INFO  (jetty-launcher-9763-thread-1) [    ] o.a.s.h.c.HttpShardHandlerFactory Host whitelist initialized: WhitelistHostChecker [whitelistHosts=null, whitelistHostCheckingEnabled=true]
   [junit4]   2> 3068116 WARN  (jetty-launcher-9763-thread-1) [    ] o.e.j.u.s.S.config No Client EndPointIdentificationAlgorithm configured for SslContextFactory@11a476e2[provider=null,keyStore=null,trustStore=null]
   [junit4]   2> 3068181 WARN  (jetty-launcher-9763-thread-1) [    ] o.e.j.u.s.S.config No Client EndPointIdentificationAlgorithm configured for SslContextFactory@618a246c[provider=null,keyStore=null,trustStore=null]
   [junit4]   2> 3068182 INFO  (jetty-launcher-9763-thread-1) [    ] o.a.s.c.ZkContainer Zookeeper client=127.0.0.1:39162/solr
   [junit4]   2> 3068205 INFO  (zkConnectionManagerCallback-9781-thread-1) [    ] o.a.s.c.c.ConnectionManager zkClient has connected
   [junit4]   2> 3068241 INFO  (zkConnectionManagerCallback-9783-thread-1) [    ] o.a.s.c.c.ConnectionManager zkClient has connected
   [junit4]   2> 3068607 INFO  (jetty-launcher-9763-thread-2) [    ] o.a.s.h.c.HttpShardHandlerFactory Host whitelist initialized: WhitelistHostChecker [whitelistHosts=null, whitelistHostCheckingEnabled=true]
   [junit4]   2> 3068627 WARN  (jetty-launcher-9763-thread-2) [    ] o.e.j.u.s.S.config No Client EndPointIdentificationAlgorithm configured for SslContextFactory@47a33a37[provider=null,keyStore=null,trustStore=null]
   [junit4]   2> 3068663 WARN  (jetty-launcher-9763-thread-2) [    ] o.e.j.u.s.S.config No Client EndPointIdentificationAlgorithm configured for SslContextFactory@1df37096[provider=null,keyStore=null,trustStore=null]
   [junit4]   2> 3068664 INFO  (jetty-launcher-9763-thread-2) [    ] o.a.s.c.ZkContainer Zookeeper client=127.0.0.1:39162/solr
   [junit4]   2> 3068683 INFO  (zkConnectionManagerCallback-9791-thread-1) [    ] o.a.s.c.c.ConnectionManager zkClient has connected
   [junit4]   2> 3068729 INFO  (jetty-launcher-9763-thread-3) [    ] o.a.s.h.c.HttpShardHandlerFactory Host whitelist initialized: WhitelistHostChecker [whitelistHosts=null, whitelistHostCheckingEnabled=true]
   [junit4]   2> 3068756 INFO  (zkConnectionManagerCallback-9793-thread-1) [    ] o.a.s.c.c.ConnectionManager zkClient has connected
   [junit4]   2> 3068790 INFO  (jetty-launcher-9763-thread-2) [n:127.0.0.1:40248_solr    ] o.a.s.c.OverseerElectionContext I am going to be the leader 127.0.0.1:40248_solr
   [junit4]   2> 3068791 INFO  (jetty-launcher-9763-thread-2) [n:127.0.0.1:40248_solr    ] o.a.s.c.Overseer Overseer (id=74487354652164106-127.0.0.1:40248_solr-n_0000000000) starting
   [junit4]   2> 3068801 WARN  (jetty-launcher-9763-thread-3) [    ] o.e.j.u.s.S.config No Client EndPointIdentificationAlgorithm configured for SslContextFactory@e53050d[provider=null,keyStore=null,trustStore=null]
   [junit4]   2> 3068815 WARN  (jetty-launcher-9763-thread-3) [    ] o.e.j.u.s.S.config No Client EndPointIdentificationAlgorithm configured for SslContextFactory@ee9a9b[provider=null,keyStore=null,trustStore=null]
   [junit4]   2> 3068815 INFO  (jetty-launcher-9763-thread-3) [    ] o.a.s.c.ZkContainer Zookeeper client=127.0.0.1:39162/solr
   [junit4]   2> 3068865 INFO  (zkConnectionManagerCallback-9801-thread-1) [    ] o.a.s.c.c.ConnectionManager zkClient has connected
   [junit4]   2> 3068995 INFO  (zkConnectionManagerCallback-9806-thread-1) [    ] o.a.s.c.c.ConnectionManager zkClient has connected
   [junit4]   2> 3069009 INFO  (jetty-launcher-9763-thread-1) [n:127.0.0.1:33253_solr    ] o.a.s.c.ZkController Register node as live in ZooKeeper:/live_nodes/127.0.0.1:33253_solr
   [junit4]   2> 3069027 INFO  (zkConnectionManagerCallback-9808-thread-1) [    ] o.a.s.c.c.ConnectionManager zkClient has connected
   [junit4]   2> 3069027 INFO  (zkCallback-9792-thread-1) [    ] o.a.s.c.c.ZkStateReader Updated live nodes from ZooKeeper... (0) -> (1)
   [junit4]   2> 3069028 INFO  (jetty-launcher-9763-thread-2) [n:127.0.0.1:40248_solr    ] o.a.s.c.c.ZkStateReader Updated live nodes from ZooKeeper... (0) -> (1)
   [junit4]   2> 3069055 INFO  (zkCallback-9782-thread-1) [    ] o.a.s.c.c.ZkStateReader Updated live nodes from ZooKeeper... (0) -> (1)
   [junit4]   2> 3069064 INFO  (jetty-launcher-9763-thread-2) [n:127.0.0.1:40248_solr    ] o.a.s.c.s.i.ZkClientClusterStateProvider Cluster at 127.0.0.1:39162/solr ready
   [junit4]   2> 3069100 INFO  (OverseerStateUpdate-74487354652164106-127.0.0.1:40248_solr-n_0000000000) [n:127.0.0.1:40248_solr    ] o.a.s.c.Overseer Starting to work on the main queue : 127.0.0.1:40248_solr
   [junit4]   2> 3069129 INFO  (jetty-launcher-9763-thread-2) [n:127.0.0.1:40248_solr    ] o.a.s.c.ZkController Publish node=127.0.0.1:40248_solr as DOWN
   [junit4]   2> 3069150 INFO  (jetty-launcher-9763-thread-2) [n:127.0.0.1:40248_solr    ] o.a.s.c.TransientSolrCoreCacheDefault Allocating transient cache for 2147483647 transient cores
   [junit4]   2> 3069150 INFO  (jetty-launcher-9763-thread-2) [n:127.0.0.1:40248_solr    ] o.a.s.c.ZkController Register node as live in ZooKeeper:/live_nodes/127.0.0.1:40248_solr
   [junit4]   2> 3069151 INFO  (zkCallback-9782-thread-1) [    ] o.a.s.c.c.ZkStateReader Updated live nodes from ZooKeeper... (1) -> (2)
   [junit4]   2> 3069151 INFO  (zkCallback-9792-thread-1) [    ] o.a.s.c.c.ZkStateReader Updated live nodes from ZooKeeper... (1) -> (2)
   [junit4]   2> 3069230 INFO  (zkConnectionManagerCallback-9815-thread-1) [    ] o.a.s.c.c.ConnectionManager zkClient has connected
   [junit4]   2> 3069250 INFO  (zkCallback-9805-thread-1) [    ] o.a.s.c.c.ZkStateReader Updated live nodes from ZooKeeper... (1) -> (2)
   [junit4]   2> 3069279 INFO  (jetty-launcher-9763-thread-1) [n:127.0.0.1:33253_solr    ] o.a.s.c.c.ZkStateReader Updated live nodes from ZooKeeper... (0) -> (2)
   [junit4]   2> 3069279 INFO  (jetty-launcher-9763-thread-1) [n:127.0.0.1:33253_solr    ] o.a.s.c.s.i.ZkClientClusterStateProvider Cluster at 127.0.0.1:39162/solr ready
   [junit4]   2> 3069291 INFO  (jetty-launcher-9763-thread-1) [n:127.0.0.1:33253_solr    ] o.a.s.h.a.MetricsHistoryHandler No .system collection, keeping metrics history in memory.
   [junit4]   2> 3069319 INFO  (jetty-launcher-9763-thread-2) [n:127.0.0.1:40248_solr    ] o.a.s.h.a.MetricsHistoryHandler No .system collection, keeping metrics history in memory.
   [junit4]   2> 3069349 INFO  (jetty-launcher-9763-thread-4) [    ] o.a.s.h.c.HttpShardHandlerFactory Host whitelist initialized: WhitelistHostChecker [whitelistHosts=null, whitelistHostCheckingEnabled=true]
   [junit4]   2> 3069401 WARN  (jetty-launcher-9763-thread-4) [    ] o.e.j.u.s.S.config No Client EndPointIdentificationAlgorithm configured for SslContextFactory@552c1ef2[provider=null,keyStore=null,trustStore=null]
   [junit4]   2> 3069513 INFO  (jetty-launcher-9763-thread-1) [n:127.0.0.1:33253_solr    ] o.a.s.m.r.SolrJmxReporter JMX monitoring for 'solr_33253.solr.node' (registry 'solr.node') enabled at server: com.sun.jmx.mbeanserver.JmxMBeanServer@7e998352
   [junit4]   2> 3069530 WARN  (jetty-launcher-9763-thread-4) [    ] o.e.j.u.s.S.config No Client EndPointIdentificationAlgorithm configured for SslContextFactory@1a7f5d82[provider=null,keyStore=null,trustStore=null]
   [junit4]   2> 3069531 INFO  (jetty-launcher-9763-thread-4) [    ] o.a.s.c.ZkContainer Zookeeper client=127.0.0.1:39162/solr
   [junit4]   2> 3069549 INFO  (jetty-launcher-9763-thread-1) [n:127.0.0.1:33253_solr    ] o.a.s.m.r.SolrJmxReporter JMX monitoring for 'solr_33253.solr.jvm' (registry 'solr.jvm') enabled at server: com.sun.jmx.mbeanserver.JmxMBeanServer@7e998352
   [junit4]   2> 3069549 INFO  (jetty-launcher-9763-thread-1) [n:127.0.0.1:33253_solr    ] o.a.s.m.r.SolrJmxReporter JMX monitoring for 'solr_33253.solr.jetty' (registry 'solr.jetty') enabled at server: com.sun.jmx.mbeanserver.JmxMBeanServer@7e998352
   [junit4]   2> 3069558 INFO  (zkConnectionManagerCallback-9823-thread-1) [    ] o.a.s.c.c.ConnectionManager zkClient has connected
   [junit4]   2> 3069583 INFO  (jetty-launcher-9763-thread-1) [n:127.0.0.1:33253_solr    ] o.a.s.c.CorePropertiesLocator Found 0 core definitions underneath /home/jenkins/jenkins-slave/workspace/Lucene-Solr-Tests-8.x/solr/build/solr-core/test/J1/temp/solr.cloud.DeleteReplicaTest_C06A63DF0E509539-001/tempDir-001/node1/.
   [junit4]   2> 3069606 INFO  (jetty-launcher-9763-thread-2) [n:127.0.0.1:40248_solr    ] o.a.s.m.r.SolrJmxReporter JMX monitoring for 'solr_40248.solr.node' (registry 'solr.node') enabled at server: com.sun.jmx.mbeanserver.JmxMBeanServer@7e998352
   [junit4]   2> 3069651 INFO  (jetty-launcher-9763-thread-3) [n:127.0.0.1:43263_solr    ] o.a.s.c.c.ZkStateReader Updated live nodes from ZooKeeper... (0) -> (2)
   [junit4]   2> 3069695 INFO  (jetty-launcher-9763-thread-2) [n:127.0.0.1:40248_solr    ] o.a.s.m.r.SolrJmxReporter JMX monitoring for 'solr_40248.solr.jvm' (registry 'solr.jvm') enabled at server: com.sun.jmx.mbeanserver.JmxMBeanServer@7e998352
   [junit4]   2> 3069695 INFO  (jetty-launcher-9763-thread-2) [n:127.0.0.1:40248_solr    ] o.a.s.m.r.SolrJmxReporter JMX monitoring for 'solr_40248.solr.jetty' (registry 'solr.jetty') enabled at server: com.sun.jmx.mbeanserver.JmxMBeanServer@7e998352
   [junit4]   2> 3069696 INFO  (zkConnectionManagerCallback-9825-thread-1) [    ] o.a.s.c.c.ConnectionManager zkClient has connected
   [junit4]   2> 3069729 INFO  (jetty-launcher-9763-thread-2) [n:127.0.0.1:40248_solr    ] o.a.s.c.CorePropertiesLocator Found 0 core definitions underneath /home/jenkins/jenkins-slave/workspace/Lucene-Solr-Tests-8.x/solr/build/solr-core/test/J1/temp/solr.cloud.DeleteReplicaTest_C06A63DF0E509539-001/tempDir-001/node4/.
   [junit4]   2> 3069781 INFO  (jetty-launcher-9763-thread-3) [n:127.0.0.1:43263_solr    ] o.a.s.c.ZkController Publish node=127.0.0.1:43263_solr as DOWN
   [junit4]   2> 3069782 INFO  (jetty-launcher-9763-thread-4) [n:127.0.0.1:38261_solr    ] o.a.s.c.c.ZkStateReader Updated live nodes from ZooKeeper... (0) -> (2)
   [junit4]   2> 3069782 INFO  (jetty-launcher-9763-thread-3) [n:127.0.0.1:43263_solr    ] o.a.s.c.TransientSolrCoreCacheDefault Allocating transient cache for 2147483647 transient cores
   [junit4]   2> 3069782 INFO  (jetty-launcher-9763-thread-3) [n:127.0.0.1:43263_solr    ] o.a.s.c.ZkController Register node as live in ZooKeeper:/live_nodes/127.0.0.1:43263_solr
   [junit4]   2> 3069784 INFO  (zkCallback-9792-thread-1) [    ] o.a.s.c.c.ZkStateReader Updated live nodes from ZooKeeper... (2) -> (3)
   [junit4]   2> 3069784 INFO  (zkCallback-9805-thread-1) [    ] o.a.s.c.c.ZkStateReader Updated live nodes from ZooKeeper... (2) -> (3)
   [junit4]   2> 3069784 INFO  (zkCallback-9782-thread-1) [    ] o.a.s.c.c.ZkStateReader Updated live nodes from ZooKeeper... (2) -> (3)
   [junit4]   2> 3069802 INFO  (zkCallback-9824-thread-1) [    ] o.a.s.c.c.ZkStateReader Updated live nodes from ZooKeeper... (2) -> (3)
   [junit4]   2> 3069802 INFO  (zkCallback-9807-thread-1) [    ] o.a.s.c.c.ZkStateReader Updated live nodes from ZooKeeper... (2) -> (3)
   [junit4]   2> 3069802 INFO  (zkCallback-9814-thread-1) [    ] o.a.s.c.c.ZkStateReader Updated live nodes from ZooKeeper... (2) -> (3)
   [junit4]   2> 3069803 INFO  (jetty-launcher-9763-thread-4) [n:127.0.0.1:38261_solr    ] o.a.s.c.ZkController Publish node=127.0.0.1:38261_solr as DOWN
   [junit4]   2> 3069804 INFO  (jetty-launcher-9763-thread-4) [n:127.0.0.1:38261_solr    ] o.a.s.c.TransientSolrCoreCacheDefault Allocating transient cache for 2147483647 transient cores
   [junit4]   2> 3069804 INFO  (jetty-launcher-9763-thread-4) [n:127.0.0.1:38261_solr    ] o.a.s.c.ZkController Register node as live in ZooKeeper:/live_nodes/127.0.0.1:38261_solr
   [junit4]   2> 3069805 INFO  (zkCallback-9805-thread-1) [    ] o.a.s.c.c.ZkStateReader Updated live nodes from ZooKeeper... (3) -> (4)
   [junit4]   2> 3069805 INFO  (zkCallback-9782-thread-1) [    ] o.a.s.c.c.ZkStateReader Updated live nodes from ZooKeeper... (3) -> (4)
   [junit4]   2> 3069805 INFO  (zkCallback-9792-thread-1) [    ] o.a.s.c.c.ZkStateReader Updated live nodes from ZooKeeper... (3) -> (4)
   [junit4]   2> 3069817 INFO  (zkCallback-9807-thread-1) [    ] o.a.s.c.c.ZkStateReader Updated live nodes from ZooKeeper... (3) -> (4)
   [junit4]   2> 3069818 INFO  (zkCallback-9824-thread-1) [    ] o.a.s.c.c.ZkStateReader Updated live nodes from ZooKeeper... (3) -> (4)
   [junit4]   2> 3069818 INFO  (zkCallback-9814-thread-1) [    ] o.a.s.c.c.ZkStateReader Updated live nodes from ZooKeeper... (3) -> (4)
   [junit4]   2> 3070056 INFO  (zkConnectionManagerCallback-9832-thread-1) [    ] o.a.s.c.c.ConnectionManager zkClient has connected
   [junit4]   2> 3070069 INFO  (jetty-launcher-9763-thread-3) [n:127.0.0.1:43263_solr    ] o.a.s.c.c.ZkStateReader Updated live nodes from ZooKeeper... (0) -> (4)
   [junit4]   2> 3070070 INFO  (jetty-launcher-9763-thread-3) [n:127.0.0.1:43263_solr    ] o.a.s.c.s.i.ZkClientClusterStateProvider Cluster at 127.0.0.1:39162/solr ready
   [junit4]   2> 3070071 INFO  (jetty-launcher-9763-thread-3) [n:127.0.0.1:43263_solr    ] o.a.s.h.a.MetricsHistoryHandler No .system collection, keeping metrics history in memory.
   [junit4]   2> 3070089 INFO  (zkConnectionManagerCallback-9837-thread-1) [    ] o.a.s.c.c.ConnectionManager zkClient has connected
   [junit4]   2> 3070132 INFO  (jetty-launcher-9763-thread-3) [n:127.0.0.1:43263_solr    ] o.a.s.m.r.SolrJmxReporter JMX monitoring for 'solr_43263.solr.node' (registry 'solr.node') enabled at server: com.sun.jmx.mbeanserver.JmxMBeanServer@7e998352
   [junit4]   2> 3070169 INFO  (jetty-launcher-9763-thread-3) [n:127.0.0.1:43263_solr    ] o.a.s.m.r.SolrJmxReporter JMX monitoring for 'solr_43263.solr.jvm' (registry 'solr.jvm') enabled at server: com.sun.jmx.mbeanserver.JmxMBeanServer@7e998352
   [junit4]   2> 3070169 INFO  (jetty-launcher-9763-thread-3) [n:127.0.0.1:43263_solr    ] o.a.s.m.r.SolrJmxReporter JMX monitoring for 'solr_43263.solr.jetty' (registry 'solr.jetty') enabled at server: com.sun.jmx.mbeanserver.JmxMBeanServer@7e998352
   [junit4]   2> 3070182 INFO  (jetty-launcher-9763-thread-3) [n:127.0.0.1:43263_solr    ] o.a.s.c.CorePropertiesLocator Found 0 core definitions underneath /home/jenkins/jenkins-slave/workspace/Lucene-Solr-Tests-8.x/solr/build/solr-core/test/J1/temp/solr.cloud.DeleteReplicaTest_C06A63DF0E509539-001/tempDir-001/node2/.
   [junit4]   2> 3070198 INFO  (jetty-launcher-9763-thread-4) [n:127.0.0.1:38261_solr    ] o.a.s.c.c.ZkStateReader Updated live nodes from ZooKeeper... (0) -> (4)
   [junit4]   2> 3070380 INFO  (jetty-launcher-9763-thread-4) [n:127.0.0.1:38261_solr    ] o.a.s.c.s.i.ZkClientClusterStateProvider Cluster at 127.0.0.1:39162/solr ready
   [junit4]   2> 3070393 INFO  (jetty-launcher-9763-thread-4) [n:127.0.0.1:38261_solr    ] o.a.s.h.a.MetricsHistoryHandler No .system collection, keeping metrics history in memory.
   [junit4]   2> 3070439 INFO  (jetty-launcher-9763-thread-4) [n:127.0.0.1:38261_solr    ] o.a.s.m.r.SolrJmxReporter JMX monitoring for 'solr_38261.solr.node' (registry 'solr.node') enabled at server: com.sun.jmx.mbeanserver.JmxMBeanServer@7e998352
   [junit4]   2> 3070476 INFO  (jetty-launcher-9763-thread-4) [n:127.0.0.1:38261_solr    ] o.a.s.m.r.SolrJmxReporter JMX monitoring for 'solr_38261.solr.jvm' (registry 'solr.jvm') enabled at server: com.sun.jmx.mbeanserver.JmxMBeanServer@7e998352
   [junit4]   2> 3070476 INFO  (jetty-launcher-9763-thread-4) [n:127.0.0.1:38261_solr    ] o.a.s.m.r.SolrJmxReporter JMX monitoring for 'solr_38261.solr.jetty' (registry 'solr.jetty') enabled at server: com.sun.jmx.mbeanserver.JmxMBeanServer@7e998352
   [junit4]   2> 3070477 INFO  (jetty-launcher-9763-thread-4) [n:127.0.0.1:38261_solr    ] o.a.s.c.CorePropertiesLocator Found 0 core definitions underneath /home/jenkins/jenkins-slave/workspace/Lucene-Solr-Tests-8.x/solr/build/solr-core/test/J1/temp/solr.cloud.DeleteReplicaTest_C06A63DF0E509539-001/tempDir-001/node3/.
   [junit4]   2> 3070722 INFO  (zkConnectionManagerCallback-9844-thread-1) [    ] o.a.s.c.c.ConnectionManager zkClient has connected
   [junit4]   2> 3070723 INFO  (TEST-DeleteReplicaTest.deleteReplicaByCount-seed#[C06A63DF0E509539]) [    ] o.a.s.c.c.ZkStateReader Updated live nodes from ZooKeeper... (0) -> (4)
   [junit4]   2> 3070724 INFO  (TEST-DeleteReplicaTest.deleteReplicaByCount-seed#[C06A63DF0E509539]) [    ] o.a.s.c.s.i.ZkClientClusterStateProvider Cluster at 127.0.0.1:39162/solr ready
   [junit4]   2> 3070782 INFO  (qtp1756050340-25918) [n:127.0.0.1:33253_solr    ] o.a.s.h.a.CollectionsHandler Invoked Collection Action :create with params collection.configName=conf&name=deleteByCount&nrtReplicas=3&action=CREATE&numShards=1&wt=javabin&version=2 and sendToOCPQueue=true
   [junit4]   2> 3070888 INFO  (OverseerThreadFactory-7682-thread-1-processing-n:127.0.0.1:40248_solr) [n:127.0.0.1:40248_solr    ] o.a.s.c.a.c.CreateCollectionCmd Create collection deleteByCount
   [junit4]   2> 3071004 INFO  (OverseerStateUpdate-74487354652164106-127.0.0.1:40248_solr-n_0000000000) [n:127.0.0.1:40248_solr    ] o.a.s.c.o.SliceMutator createReplica() {
   [junit4]   2>   "operation":"ADDREPLICA",
   [junit4]   2>   "collection":"deleteByCount",
   [junit4]   2>   "shard":"shard1",
   [junit4]   2>   "core":"deleteByCount_shard1_replica_n1",
   [junit4]   2>   "state":"down",
   [junit4]   2>   "base_url":"http://127.0.0.1:33253/solr",
   [junit4]   2>   "type":"NRT",
   [junit4]   2>   "waitForFinalState":"false"} 
   [junit4]   2> 3071031 INFO  (OverseerStateUpdate-74487354652164106-127.0.0.1:40248_solr-n_0000000000) [n:127.0.0.1:40248_solr    ] o.a.s.c.o.SliceMutator createReplica() {
   [junit4]   2>   "operation":"ADDREPLICA",
   [junit4]   2>   "collection":"deleteByCount",
   [junit4]   2>   "shard":"shard1",
   [junit4]   2>   "core":"deleteByCount_shard1_replica_n2",
   [junit4]   2>   "state":"down",
   [junit4]   2>   "base_url":"http://127.0.0.1:38261/solr",
   [junit4]   2>   "type":"NRT",
   [junit4]   2>   "waitForFinalState":"false"} 
   [junit4]   2> 3071032 INFO  (OverseerStateUpdate-74487354652164106-127.0.0.1:40248_solr-n_0000000000) [n:127.0.0.1:40248_solr    ] o.a.s.c.o.SliceMutator createReplica() {
   [junit4]   2>   "operation":"ADDREPLICA",
   [junit4]   2>   "collection":"deleteByCount",
   [junit4]   2>   "shard":"shard1",
   [junit4]   2>   "core":"deleteByCount_shard1_replica_n3",
   [junit4]   2>   "state":"down",
   [junit4]   2>   "base_url":"http://127.0.0.1:40248/solr",
   [junit4]   2>   "type":"NRT",
   [junit4]   2>   "waitForFinalState":"false"} 
   [junit4]   2> 3071218 INFO  (qtp1756050340-25920) [n:127.0.0.1:33253_solr    x:deleteByCount_shard1_replica_n1] o.a.s.h.a.CoreAdminOperation core create command qt=/admin/cores&coreNodeName=core_node4&collection.configName=conf&newCollection=true&name=deleteByCount_shard1_replica_n1&action=CREATE&numShards=1&collection=deleteByCount&shard=shard1&wt=javabin&version=2&replicaType=NRT
   [junit4]   2> 3071218 INFO  (qtp1756050340-25920) [n:127.0.0.1:33253_solr    x:deleteByCount_shard1_replica_n1] o.a.s.c.TransientSolrCoreCacheDefault Allocating transient cache for 2147483647 transient cores
   [junit4]   2> 3071242 INFO  (qtp389308199-25936) [n:127.0.0.1:40248_solr    x:deleteByCount_shard1_replica_n3] o.a.s.h.a.CoreAdminOperation core create command qt=/admin/cores&coreNodeName=core_node6&collection.configName=conf&newCollection=true&name=deleteByCount_shard1_replica_n3&action=CREATE&numShards=1&collection=deleteByCount&shard=shard1&wt=javabin&version=2&replicaType=NRT
   [junit4]   2> 3071243 INFO  (qtp524008679-25945) [n:127.0.0.1:38261_solr    x:deleteByCount_shard1_replica_n2] o.a.s.h.a.CoreAdminOperation core create command qt=/admin/cores&coreNodeName=core_node5&collection.configName=conf&newCollection=true&name=deleteByCount_shard1_replica_n2&action=CREATE&numShards=1&collection=deleteByCount&shard=shard1&wt=javabin&version=2&replicaType=NRT
   [junit4]   2> 3072305 INFO  (qtp389308199-25936) [n:127.0.0.1:40248_solr c:deleteByCount s:shard1 r:core_node6 x:deleteByCount_shard1_replica_n3] o.a.s.c.SolrConfig Using Lucene MatchVersion: 8.1.0
   [junit4]   2> 3072523 INFO  (qtp1756050340-25920) [n:127.0.0.1:33253_solr c:deleteByCount s:shard1 r:core_node4 x:deleteByCount_shard1_replica_n1] o.a.s.c.SolrConfig Using Lucene MatchVersion: 8.1.0
   [junit4]   2> 3072542 INFO  (qtp524008679-25945) [n:127.0.0.1:38261_solr c:deleteByCount s:shard1 r:core_node5 x:deleteByCount_shard1_replica_n2] o.a.s.c.SolrConfig Using Lucene MatchVersion: 8.1.0
   [junit4]   2> 3072578 INFO  (qtp389308199-25936) [n:127.0.0.1:40248_solr c:deleteByCount s:shard1 r:core_node6 x:deleteByCount_shard1_replica_n3] o.a.s.s.IndexSchema [deleteByCount_shard1_replica_n3] Schema name=minimal
   [junit4]   2> 3072607 INFO  (qtp389308199-25936) [n:127.0.0.1:40248_solr c:deleteByCount s:shard1 r:core_node6 x:deleteByCount_shard1_replica_n3] o.a.s.s.IndexSchema Loaded schema minimal/1.1 with uniqueid field id
   [junit4]   2> 3072607 INFO  (qtp389308199-25936) [n:127.0.0.1:40248_solr c:deleteByCount s:shard1 r:core_node6 x:deleteByCount_shard1_replica_n3] o.a.s.c.CoreContainer Creating SolrCore 'deleteByCount_shard1_replica_n3' using configuration from collection deleteByCount, trusted=true
   [junit4]   2> 3072607 INFO  (qtp389308199-25936) [n:127.0.0.1:40248_solr c:deleteByCount s:shard1 r:core_node6 x:deleteByCount_shard1_replica_n3] o.a.s.m.r.SolrJmxReporter JMX monitoring for 'solr_40248.solr.core.deleteByCount.shard1.replica_n3' (registry 'solr.core.deleteByCount.shard1.replica_n3') enabled at server: com.sun.jmx.mbeanserver.JmxMBeanServer@7e998352
   [junit4]   2> 3072608 INFO  (qtp389308199-25936) [n:127.0.0.1:40248_solr c:deleteByCount s:shard1 r:core_node6 x:deleteByCount_shard1_replica_n3] o.a.s.c.SolrCore [[deleteByCount_shard1_replica_n3] ] Opening new SolrCore at [/home/jenkins/jenkins-slave/workspace/Lucene-Solr-Tests-8.x/solr/build/solr-core/test/J1/temp/solr.cloud.DeleteReplicaTest_C06A63DF0E509539-001/tempDir-001/node4/deleteByCount_shard1_replica_n3], dataDir=[/home/jenkins/jenkins-slave/workspace/Lucene-Solr-Tests-8.x/solr/build/solr-core/test/J1/temp/solr.cloud.DeleteReplicaTest_C06A63DF0E509539-001/tempDir-001/node4/./deleteByCount_shard1_replica_n3/data/]
   [junit4]   2> 3072615 INFO  (qtp524008679-25945) [n:127.0.0.1:38261_solr c:deleteByCount s:shard1 r:core_node5 x:deleteByCount_shard1_replica_n2] o.a.s.s.IndexSchema [deleteByCount_shard1_replica_n2] Schema name=minimal
   [junit4]   2> 3072617 INFO  (qtp524008679-25945) [n:127.0.0.1:38261_solr c:deleteByCount s:shard1 r:core_node5 x:deleteByCount_shard1_replica_n2] o.a.s.s.IndexSchema Loaded schema minimal/1.1 with uniqueid field id
   [junit4]   2> 3072617 INFO  (qtp524008679-25945) [n:127.0.0.1:38261_solr c:deleteByCount s:shard1 r:core_node5 x:deleteByCount_shard1_replica_n2] o.a.s.c.CoreContainer Creating SolrCore 'deleteByCount_shard1_replica_n2' using configuration from collection deleteByCount, trusted=true
   [junit4]   2> 3072631 INFO  (qtp1756050340-25920) [n:127.0.0.1:33253_solr c:deleteByCount s:shard1 r:core_node4 x:deleteByCount_shard1_replica_n1] o.a.s.s.IndexSchema [deleteByCount_shard1_replica_n1] Schema name=minimal
   [junit4]   2> 3072633 INFO  (qtp1756050340-25920) [n:127.0.0.1:33253_solr c:deleteByCount s:shard1 r:core_node4 x:deleteByCount_shard1_replica_n1] o.a.s.s.IndexSchema Loaded schema minimal/1.1 with uniqueid field id
   [junit4]   2> 3072633 INFO  (qtp1756050340-25920) [n:127.0.0.1:33253_solr c:deleteByCount s:shard1 r:core_node4 x:deleteByCount_shard1_replica_n1] o.a.s.c.CoreContainer Creating SolrCore 'deleteByCount_shard1_replica_n1' using configuration from collection deleteByCount, trusted=true
   [junit4]   2> 3072666 INFO  (qtp524008679-25945) [n:127.0.0.1:38261_solr c:deleteByCount s:shard1 r:core_node5 x:deleteByCount_shard1_replica_n2] o.a.s.m.r.SolrJmxReporter JMX monitoring for 'solr_38261.solr.core.deleteByCount.shard1.replica_n2' (registry 'solr.core.deleteByCount.shard1.replica_n2') enabled at server: com.sun.jmx.mbeanserver.JmxMBeanServer@7e998352
   [junit4]   2> 3072666 INFO  (qtp524008679-25945) [n:127.0.0.1:38261_solr c:deleteByCount s:shard1 r:core_node5 x:deleteByCount_shard1_replica_n2] o.a.s.c.SolrCore [[deleteByCount_shard1_replica_n2] ] Opening new SolrCore at [/home/jenkins/jenkins-slave/workspace/Lucene-Solr-Tests-8.x/solr/build/solr-core/test/J1/temp/solr.cloud.DeleteReplicaTest_C06A63DF0E509539-001/tempDir-001/node3/deleteByCount_shard1_replica_n2], dataDir=[/home/jenkins/jenkins-slave/workspace/Lucene-Solr-Tests-8.x/solr/build/solr-core/test/J1/temp/solr.cloud.DeleteReplicaTest_C06A63DF0E509539-001/tempDir-001/node3/./deleteByCount_shard1_replica_n2/data/]
   [junit4]   2> 3072668 INFO  (qtp1756050340-25920) [n:127.0.0.1:33253_solr c:deleteByCount s:shard1 r:core_node4 x:deleteByCount_shard1_replica_n1] o.a.s.m.r.SolrJmxReporter JMX monitoring for 'solr_33253.solr.core.deleteByCount.shard1.replica_n1' (registry 'solr.core.deleteByCount.shard1.replica_n1') enabled at server: com.sun.jmx.mbeanserver.JmxMBeanServer@7e998352
   [junit4]   2> 3072668 INFO  (qtp1756050340-25920) [n:127.0.0.1:33253_solr c:deleteByCount s:shard1 r:core_node4 x:deleteByCount_shard1_replica_n1] o.a.s.c.SolrCore [[deleteByCount_shard1_replica_n1] ] Opening new SolrCore at [/home/jenkins/jenkins-slave/workspace/Lucene-Solr-Tests-8.x/solr/build/solr-core/test/J1/temp/solr.cloud.DeleteReplicaTest_C06A63DF0E509539-001/tempDir-001/node1/deleteByCount_shard1_replica_n1], dataDir=[/home/jenkins/jenkins-slave/workspace/Lucene-Solr-Tests-8.x/solr/build/solr-core/test/J1/temp/solr.cloud.DeleteReplicaTest_C06A63DF0E509539-001/tempDir-001/node1/./deleteByCount_shard1_replica_n1/data/]
   [junit4]   2> 3073064 INFO  (qtp389308199-25936) [n:127.0.0.1:40248_solr c:deleteByCount s:shard1 r:core_node6 x:deleteByCount_shard1_replica_n3] o.a.s.u.UpdateHandler Using UpdateLog implementation: org.apache.solr.update.UpdateLog
   [junit4]   2> 3073064 INFO  (qtp389308199-25936) [n:127.0.0.1:40248_solr c:deleteByCount s:shard1 r:core_node6 x:deleteByCount_shard1_replica_n3] o.a.s.u.UpdateLog Initializing UpdateLog: dataDir=null defaultSyncLevel=FLUSH numRecordsToKeep=100 maxNumLogsToKeep=10 numVersionBuckets=65536
   [junit4]   2> 3073066 INFO  (qtp389308199-25936) [n:127.0.0.1:40248_solr c:deleteByCount s:shard1 r:core_node6 x:deleteByCount_shard1_replica_n3] o.a.s.u.CommitTracker Hard AutoCommit: disabled
   [junit4]   2> 3073066 INFO  (qtp389308199-25936) [n:127.0.0.1:40248_solr c:deleteByCount s:shard1 r:core_node6 x:deleteByCount_shard1_replica_n3] o.a.s.u.CommitTracker Soft AutoCommit: disabled
   [junit4]   2> 3073083 INFO  (qtp524008679-25945) [n:127.0.0.1:38261_solr c:deleteByCount s:shard1 r:core_node5 x:deleteByCount_shard1_replica_n2] o.a.s.u.UpdateHandler Using UpdateLog implementation: org.apache.solr.update.UpdateLog
   [junit4]   2> 3073083 INFO  (qtp524008679-25945) [n:127.0.0.1:38261_solr c:deleteByCount s:shard1 r:core_node5 x:deleteByCount_shard1_replica_n2] o.a.s.u.UpdateLog Initializing UpdateLog: dataDir=null defaultSyncLevel=FLUSH numRecordsToKeep=100 maxNumLogsToKeep=10 numVersionBuckets=65536
   [junit4]   2> 3073097 INFO  (qtp524008679-25945) [n:127.0.0.1:38261_solr c:deleteByCount s:shard1 r:core_node5 x:deleteByCount_shard1_replica_n2] o.a.s.u.CommitTracker Hard AutoCommit: disabled
   [junit4]   2> 3073100 INFO  (qtp389308199-25936) [n:127.0.0.1:40248_solr c:deleteByCount s:shard1 r:core_node6 x:deleteByCount_shard1_replica_n3] o.a.s.s.SolrIndexSearcher Opening [Searcher@14e3d626[deleteByCount_shard1_replica_n3] main]
   [junit4]   2> 3073101 INFO  (qtp389308199-25936) [n:127.0.0.1:40248_solr c:deleteByCount s:shard1 r:core_node6 x:deleteByCount_shard1_replica_n3] o.a.s.r.ManagedResourceStorage Configured ZooKeeperStorageIO with znodeBase: /configs/conf
   [junit4]   2> 3073101 INFO  (qtp389308199-25936) [n:127.0.0.1:40248_solr c:deleteByCount s:shard1 r:core_node6 x:deleteByCount_shard1_replica_n3] o.a.s.r.ManagedResourceStorage Loaded null at path _rest_managed.json using ZooKeeperStorageIO:path=/configs/conf
   [junit4]   2> 3073101 INFO  (qtp389308199-25936) [n:127.0.0.1:40248_solr c:deleteByCount s:shard1 r:core_node6 x:deleteByCount_shard1_replica_n3] o.a.s.h.ReplicationHandler Commits will be reserved for 10000ms.
   [junit4]   2> 3073101 INFO  (qtp389308199-25936) [n:127.0.0.1:40248_solr c:deleteByCount s:shard1 r:core_node6 x:deleteByCount_shard1_replica_n3] o.a.s.u.UpdateLog Could not find max version in index or recent updates, using new clock 1630260753788305408
   [junit4]   2> 3073116 INFO  (qtp524008679-25945) [n:127.0.0.1:38261_solr c:deleteByCount s:shard1 r:core_node5 x:deleteByCount_shard1_replica_n2] o.a.s.u.CommitTracker Soft AutoCommit: disabled
   [junit4]   2> 3073116 INFO  (searcherExecutor-7702-thread-1-processing-n:127.0.0.1:40248_solr x:deleteByCount_shard1_replica_n3 c:deleteByCount s:shard1 r:core_node6) [n:127.0.0.1:40248_solr c:deleteByCount s:shard1 r:core_node6 x:deleteByCount_shard1_replica_n3] o.a.s.c.SolrCore [deleteByCount_shard1_replica_n3] Registered new searcher Searcher@14e3d626[deleteByCount_shard1_replica_n3] main{ExitableDirectoryReader(UninvertingDirectoryReader())}
   [junit4]   2> 3073116 INFO  (qtp524008679-25945) [n:127.0.0.1:38261_solr c:deleteByCount s:shard1 r:core_node5 x:deleteByCount_shard1_replica_n2] o.a.s.s.SolrIndexSearcher Opening [Searcher@235c7a18[deleteByCount_shard1_replica_n2] main]
   [junit4]   2> 3073117 INFO  (qtp524008679-25945) [n:127.0.0.1:38261_solr c:deleteByCount s:shard1 r:core_node5 x:deleteByCount_shard1_replica_n2] o.a.s.r.ManagedResourceStorage Configured ZooKeeperStorageIO with znodeBase: /configs/conf
   [junit4]   2> 3073118 INFO  (qtp389308199-25936) [n:127.0.0.1:40248_solr c:deleteByCount s:shard1 r:core_node6 x:deleteByCount_shard1_replica_n3] o.a.s.c.ZkShardTerms Successful update of terms at /collections/deleteByCount/terms/shard1 to Terms{values={core_node6=0}, version=0}
   [junit4]   2> 3073118 INFO  (qtp389308199-25936) [n:127.0.0.1:40248_solr c:deleteByCount s:shard1 r:core_node6 x:deleteByCount_shard1_replica_n3] o.a.s.c.ShardLeaderElectionContextBase make sure parent is created /collections/deleteByCount/leaders/shard1
   [junit4]   2> 3073132 INFO  (qtp524008679-25945) [n:127.0.0.1:38261_solr c:deleteByCount s:shard1 r:core_node5 x:deleteByCount_shard1_replica_n2] o.a.s.r.ManagedResourceStorage Loaded null at path _rest_managed.json using ZooKeeperStorageIO:path=/configs/conf
   [junit4]   2> 3073132 INFO  (qtp524008679-25945) [n:127.0.0.1:38261_solr c:deleteByCount s:shard1 r:core_node5 x:deleteByCount_shard1_replica_n2] o.a.s.h.ReplicationHandler Commits will be reserved for 10000ms.
   [junit4]   2> 3073132 INFO  (qtp524008679-25945) [n:127.0.0.1:38261_solr c:deleteByCount s:shard1 r:core_node5 x:deleteByCount_shard1_replica_n2] o.a.s.u.UpdateLog Could not find max version in index or recent updates, using new clock 1630260753820811264
   [junit4]   2> 3073137 INFO  (qtp389308199-25936) [n:127.0.0.1:40248_solr c:deleteByCount s:shard1 r:core_node6 x:deleteByCount_shard1_replica_n3] o.a.s.c.ShardLeaderElectionContext Waiting until we see more replicas up for shard shard1: total=3 found=1 timeoutin=9999ms
   [junit4]   2> 3073140 INFO  (qtp1756050340-25920) [n:127.0.0.1:33253_solr c:deleteByCount s:shard1 r:core_node4 x:deleteByCount_shard1_replica_n1] o.a.s.u.UpdateHandler Using UpdateLog implementation: org.apache.solr.update.UpdateLog
   [junit4]   2> 3073140 INFO  (qtp1756050340-25920) [n:127.0.0.1:33253_solr c:deleteByCount s:shard1 r:core_node4 x:deleteByCount_shard1_replica_n1] o.a.s.u.UpdateLog Initializing UpdateLog: dataDir=null defaultSyncLevel=FLUSH numRecordsToKeep=100 maxNumLogsToKeep=10 numVersionBuckets=65536
   [junit4]   2> 3073142 INFO  (qtp1756050340-25920) [n:127.0.0.1:33253_solr c:deleteByCount s:shard1 r:core_node4 x:deleteByCount_shard1_replica_n1] o.a.s.u.CommitTracker Hard Au

[...truncated too long message...]

.

-ivy-fail-disallowed-ivy-version:

ivy-fail:

ivy-fail:

ivy-configure:
[ivy:configure] :: loading settings :: file = /home/jenkins/jenkins-slave/workspace/Lucene-Solr-Tests-8.x/lucene/top-level-ivy-settings.xml

resolve:

ivy-availability-check:
[loadresource] Do not set property disallowed.ivy.jars.list as its length is 0.

-ivy-fail-disallowed-ivy-version:

ivy-fail:

ivy-configure:
[ivy:configure] :: loading settings :: file = /home/jenkins/jenkins-slave/workspace/Lucene-Solr-Tests-8.x/lucene/top-level-ivy-settings.xml

resolve:

ivy-availability-check:
[loadresource] Do not set property disallowed.ivy.jars.list as its length is 0.

-ivy-fail-disallowed-ivy-version:

ivy-fail:

ivy-fail:

ivy-configure:
[ivy:configure] :: loading settings :: file = /home/jenkins/jenkins-slave/workspace/Lucene-Solr-Tests-8.x/lucene/top-level-ivy-settings.xml

resolve:

ivy-availability-check:
[loadresource] Do not set property disallowed.ivy.jars.list as its length is 0.

-ivy-fail-disallowed-ivy-version:

ivy-fail:

ivy-configure:
[ivy:configure] :: loading settings :: file = /home/jenkins/jenkins-slave/workspace/Lucene-Solr-Tests-8.x/lucene/top-level-ivy-settings.xml

resolve:

ivy-availability-check:
[loadresource] Do not set property disallowed.ivy.jars.list as its length is 0.

-ivy-fail-disallowed-ivy-version:

ivy-fail:

ivy-fail:

ivy-configure:
[ivy:configure] :: loading settings :: file = /home/jenkins/jenkins-slave/workspace/Lucene-Solr-Tests-8.x/lucene/top-level-ivy-settings.xml

resolve:

ivy-availability-check:
[loadresource] Do not set property disallowed.ivy.jars.list as its length is 0.

-ivy-fail-disallowed-ivy-version:

ivy-fail:

ivy-fail:

ivy-configure:
[ivy:configure] :: loading settings :: file = /home/jenkins/jenkins-slave/workspace/Lucene-Solr-Tests-8.x/lucene/top-level-ivy-settings.xml

resolve:

ivy-availability-check:
[loadresource] Do not set property disallowed.ivy.jars.list as its length is 0.

-ivy-fail-disallowed-ivy-version:

ivy-fail:

ivy-fail:

ivy-configure:
[ivy:configure] :: loading settings :: file = /home/jenkins/jenkins-slave/workspace/Lucene-Solr-Tests-8.x/lucene/top-level-ivy-settings.xml

resolve:

ivy-availability-check:
[loadresource] Do not set property disallowed.ivy.jars.list as its length is 0.

-ivy-fail-disallowed-ivy-version:

ivy-fail:

ivy-fail:

ivy-configure:
[ivy:configure] :: loading settings :: file = /home/jenkins/jenkins-slave/workspace/Lucene-Solr-Tests-8.x/lucene/top-level-ivy-settings.xml

resolve:

ivy-availability-check:
[loadresource] Do not set property disallowed.ivy.jars.list as its length is 0.

-ivy-fail-disallowed-ivy-version:

ivy-fail:

ivy-fail:

ivy-configure:
[ivy:configure] :: loading settings :: file = /home/jenkins/jenkins-slave/workspace/Lucene-Solr-Tests-8.x/lucene/top-level-ivy-settings.xml

resolve:

ivy-availability-check:
[loadresource] Do not set property disallowed.ivy.jars.list as its length is 0.

-ivy-fail-disallowed-ivy-version:

ivy-fail:

ivy-fail:

ivy-configure:
[ivy:configure] :: loading settings :: file = /home/jenkins/jenkins-slave/workspace/Lucene-Solr-Tests-8.x/lucene/top-level-ivy-settings.xml

resolve:

ivy-availability-check:
[loadresource] Do not set property disallowed.ivy.jars.list as its length is 0.

-ivy-fail-disallowed-ivy-version:

ivy-fail:

ivy-fail:

ivy-configure:
[ivy:configure] :: loading settings :: file = /home/jenkins/jenkins-slave/workspace/Lucene-Solr-Tests-8.x/lucene/top-level-ivy-settings.xml

resolve:

ivy-availability-check:
[loadresource] Do not set property disallowed.ivy.jars.list as its length is 0.

-ivy-fail-disallowed-ivy-version:

ivy-fail:

ivy-fail:

ivy-configure:
[ivy:configure] :: loading settings :: file = /home/jenkins/jenkins-slave/workspace/Lucene-Solr-Tests-8.x/lucene/top-level-ivy-settings.xml

resolve:

ivy-availability-check:
[loadresource] Do not set property disallowed.ivy.jars.list as its length is 0.

-ivy-fail-disallowed-ivy-version:

ivy-fail:

ivy-fail:

ivy-configure:
[ivy:configure] :: loading settings :: file = /home/jenkins/jenkins-slave/workspace/Lucene-Solr-Tests-8.x/lucene/top-level-ivy-settings.xml

resolve:

ivy-availability-check:
[loadresource] Do not set property disallowed.ivy.jars.list as its length is 0.

-ivy-fail-disallowed-ivy-version:

ivy-fail:

ivy-fail:

ivy-configure:
[ivy:configure] :: loading settings :: file = /home/jenkins/jenkins-slave/workspace/Lucene-Solr-Tests-8.x/lucene/top-level-ivy-settings.xml

resolve:

jar-checksums:
    [mkdir] Created dir: /home/jenkins/jenkins-slave/workspace/Lucene-Solr-Tests-8.x/solr/null501316920
     [copy] Copying 240 files to /home/jenkins/jenkins-slave/workspace/Lucene-Solr-Tests-8.x/solr/null501316920
   [delete] Deleting directory /home/jenkins/jenkins-slave/workspace/Lucene-Solr-Tests-8.x/solr/null501316920

check-working-copy:
[ivy:cachepath] :: resolving dependencies :: org.eclipse.jgit#org.eclipse.jgit-caller;working
[ivy:cachepath] 	confs: [default]
[ivy:cachepath] 	found org.eclipse.jgit#org.eclipse.jgit;4.6.0.201612231935-r in public
[ivy:cachepath] 	found com.jcraft#jsch;0.1.53 in public
[ivy:cachepath] 	found com.googlecode.javaewah#JavaEWAH;1.1.6 in public
[ivy:cachepath] 	found org.apache.httpcomponents#httpclient;4.3.6 in public
[ivy:cachepath] 	found org.apache.httpcomponents#httpcore;4.3.3 in public
[ivy:cachepath] 	found commons-logging#commons-logging;1.1.3 in public
[ivy:cachepath] 	found commons-codec#commons-codec;1.6 in public
[ivy:cachepath] 	found org.slf4j#slf4j-api;1.7.2 in public
[ivy:cachepath] :: resolution report :: resolve 20ms :: artifacts dl 1ms
	---------------------------------------------------------------------
	|                  |            modules            ||   artifacts   |
	|       conf       | number| search|dwnlded|evicted|| number|dwnlded|
	---------------------------------------------------------------------
	|      default     |   8   |   0   |   0   |   0   ||   8   |   0   |
	---------------------------------------------------------------------
[wc-checker] Initializing working copy...
[wc-checker] SLF4J: Failed to load class "org.slf4j.impl.StaticLoggerBinder".
[wc-checker] SLF4J: Defaulting to no-operation (NOP) logger implementation
[wc-checker] SLF4J: See http://www.slf4j.org/codes.html#StaticLoggerBinder for further details.
[wc-checker] Checking working copy status...

-jenkins-base:

BUILD SUCCESSFUL
Total time: 229 minutes 0 seconds
Archiving artifacts
java.lang.InterruptedException: no matches found within 10000
	at hudson.FilePath$ValidateAntFileMask.hasMatch(FilePath.java:2847)
	at hudson.FilePath$ValidateAntFileMask.invoke(FilePath.java:2726)
	at hudson.FilePath$ValidateAntFileMask.invoke(FilePath.java:2707)
	at hudson.FilePath$FileCallableWrapper.call(FilePath.java:3086)
Also:   hudson.remoting.Channel$CallSiteStackTrace: Remote call to lucene2
		at hudson.remoting.Channel.attachCallSiteStackTrace(Channel.java:1741)
		at hudson.remoting.UserRequest$ExceptionResponse.retrieve(UserRequest.java:357)
		at hudson.remoting.Channel.call(Channel.java:955)
		at hudson.FilePath.act(FilePath.java:1072)
		at hudson.FilePath.act(FilePath.java:1061)
		at hudson.FilePath.validateAntFileMask(FilePath.java:2705)
		at hudson.tasks.ArtifactArchiver.perform(ArtifactArchiver.java:243)
		at hudson.tasks.BuildStepCompatibilityLayer.perform(BuildStepCompatibilityLayer.java:81)
		at hudson.tasks.BuildStepMonitor$1.perform(BuildStepMonitor.java:20)
		at hudson.model.AbstractBuild$AbstractBuildExecution.perform(AbstractBuild.java:744)
		at hudson.model.AbstractBuild$AbstractBuildExecution.performAllBuildSteps(AbstractBuild.java:690)
		at hudson.model.Build$BuildExecution.post2(Build.java:186)
		at hudson.model.AbstractBuild$AbstractBuildExecution.post(AbstractBuild.java:635)
		at hudson.model.Run.execute(Run.java:1835)
		at hudson.model.FreeStyleBuild.run(FreeStyleBuild.java:43)
		at hudson.model.ResourceController.execute(ResourceController.java:97)
		at hudson.model.Executor.run(Executor.java:429)
Caused: hudson.FilePath$TunneledInterruptedException
	at hudson.FilePath$FileCallableWrapper.call(FilePath.java:3088)
	at hudson.remoting.UserRequest.perform(UserRequest.java:212)
	at hudson.remoting.UserRequest.perform(UserRequest.java:54)
	at hudson.remoting.Request$2.run(Request.java:369)
	at hudson.remoting.InterceptingExecutorService$1.call(InterceptingExecutorService.java:72)
	at java.util.concurrent.FutureTask.run(FutureTask.java:266)
	at java.util.concurrent.ThreadPoolExecutor.runWorker(ThreadPoolExecutor.java:1142)
	at java.util.concurrent.ThreadPoolExecutor$Worker.run(ThreadPoolExecutor.java:617)
	at java.lang.Thread.run(Thread.java:748)
Caused: java.lang.InterruptedException: java.lang.InterruptedException: no matches found within 10000
	at hudson.FilePath.act(FilePath.java:1074)
	at hudson.FilePath.act(FilePath.java:1061)
	at hudson.FilePath.validateAntFileMask(FilePath.java:2705)
	at hudson.tasks.ArtifactArchiver.perform(ArtifactArchiver.java:243)
	at hudson.tasks.BuildStepCompatibilityLayer.perform(BuildStepCompatibilityLayer.java:81)
	at hudson.tasks.BuildStepMonitor$1.perform(BuildStepMonitor.java:20)
	at hudson.model.AbstractBuild$AbstractBuildExecution.perform(AbstractBuild.java:744)
	at hudson.model.AbstractBuild$AbstractBuildExecution.performAllBuildSteps(AbstractBuild.java:690)
	at hudson.model.Build$BuildExecution.post2(Build.java:186)
	at hudson.model.AbstractBuild$AbstractBuildExecution.post(AbstractBuild.java:635)
	at hudson.model.Run.execute(Run.java:1835)
	at hudson.model.FreeStyleBuild.run(FreeStyleBuild.java:43)
	at hudson.model.ResourceController.execute(ResourceController.java:97)
	at hudson.model.Executor.run(Executor.java:429)
No artifacts found that match the file pattern "**/*.events,heapdumps/**,**/hs_err_pid*". Configuration error?
Recording test results
Build step 'Publish JUnit test result report' changed build result to UNSTABLE
Email was triggered for: Unstable (Test Failures)
Sending email for trigger: Unstable (Test Failures)

Mime
View raw message