lucene-dev mailing list archives

Site index · List index
Message view « Date » · « Thread »
Top « Date » · « Thread »
From Apache Jenkins Server <jenk...@builds.apache.org>
Subject [JENKINS] Lucene-Solr-Tests-master - Build # 3254 - Still Unstable
Date Mon, 08 Apr 2019 21:03:57 GMT
Build: https://builds.apache.org/job/Lucene-Solr-Tests-master/3254/

2 tests failed.
FAILED:  org.apache.solr.cloud.DeleteReplicaTest.deleteLiveReplicaTest

Error Message:
expected:<0> but was:<1>

Stack Trace:
java.lang.AssertionError: expected:<0> but was:<1>
	at __randomizedtesting.SeedInfo.seed([3403DAAA3B249F6C:99636EA1261B3719]:0)
	at org.junit.Assert.fail(Assert.java:88)
	at org.junit.Assert.failNotEquals(Assert.java:834)
	at org.junit.Assert.assertEquals(Assert.java:645)
	at org.junit.Assert.assertEquals(Assert.java:631)
	at org.apache.solr.cloud.DeleteReplicaTest.deleteLiveReplicaTest(DeleteReplicaTest.java:126)
	at sun.reflect.NativeMethodAccessorImpl.invoke0(Native Method)
	at sun.reflect.NativeMethodAccessorImpl.invoke(NativeMethodAccessorImpl.java:62)
	at sun.reflect.DelegatingMethodAccessorImpl.invoke(DelegatingMethodAccessorImpl.java:43)
	at java.lang.reflect.Method.invoke(Method.java:498)
	at com.carrotsearch.randomizedtesting.RandomizedRunner.invoke(RandomizedRunner.java:1750)
	at com.carrotsearch.randomizedtesting.RandomizedRunner$8.evaluate(RandomizedRunner.java:938)
	at com.carrotsearch.randomizedtesting.RandomizedRunner$9.evaluate(RandomizedRunner.java:974)
	at com.carrotsearch.randomizedtesting.RandomizedRunner$10.evaluate(RandomizedRunner.java:988)
	at com.carrotsearch.randomizedtesting.rules.SystemPropertiesRestoreRule$1.evaluate(SystemPropertiesRestoreRule.java:57)
	at org.apache.lucene.util.TestRuleSetupTeardownChained$1.evaluate(TestRuleSetupTeardownChained.java:49)
	at org.apache.lucene.util.AbstractBeforeAfterRule$1.evaluate(AbstractBeforeAfterRule.java:45)
	at org.apache.lucene.util.TestRuleThreadAndTestName$1.evaluate(TestRuleThreadAndTestName.java:48)
	at org.apache.lucene.util.TestRuleIgnoreAfterMaxFailures$1.evaluate(TestRuleIgnoreAfterMaxFailures.java:64)
	at org.apache.lucene.util.TestRuleMarkFailure$1.evaluate(TestRuleMarkFailure.java:47)
	at com.carrotsearch.randomizedtesting.rules.StatementAdapter.evaluate(StatementAdapter.java:36)
	at com.carrotsearch.randomizedtesting.ThreadLeakControl$StatementRunner.run(ThreadLeakControl.java:368)
	at com.carrotsearch.randomizedtesting.ThreadLeakControl.forkTimeoutingTask(ThreadLeakControl.java:817)
	at com.carrotsearch.randomizedtesting.ThreadLeakControl$3.evaluate(ThreadLeakControl.java:468)
	at com.carrotsearch.randomizedtesting.RandomizedRunner.runSingleTest(RandomizedRunner.java:947)
	at com.carrotsearch.randomizedtesting.RandomizedRunner$5.evaluate(RandomizedRunner.java:832)
	at com.carrotsearch.randomizedtesting.RandomizedRunner$6.evaluate(RandomizedRunner.java:883)
	at com.carrotsearch.randomizedtesting.RandomizedRunner$7.evaluate(RandomizedRunner.java:894)
	at com.carrotsearch.randomizedtesting.rules.StatementAdapter.evaluate(StatementAdapter.java:36)
	at com.carrotsearch.randomizedtesting.rules.SystemPropertiesRestoreRule$1.evaluate(SystemPropertiesRestoreRule.java:57)
	at org.apache.lucene.util.AbstractBeforeAfterRule$1.evaluate(AbstractBeforeAfterRule.java:45)
	at com.carrotsearch.randomizedtesting.rules.StatementAdapter.evaluate(StatementAdapter.java:36)
	at org.apache.lucene.util.TestRuleStoreClassName$1.evaluate(TestRuleStoreClassName.java:41)
	at com.carrotsearch.randomizedtesting.rules.NoShadowingOrOverridesOnMethodsRule$1.evaluate(NoShadowingOrOverridesOnMethodsRule.java:40)
	at com.carrotsearch.randomizedtesting.rules.NoShadowingOrOverridesOnMethodsRule$1.evaluate(NoShadowingOrOverridesOnMethodsRule.java:40)
	at com.carrotsearch.randomizedtesting.rules.StatementAdapter.evaluate(StatementAdapter.java:36)
	at com.carrotsearch.randomizedtesting.rules.StatementAdapter.evaluate(StatementAdapter.java:36)
	at com.carrotsearch.randomizedtesting.rules.StatementAdapter.evaluate(StatementAdapter.java:36)
	at org.apache.lucene.util.TestRuleAssertionsRequired$1.evaluate(TestRuleAssertionsRequired.java:53)
	at org.apache.lucene.util.TestRuleMarkFailure$1.evaluate(TestRuleMarkFailure.java:47)
	at org.apache.lucene.util.TestRuleIgnoreAfterMaxFailures$1.evaluate(TestRuleIgnoreAfterMaxFailures.java:64)
	at org.apache.lucene.util.TestRuleIgnoreTestSuites$1.evaluate(TestRuleIgnoreTestSuites.java:54)
	at com.carrotsearch.randomizedtesting.rules.StatementAdapter.evaluate(StatementAdapter.java:36)
	at com.carrotsearch.randomizedtesting.ThreadLeakControl$StatementRunner.run(ThreadLeakControl.java:368)
	at java.lang.Thread.run(Thread.java:748)


FAILED:  org.apache.solr.security.AuditLoggerIntegrationTest.testAsyncQueueDrain

Error Message:
Failed waiting for 3 callbacks after 5 seconds

Stack Trace:
java.lang.AssertionError: Failed waiting for 3 callbacks after 5 seconds
	at __randomizedtesting.SeedInfo.seed([3403DAAA3B249F6C:851C258E8BE70CB3]:0)
	at org.junit.Assert.fail(Assert.java:88)
	at org.apache.solr.security.AuditLoggerIntegrationTest.waitForAuditEventCallbacks(AuditLoggerIntegrationTest.java:229)
	at org.apache.solr.security.AuditLoggerIntegrationTest.waitForAuditEventCallbacks(AuditLoggerIntegrationTest.java:221)
	at org.apache.solr.security.AuditLoggerIntegrationTest.assertThreeAdminEvents(AuditLoggerIntegrationTest.java:252)
	at org.apache.solr.security.AuditLoggerIntegrationTest.testAsyncQueueDrain(AuditLoggerIntegrationTest.java:132)
	at sun.reflect.NativeMethodAccessorImpl.invoke0(Native Method)
	at sun.reflect.NativeMethodAccessorImpl.invoke(NativeMethodAccessorImpl.java:62)
	at sun.reflect.DelegatingMethodAccessorImpl.invoke(DelegatingMethodAccessorImpl.java:43)
	at java.lang.reflect.Method.invoke(Method.java:498)
	at com.carrotsearch.randomizedtesting.RandomizedRunner.invoke(RandomizedRunner.java:1750)
	at com.carrotsearch.randomizedtesting.RandomizedRunner$8.evaluate(RandomizedRunner.java:938)
	at com.carrotsearch.randomizedtesting.RandomizedRunner$9.evaluate(RandomizedRunner.java:974)
	at com.carrotsearch.randomizedtesting.RandomizedRunner$10.evaluate(RandomizedRunner.java:988)
	at com.carrotsearch.randomizedtesting.rules.SystemPropertiesRestoreRule$1.evaluate(SystemPropertiesRestoreRule.java:57)
	at org.apache.lucene.util.TestRuleSetupTeardownChained$1.evaluate(TestRuleSetupTeardownChained.java:49)
	at org.apache.lucene.util.AbstractBeforeAfterRule$1.evaluate(AbstractBeforeAfterRule.java:45)
	at org.apache.lucene.util.TestRuleThreadAndTestName$1.evaluate(TestRuleThreadAndTestName.java:48)
	at org.apache.lucene.util.TestRuleIgnoreAfterMaxFailures$1.evaluate(TestRuleIgnoreAfterMaxFailures.java:64)
	at org.apache.lucene.util.TestRuleMarkFailure$1.evaluate(TestRuleMarkFailure.java:47)
	at com.carrotsearch.randomizedtesting.rules.StatementAdapter.evaluate(StatementAdapter.java:36)
	at com.carrotsearch.randomizedtesting.ThreadLeakControl$StatementRunner.run(ThreadLeakControl.java:368)
	at com.carrotsearch.randomizedtesting.ThreadLeakControl.forkTimeoutingTask(ThreadLeakControl.java:817)
	at com.carrotsearch.randomizedtesting.ThreadLeakControl$3.evaluate(ThreadLeakControl.java:468)
	at com.carrotsearch.randomizedtesting.RandomizedRunner.runSingleTest(RandomizedRunner.java:947)
	at com.carrotsearch.randomizedtesting.RandomizedRunner$5.evaluate(RandomizedRunner.java:832)
	at com.carrotsearch.randomizedtesting.RandomizedRunner$6.evaluate(RandomizedRunner.java:883)
	at com.carrotsearch.randomizedtesting.RandomizedRunner$7.evaluate(RandomizedRunner.java:894)
	at com.carrotsearch.randomizedtesting.rules.StatementAdapter.evaluate(StatementAdapter.java:36)
	at com.carrotsearch.randomizedtesting.rules.SystemPropertiesRestoreRule$1.evaluate(SystemPropertiesRestoreRule.java:57)
	at org.apache.lucene.util.AbstractBeforeAfterRule$1.evaluate(AbstractBeforeAfterRule.java:45)
	at com.carrotsearch.randomizedtesting.rules.StatementAdapter.evaluate(StatementAdapter.java:36)
	at org.apache.lucene.util.TestRuleStoreClassName$1.evaluate(TestRuleStoreClassName.java:41)
	at com.carrotsearch.randomizedtesting.rules.NoShadowingOrOverridesOnMethodsRule$1.evaluate(NoShadowingOrOverridesOnMethodsRule.java:40)
	at com.carrotsearch.randomizedtesting.rules.NoShadowingOrOverridesOnMethodsRule$1.evaluate(NoShadowingOrOverridesOnMethodsRule.java:40)
	at com.carrotsearch.randomizedtesting.rules.StatementAdapter.evaluate(StatementAdapter.java:36)
	at com.carrotsearch.randomizedtesting.rules.StatementAdapter.evaluate(StatementAdapter.java:36)
	at com.carrotsearch.randomizedtesting.rules.StatementAdapter.evaluate(StatementAdapter.java:36)
	at org.apache.lucene.util.TestRuleAssertionsRequired$1.evaluate(TestRuleAssertionsRequired.java:53)
	at org.apache.lucene.util.TestRuleMarkFailure$1.evaluate(TestRuleMarkFailure.java:47)
	at org.apache.lucene.util.TestRuleIgnoreAfterMaxFailures$1.evaluate(TestRuleIgnoreAfterMaxFailures.java:64)
	at org.apache.lucene.util.TestRuleIgnoreTestSuites$1.evaluate(TestRuleIgnoreTestSuites.java:54)
	at com.carrotsearch.randomizedtesting.rules.StatementAdapter.evaluate(StatementAdapter.java:36)
	at com.carrotsearch.randomizedtesting.ThreadLeakControl$StatementRunner.run(ThreadLeakControl.java:368)
	at java.lang.Thread.run(Thread.java:748)




Build Log:
[...truncated 13623 lines...]
   [junit4] Suite: org.apache.solr.cloud.DeleteReplicaTest
   [junit4]   2> Creating dataDir: /home/jenkins/jenkins-slave/workspace/Lucene-Solr-Tests-master/solr/build/solr-core/test/J0/temp/solr.cloud.DeleteReplicaTest_3403DAAA3B249F6C-001/init-core-data-001
   [junit4]   2> 2125657 INFO  (SUITE-DeleteReplicaTest-seed#[3403DAAA3B249F6C]-worker) [    ] o.a.s.SolrTestCaseJ4 SecureRandom sanity checks: test.solr.allowed.securerandom=null & java.security.egd=file:/dev/./urandom
   [junit4]   2> 2125658 WARN  (SUITE-DeleteReplicaTest-seed#[3403DAAA3B249F6C]-worker) [    ] o.a.s.SolrTestCaseJ4 startTrackingSearchers: numOpens=2 numCloses=2
   [junit4]   2> 2125658 INFO  (SUITE-DeleteReplicaTest-seed#[3403DAAA3B249F6C]-worker) [    ] o.a.s.SolrTestCaseJ4 Using PointFields (NUMERIC_POINTS_SYSPROP=true) w/NUMERIC_DOCVALUES_SYSPROP=true
   [junit4]   2> 2125744 INFO  (SUITE-DeleteReplicaTest-seed#[3403DAAA3B249F6C]-worker) [    ] o.a.s.SolrTestCaseJ4 Randomized ssl (false) and clientAuth (false) via: @org.apache.solr.util.RandomizeSSL(reason=, ssl=NaN, value=NaN, clientAuth=NaN)
   [junit4]   2> 2125769 INFO  (TEST-DeleteReplicaTest.deleteReplicaAndVerifyDirectoryCleanup-seed#[3403DAAA3B249F6C]) [    ] o.a.s.SolrTestCaseJ4 ###Starting deleteReplicaAndVerifyDirectoryCleanup
   [junit4]   2> 2125770 INFO  (TEST-DeleteReplicaTest.deleteReplicaAndVerifyDirectoryCleanup-seed#[3403DAAA3B249F6C]) [    ] o.a.s.c.MiniSolrCloudCluster Starting cluster of 4 servers in /home/jenkins/jenkins-slave/workspace/Lucene-Solr-Tests-master/solr/build/solr-core/test/J0/temp/solr.cloud.DeleteReplicaTest_3403DAAA3B249F6C-001/tempDir-001
   [junit4]   2> 2125770 INFO  (TEST-DeleteReplicaTest.deleteReplicaAndVerifyDirectoryCleanup-seed#[3403DAAA3B249F6C]) [    ] o.a.s.c.ZkTestServer STARTING ZK TEST SERVER
   [junit4]   2> 2125771 INFO  (ZkTestServer Run Thread) [    ] o.a.s.c.ZkTestServer client port:0.0.0.0/0.0.0.0:0
   [junit4]   2> 2125771 INFO  (ZkTestServer Run Thread) [    ] o.a.s.c.ZkTestServer Starting server
   [junit4]   2> 2125878 INFO  (TEST-DeleteReplicaTest.deleteReplicaAndVerifyDirectoryCleanup-seed#[3403DAAA3B249F6C]) [    ] o.a.s.c.ZkTestServer start zk server on port:36755
   [junit4]   2> 2125878 INFO  (TEST-DeleteReplicaTest.deleteReplicaAndVerifyDirectoryCleanup-seed#[3403DAAA3B249F6C]) [    ] o.a.s.c.ZkTestServer parse host and port list: 127.0.0.1:36755
   [junit4]   2> 2125878 INFO  (TEST-DeleteReplicaTest.deleteReplicaAndVerifyDirectoryCleanup-seed#[3403DAAA3B249F6C]) [    ] o.a.s.c.ZkTestServer connecting to 127.0.0.1 36755
   [junit4]   2> 2125939 INFO  (zkConnectionManagerCallback-4942-thread-1) [    ] o.a.s.c.c.ConnectionManager zkClient has connected
   [junit4]   2> 2125996 INFO  (zkConnectionManagerCallback-4944-thread-1) [    ] o.a.s.c.c.ConnectionManager zkClient has connected
   [junit4]   2> 2126008 INFO  (zkConnectionManagerCallback-4946-thread-1) [    ] o.a.s.c.c.ConnectionManager zkClient has connected
   [junit4]   2> 2126010 WARN  (jetty-launcher-4947-thread-1) [    ] o.e.j.s.AbstractConnector Ignoring deprecated socket close linger time
   [junit4]   2> 2126010 INFO  (jetty-launcher-4947-thread-1) [    ] o.a.s.c.s.e.JettySolrRunner Start Jetty (original configured port=0)
   [junit4]   2> 2126010 INFO  (jetty-launcher-4947-thread-1) [    ] o.a.s.c.s.e.JettySolrRunner Trying to start Jetty on port 0 try number 1 ...
   [junit4]   2> 2126010 INFO  (jetty-launcher-4947-thread-1) [    ] o.e.j.s.Server jetty-9.4.14.v20181114; built: 2018-11-14T21:20:31.478Z; git: c4550056e785fb5665914545889f21dc136ad9e6; jvm 1.8.0_191-b12
   [junit4]   2> 2126025 WARN  (jetty-launcher-4947-thread-2) [    ] o.e.j.s.AbstractConnector Ignoring deprecated socket close linger time
   [junit4]   2> 2126025 INFO  (jetty-launcher-4947-thread-2) [    ] o.a.s.c.s.e.JettySolrRunner Start Jetty (original configured port=0)
   [junit4]   2> 2126025 INFO  (jetty-launcher-4947-thread-2) [    ] o.a.s.c.s.e.JettySolrRunner Trying to start Jetty on port 0 try number 1 ...
   [junit4]   2> 2126025 INFO  (jetty-launcher-4947-thread-2) [    ] o.e.j.s.Server jetty-9.4.14.v20181114; built: 2018-11-14T21:20:31.478Z; git: c4550056e785fb5665914545889f21dc136ad9e6; jvm 1.8.0_191-b12
   [junit4]   2> 2126069 WARN  (jetty-launcher-4947-thread-4) [    ] o.e.j.s.AbstractConnector Ignoring deprecated socket close linger time
   [junit4]   2> 2126069 INFO  (jetty-launcher-4947-thread-4) [    ] o.a.s.c.s.e.JettySolrRunner Start Jetty (original configured port=0)
   [junit4]   2> 2126069 INFO  (jetty-launcher-4947-thread-4) [    ] o.a.s.c.s.e.JettySolrRunner Trying to start Jetty on port 0 try number 1 ...
   [junit4]   2> 2126069 INFO  (jetty-launcher-4947-thread-4) [    ] o.e.j.s.Server jetty-9.4.14.v20181114; built: 2018-11-14T21:20:31.478Z; git: c4550056e785fb5665914545889f21dc136ad9e6; jvm 1.8.0_191-b12
   [junit4]   2> 2126081 WARN  (jetty-launcher-4947-thread-3) [    ] o.e.j.s.AbstractConnector Ignoring deprecated socket close linger time
   [junit4]   2> 2126081 INFO  (jetty-launcher-4947-thread-3) [    ] o.a.s.c.s.e.JettySolrRunner Start Jetty (original configured port=0)
   [junit4]   2> 2126081 INFO  (jetty-launcher-4947-thread-3) [    ] o.a.s.c.s.e.JettySolrRunner Trying to start Jetty on port 0 try number 1 ...
   [junit4]   2> 2126081 INFO  (jetty-launcher-4947-thread-3) [    ] o.e.j.s.Server jetty-9.4.14.v20181114; built: 2018-11-14T21:20:31.478Z; git: c4550056e785fb5665914545889f21dc136ad9e6; jvm 1.8.0_191-b12
   [junit4]   2> 2126105 INFO  (jetty-launcher-4947-thread-4) [    ] o.e.j.s.session DefaultSessionIdManager workerName=node0
   [junit4]   2> 2126105 INFO  (jetty-launcher-4947-thread-4) [    ] o.e.j.s.session No SessionScavenger set, using defaults
   [junit4]   2> 2126105 INFO  (jetty-launcher-4947-thread-4) [    ] o.e.j.s.session node0 Scavenging every 660000ms
   [junit4]   2> 2126106 INFO  (jetty-launcher-4947-thread-4) [    ] o.e.j.s.h.ContextHandler Started o.e.j.s.ServletContextHandler@13b271cc{/solr,null,AVAILABLE}
   [junit4]   2> 2126106 INFO  (jetty-launcher-4947-thread-4) [    ] o.e.j.s.AbstractConnector Started ServerConnector@5ba392d8{HTTP/1.1,[http/1.1, h2c]}{127.0.0.1:35109}
   [junit4]   2> 2126106 INFO  (jetty-launcher-4947-thread-4) [    ] o.e.j.s.Server Started @2126192ms
   [junit4]   2> 2126106 INFO  (jetty-launcher-4947-thread-4) [    ] o.a.s.c.s.e.JettySolrRunner Jetty properties: {hostContext=/solr, hostPort=35109}
   [junit4]   2> 2126106 ERROR (jetty-launcher-4947-thread-4) [    ] o.a.s.u.StartupLoggingUtils Missing Java Option solr.log.dir. Logging may be missing or incomplete.
   [junit4]   2> 2126106 INFO  (jetty-launcher-4947-thread-4) [    ] o.a.s.s.SolrDispatchFilter Using logger factory org.apache.logging.slf4j.Log4jLoggerFactory
   [junit4]   2> 2126106 INFO  (jetty-launcher-4947-thread-4) [    ] o.a.s.s.SolrDispatchFilter  ___      _       Welcome to Apache Solr? version 9.0.0
   [junit4]   2> 2126106 INFO  (jetty-launcher-4947-thread-4) [    ] o.a.s.s.SolrDispatchFilter / __| ___| |_ _   Starting in cloud mode on port null
   [junit4]   2> 2126106 INFO  (jetty-launcher-4947-thread-4) [    ] o.a.s.s.SolrDispatchFilter \__ \/ _ \ | '_|  Install dir: null
   [junit4]   2> 2126106 INFO  (jetty-launcher-4947-thread-4) [    ] o.a.s.s.SolrDispatchFilter |___/\___/_|_|    Start time: 2019-04-08T19:16:15.375Z
   [junit4]   2> 2126251 INFO  (jetty-launcher-4947-thread-3) [    ] o.e.j.s.session DefaultSessionIdManager workerName=node0
   [junit4]   2> 2126251 INFO  (jetty-launcher-4947-thread-3) [    ] o.e.j.s.session No SessionScavenger set, using defaults
   [junit4]   2> 2126251 INFO  (jetty-launcher-4947-thread-3) [    ] o.e.j.s.session node0 Scavenging every 660000ms
   [junit4]   2> 2126251 INFO  (jetty-launcher-4947-thread-3) [    ] o.e.j.s.h.ContextHandler Started o.e.j.s.ServletContextHandler@6418886{/solr,null,AVAILABLE}
   [junit4]   2> 2126304 INFO  (jetty-launcher-4947-thread-1) [    ] o.e.j.s.session DefaultSessionIdManager workerName=node0
   [junit4]   2> 2126304 INFO  (jetty-launcher-4947-thread-1) [    ] o.e.j.s.session No SessionScavenger set, using defaults
   [junit4]   2> 2126304 INFO  (jetty-launcher-4947-thread-1) [    ] o.e.j.s.session node0 Scavenging every 600000ms
   [junit4]   2> 2126304 INFO  (jetty-launcher-4947-thread-1) [    ] o.e.j.s.h.ContextHandler Started o.e.j.s.ServletContextHandler@16e181ec{/solr,null,AVAILABLE}
   [junit4]   2> 2126304 INFO  (jetty-launcher-4947-thread-1) [    ] o.e.j.s.AbstractConnector Started ServerConnector@3e2b1af2{HTTP/1.1,[http/1.1, h2c]}{127.0.0.1:38519}
   [junit4]   2> 2126304 INFO  (jetty-launcher-4947-thread-1) [    ] o.e.j.s.Server Started @2126390ms
   [junit4]   2> 2126304 INFO  (jetty-launcher-4947-thread-1) [    ] o.a.s.c.s.e.JettySolrRunner Jetty properties: {hostContext=/solr, hostPort=38519}
   [junit4]   2> 2126305 ERROR (jetty-launcher-4947-thread-1) [    ] o.a.s.u.StartupLoggingUtils Missing Java Option solr.log.dir. Logging may be missing or incomplete.
   [junit4]   2> 2126305 INFO  (jetty-launcher-4947-thread-1) [    ] o.a.s.s.SolrDispatchFilter Using logger factory org.apache.logging.slf4j.Log4jLoggerFactory
   [junit4]   2> 2126305 INFO  (jetty-launcher-4947-thread-1) [    ] o.a.s.s.SolrDispatchFilter  ___      _       Welcome to Apache Solr? version 9.0.0
   [junit4]   2> 2126305 INFO  (jetty-launcher-4947-thread-1) [    ] o.a.s.s.SolrDispatchFilter / __| ___| |_ _   Starting in cloud mode on port null
   [junit4]   2> 2126305 INFO  (jetty-launcher-4947-thread-1) [    ] o.a.s.s.SolrDispatchFilter \__ \/ _ \ | '_|  Install dir: null
   [junit4]   2> 2126305 INFO  (jetty-launcher-4947-thread-1) [    ] o.a.s.s.SolrDispatchFilter |___/\___/_|_|    Start time: 2019-04-08T19:16:15.574Z
   [junit4]   2> 2126352 INFO  (zkConnectionManagerCallback-4949-thread-1) [    ] o.a.s.c.c.ConnectionManager zkClient has connected
   [junit4]   2> 2126356 INFO  (jetty-launcher-4947-thread-4) [    ] o.a.s.s.SolrDispatchFilter solr.xml found in ZooKeeper. Loading...
   [junit4]   2> 2126421 INFO  (jetty-launcher-4947-thread-2) [    ] o.e.j.s.session DefaultSessionIdManager workerName=node0
   [junit4]   2> 2126421 INFO  (jetty-launcher-4947-thread-2) [    ] o.e.j.s.session No SessionScavenger set, using defaults
   [junit4]   2> 2126421 INFO  (jetty-launcher-4947-thread-2) [    ] o.e.j.s.session node0 Scavenging every 660000ms
   [junit4]   2> 2126422 INFO  (jetty-launcher-4947-thread-2) [    ] o.e.j.s.h.ContextHandler Started o.e.j.s.ServletContextHandler@31757fb1{/solr,null,AVAILABLE}
   [junit4]   2> 2126433 INFO  (jetty-launcher-4947-thread-3) [    ] o.e.j.s.AbstractConnector Started ServerConnector@2d8c671f{HTTP/1.1,[http/1.1, h2c]}{127.0.0.1:37942}
   [junit4]   2> 2126433 INFO  (jetty-launcher-4947-thread-3) [    ] o.e.j.s.Server Started @2126519ms
   [junit4]   2> 2126433 INFO  (jetty-launcher-4947-thread-3) [    ] o.a.s.c.s.e.JettySolrRunner Jetty properties: {hostContext=/solr, hostPort=37942}
   [junit4]   2> 2126434 ERROR (jetty-launcher-4947-thread-3) [    ] o.a.s.u.StartupLoggingUtils Missing Java Option solr.log.dir. Logging may be missing or incomplete.
   [junit4]   2> 2126434 INFO  (jetty-launcher-4947-thread-3) [    ] o.a.s.s.SolrDispatchFilter Using logger factory org.apache.logging.slf4j.Log4jLoggerFactory
   [junit4]   2> 2126434 INFO  (jetty-launcher-4947-thread-3) [    ] o.a.s.s.SolrDispatchFilter  ___      _       Welcome to Apache Solr? version 9.0.0
   [junit4]   2> 2126434 INFO  (jetty-launcher-4947-thread-3) [    ] o.a.s.s.SolrDispatchFilter / __| ___| |_ _   Starting in cloud mode on port null
   [junit4]   2> 2126434 INFO  (jetty-launcher-4947-thread-3) [    ] o.a.s.s.SolrDispatchFilter \__ \/ _ \ | '_|  Install dir: null
   [junit4]   2> 2126434 INFO  (jetty-launcher-4947-thread-3) [    ] o.a.s.s.SolrDispatchFilter |___/\___/_|_|    Start time: 2019-04-08T19:16:15.703Z
   [junit4]   2> 2126445 INFO  (jetty-launcher-4947-thread-2) [    ] o.e.j.s.AbstractConnector Started ServerConnector@188ceb5c{HTTP/1.1,[http/1.1, h2c]}{127.0.0.1:36903}
   [junit4]   2> 2126445 INFO  (jetty-launcher-4947-thread-2) [    ] o.e.j.s.Server Started @2126531ms
   [junit4]   2> 2126446 INFO  (jetty-launcher-4947-thread-2) [    ] o.a.s.c.s.e.JettySolrRunner Jetty properties: {hostContext=/solr, hostPort=36903}
   [junit4]   2> 2126446 ERROR (jetty-launcher-4947-thread-2) [    ] o.a.s.u.StartupLoggingUtils Missing Java Option solr.log.dir. Logging may be missing or incomplete.
   [junit4]   2> 2126446 INFO  (jetty-launcher-4947-thread-2) [    ] o.a.s.s.SolrDispatchFilter Using logger factory org.apache.logging.slf4j.Log4jLoggerFactory
   [junit4]   2> 2126446 INFO  (jetty-launcher-4947-thread-2) [    ] o.a.s.s.SolrDispatchFilter  ___      _       Welcome to Apache Solr? version 9.0.0
   [junit4]   2> 2126446 INFO  (jetty-launcher-4947-thread-2) [    ] o.a.s.s.SolrDispatchFilter / __| ___| |_ _   Starting in cloud mode on port null
   [junit4]   2> 2126446 INFO  (jetty-launcher-4947-thread-2) [    ] o.a.s.s.SolrDispatchFilter \__ \/ _ \ | '_|  Install dir: null
   [junit4]   2> 2126446 INFO  (jetty-launcher-4947-thread-2) [    ] o.a.s.s.SolrDispatchFilter |___/\___/_|_|    Start time: 2019-04-08T19:16:15.715Z
   [junit4]   2> 2126446 WARN  (NIOServerCxn.Factory:0.0.0.0/0.0.0.0:0) [    ] o.a.z.s.NIOServerCnxn Unable to read additional data from client sessionid 0x108a2a3b4bb0003, likely client has closed socket
   [junit4]   2> 2126462 INFO  (zkConnectionManagerCallback-4951-thread-1) [    ] o.a.s.c.c.ConnectionManager zkClient has connected
   [junit4]   2> 2126462 INFO  (jetty-launcher-4947-thread-1) [    ] o.a.s.s.SolrDispatchFilter solr.xml found in ZooKeeper. Loading...
   [junit4]   2> 2126559 INFO  (zkConnectionManagerCallback-4953-thread-1) [    ] o.a.s.c.c.ConnectionManager zkClient has connected
   [junit4]   2> 2126579 INFO  (zkConnectionManagerCallback-4955-thread-1) [    ] o.a.s.c.c.ConnectionManager zkClient has connected
   [junit4]   2> 2126595 INFO  (jetty-launcher-4947-thread-2) [    ] o.a.s.s.SolrDispatchFilter solr.xml found in ZooKeeper. Loading...
   [junit4]   2> 2126595 INFO  (jetty-launcher-4947-thread-3) [    ] o.a.s.s.SolrDispatchFilter solr.xml found in ZooKeeper. Loading...
   [junit4]   2> 2127371 INFO  (jetty-launcher-4947-thread-2) [    ] o.a.s.h.c.HttpShardHandlerFactory Host whitelist initialized: WhitelistHostChecker [whitelistHosts=null, whitelistHostCheckingEnabled=true]
   [junit4]   2> 2127426 WARN  (jetty-launcher-4947-thread-2) [    ] o.e.j.u.s.S.config No Client EndPointIdentificationAlgorithm configured for SslContextFactory@7b1bba96[provider=null,keyStore=null,trustStore=null]
   [junit4]   2> 2127479 WARN  (jetty-launcher-4947-thread-2) [    ] o.e.j.u.s.S.config No Client EndPointIdentificationAlgorithm configured for SslContextFactory@47e6f85[provider=null,keyStore=null,trustStore=null]
   [junit4]   2> 2127480 INFO  (jetty-launcher-4947-thread-2) [    ] o.a.s.c.ZkContainer Zookeeper client=127.0.0.1:36755/solr
   [junit4]   2> 2127515 INFO  (zkConnectionManagerCallback-4965-thread-1) [    ] o.a.s.c.c.ConnectionManager zkClient has connected
   [junit4]   2> 2127537 INFO  (jetty-launcher-4947-thread-1) [    ] o.a.s.h.c.HttpShardHandlerFactory Host whitelist initialized: WhitelistHostChecker [whitelistHosts=null, whitelistHostCheckingEnabled=true]
   [junit4]   2> 2127593 WARN  (jetty-launcher-4947-thread-1) [    ] o.e.j.u.s.S.config No Client EndPointIdentificationAlgorithm configured for SslContextFactory@1006c276[provider=null,keyStore=null,trustStore=null]
   [junit4]   2> 2127608 INFO  (zkConnectionManagerCallback-4967-thread-1) [    ] o.a.s.c.c.ConnectionManager zkClient has connected
   [junit4]   2> 2127718 INFO  (jetty-launcher-4947-thread-3) [    ] o.a.s.h.c.HttpShardHandlerFactory Host whitelist initialized: WhitelistHostChecker [whitelistHosts=null, whitelistHostCheckingEnabled=true]
   [junit4]   2> 2127938 WARN  (jetty-launcher-4947-thread-1) [    ] o.e.j.u.s.S.config No Client EndPointIdentificationAlgorithm configured for SslContextFactory@68e390ce[provider=null,keyStore=null,trustStore=null]
   [junit4]   2> 2127939 INFO  (jetty-launcher-4947-thread-1) [    ] o.a.s.c.ZkContainer Zookeeper client=127.0.0.1:36755/solr
   [junit4]   2> 2127958 WARN  (jetty-launcher-4947-thread-3) [    ] o.e.j.u.s.S.config No Client EndPointIdentificationAlgorithm configured for SslContextFactory@35ec8022[provider=null,keyStore=null,trustStore=null]
   [junit4]   2> 2128010 WARN  (jetty-launcher-4947-thread-3) [    ] o.e.j.u.s.S.config No Client EndPointIdentificationAlgorithm configured for SslContextFactory@59b6e112[provider=null,keyStore=null,trustStore=null]
   [junit4]   2> 2128011 INFO  (jetty-launcher-4947-thread-3) [    ] o.a.s.c.ZkContainer Zookeeper client=127.0.0.1:36755/solr
   [junit4]   2> 2128025 INFO  (zkConnectionManagerCallback-4976-thread-1) [    ] o.a.s.c.c.ConnectionManager zkClient has connected
   [junit4]   2> 2128056 WARN  (NIOServerCxn.Factory:0.0.0.0/0.0.0.0:0) [    ] o.a.z.s.NIOServerCnxn Unable to read additional data from client sessionid 0x108a2a3b4bb0009, likely client has closed socket
   [junit4]   2> 2128082 INFO  (zkConnectionManagerCallback-4981-thread-1) [    ] o.a.s.c.c.ConnectionManager zkClient has connected
   [junit4]   2> 2128135 INFO  (zkConnectionManagerCallback-4983-thread-1) [    ] o.a.s.c.c.ConnectionManager zkClient has connected
   [junit4]   2> 2128139 WARN  (NIOServerCxn.Factory:0.0.0.0/0.0.0.0:0) [    ] o.a.z.s.NIOServerCnxn Unable to read additional data from client sessionid 0x108a2a3b4bb000a, likely client has closed socket
   [junit4]   2> 2128208 INFO  (zkConnectionManagerCallback-4985-thread-1) [    ] o.a.s.c.c.ConnectionManager zkClient has connected
   [junit4]   2> 2128231 INFO  (jetty-launcher-4947-thread-1) [n:127.0.0.1:38519_solr    ] o.a.s.c.OverseerElectionContext I am going to be the leader 127.0.0.1:38519_solr
   [junit4]   2> 2128231 INFO  (jetty-launcher-4947-thread-1) [n:127.0.0.1:38519_solr    ] o.a.s.c.Overseer Overseer (id=74488217847136267-127.0.0.1:38519_solr-n_0000000000) starting
   [junit4]   2> 2128337 INFO  (zkConnectionManagerCallback-4992-thread-1) [    ] o.a.s.c.c.ConnectionManager zkClient has connected
   [junit4]   2> 2128470 INFO  (jetty-launcher-4947-thread-4) [    ] o.a.s.h.c.HttpShardHandlerFactory Host whitelist initialized: WhitelistHostChecker [whitelistHosts=null, whitelistHostCheckingEnabled=true]
   [junit4]   2> 2128504 INFO  (jetty-launcher-4947-thread-1) [n:127.0.0.1:38519_solr    ] o.a.s.c.s.i.ZkClientClusterStateProvider Cluster at 127.0.0.1:36755/solr ready
   [junit4]   2> 2128524 WARN  (jetty-launcher-4947-thread-4) [    ] o.e.j.u.s.S.config No Client EndPointIdentificationAlgorithm configured for SslContextFactory@7aa946f3[provider=null,keyStore=null,trustStore=null]
   [junit4]   2> 2128548 INFO  (OverseerStateUpdate-74488217847136267-127.0.0.1:38519_solr-n_0000000000) [n:127.0.0.1:38519_solr    ] o.a.s.c.Overseer Starting to work on the main queue : 127.0.0.1:38519_solr
   [junit4]   2> 2128548 INFO  (jetty-launcher-4947-thread-1) [n:127.0.0.1:38519_solr    ] o.a.s.c.ZkController Register node as live in ZooKeeper:/live_nodes/127.0.0.1:38519_solr
   [junit4]   2> 2128559 INFO  (OverseerStateUpdate-74488217847136267-127.0.0.1:38519_solr-n_0000000000) [n:127.0.0.1:38519_solr    ] o.a.s.c.c.ZkStateReader Updated live nodes from ZooKeeper... (0) -> (1)
   [junit4]   2> 2128572 INFO  (jetty-launcher-4947-thread-3) [n:127.0.0.1:37942_solr    ] o.a.s.c.c.ZkStateReader Updated live nodes from ZooKeeper... (0) -> (1)
   [junit4]   2> 2128593 INFO  (jetty-launcher-4947-thread-3) [n:127.0.0.1:37942_solr    ] o.a.s.c.ZkController Publish node=127.0.0.1:37942_solr as DOWN
   [junit4]   2> 2128594 INFO  (jetty-launcher-4947-thread-3) [n:127.0.0.1:37942_solr    ] o.a.s.c.TransientSolrCoreCacheDefault Allocating transient cache for 2147483647 transient cores
   [junit4]   2> 2128594 INFO  (jetty-launcher-4947-thread-3) [n:127.0.0.1:37942_solr    ] o.a.s.c.ZkController Register node as live in ZooKeeper:/live_nodes/127.0.0.1:37942_solr
   [junit4]   2> 2128703 WARN  (jetty-launcher-4947-thread-4) [    ] o.e.j.u.s.S.config No Client EndPointIdentificationAlgorithm configured for SslContextFactory@7fc6c03c[provider=null,keyStore=null,trustStore=null]
   [junit4]   2> 2128704 INFO  (jetty-launcher-4947-thread-4) [    ] o.a.s.c.ZkContainer Zookeeper client=127.0.0.1:36755/solr
   [junit4]   2> 2128747 INFO  (zkCallback-4982-thread-1) [    ] o.a.s.c.c.ZkStateReader Updated live nodes from ZooKeeper... (1) -> (2)
   [junit4]   2> 2128755 INFO  (jetty-launcher-4947-thread-1) [n:127.0.0.1:38519_solr    ] o.a.s.h.a.MetricsHistoryHandler No .system collection, keeping metrics history in memory.
   [junit4]   2> 2128791 INFO  (zkCallback-4984-thread-1) [    ] o.a.s.c.c.ZkStateReader Updated live nodes from ZooKeeper... (1) -> (2)
   [junit4]   2> 2128799 INFO  (zkCallback-4991-thread-1) [    ] o.a.s.c.c.ZkStateReader Updated live nodes from ZooKeeper... (0) -> (2)
   [junit4]   2> 2128832 INFO  (zkConnectionManagerCallback-5001-thread-1) [    ] o.a.s.c.c.ConnectionManager zkClient has connected
   [junit4]   2> 2128961 INFO  (zkConnectionManagerCallback-5003-thread-1) [    ] o.a.s.c.c.ConnectionManager zkClient has connected
   [junit4]   2> 2128965 INFO  (jetty-launcher-4947-thread-4) [n:127.0.0.1:35109_solr    ] o.a.s.c.c.ZkStateReader Updated live nodes from ZooKeeper... (0) -> (2)
   [junit4]   2> 2129020 INFO  (jetty-launcher-4947-thread-4) [n:127.0.0.1:35109_solr    ] o.a.s.c.ZkController Publish node=127.0.0.1:35109_solr as DOWN
   [junit4]   2> 2129021 INFO  (jetty-launcher-4947-thread-4) [n:127.0.0.1:35109_solr    ] o.a.s.c.TransientSolrCoreCacheDefault Allocating transient cache for 2147483647 transient cores
   [junit4]   2> 2129021 INFO  (jetty-launcher-4947-thread-4) [n:127.0.0.1:35109_solr    ] o.a.s.c.ZkController Register node as live in ZooKeeper:/live_nodes/127.0.0.1:35109_solr
   [junit4]   2> 2129035 INFO  (zkConnectionManagerCallback-5008-thread-1) [    ] o.a.s.c.c.ConnectionManager zkClient has connected
   [junit4]   2> 2129055 INFO  (zkCallback-4982-thread-1) [    ] o.a.s.c.c.ZkStateReader Updated live nodes from ZooKeeper... (2) -> (3)
   [junit4]   2> 2129058 INFO  (zkCallback-5002-thread-1) [    ] o.a.s.c.c.ZkStateReader Updated live nodes from ZooKeeper... (2) -> (3)
   [junit4]   2> 2129067 INFO  (zkCallback-4984-thread-1) [    ] o.a.s.c.c.ZkStateReader Updated live nodes from ZooKeeper... (2) -> (3)
   [junit4]   2> 2129067 INFO  (zkCallback-4991-thread-1) [    ] o.a.s.c.c.ZkStateReader Updated live nodes from ZooKeeper... (2) -> (3)
   [junit4]   2> 2129071 INFO  (jetty-launcher-4947-thread-1) [n:127.0.0.1:38519_solr    ] o.a.s.m.r.SolrJmxReporter JMX monitoring for 'solr_38519.solr.node' (registry 'solr.node') enabled at server: com.sun.jmx.mbeanserver.JmxMBeanServer@295f086c
   [junit4]   2> 2129119 INFO  (jetty-launcher-4947-thread-3) [n:127.0.0.1:37942_solr    ] o.a.s.c.c.ZkStateReader Updated live nodes from ZooKeeper... (0) -> (3)
   [junit4]   2> 2129156 INFO  (jetty-launcher-4947-thread-2) [n:127.0.0.1:36903_solr    ] o.a.s.c.c.ZkStateReader Updated live nodes from ZooKeeper... (0) -> (3)
   [junit4]   2> 2129164 INFO  (jetty-launcher-4947-thread-1) [n:127.0.0.1:38519_solr    ] o.a.s.m.r.SolrJmxReporter JMX monitoring for 'solr_38519.solr.jvm' (registry 'solr.jvm') enabled at server: com.sun.jmx.mbeanserver.JmxMBeanServer@295f086c
   [junit4]   2> 2129165 INFO  (jetty-launcher-4947-thread-1) [n:127.0.0.1:38519_solr    ] o.a.s.m.r.SolrJmxReporter JMX monitoring for 'solr_38519.solr.jetty' (registry 'solr.jetty') enabled at server: com.sun.jmx.mbeanserver.JmxMBeanServer@295f086c
   [junit4]   2> 2129165 INFO  (jetty-launcher-4947-thread-1) [n:127.0.0.1:38519_solr    ] o.a.s.c.CorePropertiesLocator Found 0 core definitions underneath /home/jenkins/jenkins-slave/workspace/Lucene-Solr-Tests-master/solr/build/solr-core/test/J0/temp/solr.cloud.DeleteReplicaTest_3403DAAA3B249F6C-001/tempDir-001/node1/.
   [junit4]   2> 2129192 INFO  (jetty-launcher-4947-thread-3) [n:127.0.0.1:37942_solr    ] o.a.s.c.s.i.ZkClientClusterStateProvider Cluster at 127.0.0.1:36755/solr ready
   [junit4]   2> 2129220 INFO  (jetty-launcher-4947-thread-2) [n:127.0.0.1:36903_solr    ] o.a.s.c.ZkController Publish node=127.0.0.1:36903_solr as DOWN
   [junit4]   2> 2129220 INFO  (jetty-launcher-4947-thread-2) [n:127.0.0.1:36903_solr    ] o.a.s.c.TransientSolrCoreCacheDefault Allocating transient cache for 2147483647 transient cores
   [junit4]   2> 2129220 INFO  (jetty-launcher-4947-thread-2) [n:127.0.0.1:36903_solr    ] o.a.s.c.ZkController Register node as live in ZooKeeper:/live_nodes/127.0.0.1:36903_solr
   [junit4]   2> 2129233 INFO  (jetty-launcher-4947-thread-3) [n:127.0.0.1:37942_solr    ] o.a.s.h.a.MetricsHistoryHandler No .system collection, keeping metrics history in memory.
   [junit4]   2> 2129347 INFO  (zkCallback-4991-thread-1) [    ] o.a.s.c.c.ZkStateReader Updated live nodes from ZooKeeper... (3) -> (4)
   [junit4]   2> 2129347 INFO  (zkCallback-4984-thread-1) [    ] o.a.s.c.c.ZkStateReader Updated live nodes from ZooKeeper... (3) -> (4)
   [junit4]   2> 2129347 INFO  (zkCallback-4982-thread-1) [    ] o.a.s.c.c.ZkStateReader Updated live nodes from ZooKeeper... (3) -> (4)
   [junit4]   2> 2129379 INFO  (zkConnectionManagerCallback-5016-thread-1) [    ] o.a.s.c.c.ConnectionManager zkClient has connected
   [junit4]   2> 2129493 INFO  (zkCallback-5002-thread-1) [    ] o.a.s.c.c.ZkStateReader Updated live nodes from ZooKeeper... (3) -> (4)
   [junit4]   2> 2129493 INFO  (zkCallback-5007-thread-1) [    ] o.a.s.c.c.ZkStateReader Updated live nodes from ZooKeeper... (3) -> (4)
   [junit4]   2> 2129504 INFO  (zkCallback-4966-thread-1) [    ] o.a.s.c.c.ZkStateReader Updated live nodes from ZooKeeper... (3) -> (4)
   [junit4]   2> 2129561 INFO  (jetty-launcher-4947-thread-4) [n:127.0.0.1:35109_solr    ] o.a.s.c.c.ZkStateReader Updated live nodes from ZooKeeper... (0) -> (4)
   [junit4]   2> 2129563 INFO  (jetty-launcher-4947-thread-3) [n:127.0.0.1:37942_solr    ] o.a.s.m.r.SolrJmxReporter JMX monitoring for 'solr_37942.solr.node' (registry 'solr.node') enabled at server: com.sun.jmx.mbeanserver.JmxMBeanServer@295f086c
   [junit4]   2> 2129622 INFO  (jetty-launcher-4947-thread-4) [n:127.0.0.1:35109_solr    ] o.a.s.c.s.i.ZkClientClusterStateProvider Cluster at 127.0.0.1:36755/solr ready
   [junit4]   2> 2129635 INFO  (jetty-launcher-4947-thread-3) [n:127.0.0.1:37942_solr    ] o.a.s.m.r.SolrJmxReporter JMX monitoring for 'solr_37942.solr.jvm' (registry 'solr.jvm') enabled at server: com.sun.jmx.mbeanserver.JmxMBeanServer@295f086c
   [junit4]   2> 2129635 INFO  (jetty-launcher-4947-thread-3) [n:127.0.0.1:37942_solr    ] o.a.s.m.r.SolrJmxReporter JMX monitoring for 'solr_37942.solr.jetty' (registry 'solr.jetty') enabled at server: com.sun.jmx.mbeanserver.JmxMBeanServer@295f086c
   [junit4]   2> 2129636 INFO  (jetty-launcher-4947-thread-3) [n:127.0.0.1:37942_solr    ] o.a.s.c.CorePropertiesLocator Found 0 core definitions underneath /home/jenkins/jenkins-slave/workspace/Lucene-Solr-Tests-master/solr/build/solr-core/test/J0/temp/solr.cloud.DeleteReplicaTest_3403DAAA3B249F6C-001/tempDir-001/node4/.
   [junit4]   2> 2129636 INFO  (jetty-launcher-4947-thread-4) [n:127.0.0.1:35109_solr    ] o.a.s.h.a.MetricsHistoryHandler No .system collection, keeping metrics history in memory.
   [junit4]   2> 2129747 INFO  (zkConnectionManagerCallback-5022-thread-1) [    ] o.a.s.c.c.ConnectionManager zkClient has connected
   [junit4]   2> 2129749 INFO  (jetty-launcher-4947-thread-2) [n:127.0.0.1:36903_solr    ] o.a.s.c.c.ZkStateReader Updated live nodes from ZooKeeper... (0) -> (4)
   [junit4]   2> 2129785 INFO  (jetty-launcher-4947-thread-4) [n:127.0.0.1:35109_solr    ] o.a.s.m.r.SolrJmxReporter JMX monitoring for 'solr_35109.solr.node' (registry 'solr.node') enabled at server: com.sun.jmx.mbeanserver.JmxMBeanServer@295f086c
   [junit4]   2> 2129905 INFO  (jetty-launcher-4947-thread-2) [n:127.0.0.1:36903_solr    ] o.a.s.c.s.i.ZkClientClusterStateProvider Cluster at 127.0.0.1:36755/solr ready
   [junit4]   2> 2129911 INFO  (jetty-launcher-4947-thread-2) [n:127.0.0.1:36903_solr    ] o.a.s.h.a.MetricsHistoryHandler No .system collection, keeping metrics history in memory.
   [junit4]   2> 2129964 INFO  (jetty-launcher-4947-thread-4) [n:127.0.0.1:35109_solr    ] o.a.s.m.r.SolrJmxReporter JMX monitoring for 'solr_35109.solr.jvm' (registry 'solr.jvm') enabled at server: com.sun.jmx.mbeanserver.JmxMBeanServer@295f086c
   [junit4]   2> 2129964 INFO  (jetty-launcher-4947-thread-4) [n:127.0.0.1:35109_solr    ] o.a.s.m.r.SolrJmxReporter JMX monitoring for 'solr_35109.solr.jetty' (registry 'solr.jetty') enabled at server: com.sun.jmx.mbeanserver.JmxMBeanServer@295f086c
   [junit4]   2> 2129965 INFO  (jetty-launcher-4947-thread-4) [n:127.0.0.1:35109_solr    ] o.a.s.c.CorePropertiesLocator Found 0 core definitions underneath /home/jenkins/jenkins-slave/workspace/Lucene-Solr-Tests-master/solr/build/solr-core/test/J0/temp/solr.cloud.DeleteReplicaTest_3403DAAA3B249F6C-001/tempDir-001/node3/.
   [junit4]   2> 2130419 INFO  (jetty-launcher-4947-thread-2) [n:127.0.0.1:36903_solr    ] o.a.s.m.r.SolrJmxReporter JMX monitoring for 'solr_36903.solr.node' (registry 'solr.node') enabled at server: com.sun.jmx.mbeanserver.JmxMBeanServer@295f086c
   [junit4]   2> 2130492 INFO  (jetty-launcher-4947-thread-2) [n:127.0.0.1:36903_solr    ] o.a.s.m.r.SolrJmxReporter JMX monitoring for 'solr_36903.solr.jvm' (registry 'solr.jvm') enabled at server: com.sun.jmx.mbeanserver.JmxMBeanServer@295f086c
   [junit4]   2> 2130493 INFO  (jetty-launcher-4947-thread-2) [n:127.0.0.1:36903_solr    ] o.a.s.m.r.SolrJmxReporter JMX monitoring for 'solr_36903.solr.jetty' (registry 'solr.jetty') enabled at server: com.sun.jmx.mbeanserver.JmxMBeanServer@295f086c
   [junit4]   2> 2130526 INFO  (jetty-launcher-4947-thread-2) [n:127.0.0.1:36903_solr    ] o.a.s.c.CorePropertiesLocator Found 0 core definitions underneath /home/jenkins/jenkins-slave/workspace/Lucene-Solr-Tests-master/solr/build/solr-core/test/J0/temp/solr.cloud.DeleteReplicaTest_3403DAAA3B249F6C-001/tempDir-001/node2/.
   [junit4]   2> 2130755 INFO  (zkConnectionManagerCallback-5028-thread-1) [    ] o.a.s.c.c.ConnectionManager zkClient has connected
   [junit4]   2> 2130756 INFO  (TEST-DeleteReplicaTest.deleteReplicaAndVerifyDirectoryCleanup-seed#[3403DAAA3B249F6C]) [    ] o.a.s.c.c.ZkStateReader Updated live nodes from ZooKeeper... (0) -> (4)
   [junit4]   2> 2130756 INFO  (TEST-DeleteReplicaTest.deleteReplicaAndVerifyDirectoryCleanup-seed#[3403DAAA3B249F6C]) [    ] o.a.s.c.s.i.ZkClientClusterStateProvider Cluster at 127.0.0.1:36755/solr ready
   [junit4]   2> 2130781 INFO  (qtp37589231-14152) [n:127.0.0.1:35109_solr    ] o.a.s.h.a.CollectionsHandler Invoked Collection Action :create with params collection.configName=conf&name=deletereplica_test&nrtReplicas=2&action=CREATE&numShards=1&wt=javabin&version=2 and sendToOCPQueue=true
   [junit4]   2> 2130786 INFO  (OverseerThreadFactory-4195-thread-1-processing-n:127.0.0.1:38519_solr) [n:127.0.0.1:38519_solr    ] o.a.s.c.a.c.CreateCollectionCmd Create collection deletereplica_test
   [junit4]   2> 2130909 INFO  (OverseerStateUpdate-74488217847136267-127.0.0.1:38519_solr-n_0000000000) [n:127.0.0.1:38519_solr    ] o.a.s.c.o.SliceMutator createReplica() {
   [junit4]   2>   "operation":"ADDREPLICA",
   [junit4]   2>   "collection":"deletereplica_test",
   [junit4]   2>   "shard":"shard1",
   [junit4]   2>   "core":"deletereplica_test_shard1_replica_n1",
   [junit4]   2>   "state":"down",
   [junit4]   2>   "base_url":"http://127.0.0.1:38519/solr",
   [junit4]   2>   "type":"NRT",
   [junit4]   2>   "waitForFinalState":"false"} 
   [junit4]   2> 2130944 INFO  (OverseerStateUpdate-74488217847136267-127.0.0.1:38519_solr-n_0000000000) [n:127.0.0.1:38519_solr    ] o.a.s.c.o.SliceMutator createReplica() {
   [junit4]   2>   "operation":"ADDREPLICA",
   [junit4]   2>   "collection":"deletereplica_test",
   [junit4]   2>   "shard":"shard1",
   [junit4]   2>   "core":"deletereplica_test_shard1_replica_n2",
   [junit4]   2>   "state":"down",
   [junit4]   2>   "base_url":"http://127.0.0.1:36903/solr",
   [junit4]   2>   "type":"NRT",
   [junit4]   2>   "waitForFinalState":"false"} 
   [junit4]   2> 2131247 INFO  (qtp729327217-14184) [n:127.0.0.1:36903_solr    x:deletereplica_test_shard1_replica_n2] o.a.s.h.a.CoreAdminOperation core create command qt=/admin/cores&coreNodeName=core_node4&collection.configName=conf&newCollection=true&name=deletereplica_test_shard1_replica_n2&action=CREATE&numShards=1&collection=deletereplica_test&shard=shard1&wt=javabin&version=2&replicaType=NRT
   [junit4]   2> 2131263 INFO  (qtp1842573325-14173) [n:127.0.0.1:38519_solr    x:deletereplica_test_shard1_replica_n1] o.a.s.h.a.CoreAdminOperation core create command qt=/admin/cores&coreNodeName=core_node3&collection.configName=conf&newCollection=true&name=deletereplica_test_shard1_replica_n1&action=CREATE&numShards=1&collection=deletereplica_test&shard=shard1&wt=javabin&version=2&replicaType=NRT
   [junit4]   2> 2131263 INFO  (qtp1842573325-14173) [n:127.0.0.1:38519_solr    x:deletereplica_test_shard1_replica_n1] o.a.s.c.TransientSolrCoreCacheDefault Allocating transient cache for 2147483647 transient cores
   [junit4]   2> 2132354 INFO  (qtp1842573325-14173) [n:127.0.0.1:38519_solr c:deletereplica_test s:shard1 r:core_node3 x:deletereplica_test_shard1_replica_n1] o.a.s.c.SolrConfig Using Lucene MatchVersion: 9.0.0
   [junit4]   2> 2132427 INFO  (qtp1842573325-14173) [n:127.0.0.1:38519_solr c:deletereplica_test s:shard1 r:core_node3 x:deletereplica_test_shard1_replica_n1] o.a.s.s.IndexSchema [deletereplica_test_shard1_replica_n1] Schema name=minimal
   [junit4]   2> 2132465 INFO  (qtp1842573325-14173) [n:127.0.0.1:38519_solr c:deletereplica_test s:shard1 r:core_node3 x:deletereplica_test_shard1_replica_n1] o.a.s.s.IndexSchema Loaded schema minimal/1.1 with uniqueid field id
   [junit4]   2> 2132465 INFO  (qtp1842573325-14173) [n:127.0.0.1:38519_solr c:deletereplica_test s:shard1 r:core_node3 x:deletereplica_test_shard1_replica_n1] o.a.s.c.CoreContainer Creating SolrCore 'deletereplica_test_shard1_replica_n1' using configuration from collection deletereplica_test, trusted=true
   [junit4]   2> 2132465 INFO  (qtp1842573325-14173) [n:127.0.0.1:38519_solr c:deletereplica_test s:shard1 r:core_node3 x:deletereplica_test_shard1_replica_n1] o.a.s.m.r.SolrJmxReporter JMX monitoring for 'solr_38519.solr.core.deletereplica_test.shard1.replica_n1' (registry 'solr.core.deletereplica_test.shard1.replica_n1') enabled at server: com.sun.jmx.mbeanserver.JmxMBeanServer@295f086c
   [junit4]   2> 2132466 INFO  (qtp1842573325-14173) [n:127.0.0.1:38519_solr c:deletereplica_test s:shard1 r:core_node3 x:deletereplica_test_shard1_replica_n1] o.a.s.c.SolrCore [[deletereplica_test_shard1_replica_n1] ] Opening new SolrCore at [/home/jenkins/jenkins-slave/workspace/Lucene-Solr-Tests-master/solr/build/solr-core/test/J0/temp/solr.cloud.DeleteReplicaTest_3403DAAA3B249F6C-001/tempDir-001/node1/deletereplica_test_shard1_replica_n1], dataDir=[/home/jenkins/jenkins-slave/workspace/Lucene-Solr-Tests-master/solr/build/solr-core/test/J0/temp/solr.cloud.DeleteReplicaTest_3403DAAA3B249F6C-001/tempDir-001/node1/./deletereplica_test_shard1_replica_n1/data/]
   [junit4]   2> 2132684 INFO  (qtp729327217-14184) [n:127.0.0.1:36903_solr c:deletereplica_test s:shard1 r:core_node4 x:deletereplica_test_shard1_replica_n2] o.a.s.c.SolrConfig Using Lucene MatchVersion: 9.0.0
   [junit4]   2> 2132784 INFO  (qtp729327217-14184) [n:127.0.0.1:36903_solr c:deletereplica_test s:shard1 r:core_node4 x:deletereplica_test_shard1_replica_n2] o.a.s.s.IndexSchema [deletereplica_test_shard1_replica_n2] Schema name=minimal
   [junit4]   2> 2132786 INFO  (qtp729327217-14184) [n:127.0.0.1:36903_solr c:deletereplica_test s:shard1 r:core_node4 x:deletereplica_test_shard1_replica_n2] o.a.s.s.IndexSchema Loaded schema minimal/1.1 with uniqueid field id
   [junit4]   2> 2132786 INFO  (qtp729327217-14184) [n:127.0.0.1:36903_solr c:deletereplica_test s:shard1 r:core_node4 x:deletereplica_test_shard1_replica_n2] o.a.s.c.CoreContainer Creating SolrCore 'deletereplica_test_shard1_replica_n2' using configuration from collection deletereplica_test, trusted=true
   [junit4]   2> 2132803 INFO  (qtp729327217-14184) [n:127.0.0.1:36903_solr c:deletereplica_test s:shard1 r:core_node4 x:deletereplica_test_shard1_replica_n2] o.a.s.m.r.SolrJmxReporter JMX monitoring for 'solr_36903.solr.core.deletereplica_test.shard1.replica_n2' (registry 'solr.core.deletereplica_test.shard1.replica_n2') enabled at server: com.sun.jmx.mbeanserver.JmxMBeanServer@295f086c
   [junit4]   2> 2132803 INFO  (qtp729327217-14184) [n:127.0.0.1:36903_solr c:deletereplica_test s:shard1 r:core_node4 x:deletereplica_test_shard1_replica_n2] o.a.s.c.SolrCore [[deletereplica_test_shard1_replica_n2] ] Opening new SolrCore at [/home/jenkins/jenkins-slave/workspace/Lucene-Solr-Tests-master/solr/build/solr-core/test/J0/temp/solr.cloud.DeleteReplicaTest_3403DAAA3B249F6C-001/tempDir-001/node2/deletereplica_test_shard1_replica_n2], dataDir=[/home/jenkins/jenkins-slave/workspace/Lucene-Solr-Tests-master/solr/build/solr-core/test/J0/temp/solr.cloud.DeleteReplicaTest_3403DAAA3B249F6C-001/tempDir-001/node2/./deletereplica_test_shard1_replica_n2/data/]
   [junit4]   2> 2133200 INFO  (qtp1842573325-14173) [n:127.0.0.1:38519_solr c:deletereplica_test s:shard1 r:core_node3 x:deletereplica_test_shard1_replica_n1] o.a.s.u.UpdateHandler Using UpdateLog implementation: org.apache.solr.update.UpdateLog
   [junit4]   2> 2133201 INFO  (qtp1842573325-14173) [n:127.0.0.1:38519_solr c:deletereplica_test s:shard1 r:core_node3 x:deletereplica_test_shard1_replica_n1] o.a.s.u.UpdateLog Initializing UpdateLog: dataDir=null defaultSyncLevel=FLUSH numRecordsToKeep=100 maxNumLogsToKeep=10 numVersionBuckets=65536
   [junit4]   2> 2133203 INFO  (qtp1842573325-14173) [n:127.0.0.1:38519_solr c:deletereplica_test s:shard1 r:core_node3 x:deletereplica_test_shard1_replica_n1] o.a.s.u.CommitTracker Hard AutoCommit: disabled
   [junit4]   2> 2133203 INFO  (qtp1842573325-14173) [n:127.0.0.1:38519_solr c:deletereplica_test s:shard1 r:core_node3 x:deletereplica_test_shard1_replica_n1] o.a.s.u.CommitTracker Soft AutoCommit: disabled
   [junit4]   2> 2133237 INFO  (qtp1842573325-14173) [n:127.0.0.1:38519_solr c:deletereplica_test s:shard1 r:core_node3 x:deletereplica_test_shard1_replica_n1] o.a.s.s.SolrIndexSearcher Opening [Searcher@40a7d618[deletereplica_test_shard1_replica_n1] main]
   [junit4]   2> 2133237 INFO  (qtp729327217-14184) [n:127.0.0.1:36903_solr c:deletereplica_test s:shard1 r:core_node4 x:deletereplica_test_shard1_replica_n2] o.a.s.u.UpdateHandler Using UpdateLog implementation: org.apache.solr.update.UpdateLog
   [junit4]   2> 2133237 INFO  (qtp729327217-14184) [n:127.0.0.1:36903_solr c:deletereplica_test s:shard1 r:core_node4 x:deletereplica_test_shard1_replica_n2] o.a.s.u.UpdateLog Initializing UpdateLog: dataDir=null defaultSyncLevel=FLUSH numRecordsToKeep=100 maxNumLogsToKeep=10 numVersionBuckets=65536
   [junit4]   2> 2133239 INFO  (qtp729327217-14184) [n:127.0.0.1:36903_solr c:deletereplica_test s:shard1 r:core_node4 x:deletereplica_test_shard1_replica_n2] o.a.s.u.CommitTracker Hard AutoCommit: disabled
   [junit4]   2> 2133239 INFO  (qtp729327217-14184) [n:127.0.0.1:36903_solr c:deletereplica_test s:shard1 r:core_node4 x:deletereplica_test_shard1_replica_n2] o.a.s.u.CommitTracker Soft AutoCommit: disabled
   [junit4]   2> 2133245 INFO  (qtp1842573325-14173) [n:127.0.0.1:38519_solr c:deletereplica_test s:shard1 r:core_node3 x:deletereplica_test_shard1_replica_n1] o.a.s.r.ManagedResourceStorage Configured ZooKeeperStorageIO with znodeBase: /configs/conf
   [junit4]   2> 2133245 INFO  (qtp1842573325-14173) [n:127.0.0.1:38519_solr c:deletereplica_test s:shard1 r:core_node3 x:deletereplica_test_shard1_replica_n1] o.a.s.r.ManagedResourceStorage Loaded null at path _rest_managed.json using ZooKeeperStorageIO:path=/configs/conf
   [junit4]   2> 2133245 INFO  (qtp1842573325-14173) [n:127.0.0.1:38519_solr c:deletereplica_test s:shard1 r:core_node3 x:deletereplica_test_shard1_replica_n1] o.a.s.h.ReplicationHandler Commits will be reserved for 10000ms.
   [junit4]   2> 2133246 INFO  (qtp1842573325-14173) [n:127.0.0.1:38519_solr c:deletereplica_test s:shard1 r:core_node3 x:deletereplica_test_shard1_replica_n1] o.a.s.u.UpdateLog Could not find max version in index or recent updates, using new clock 1630274566241648640
   [junit4]   2> 2133248 INFO  (searcherExecutor-4212-thread-1-processing-n:127.0.0.1:38519_solr x:deletereplica_test_shard1_replica_n1 c:deletereplica_test s:shard1 r:core_node3) [n:127.0.0.1:38519_solr c:deletereplica_test s:shard1 r:core_node3 x:deletereplica_test_shard1_replica_n1] o.a.s.c.SolrCore [deletereplica_test_shard1_replica_n1] Registered new searcher Searcher@40a7d618[deletereplica_test_shard1_replica_n1] main{ExitableDirectoryReader(UninvertingDirectoryReader())}
   [junit4]   2> 2133253 INFO  (qtp729327217-14184) [n:127.0.0.1:36903_solr c:deletereplica_test s:shard1 r:core_node4 x:deletereplica_test_shard1_replica_n2] o.a.s.s.SolrIndexSearcher Opening [Searcher@3a64caab[deletereplica_test_shard1_replica_n2] main]
   [junit4]   2> 2133254 INFO  (qtp729327217-14184) [n:127.0.0.1:36903_solr c:deletereplica_test s:shard1 r:core_node4 x:deletereplica_test_shard1_replica_n2] o.a.s.r.ManagedResourceStorage Configured ZooKeeperStorageIO with znodeBase: /configs/conf
   [junit4]   2> 2133254 INFO  (qtp729327217-14184) [n:127.0.0.1:36903_solr c:deletereplica_test s:shard1 r:core_node4 x:deletereplica_test_shard1_replica_n2] o.a.s.r.ManagedResourceStorage Loaded null at path _rest_managed.json using ZooKeeperStorageIO:path=/configs/conf
   [junit4]   2> 2133255 INFO  (qtp729327217-14184) [n:127.0.0.1:36903_solr c:deletereplica_test s:shard1 r:core_node4 x:deletereplica_test_shard1_replica_n2] o.a.s.h.ReplicationHandler Commits will be reserved for 10000ms.
   [junit4]   2> 2133255 INFO  (qtp729327217-14184) [n:127.0.0.1:36903_solr c:deletereplica_test s:shard1 r:core_node4 x:deletereplica_test_shard1_replica_n2] o.a.s.u.UpdateLog Could not find max version in index or recent updates, using new clock 1630274566251085824
   [junit4]   2> 2133268 INFO  (qtp1842573325-14173) [n:127.0.0.1:38519_solr c:deletereplica_test s:shard1 r:core_node3 x:deletereplica_test_shard1_replica_n1] o.a.s.c.ZkShardTerms Successful update of terms at /collections/deletereplica_test/terms/shard1 to Terms{values={core_node3=0}, version=0}
   [junit4]   2> 2133268 INFO  (qtp1842573325-14173) [n:127.0.0.1:38519_solr c:deletereplica_test s:shard1 r:core_node3 x:deletereplica_test_shard1_replica_n1] o.a.s.c.ShardLeaderElectionContextBase make sure parent is created /collections/deletereplica_test/leaders/shard1
   [junit4]   2> 2133282 INFO  (searcherExecutor-4213-thread-1-processing-n:127.0.0.1:36903_solr x:deletereplica_test_shard1_replica_n2 c:deletereplica_test s:shard1 r:core_node4) [n:127.0.0.1:36903_solr c:deletereplica_test s:shard1 r:core_node4 x:deletereplica_test_shard1_replica_n2] o.a.s.c.SolrCore [deletereplica_test_shard1_replica_n2] Registered new searcher Searcher@3a64caab[deletereplica_test_shard1_replica_n2] main{ExitableDirectoryReader(UninvertingDirectoryReader())}
   [junit4]   2> 2133300 INFO  (qtp1842573325-14173) [n:127.0.0.1:38519_solr c:deletereplica_test s:shard1 r:core_node3 x:deletereplica_test_shard1_replica_n1] o.a.s.c.ShardLeaderElectionContext Waiting until we see more replicas up for shard shard1: total=2 found=1 timeoutin=9999ms
   [junit4]   2> 2133301 INFO  (qtp729327217-14184) [n:127.0.0.1:36903_solr c:deletereplica_test s:shard1 r:core_node4 x:deletereplica_test_shard1_replica_n2] o.a.s.c.ZkShardTerms Successful update of terms at /collections/deletereplica_test/terms/shard1 to Terms{values={core_node3=0, core_node4=0}, version=1}
   [junit4]   2> 2133301 INFO  (qtp729327217-14184) [n:127.0.0.1:36903_solr c:deletereplica_test s:shard1 r:core_node4 x:deletereplica_test_shard1_replica_n2] o.a.s.c.ShardLeaderElectionContextBase make sure parent is created /collections/deletereplica_test/leaders/shard1
   [junit4]   2> 2133809 INFO  (qtp1842573325-14173) [n:127.0.0.1:38519_solr c:deletereplica_test s:shard1 r:core_node3 x:deletereplica_test_shard1_replica_n1] o.a.s.c.ShardLeaderElectionContext Enough replicas found to continue.
   [junit4]   2> 2133809 INFO  (qtp1842573325-14173) [n:127.0.0.1:38519_solr c:deletereplica_test s:shard1 r:core_node3 x:deletereplica_test_shard1_replica_n1] o.a.s.c.ShardLeaderElectionContext I may be the new leader - try and sync
   [junit4]   2> 2133809 INFO  (qtp1842573325-14173) [n:127.0.0.1:38519_solr c:deletereplica_test s:shard1 r:core_node3 x:deletereplica_test_shard1_replica_n1] o.a.s.c.SyncStrategy Sync replicas to http://127.0.0.1:38519/solr/deletereplica_test_shard1_replica_n1/
   [junit4]   2> 2133810 INFO  (qtp1842573325-14173) [n:127.0.0.1:38519_solr c:deletereplica_test s:shard1 r:core_node3 x:deletereplica_test_shard1_replica_n1] o.a.s.u.PeerSync PeerSync: core=deletereplica_test_shard1_replica_n1 url=http://127.0.0.1:38519/solr START replicas=[http://127.0.0.1:36903/solr/deletereplica_test_shard1_replica_n2/] nUpdates=100
   [junit4]   2> 2133830 INFO  (qtp1842573325-14173) [n:127.0.0.1:38519_solr c:deletereplica_test s:shard1 r:core_node3 x:deletereplica_test_shard1_replica_n1] o.a.s.u.PeerSync PeerSync: core=deletereplica_test_shard1_replica_n1 url=http://127.0.0.1:38519/solr DONE.  We have no versions.  sync failed.
   [junit4]   2> 2133872 INFO  (qtp729327217-14186) [n:127.0.0.1:36903_solr c:deletereplica_test s:shard1 r:core_node4 x:deletereplica_test_shard1_replica_n2] o.a.s.c.S.Request [deletereplica_test_shard1_replica_n2]  webapp=/solr path=/get params={distrib=false&qt=/get&fingerprint=false&getVersions=100&wt=javabin&version=2} status=0 QTime=22
   [junit4]   2> 2133873 INFO  (qtp1842573325-14173) [n:127.0.0.1:38519_solr c:deletereplica_test s:shard1 r:core_node3 x:deletereplica_test_shard1_replica_n1] o.a.s.c.SyncStrategy Leader's attempt to sync with shard failed, moving to the next candidate
   [junit4]   2> 2133873 INFO  (qtp1842573325-14173) [n:127.0.0.1:38519_solr c:deletereplica_test s:shard1 r:core_node3 x:deletereplica_test_shard1_replica_n1] o.a.s.c.ShardLeaderElectionContext We failed sync, but we have no versions - we can't sync in that case - we were active before, so become leader anyway
   [junit4]   2> 2133873 INFO  (qtp1842573325-14173) [n:127.0.0.1:38519_solr c:deletereplica_test s:shard1 r:core_node3 x:deletereplica_test_shard1_replica_n1] o.a.s.c.ShardLeaderElectionContextBase Creating leader registration node /collections/deletereplica_test/leaders/shard1/leader after winning as /collections/deletereplica_test/leader_elect/shard1/election/74488217847136267-core_node3-n_0000000000
   [junit4]   2> 2133874 INFO  (qtp1842573325-14173) [n:127.0.0.1:38519_solr c:deletereplica_test s:shard1 r:core_node3 x:deletereplica_test_shard1_replica_n1] o.a.s.c.ShardLeaderElectionContext I am the new leader: http://127.0.0.1:38519/solr/deletereplica_test_shard1_replica_n1/ shard1
   [junit4]   2> 2133976 INFO  (zkCallback-4982-thread-1) [    ] o.a.s.c.c.ZkStateReader A cluster state change: [WatchedEvent state:SyncConnected type:NodeDataChanged path:/collections/deletereplica_test/state.json] for collection [deletereplica_test] has occurred - updating... (live nodes size: [4])
   [junit4]   2> 2133977 INFO  (qtp1842573325-14173) [n:127.0.0.1:38519_solr c:deletereplica_test s:shard1 r:core_node3 x:deletereplica_test_shard1_replica_n1] o.a.s.c.ZkController I am the leader, no recovery necessary
   [junit4]   2> 2133991 INFO  (qtp1842573325-14173) [n:127.0.0.1:38519_solr c:deletereplica_test s:shard1 r:core_node3 x:deletereplica_test_shard1_replica_n1] o.a.s.s.HttpSolrCall [admin] webapp=null path=/admin/cores params={qt=/admin/cores&coreNodeName=core_node3&collection.configName=conf&newCollection=true&name=deletereplica_test_shard1_replica_n1&action=CREATE&numShards=1&collection=deletereplica_test&shard=shard1&wt=javabin&version=2&replicaType=NRT} status=0 QTime=2728
   [junit4]   2> 2134104 INFO  (zkCallback-4982-thread-1) [    ] o.a.s.c.c.ZkStateReader A cluster state change: [WatchedEvent state:SyncConnected type:NodeDataChanged path:/collections/deletereplica_test/state.json] for collection [deletereplica_test] has occurred - updating... (live nodes size: [4])
   [junit4]   2> 2134104 INFO  (zkCallback-4982-thread-2) [    ] o.a.s.c.c.ZkStateReader A cluster state change: [WatchedEvent state:SyncConnected type:NodeDataChanged path:/collections/deletereplica_test/state.json] for collection [deletereplica_test] has occurred - updating... (live nodes size: [4])
   [junit4]   2> 2134325 INFO  (qtp729327217-14184) [n:127.0.0.1:36903_solr c:deletereplica_test s:shard1 r:core_node4 x:deletereplica_test_shard1_replica_n2] o.a.s.s.HttpSolrCall [admin] webapp=null path=/admin/cores params={qt=/admin/cores&coreNodeName=core_node4&collection.configName=conf&newCollection=true&name=deletereplica_test_shard1_replica_n2&action=CREATE&numShards=1&collection=deletereplica_test&shard=shard1&wt=javabin&version=2&replicaType=NRT} status=0 QTime=3077
   [junit4]   2> 2134376 INFO  (qtp37589231-14152) [n:127.0.0.1:35109_solr    ] o.a.s.h.a.CollectionsHandler Wait for new collection to be active for at most 45 seconds. Check all shard replicas
   [junit4]   2> 2134425 INFO  (zkCallback-4966-thread-1) [    ] o.a.s.c.c.ZkStateReader A cluster state change: [WatchedEvent state:SyncConnected type:NodeDataChanged path:/collections/deletereplica_test/state.json] for collection [deletereplica_test] has occurred - updating... (live nodes size: [4])
   [junit4]   2> 2134425 INFO  (zkCallback-5002-thread-1) [    ] o.a.s.c.c.ZkStateReader A cluster state change: [WatchedEvent state:SyncConnected type:NodeDataChanged path:/collections/deletereplica_test/state.json] for collection [deletereplica_test] has occurred - updating... (live nodes size: [4])
   [junit4]   2> 2134426 INFO  (zkCallback-4982-thread-1) [    ] o.a.s.c.c.ZkStateReader A cluster state change: [WatchedEvent state:SyncConnected type:NodeDataChanged path:/collections/deletereplica_test/state.json] for collection [deletereplica_test] has occurred - updating... (live nodes size: [4])
   [junit4]   2> 2134427 INFO  (qtp37589231-14152) [n:127.0.0.1:35109_solr    ] o.a.s.s.HttpSolrCall [admin] webapp=null path=/admin/collections params={collection.configName=conf&name=deletereplica_test&nrtReplicas=2&action=CREATE&numShards=1&wt=javabin&version=2} status=0 QTime=3645
   [junit4]   2> 2134427 INFO  (zkCallback-4982-thread-3) [    ] o.a.s.c.c.ZkStateReader A cluster state change: [WatchedEvent state:SyncConnected type:NodeDataChanged path:/collections/deletereplica_test/state.json] for collection [deletereplica_test] has occurred - updating... (live nodes size: [4])
   [junit4]   2> 2134428 INFO  (zkCallback-4966-thread-2) [    ] o.a.s.c.c.ZkStateReader A cluster state change: [WatchedEvent state:SyncConnected type:NodeDataChanged path:/collections/deletereplica_test/state.json] for collection [deletereplica_test] has occurred - updating... (live nodes size: [4])
   [junit4]   2> 2134432 INFO  (qtp1842573325-14175) [n:127.0.0.1:38519_solr    ] o.a.s.s.HttpSolrCall [admin] webapp=null path=/admin/cores params={action=STATUS&indexInfo=true&wt=javabin&version=2} status=0 QTime=0
   [junit4]   2> 2134434 INFO  (qtp37589231-14153) [n:127.0.0.1:35109_solr    ] o.a.s.h.a.CollectionsHandler Invoked Collection Action :deletereplica with params replica=core_node3&action=DELETEREPLICA&collection=deletereplica_test&shard=shard1&wt=javabin&version=2 and sendToOCPQueue=true
   [junit4]   2> 2134448 INFO  (OverseerCollectionConfigSetProcessor-74488217847136267-127.0.0.1:38519_solr-n_0000000000) [n:127.0.0.1:38519_solr    ] o.a.s.c.OverseerTaskQueue Response ZK path: /overseer/collection-queue-work/qnr-0000000000 doesn't exist.  Requestor may have disconnected from ZooKeeper
   [junit4]   2> 2134450 INFO  (qtp1842573325-14176) [n:127.0.0.1:38519_solr    x:deletereplica_test_shard1_replica_n1] o.a.s.m.SolrMetricManager Closing metric reporters for registry=solr.core.deletereplica_test.shard1.replica_n1, tag=null
   [junit4]   2> 2134450 INFO  (qtp1842573325-14176) [n:127.0.0.1:38519_solr    x:deletereplica_test_shard1_replica_n1] o.a.s.m.r.SolrJmxReporter Closing reporter [org.apache.solr.metrics.reporters.SolrJmxReporter@4a455c3d: rootName = solr_38519, domain = solr.core.deletereplica_test.shard1.replica_n1, service url = null, agent id = null] for registry solr.core.deletereplica_test.shard1.replica_n1 / com.codahale.metrics.MetricRegistry@33cf02c5
   [junit4]   2> 2134559 INFO  (qtp1842573325-14176) [n:127.0.0.1:38519_solr    x:deletereplica_test_shard1_replica_n1] o.a.s.c.SolrCore [deletereplica_test_shard1_replica_n1]  CLOSING SolrCore org.apache.solr.core.SolrCore@4dc179a7
   [junit4]   2> 2134559 INFO  (qtp1842573325-14176) [n:127.0.0.1:38519_solr    x:deletereplica_test_shard1_replica_n1] o.a.s.m.SolrMetricManager Closing metric reporters for registry=solr.core.deletereplica_test.shard1.replica_n1, tag=4dc179a7
   [junit4]   2> 2134559 INFO  (qtp1842573325-14176) [n:127.0.0.1:38519_solr    x:deletereplica_test_shard1_replica_n1] o.a.s.m.SolrMetricManager Closing metric reporters for registry=solr.collection.deletereplica_test.shard1.leader, tag=4dc179a7
   [junit4]   2> 2134772 INFO  (qtp1842573325-14176) [n:127.0.0.1:38519_solr    x:deletereplica_test_shard1_replica_n1] o.a.s.c.ZkShardTerms Successful update of terms at /collections/deletereplica_test/terms/shard1 to Terms{values={core_node4=0}, version=2}
   [junit4]   2> 2134845 INFO  (qtp1842573325-14176) [n:127.0.0.1:38519_solr    x:deletereplica_test_shard1_replica_n1] o.a.s.s.HttpSolrCall [admin] webapp=null path=/admin/cores params={deleteInstanceDir=true&core=deletereplica_test_shard1_replica_n1&deleteMetricsHistory=true&qt=/admin/cores&deleteDataDir=true&action=UNLOAD&wt=javabin&version=2&deleteIndex=true} status=0 QTime=395
   [junit4]   2> 2134846 INFO  (zkCallback-4966-thread-1) [n:127.0.0.1:36903_solr c:deletereplica_test s:shard1 r:core_node4 x:deletereplica_test_shard1_replica_n2] o.a.s.c.ShardLeaderElectionContext I may be the new leader - try and sync
   [junit4]   2> 2134967 INFO  (zkCallback-4966-thread-2) [    ] o.a.s.c.c.ZkStateReader A cluster state change: [WatchedEvent state:SyncConnected type:NodeDataChanged path:/collections/deletereplica_test/state.json] for collection [deletereplica_test] has occurred - updating... (live nodes size: [4])
   [junit4]   2> 2134979 INFO  (zkCallback-4982-thread-3) [    ] o.a.s.c.c.ZkStateReader A cluster state change: [WatchedEvent state:SyncConnected type:NodeDataChanged path:/collections/deletereplica_test/state.json] for collection [deletereplica_test] has occurred - updating... (live nodes size: [4])
   [junit4]   2> 2134987 INFO  (zkCallback-4982-thread-1) [    ] o.a.s.c.c.ZkStateReader A cluster state change: [WatchedEvent state:SyncConnected type:NodeDataChanged path:/collections/deletereplica_test/state.json] for collection [deletereplica_test] has occurred - updating... (live nodes size: [4])
   [junit4]   2> 2134995 INFO  (zkCallback-4966-thread-3) [    ] o.a.s.c.c.ZkStateReader A cluster state change: [WatchedEvent state:SyncConnected type:NodeDataChanged path:/collections/deletereplica_test/state.json] for collection [deletereplica_test] has occurred - updating... (live nodes size: [4])
   [junit4]   2> 2135032 INFO  (qtp37589231-14153) [n:127.0.0.1:35109_solr c:deletereplica_test   ] o.a.s.s.HttpSolrCall [admin] webapp=null path=/admin/collections params={replica=core_node3&action=DELETEREPLICA&collection=deletereplica_test&shard=shard1&wt=javabin&version=2} status=0 QTime=598
   [junit4]   2> 2136470 INFO  (OverseerCollectionConfigSetProcessor-74488217847136267-127.0.0.1:38519_solr-n_0000000000) [n:127.0.0.1:38519_solr    ] o.a.s.c.OverseerTaskQueue Response ZK path: /overseer/collection-queue-work/qnr-0000000002 doesn't exist.  Requestor may have disconnected from ZooKeeper
   [junit4]   2> 2137349 INFO  (zkCallback-4966-thread-1) [n:127.0.0.1:36903_solr c:deletereplica_test s:shard1 r:core_node4 x:deletereplica_test_shard1_replica_n2] o.a.s.c.SyncStrategy Sync replicas to http://127.0.0.1:36903/solr/deletereplica_test_shard1_replica_n2/
   [junit4]   2> 2137349 INFO  (zkCallback-4966-thread-1) [n:127.0.0.1:36903_solr c:deletereplica_test s:shard1 r:core_node4 x:deletereplica_test_shard1_replica_n2] o.a.s.c.SyncStrategy Sync Success - now sync replicas to me
   [junit4]   2> 2137349 INFO  (zkCallback-4966-thread-1) [n:127.0.0.1:36903_solr c:deletereplica_test s:shard1 r:core_node4 x:deletereplica_test_shard1_replica_n2] o.a.s.c.SyncStrategy http://127.0.0.1:36903/solr/deletereplica_test_shard1_replica_n2/ has no replicas
   [junit4]   2> 2137349 INFO  (zkCallback-4966-thread-1) [n:127.0.0.1:36903_solr c:deletereplica_test s:shard1 r:core_node4 x:deletereplica_test_shard1_replica_n2] o.a.s.c.ShardLeaderElectionContextBase Creating leader registration node /collections/deletereplica_test/leaders/shard1/leader after winning as /collections/deletereplica_test/leader_elect/shard1/election/74488217847136264-core_node4-n_0000000001
   [junit4]   2> 2137431 INFO  (zkCallback-4966-thread-3) [    ] o.a.s.c.c.ZkStateReader A cluster state change: [WatchedEvent state:SyncConnected type:NodeDataChanged path:/collections/deletereplica_test/state.json] for collection [deletereplica_test] has occurred - updating... (live nodes size: [4])
   [junit4]   2> 2137431 INFO  (zkCallback-4966-thread-2) [    ] o.a.s.c.c.ZkStateReader A cluster state change: [WatchedEvent state:SyncConnected type:NodeDataChanged path:/collections/deletereplica_test/state.json] for collection [deletereplica_test] has occurred - updating... (live nodes size: [4])
   [junit4]   2> 2137466 INFO  (zkCallback-5027-thread-1) [    ] o.a.s.c.c.ZkStateReader A cluster state change: [WatchedEvent state:SyncConnected type:NodeDataChanged path:/collections/deletereplica_test/state.json] for collection [deletereplica_test] has occurred - updating... (live nodes size: [4])
   [junit4]   2> 2137466 INFO  (zkCallback-4966-thread-1) [n:127.0.0.1:36903_solr c:deletereplica_test s:shard1 r:core_node4 x:deletereplica_test_shard1_replica_n2] o.a.s.c.ShardLeaderElectionContext I am the new leader: http://127.0.0.1:36903/solr/deletereplica_test_shard1_replica_n2/ shard1
   [junit4]   2> 2137515 INFO  (jetty-closer-5031-thread-1) [    ] o.a.s.c.CoreContainer Shutting down CoreContainer instance=1836409525
   [junit4]   2> 2137515 INFO  (jetty-closer-5031-thread-1) [    ] o.a.s.c.ZkController Remove node as live in ZooKeeper:/live_nodes/127.0.0.1:38519_solr
   [junit4]   2> 2137531 INFO  (jetty-closer-5031-thread-1) [    ] o.a.s.c.CoreContainer Publish this node as DOWN...
   [junit4]   2> 2137531 INFO  (jetty-closer-5031-thread-1) [    ] o.a.s.c.ZkController Publish node=127.0.0.1:38519_solr as DOWN
   [junit4]   2> 2137552 INFO  (jetty-closer-5031-thread-2) [    ] o.a.s.c.CoreContainer Shutting down CoreContainer instance=1778019741
   [junit4]   2> 2137552 INFO  (jetty-closer-5031-thread-2) [    ] o.a.s.c.ZkController Remove node as live in ZooKeeper:/live_nodes/127.0.0.1:37942_solr
   [junit4]   2> 2137555 INFO  (jetty-closer-5031-thread-3) [    ] o.a.s.c.CoreContainer Shutting down CoreContainer instance=336656578
   [junit4]   2> 2137556 INFO  (jetty-closer-5031-thread-3) [    ] o.a.s.c.ZkController Remove node as live in ZooKeeper:/live_nodes/127.0.0.1:35109_solr
   [junit4]   2> 2137974 INFO  (jetty-closer-5031-thread-4) [    ] o.a.s.c.CoreContainer Shutting down CoreContainer instance=216778952
   [junit4]   2> 2137974 INFO  (jetty-closer-5031-thread-4) [    ] o.a.s.c.ZkController Remove node as live in ZooKeeper:/live_nodes/127.0.0.1:36903_solr
   [junit4]   2> 2137974 INFO  (jetty-closer-5031-thread-3) [    ] o.a.s.c.CoreContainer Publish this node as DOWN...
   [junit4]   2> 2137974 INFO  (jetty-closer-5031-thread-3) [    ] o.a.s.c.ZkController Publish node=127.0.0.1:35109_solr as DOWN
   [junit4]   2> 2137978 INFO  (jetty-closer-5031-thread-4) [    ] o.a.s.c.CoreContainer Publish this node as DOWN...
   [junit4]   2> 2137978 INFO  (jetty-closer-5031-thread-4) [    ] o.a.s.c.ZkController Publish node=127.0.0.1:36903_solr as DOWN
   [junit4]   2> 2138009 INFO  (jetty-closer-5031-thread-1) [    ] o.a.s.m.SolrMetricManager Closing metric reporters for registry=solr.node, tag=null
   [junit4]   2> 2138009 INFO  (jetty-closer-5031-thread-1) [    ] o.a.s.m.r.SolrJmxReporter Closing reporter [org.apache.solr.metrics.reporters.SolrJmxReporter@4b526771: rootName = solr_38519, domain = solr.node, service url = null, agent id = null] for registry solr.node / com.codahale.metrics.MetricRegistry@7204527e
   [junit4]   2> 2138013 INFO  (jetty-closer-5031-thread-1) [    ] o.a.s.m.SolrMetricManager Closing metric reporters for registry=solr.jvm, tag=null
   [junit4]   2> 2138013 INFO  (jetty-closer-5031-thread-1) [    ] o.a.s.m.r.SolrJmxReporter Closing reporter [org.apache.solr.metrics.reporters.SolrJmxReporter@724c3df0: rootName = solr_38519, domain = solr.jvm, service url = null, agent id = null] for registry solr.jvm / com.codahale.metrics.MetricRegistry@3f71799a
   [junit4]   2> 2138124 INFO  (jetty-closer-5031-thread-1) [    ] o.a.s.m.SolrMetricManager Closing metric reporters for registry=solr.jetty, tag=null
   [junit4]   2> 2138124 INFO  (jetty-closer-5031-thread-1) [    ] o.a.s.m.r.SolrJmxReporter Closing reporter [org.apache.solr.metrics.reporters.SolrJmxReporter@1cbc6c02: rootName = solr_38519, domain = solr.jetty, service url = null, agent id = null] for registry solr.jetty / com.codahale.metrics.MetricRegistry@1a8954e3
   [junit4]   2> 2138124 INFO  (jetty-closer-5031-thread-1) [    ] o.a.s.m.SolrMetricManager Closing metric reporters for registry=solr.cluster, tag=null
   [junit4]   2> 2138171 INFO  (jetty-closer-5031-thread-2) [    ] o.a.s.c.CoreContainer Publish this node as DOWN...
   [junit4]   2> 2138171 INFO  (jetty-closer-5031-thread-2) [    ] o.a.s.c.ZkController Publish node=127.0.0.1:37942_solr as DOWN
   [junit4]   2> 2138175 INFO  (closeThreadPool-5040-thread-1) [    ] o.a.s.c.Overseer Overseer (id=74488217847136267-127.0.0.1:38519_solr-n_0000000000) closing
   [junit4]   2> 2138179 INFO  (OverseerStateUpdate-74488217847136267-127.0.0.1:38519_solr-n_0000000000) [n:127.0.0.1:38519_solr    ] o.a.s.c.Overseer Overseer Loop exiting : 127.0.0.1:38519_solr
   [junit4]   2> 2138264 INFO  (OverseerAutoScalingTriggerThread-74488217847136267-127.0.0.1:38519_solr-n_0000000000) [    ] o.a.s.c.a.OverseerTriggerThread OverseerTriggerThread woken up but we are closed, exiting.
   [junit4]   2> 2138289 INFO  (zkCallback-4984-thread-1) [    ] o.a.s.c.c.ZkStateReader Updated live nodes from ZooKeeper... (4) -> (3)
   [junit4]   2> 2138289 INFO  (zkCallback-5007-thread-1) [    ] o.a.s.c.c.ZkStateReader Updated live nodes from ZooKeeper... (4) -> (3)
   [junit4]   2> 2138293 INFO  (zkCallback-5002-thread-1) [    ] o.a.s.c.c.ZkStateReader Updated live nodes from ZooKeeper... (4) -> (3)
   [junit4]   2> 2138302 INFO  (coreCloseExecutor-4224-thread-1) [n:127.0.0.1:36903_solr c:deletereplica_test s:shard1 r:core_node4 x:deletereplica_test_shard1_replica_n2] o.a.s.c.SolrCore [deletereplica_test_shard1_replica_n2]  CLOSING SolrCore org.apache.solr.core.SolrCore@75c53006
   [junit4]   2> 2138302 INFO  (coreCloseExecutor-4224-thread-1) [n:127.0.0.1:36903_solr c:deletereplica_test s:shard1 r:core_node4 x:deletereplica_test_shard1_replica_n2] o.a.s.m.SolrMetricManager Closing metric reporters for registry=solr.core.deletereplica_test.shard1.replica_n2, tag=75c53006
   [junit4]   2> 2138302 INFO  (coreCloseExecutor-4224-thread-1) [n:127.0.0.1:36903_solr c:deletereplica_test s:shard1 r:core_node4 x:deletereplica_test_shard1_replica_n2] o.a.s.m.r.SolrJmxReporter Closing reporter [org.apache.solr.metrics.reporters.SolrJmxReporter@78324ba5: rootName = solr_36903, domain = solr.core.deletereplica_test.shard1.replica_n2, service url = null, agent id = null] for registry solr.core.deletereplica_test.shard1.replica_n2 / com.codahale.metrics.MetricRegistry@658479d9
   [junit4]   2> 2138305 INFO  (zkCallback-4966-thread-2) [    ] o.a.s.c.c.ZkStateReader Updated live nodes from ZooKeeper... (4) -> (3)
   [junit4]   2> 2138309 INFO  (jetty-closer-5031-thread-3) [    ] o.a.s.m.SolrMetricManager Closing metric reporters for registry=solr.node, tag=null
   [junit4]   2> 2138309 INFO  (jetty-closer-5031-thread-3) [    ] o.a.s.m.r.SolrJmxReporter Closing reporter [org.apache.solr.metrics.reporters.SolrJmxReporter@90ccb19: rootName = solr_35109, domain = solr.node, service url = null, agent id = null] for registry solr.node / com.codahale.metrics.MetricRegistry@6510286e
   [junit4]   2> 2138312 INFO  (jetty-closer-5031-thread-3) [    ] o.a.s.m.SolrMetricManager Closing metric reporters for registry=solr.jvm, tag=null
   [junit4]   2> 2138312 INFO  (jetty-closer-5031-thread-3) [    ] o.a.s.m.r.SolrJmxReporter Closing reporter [org.apache.solr.metrics.reporters.SolrJmxReporter@767fa0dd: rootName = solr_35109, domain = solr.jvm, service url = null, agent id = null] for registry solr.jvm / com.codahale.metrics.MetricRegistry@3f71799a
   [junit4]   2> 2138338 INFO  (zkCallback-5015-thread-1) [    ] o.a.s.c.c.ZkStateReader Updated live nodes from ZooKeeper... (4) -> (3)
   [junit4]   2> 2138339 INFO  (jetty-closer-5031-thread-3) [    ] o.a.s.m.SolrMetricManager Closing metric reporters for registry=solr.jetty, tag=null
   [junit4]   2> 2138339 INFO  (jetty-closer-5031-thread-3) [    ] o.a.s.m.r.SolrJmxReporter Closing reporter [org.apache.solr.metrics.reporters.SolrJmxReporter@37482816: rootName = solr_35109, domain = solr.jetty, service url = null, agent id = null] for registry solr.jetty / com.codahale.metrics.MetricRegistry@1a8954e3
   [junit4]   2> 2138339 INFO  (jetty-closer-5031-thread-3) [    ] o.a.s.m.SolrMetricManager Closing metric reporters for registry=solr.cluster, tag=null
   [junit4]   2> 2138345 INFO  (zkCallback-5021-thread-1) [    ] o.a.s.c.c.ZkStateReader Updated live nodes from ZooKeeper... (4) -> (3)
   [junit4]   2> 2138362 INFO  (jetty-closer-5031-thread-2) [    ] o.a.s.m.SolrMetricManager Closing metric reporters for registry=solr.node, tag=null
   [junit4]   2> 2138362 INFO  (jetty-closer-5031-thread-2) [    ] o.a.s.m.r.SolrJmxReporter Closing reporter [org.apache.solr.metrics.reporters.SolrJmxReporter@59462724: rootName = solr_37942, domain = solr.node, service url = null, agent id = null] for registry solr.node / com.codahale.metrics.MetricRegistry@4c12ba04
   [junit4]   2> 2138378 INFO  (jetty-closer-5031-thread-2) [    ] o.a.s.m.SolrMetricManager Closing metric reporters for registry=solr.jvm, tag=null
   [junit4]   2> 2138378 INFO  (jetty-closer-5031-thread-2) [    ] o.a.s.m.r.SolrJmxReporter Closing reporter [org.apache.solr.metrics.reporters.SolrJmxReporter@5bd77dc9: rootName = solr_37942, domain = solr.jvm, service url = null, agent id = null] for registry solr.jvm / com.codahale.metrics.MetricRegistry@3f71799a
   [junit4]   2> 2138380 INFO  (jetty-closer-5031-thread-2) [    ] o.a.s.m.SolrMetricManager Closing metric reporters for registry=solr.jetty, tag=null
   [junit4]   2> 2138380 INFO  (jetty-closer-5031-thread-2) [    ] o.a.s.m.r.SolrJmxReporter Closing reporter [org.apache.solr.metrics.reporters.SolrJmxReporter@330c57d1: rootName = solr_37942, domain = solr.jetty, service url = null, agent id = null] for registry solr.jetty / com.codahale.metrics.MetricRegistry@1a8954e3
   [junit4]   2> 2138380 INFO  (jetty-closer-5031-thread-2) [    ] o.a.s.m.SolrMetricManager Closing metric reporters for registry=solr.cluster, tag=null
   [junit4]   2> 2138378 INFO  (zkCallback-4984-thread-2) [    ] o.a.s.c.OverseerElectionContext I am going to be the leader 127.0.0.1:37942_solr
   [junit4]   2> 2138466 INFO  (coreCloseExecutor-4224-thread-1) [n:127.0.0.1:36903_solr c:deletereplica_test s:shard1 r:core_node4 x:deletereplica_test_shard1_replica_n2] o.a.s.m.SolrMetricManager Closing metric reporters for registry=solr.collection.deletereplica_test.shard1.leader, tag=75c53006
   [junit4]   2> 2138690 INFO  (jetty-closer-5031-thread-1) [    ] o.a.s.c.Overseer Overseer (id=74488217847136267-127.0.0.1:38519_solr-n_0000000000) closing
   [junit4]   2> 2138698 INFO  (closeThreadPool-5040-thread-2) [    ] o.a.s.c.Overseer Overseer (id=74488217847136267-127.0.0.1:38519_solr-n_0000000000) closing
   [junit4]   2> 2138727 INFO  (zkCallback-5021-thread-1) [    ] o.a.s.c.c.ZkStateReader Updated live nodes from ZooKeeper... (3) -> (2)
   [junit4]   2> 2138727 INFO  (zkCallback-5007-thread-1) [    ] o.a.s.c.c.ZkStateReader Updated live nodes from ZooKeeper... (3) -> (2)
   [junit4]   2> 2138727 INFO  (zkCallback-5015-thread-1) [    ] o.a.s.c.c.ZkStateReader Updated live nodes from ZooKeeper... (3) -> (2)
   [junit4]   2> 2138739 INFO  (zkCallback-4966-thread-2) [    ] o.a.s.c.c.ZkStateReader Updated live nodes from ZooKeeper... (3) -> (2)
   [junit4]   2> 2138739 INFO  (zkCallback-4984-thread-2) [    ] o.a.s.c.c.ZkStateReader Updated live nodes from ZooKeeper... (3) -> (2)
   [junit4]   2> 2138764 INFO  (zkCallback-5021-thread-1) [    ] o.a.s.c.c.ZkStateReader Updated live nodes from ZooKeeper... (2) -> (1)
   [junit4]   2> 2138774 INFO  (zkCallback-4966-thread-3) [    ] o.a.s.c.OverseerElectionContext I am going to be the leader 127.0.0.1:36903_solr
   [junit4]   2> 2138774 INFO  (zkCallback-4966-thread-1) [    ] o.a.s.c.c.ZkStateReader Updated live nodes from ZooKeeper... (2) -> (1)
   [junit4]   2> 2138794 INFO  (jetty-closer-5031-thread-4) [    ] o.a.s.m.SolrMetricManager Closing metric reporters for registry=solr.node, tag=null
   [junit4]   2> 2138794 INFO  (jetty-closer-5031-thread-4) [    ] o.a.s.m.r.SolrJmxReporter Closing reporter [org.apache.solr.metrics.reporters.SolrJmxReporter@3f68cd86: rootName = solr_36903, domain = solr.node, service url = null, agent id = null] for registry solr.node / com.codahale.metrics.MetricRegistry@12c7b756
   [junit4]   2> 2138811 INFO  (jetty-closer-5031-thread-1) [    ] o.e.j.s.AbstractConnector Stopped ServerConnector@3e2b1af2{HTTP/1.1,[http/1.1, h2c]}{127.0.0.1:0}
   [junit4]   2> 2138828 INFO  (jetty-closer-5031-thread-1) [    ] o.e.j.s.h.ContextHandler Stopped o.e.j.s.ServletContextHandler@16e181ec{/solr,null,UNAVAILABLE}
   [junit4]   2> 2138828 INFO  (jetty-closer-5031-thread-1) [    ] o.e.j.s.session node0 Stopped scavenging
   [junit4]   2> 2138912 INFO  (jetty-closer-5031-thread-4) [    ] o.a.s.m.SolrMetricManager Closing metric reporters for registry=solr.jvm, tag=null
   [junit4]   2> 2138912 INFO  (jetty-closer-5031-thread-4) [    ] o.a.s.m.r.SolrJmxReporter Closing reporter [org.apache.solr.metrics.reporters.SolrJmxReporter@7934e515: rootName = solr_36903, domain = solr.jvm, service url = null, agent id = null] for registry solr.jvm / com.codahale.metrics.MetricRegistry@3f71799a
   [junit4]   2> 2138917 INFO  (jetty-closer-5031-thread-3) [    ] o.e.j.s.AbstractConnector Stopped ServerConnector@5ba392d8{HTTP/1.1,[http/1.1, h2c]}{127.0.0.1:0}
   [junit4]   2> 2138953 INFO  (jetty-closer-5031-thread-3) [    ] o.e.j.s.h.ContextHandler Stopped o.e.j.s.ServletContextHandler@13b271cc{/solr,null,UNAVAILABLE}
   [junit4]   2> 2138967 INFO  (jetty-closer-5031-thread-4) [    ] o.a.s.m.SolrMetricManager Closing metric reporters for registry=solr.jetty, tag=null
   [junit4]   2> 2138967 INFO  (jetty-closer-5031-thread-4) [    ] o.a.s.m.r.SolrJmxReporter Closing reporter [org.apache.solr.metrics.reporters.SolrJmxReporter@3e381c33: rootName = solr_36903, domain = solr.jetty, service url = null, agent id = null] for registry solr.jetty / com.codahale.metrics.MetricRegistry@1a8954e3
   [junit4]   2> 2138967 INFO  (jetty-closer-5031-thread-4) [    ] o.a.s.m.SolrMetricManager Closing metric reporters for registry=solr.cluster, tag=null
   [junit4]   2> 2138967 INFO  (jetty-closer-5031-thread-3) [    ] o.e.j.s.session node0 Stopped scavenging
   [junit4]   2> 2139051 INFO  (jetty-closer-5031-thread-2) [    ] o.e.j.s.AbstractConnector Stopped ServerConnector@2d8c671f{HTTP/1.1,[http/1.1, h2c]}{127.0.0.1:0}
   [junit4]   2> 2139051 INFO  (jetty-closer-5031-thread-2) [    ] o.e.j.s.h.ContextHandler Stopped o.e.j.s.ServletContextHandler@6418886{/solr,null,UNAVAILABLE}
   [junit4]   2> 2139051 INFO  (jetty-closer-5031-thread-2) [    ] o.e.j.s.session node0 Stopped scavenging
   [junit4]   2> 2139063 WARN  (NIOServerCxn.Factory:0.0.0.0/0.0.0.0:0) [    ] o.a.z.s.NIOServerCnxn Unable to read additional data from client sessionid 0x108a2a3b4bb0008, likely client has closed socket
   [junit4]   2> 2139095 INFO  (jetty-closer-5031-thread-4) [    ] o.e.j.s.AbstractConnector Stopped ServerConnector@188ceb5c{HTTP/1.1,[http/1.1, h2c]}{127.0.0.1:0}
   [junit4]   2> 2139095 INFO  (jetty-closer-5031-thread-4) [    ] o.e.j.s.h.ContextHandler Stopped o.e.j.s.ServletContextHandler@31757fb1{/solr,null,UNAVAILABLE}
   [junit4]   2> 2139096 INFO  (jetty-closer-5031-thread-4) [    ] o.e.j.s.session node0 Stopped scavenging
   [junit4]   2> 2139116 INFO  (TEST-DeleteReplicaTest.deleteReplicaAndVerifyDirectoryCleanup-seed#[3403DAAA3B249F6C]) [    ] o.a.s.c.ZkTestServer Shutting down ZkTestServer.
   [junit4]   2> 2139117 WARN  (ZkTestServer Run Thread) [    ] o.a.s.c.ZkTestServer Watch limit violations: 
   [junit4]   2> Maximum concurrent create/delete watches above limit:
   [junit4]   2> 
   [junit4]   2> 	9	/solr/aliases.json
   [junit4]   2> 	9	/solr/clusterprops.json
   [junit4]   2> 	7	/solr/collections/deletereplica_test/terms/shard1
   [junit4]   2> 	4	/solr/security.json
   [junit4]   2> 	2	/solr/configs/conf
   [junit4]   2> 
   [junit4]   2> Maximum concurrent data watches above limit:
   [junit4]   2> 
   [junit4]   2> 	10	/solr/collections/deletereplica_test/state.json
   [junit4]   2> 	9	/solr/clusterstate.json
   [junit4]   2> 	2	/solr/overseer_elect/election/74488217847136268-127.0.0.1:37942_solr-n_0000000001
   [junit4]   2> 
   [junit4]   2> Maximum concurrent children watches above limit:
   [junit4]   2> 
   [junit4]   2> 	9	/solr/live_nodes
   [junit4]   2> 	9	/solr/collections
   [junit4]   2> 
   [junit4]   2> 2139119 INFO  (TEST-DeleteReplicaTest.deleteReplicaAndVerifyDirectoryCleanup-seed#[3403DAAA3B249F6C]) [    ] o.a.s.c.ZkTestServer parse host and port list: 127.0.0.1:36755
   [junit4]   2> 2139119 INFO  (TEST-DeleteReplicaTest.deleteReplicaAndVerifyDirectoryCleanup-seed#[3403DAAA3B249F6C]) [    ] o.a.s.c.ZkTestServer connecting to 127.0.0.1 36755
   [junit4]   2> 2139119 INFO  (TEST-DeleteReplicaTest.deleteReplicaAndVerifyDirectoryCleanup-seed#[3403DAAA3B249F6C]) [    ] o.a.s.SolrTestCaseJ4 ###Ending deleteReplicaAndVerifyDirectoryCleanup
   [junit4]   2> 2139123 INFO  (TEST-DeleteReplicaTest.raceConditionOnDeleteAndRegisterReplica-seed#[3403DAAA3B249F6C]) [    ] o.a.s.SolrTestCaseJ4 ###Starting raceConditionOnDeleteAndRegisterReplica
   [junit4]   2> 2139123 INFO  (TEST-DeleteReplicaTest.raceConditionOnDeleteAndRegisterReplica-seed#[3403DAAA3B249F6C]) [    ] o.a.s.c.MiniSolrCloudCluster Starting cluster of 4 servers in /home/jenkins/jenkins-slave/workspace/Lucene-Solr-Tests-master/solr/build/solr-core/test/J0/temp/solr.cloud.DeleteReplicaTest_3403DAAA3B249F6C-001/tempDir-002
   [junit4]   2> 2139144 INFO  (TEST-DeleteReplicaTest.raceConditionOnDeleteAndRegisterReplica-seed#[3403DAAA3B249F6C]) [    ] o.a.s.c.ZkTestServer STARTING ZK TEST SERVER
   [junit4]   2> 2139146 INFO  (ZkTestServer Run Thread) [    ] o.a.s.c.ZkTestServer client port:0.0.0.0/0.0.0.0:0
   [junit4]   2> 2139146 INFO  (ZkTestServer Run Thread) [    ] o.a.s.c.ZkTestServer Starting server
   [junit4]   2> 2139246 INFO  (TEST-DeleteReplicaTest.raceConditionOnDeleteAndRegisterReplica-seed#[3403DAAA3B249F6C]) [    ] o.a.s.c.ZkTestServer start zk server on port:37052
   [junit4]   2> 2139246 INFO  (TEST-DeleteReplicaTest.raceConditionOnDeleteAndRegisterReplica-seed#[3403DAAA3B249F6C]) [    ] o.a.s.c.ZkTestServer parse host and port list: 127.0.0.1:37052
   [junit4]   2> 2139246 INFO  (TEST-DeleteReplicaTest.raceConditionOnDeleteAndRegisterReplica-seed#[3403DAAA3B249F6C]) [    ] o.a.s.c.ZkTestServer connecting to 127.0.0.1 37052
   [junit4]   2> 2139281 INFO  (zkConnectionManagerCallback-5045-thread-1) [    ] o.a.s.c.c.ConnectionManager zkClient has connected
   [junit4]   2> 2139299 INFO  (zkConnectionManagerCallback-5047-thread-1) [    ] o.a.s.c.c.ConnectionManager zkClient has connected
   [junit4]   2> 2139320 INFO  (zkConnectionManagerCallback-5049-thread-1) [    ] o.a.s.c.c.ConnectionManager zkClient has connected
   [junit4]   2> 2139338 WARN  (jetty-launcher-5050-thread-2) [    ] o.e.j.s.AbstractConnector Ignoring deprecated socket close linger time
   [junit4]   2> 2139338 INFO  (jetty-launcher-5050-thread-2) [    ] o.a.s.c.s.e.JettySolrRunner Start Jetty (original configured port=0)
   [junit4]   2> 2139338 INFO  (jetty-launcher-5050-thread-2) [    ] o.a.s.c.s.e.JettySolrRunner Trying to start Jetty on port 0 try number 1 ...
   [junit4]   2> 2139338 INFO  (jetty-launcher-5050-thread-2) [    ] o.e.j.s.Server jetty-9.4.14.v20181114; built: 2018-11-14T21:20:31.478Z; git: c4550056e785fb5665914545889f21dc136ad9e6; jvm 1.8.0_191-b12
   [junit4]   2> 2139339 WARN  (jetty-launcher-5050-thread-3) [    ] o.e.j.s.AbstractConnector Ignoring deprecated socket close linger time
   [junit4]   2> 2139339 INFO  (jetty-launcher-5050-thread-3) [    ] o.a.s.c.s.e.JettySolrRunner Start Jetty (original configured port=0)
   [junit4]   2> 2139339 INFO  (jetty-launcher-5050-thread-3) [    ] o.a.s.c.s.e.JettySolrRunner Trying to start Jetty on port 0 try number 1 ...
   [junit4]   2> 2139339 INFO  (jetty-launcher-5050-thread-3) [    ] o.e.j.s.Server jetty-9.4.14.v20181114; built: 2018-11-14T21:20:31.478Z; git: c4550056e785fb5665914545889f21dc136ad9e6; jvm 1.8.0_191-b12
   [junit4]   2> 2139347 WARN  (jetty-launcher-5050-thread-1) [    ] o.e.j.s.AbstractConnector Ignoring deprecated socket close linger time
   [junit4]   2> 2139347 INFO  (jetty-launcher-5050-thread-1) [    ] o.a.s.c.s.e.JettySolrRunner Start Jetty (original configured port=0)
   [junit4]   2> 2139347 INFO  (jetty-launcher-5050-thread-1) [    ] o.a.s.c.s.e.JettySolrRunner Trying to start Jetty on port 0 try number 1 ...
   [junit4]   2> 2139347 INFO  (jetty-launcher-5050-thread-1) [    ] o.e.j.s.Server jetty-9.4.14.v20181114; built: 2018-11-14T21:20:31.478Z; git: c4550056e785fb5665914545889f21dc136ad9e6; jvm 1.8.0_191-b12
   [junit4]   2> 2139347 INFO  (jetty-launcher-5050-thread-1) [    ] o.e.j.s.session DefaultSessionIdManager workerName=node0
   [junit4]   2> 2139347 INFO  (jetty-launcher-5050-thread-1) [    ] o.e.j.s.session No SessionScavenger set, using defaults
   [junit4]   2> 2139347 INFO  (jetty-launcher-5050-thread-1) [    ] o.e.j.s.session node0 Scavenging every 660000ms
   [junit4]   2> 2139348 INFO  (jetty-launcher-5050-thread-1) [    ] o.e.j.s.h.ContextHandler Started o.e.j.s.ServletContextHandler@7ca15436{/solr,null,AVAILABLE}
   [junit4]   2> 2139355 INFO  (jetty-launcher-5050-thread-1) [    ] o.e.j.s.AbstractConnector Started ServerConnector@239a9af8{HTTP/1.1,[http/1.1, h2c]}{127.0.0.1:35799}
   [junit4]   2> 2139355 INFO  (jetty-launcher-5050-thread-1) [    ] o.e.j.s.Server Started @2139440ms
   [junit4]   2> 2139355 INFO  (jetty-launcher-5050-thread-1) [    ] o.a.s.c.s.e.JettySolrRunner Jetty properties: {hostContext=/solr, hostPort=35799}
   [junit4]   2> 2139355 ERROR (jetty-launcher-5050-thread-1) [    ] o.a.s.u.StartupLoggingUtils Missing Java Option solr.log.dir. Logging may be missing or incomplete.
   [junit4]   2> 2139355 INFO  (jetty-launcher-5050-thread-1) [    ] o.a.s.s.SolrDispatchFilter Using logger factory org.apache.logging.slf4j.Log4jLoggerFactory
   [junit4]   2> 2139355 INFO  (jetty-launcher-5050-thread-1) [    ] o.a.s.s.SolrDispatchFilter  ___      _       Welcome to Apache Solr? version 9.0.0
   [junit4]   2> 2139355 INFO  (jetty-launcher-5050-thread-1) [    ] o.a.s.s.SolrDispatchFilter / __| ___| |_ _   Starting in cloud mode on port null
   [junit4]   2> 2139355 INFO  (jetty-launcher-5050-thread-1) [    ] o.a.s.s.SolrDispatchFilter \__ \/ _ \ | '_|  Install dir: null
   [junit4]   2> 2139355 INFO  (jetty-launcher-5050-thread-1) [    ] o.a.s.s.SolrDispatchFilter |___/\___/_|_|    Start time: 2019-04-08T19:16:28.624Z
   [junit4]   2> 2139356 WARN  (jetty-launcher-5050-thread-4) [    ] o.e.j.s.AbstractConnector Ignoring deprecated socket c

[...truncated too long message...]

l:

ivy-configure:
[ivy:configure] :: loading settings :: file = /home/jenkins/jenkins-slave/workspace/Lucene-Solr-Tests-master/lucene/top-level-ivy-settings.xml

resolve:

ivy-availability-check:
[loadresource] Do not set property disallowed.ivy.jars.list as its length is 0.

-ivy-fail-disallowed-ivy-version:

ivy-fail:

ivy-configure:
[ivy:configure] :: loading settings :: file = /home/jenkins/jenkins-slave/workspace/Lucene-Solr-Tests-master/lucene/top-level-ivy-settings.xml

resolve:

ivy-availability-check:
[loadresource] Do not set property disallowed.ivy.jars.list as its length is 0.

-ivy-fail-disallowed-ivy-version:

ivy-fail:

ivy-fail:

ivy-configure:
[ivy:configure] :: loading settings :: file = /home/jenkins/jenkins-slave/workspace/Lucene-Solr-Tests-master/lucene/top-level-ivy-settings.xml

resolve:

ivy-availability-check:
[loadresource] Do not set property disallowed.ivy.jars.list as its length is 0.

-ivy-fail-disallowed-ivy-version:

ivy-fail:

ivy-configure:
[ivy:configure] :: loading settings :: file = /home/jenkins/jenkins-slave/workspace/Lucene-Solr-Tests-master/lucene/top-level-ivy-settings.xml

resolve:

ivy-availability-check:
[loadresource] Do not set property disallowed.ivy.jars.list as its length is 0.

-ivy-fail-disallowed-ivy-version:

ivy-fail:

ivy-fail:

ivy-configure:
[ivy:configure] :: loading settings :: file = /home/jenkins/jenkins-slave/workspace/Lucene-Solr-Tests-master/lucene/top-level-ivy-settings.xml

resolve:

ivy-availability-check:
[loadresource] Do not set property disallowed.ivy.jars.list as its length is 0.

-ivy-fail-disallowed-ivy-version:

ivy-fail:

ivy-fail:

ivy-configure:
[ivy:configure] :: loading settings :: file = /home/jenkins/jenkins-slave/workspace/Lucene-Solr-Tests-master/lucene/top-level-ivy-settings.xml

resolve:

ivy-availability-check:
[loadresource] Do not set property disallowed.ivy.jars.list as its length is 0.

-ivy-fail-disallowed-ivy-version:

ivy-fail:

ivy-fail:

ivy-configure:
[ivy:configure] :: loading settings :: file = /home/jenkins/jenkins-slave/workspace/Lucene-Solr-Tests-master/lucene/top-level-ivy-settings.xml

resolve:

ivy-availability-check:
[loadresource] Do not set property disallowed.ivy.jars.list as its length is 0.

-ivy-fail-disallowed-ivy-version:

ivy-fail:

ivy-fail:

ivy-configure:
[ivy:configure] :: loading settings :: file = /home/jenkins/jenkins-slave/workspace/Lucene-Solr-Tests-master/lucene/top-level-ivy-settings.xml

resolve:

ivy-availability-check:
[loadresource] Do not set property disallowed.ivy.jars.list as its length is 0.

-ivy-fail-disallowed-ivy-version:

ivy-fail:

ivy-fail:

ivy-configure:
[ivy:configure] :: loading settings :: file = /home/jenkins/jenkins-slave/workspace/Lucene-Solr-Tests-master/lucene/top-level-ivy-settings.xml

resolve:

ivy-availability-check:
[loadresource] Do not set property disallowed.ivy.jars.list as its length is 0.

-ivy-fail-disallowed-ivy-version:

ivy-fail:

ivy-fail:

ivy-configure:
[ivy:configure] :: loading settings :: file = /home/jenkins/jenkins-slave/workspace/Lucene-Solr-Tests-master/lucene/top-level-ivy-settings.xml

resolve:

ivy-availability-check:
[loadresource] Do not set property disallowed.ivy.jars.list as its length is 0.

-ivy-fail-disallowed-ivy-version:

ivy-fail:

ivy-fail:

ivy-configure:
[ivy:configure] :: loading settings :: file = /home/jenkins/jenkins-slave/workspace/Lucene-Solr-Tests-master/lucene/top-level-ivy-settings.xml

resolve:

ivy-availability-check:
[loadresource] Do not set property disallowed.ivy.jars.list as its length is 0.

-ivy-fail-disallowed-ivy-version:

ivy-fail:

ivy-fail:

ivy-configure:
[ivy:configure] :: loading settings :: file = /home/jenkins/jenkins-slave/workspace/Lucene-Solr-Tests-master/lucene/top-level-ivy-settings.xml

resolve:

ivy-availability-check:
[loadresource] Do not set property disallowed.ivy.jars.list as its length is 0.

-ivy-fail-disallowed-ivy-version:

ivy-fail:

ivy-fail:

ivy-configure:
[ivy:configure] :: loading settings :: file = /home/jenkins/jenkins-slave/workspace/Lucene-Solr-Tests-master/lucene/top-level-ivy-settings.xml

resolve:

ivy-availability-check:
[loadresource] Do not set property disallowed.ivy.jars.list as its length is 0.

-ivy-fail-disallowed-ivy-version:

ivy-fail:

ivy-fail:

ivy-configure:
[ivy:configure] :: loading settings :: file = /home/jenkins/jenkins-slave/workspace/Lucene-Solr-Tests-master/lucene/top-level-ivy-settings.xml

resolve:

jar-checksums:
    [mkdir] Created dir: /home/jenkins/jenkins-slave/workspace/Lucene-Solr-Tests-master/solr/null2111042023
     [copy] Copying 240 files to /home/jenkins/jenkins-slave/workspace/Lucene-Solr-Tests-master/solr/null2111042023
   [delete] Deleting directory /home/jenkins/jenkins-slave/workspace/Lucene-Solr-Tests-master/solr/null2111042023

check-working-copy:
[ivy:cachepath] :: resolving dependencies :: org.eclipse.jgit#org.eclipse.jgit-caller;working
[ivy:cachepath] 	confs: [default]
[ivy:cachepath] 	found org.eclipse.jgit#org.eclipse.jgit;4.6.0.201612231935-r in public
[ivy:cachepath] 	found com.jcraft#jsch;0.1.53 in public
[ivy:cachepath] 	found com.googlecode.javaewah#JavaEWAH;1.1.6 in public
[ivy:cachepath] 	found org.apache.httpcomponents#httpclient;4.3.6 in public
[ivy:cachepath] 	found org.apache.httpcomponents#httpcore;4.3.3 in public
[ivy:cachepath] 	found commons-logging#commons-logging;1.1.3 in public
[ivy:cachepath] 	found commons-codec#commons-codec;1.6 in public
[ivy:cachepath] 	found org.slf4j#slf4j-api;1.7.2 in public
[ivy:cachepath] :: resolution report :: resolve 81ms :: artifacts dl 13ms
	---------------------------------------------------------------------
	|                  |            modules            ||   artifacts   |
	|       conf       | number| search|dwnlded|evicted|| number|dwnlded|
	---------------------------------------------------------------------
	|      default     |   8   |   0   |   0   |   0   ||   8   |   0   |
	---------------------------------------------------------------------
[wc-checker] Initializing working copy...
[wc-checker] SLF4J: Failed to load class "org.slf4j.impl.StaticLoggerBinder".
[wc-checker] SLF4J: Defaulting to no-operation (NOP) logger implementation
[wc-checker] SLF4J: See http://www.slf4j.org/codes.html#StaticLoggerBinder for further details.
[wc-checker] Checking working copy status...

-jenkins-base:

BUILD SUCCESSFUL
Total time: 233 minutes 36 seconds
Archiving artifacts
java.lang.InterruptedException: no matches found within 10000
	at hudson.FilePath$ValidateAntFileMask.hasMatch(FilePath.java:2847)
	at hudson.FilePath$ValidateAntFileMask.invoke(FilePath.java:2726)
	at hudson.FilePath$ValidateAntFileMask.invoke(FilePath.java:2707)
	at hudson.FilePath$FileCallableWrapper.call(FilePath.java:3086)
Also:   hudson.remoting.Channel$CallSiteStackTrace: Remote call to lucene2
		at hudson.remoting.Channel.attachCallSiteStackTrace(Channel.java:1741)
		at hudson.remoting.UserRequest$ExceptionResponse.retrieve(UserRequest.java:357)
		at hudson.remoting.Channel.call(Channel.java:955)
		at hudson.FilePath.act(FilePath.java:1072)
		at hudson.FilePath.act(FilePath.java:1061)
		at hudson.FilePath.validateAntFileMask(FilePath.java:2705)
		at hudson.tasks.ArtifactArchiver.perform(ArtifactArchiver.java:243)
		at hudson.tasks.BuildStepCompatibilityLayer.perform(BuildStepCompatibilityLayer.java:81)
		at hudson.tasks.BuildStepMonitor$1.perform(BuildStepMonitor.java:20)
		at hudson.model.AbstractBuild$AbstractBuildExecution.perform(AbstractBuild.java:744)
		at hudson.model.AbstractBuild$AbstractBuildExecution.performAllBuildSteps(AbstractBuild.java:690)
		at hudson.model.Build$BuildExecution.post2(Build.java:186)
		at hudson.model.AbstractBuild$AbstractBuildExecution.post(AbstractBuild.java:635)
		at hudson.model.Run.execute(Run.java:1835)
		at hudson.model.FreeStyleBuild.run(FreeStyleBuild.java:43)
		at hudson.model.ResourceController.execute(ResourceController.java:97)
		at hudson.model.Executor.run(Executor.java:429)
Caused: hudson.FilePath$TunneledInterruptedException
	at hudson.FilePath$FileCallableWrapper.call(FilePath.java:3088)
	at hudson.remoting.UserRequest.perform(UserRequest.java:212)
	at hudson.remoting.UserRequest.perform(UserRequest.java:54)
	at hudson.remoting.Request$2.run(Request.java:369)
	at hudson.remoting.InterceptingExecutorService$1.call(InterceptingExecutorService.java:72)
	at java.util.concurrent.FutureTask.run(FutureTask.java:266)
	at java.util.concurrent.ThreadPoolExecutor.runWorker(ThreadPoolExecutor.java:1142)
	at java.util.concurrent.ThreadPoolExecutor$Worker.run(ThreadPoolExecutor.java:617)
	at java.lang.Thread.run(Thread.java:748)
Caused: java.lang.InterruptedException: java.lang.InterruptedException: no matches found within 10000
	at hudson.FilePath.act(FilePath.java:1074)
	at hudson.FilePath.act(FilePath.java:1061)
	at hudson.FilePath.validateAntFileMask(FilePath.java:2705)
	at hudson.tasks.ArtifactArchiver.perform(ArtifactArchiver.java:243)
	at hudson.tasks.BuildStepCompatibilityLayer.perform(BuildStepCompatibilityLayer.java:81)
	at hudson.tasks.BuildStepMonitor$1.perform(BuildStepMonitor.java:20)
	at hudson.model.AbstractBuild$AbstractBuildExecution.perform(AbstractBuild.java:744)
	at hudson.model.AbstractBuild$AbstractBuildExecution.performAllBuildSteps(AbstractBuild.java:690)
	at hudson.model.Build$BuildExecution.post2(Build.java:186)
	at hudson.model.AbstractBuild$AbstractBuildExecution.post(AbstractBuild.java:635)
	at hudson.model.Run.execute(Run.java:1835)
	at hudson.model.FreeStyleBuild.run(FreeStyleBuild.java:43)
	at hudson.model.ResourceController.execute(ResourceController.java:97)
	at hudson.model.Executor.run(Executor.java:429)
No artifacts found that match the file pattern "**/*.events,heapdumps/**,**/hs_err_pid*". Configuration error?
Recording test results
Build step 'Publish JUnit test result report' changed build result to UNSTABLE
Email was triggered for: Unstable (Test Failures)
Sending email for trigger: Unstable (Test Failures)

Mime
View raw message