lucene-dev mailing list archives

Site index · List index
Message view « Date » · « Thread »
Top « Date » · « Thread »
From Policeman Jenkins Server <jenk...@thetaphi.de>
Subject [JENKINS] Lucene-Solr-8.x-Linux (64bit/jdk1.8.0_201) - Build # 579 - Failure!
Date Sat, 18 May 2019 10:35:55 GMT
Build: https://jenkins.thetaphi.de/job/Lucene-Solr-8.x-Linux/579/
Java: 64bit/jdk1.8.0_201 -XX:-UseCompressedOops -XX:+UseSerialGC

1 tests failed.
FAILED:  org.apache.solr.core.TestDynamicLoading.testDynamicLoading

Error Message:
Could not get expected value  'org.apache.solr.core.BlobStoreTestRequestHandler' for path 'overlay/requestHandler/\/test1/class' full output: {   "responseHeader":{     "status":0,     "QTime":0},   "overlay":{     "znodeVersion":0,     "runtimeLib":{"colltest":{         "name":"colltest",         "version":1}}}},  from server:  null

Stack Trace:
java.lang.AssertionError: Could not get expected value  'org.apache.solr.core.BlobStoreTestRequestHandler' for path 'overlay/requestHandler/\/test1/class' full output: {
  "responseHeader":{
    "status":0,
    "QTime":0},
  "overlay":{
    "znodeVersion":0,
    "runtimeLib":{"colltest":{
        "name":"colltest",
        "version":1}}}},  from server:  null
	at __randomizedtesting.SeedInfo.seed([1C894DE142694CE6:C4C460B6B5B4E946]:0)
	at org.junit.Assert.fail(Assert.java:88)
	at org.junit.Assert.assertTrue(Assert.java:41)
	at org.apache.solr.core.TestSolrConfigHandler.testForResponseElement(TestSolrConfigHandler.java:589)
	at org.apache.solr.core.TestDynamicLoading.testDynamicLoading(TestDynamicLoading.java:80)
	at sun.reflect.NativeMethodAccessorImpl.invoke0(Native Method)
	at sun.reflect.NativeMethodAccessorImpl.invoke(NativeMethodAccessorImpl.java:62)
	at sun.reflect.DelegatingMethodAccessorImpl.invoke(DelegatingMethodAccessorImpl.java:43)
	at java.lang.reflect.Method.invoke(Method.java:498)
	at com.carrotsearch.randomizedtesting.RandomizedRunner.invoke(RandomizedRunner.java:1750)
	at com.carrotsearch.randomizedtesting.RandomizedRunner$8.evaluate(RandomizedRunner.java:938)
	at com.carrotsearch.randomizedtesting.RandomizedRunner$9.evaluate(RandomizedRunner.java:974)
	at com.carrotsearch.randomizedtesting.RandomizedRunner$10.evaluate(RandomizedRunner.java:988)
	at org.apache.solr.BaseDistributedSearchTestCase$ShardsRepeatRule$ShardsFixedStatement.callStatement(BaseDistributedSearchTestCase.java:1082)
	at org.apache.solr.BaseDistributedSearchTestCase$ShardsRepeatRule$ShardsStatement.evaluate(BaseDistributedSearchTestCase.java:1054)
	at com.carrotsearch.randomizedtesting.rules.SystemPropertiesRestoreRule$1.evaluate(SystemPropertiesRestoreRule.java:57)
	at org.apache.lucene.util.TestRuleSetupTeardownChained$1.evaluate(TestRuleSetupTeardownChained.java:49)
	at org.apache.lucene.util.AbstractBeforeAfterRule$1.evaluate(AbstractBeforeAfterRule.java:45)
	at org.apache.lucene.util.TestRuleThreadAndTestName$1.evaluate(TestRuleThreadAndTestName.java:48)
	at org.apache.lucene.util.TestRuleIgnoreAfterMaxFailures$1.evaluate(TestRuleIgnoreAfterMaxFailures.java:64)
	at org.apache.lucene.util.TestRuleMarkFailure$1.evaluate(TestRuleMarkFailure.java:47)
	at com.carrotsearch.randomizedtesting.rules.StatementAdapter.evaluate(StatementAdapter.java:36)
	at com.carrotsearch.randomizedtesting.ThreadLeakControl$StatementRunner.run(ThreadLeakControl.java:368)
	at com.carrotsearch.randomizedtesting.ThreadLeakControl.forkTimeoutingTask(ThreadLeakControl.java:817)
	at com.carrotsearch.randomizedtesting.ThreadLeakControl$3.evaluate(ThreadLeakControl.java:468)
	at com.carrotsearch.randomizedtesting.RandomizedRunner.runSingleTest(RandomizedRunner.java:947)
	at com.carrotsearch.randomizedtesting.RandomizedRunner$5.evaluate(RandomizedRunner.java:832)
	at com.carrotsearch.randomizedtesting.RandomizedRunner$6.evaluate(RandomizedRunner.java:883)
	at com.carrotsearch.randomizedtesting.RandomizedRunner$7.evaluate(RandomizedRunner.java:894)
	at com.carrotsearch.randomizedtesting.rules.StatementAdapter.evaluate(StatementAdapter.java:36)
	at com.carrotsearch.randomizedtesting.rules.SystemPropertiesRestoreRule$1.evaluate(SystemPropertiesRestoreRule.java:57)
	at org.apache.lucene.util.AbstractBeforeAfterRule$1.evaluate(AbstractBeforeAfterRule.java:45)
	at com.carrotsearch.randomizedtesting.rules.StatementAdapter.evaluate(StatementAdapter.java:36)
	at org.apache.lucene.util.TestRuleStoreClassName$1.evaluate(TestRuleStoreClassName.java:41)
	at com.carrotsearch.randomizedtesting.rules.NoShadowingOrOverridesOnMethodsRule$1.evaluate(NoShadowingOrOverridesOnMethodsRule.java:40)
	at com.carrotsearch.randomizedtesting.rules.NoShadowingOrOverridesOnMethodsRule$1.evaluate(NoShadowingOrOverridesOnMethodsRule.java:40)
	at com.carrotsearch.randomizedtesting.rules.StatementAdapter.evaluate(StatementAdapter.java:36)
	at com.carrotsearch.randomizedtesting.rules.StatementAdapter.evaluate(StatementAdapter.java:36)
	at com.carrotsearch.randomizedtesting.rules.StatementAdapter.evaluate(StatementAdapter.java:36)
	at org.apache.lucene.util.TestRuleAssertionsRequired$1.evaluate(TestRuleAssertionsRequired.java:53)
	at org.apache.lucene.util.TestRuleMarkFailure$1.evaluate(TestRuleMarkFailure.java:47)
	at org.apache.lucene.util.TestRuleIgnoreAfterMaxFailures$1.evaluate(TestRuleIgnoreAfterMaxFailures.java:64)
	at org.apache.lucene.util.TestRuleIgnoreTestSuites$1.evaluate(TestRuleIgnoreTestSuites.java:54)
	at com.carrotsearch.randomizedtesting.rules.StatementAdapter.evaluate(StatementAdapter.java:36)
	at com.carrotsearch.randomizedtesting.ThreadLeakControl$StatementRunner.run(ThreadLeakControl.java:368)
	at java.lang.Thread.run(Thread.java:748)




Build Log:
[...truncated 13560 lines...]
   [junit4] Suite: org.apache.solr.core.TestDynamicLoading
   [junit4]   2> Creating dataDir: /home/jenkins/workspace/Lucene-Solr-8.x-Linux/solr/build/solr-core/test/J2/temp/solr.core.TestDynamicLoading_1C894DE142694CE6-001/init-core-data-001
   [junit4]   2> 468629 WARN  (SUITE-TestDynamicLoading-seed#[1C894DE142694CE6]-worker) [    ] o.a.s.SolrTestCaseJ4 startTrackingSearchers: numOpens=2 numCloses=2
   [junit4]   2> 468629 INFO  (SUITE-TestDynamicLoading-seed#[1C894DE142694CE6]-worker) [    ] o.a.s.SolrTestCaseJ4 Using PointFields (NUMERIC_POINTS_SYSPROP=true) w/NUMERIC_DOCVALUES_SYSPROP=false
   [junit4]   2> 468631 INFO  (SUITE-TestDynamicLoading-seed#[1C894DE142694CE6]-worker) [    ] o.a.s.SolrTestCaseJ4 Randomized ssl (true) and clientAuth (true) via: @org.apache.solr.util.RandomizeSSL(reason=, ssl=NaN, value=NaN, clientAuth=NaN)
   [junit4]   2> 468631 INFO  (SUITE-TestDynamicLoading-seed#[1C894DE142694CE6]-worker) [    ] o.a.s.SolrTestCaseJ4 SecureRandom sanity checks: test.solr.allowed.securerandom=null & java.security.egd=file:/dev/./urandom
   [junit4]   2> 468631 INFO  (SUITE-TestDynamicLoading-seed#[1C894DE142694CE6]-worker) [    ] o.a.s.BaseDistributedSearchTestCase Setting hostContext system property: /mkb/
   [junit4]   2> 468633 INFO  (TEST-TestDynamicLoading.testDynamicLoading-seed#[1C894DE142694CE6]) [    ] o.a.s.c.ZkTestServer STARTING ZK TEST SERVER
   [junit4]   2> 468655 INFO  (ZkTestServer Run Thread) [    ] o.a.s.c.ZkTestServer client port:0.0.0.0/0.0.0.0:0
   [junit4]   2> 468655 INFO  (ZkTestServer Run Thread) [    ] o.a.s.c.ZkTestServer Starting server
   [junit4]   2> 468755 INFO  (TEST-TestDynamicLoading.testDynamicLoading-seed#[1C894DE142694CE6]) [    ] o.a.s.c.ZkTestServer start zk server on port:43041
   [junit4]   2> 468755 INFO  (TEST-TestDynamicLoading.testDynamicLoading-seed#[1C894DE142694CE6]) [    ] o.a.s.c.ZkTestServer parse host and port list: 127.0.0.1:43041
   [junit4]   2> 468755 INFO  (TEST-TestDynamicLoading.testDynamicLoading-seed#[1C894DE142694CE6]) [    ] o.a.s.c.ZkTestServer connecting to 127.0.0.1 43041
   [junit4]   2> 468783 INFO  (zkConnectionManagerCallback-3584-thread-1) [    ] o.a.s.c.c.ConnectionManager zkClient has connected
   [junit4]   2> 468797 INFO  (zkConnectionManagerCallback-3586-thread-1) [    ] o.a.s.c.c.ConnectionManager zkClient has connected
   [junit4]   2> 468799 INFO  (TEST-TestDynamicLoading.testDynamicLoading-seed#[1C894DE142694CE6]) [    ] o.a.s.c.ZkTestServer put /home/jenkins/workspace/Lucene-Solr-8.x-Linux/solr/core/src/test-files/solr/collection1/conf/solrconfig-tlog.xml to /configs/conf1/solrconfig.xml
   [junit4]   2> 468799 INFO  (TEST-TestDynamicLoading.testDynamicLoading-seed#[1C894DE142694CE6]) [    ] o.a.s.c.ZkTestServer put /home/jenkins/workspace/Lucene-Solr-8.x-Linux/solr/core/src/test-files/solr/collection1/conf/schema.xml to /configs/conf1/schema.xml
   [junit4]   2> 468800 INFO  (TEST-TestDynamicLoading.testDynamicLoading-seed#[1C894DE142694CE6]) [    ] o.a.s.c.ZkTestServer put /home/jenkins/workspace/Lucene-Solr-8.x-Linux/solr/core/src/test-files/solr/collection1/conf/solrconfig.snippet.randomindexconfig.xml to /configs/conf1/solrconfig.snippet.randomindexconfig.xml
   [junit4]   2> 468800 INFO  (TEST-TestDynamicLoading.testDynamicLoading-seed#[1C894DE142694CE6]) [    ] o.a.s.c.ZkTestServer put /home/jenkins/workspace/Lucene-Solr-8.x-Linux/solr/core/src/test-files/solr/collection1/conf/stopwords.txt to /configs/conf1/stopwords.txt
   [junit4]   2> 468801 INFO  (TEST-TestDynamicLoading.testDynamicLoading-seed#[1C894DE142694CE6]) [    ] o.a.s.c.ZkTestServer put /home/jenkins/workspace/Lucene-Solr-8.x-Linux/solr/core/src/test-files/solr/collection1/conf/protwords.txt to /configs/conf1/protwords.txt
   [junit4]   2> 468801 INFO  (TEST-TestDynamicLoading.testDynamicLoading-seed#[1C894DE142694CE6]) [    ] o.a.s.c.ZkTestServer put /home/jenkins/workspace/Lucene-Solr-8.x-Linux/solr/core/src/test-files/solr/collection1/conf/currency.xml to /configs/conf1/currency.xml
   [junit4]   2> 468802 INFO  (TEST-TestDynamicLoading.testDynamicLoading-seed#[1C894DE142694CE6]) [    ] o.a.s.c.ZkTestServer put /home/jenkins/workspace/Lucene-Solr-8.x-Linux/solr/core/src/test-files/solr/collection1/conf/enumsConfig.xml to /configs/conf1/enumsConfig.xml
   [junit4]   2> 468802 INFO  (TEST-TestDynamicLoading.testDynamicLoading-seed#[1C894DE142694CE6]) [    ] o.a.s.c.ZkTestServer put /home/jenkins/workspace/Lucene-Solr-8.x-Linux/solr/core/src/test-files/solr/collection1/conf/open-exchange-rates.json to /configs/conf1/open-exchange-rates.json
   [junit4]   2> 468803 INFO  (TEST-TestDynamicLoading.testDynamicLoading-seed#[1C894DE142694CE6]) [    ] o.a.s.c.ZkTestServer put /home/jenkins/workspace/Lucene-Solr-8.x-Linux/solr/core/src/test-files/solr/collection1/conf/mapping-ISOLatin1Accent.txt to /configs/conf1/mapping-ISOLatin1Accent.txt
   [junit4]   2> 468803 INFO  (TEST-TestDynamicLoading.testDynamicLoading-seed#[1C894DE142694CE6]) [    ] o.a.s.c.ZkTestServer put /home/jenkins/workspace/Lucene-Solr-8.x-Linux/solr/core/src/test-files/solr/collection1/conf/old_synonyms.txt to /configs/conf1/old_synonyms.txt
   [junit4]   2> 468804 INFO  (TEST-TestDynamicLoading.testDynamicLoading-seed#[1C894DE142694CE6]) [    ] o.a.s.c.ZkTestServer put /home/jenkins/workspace/Lucene-Solr-8.x-Linux/solr/core/src/test-files/solr/collection1/conf/synonyms.txt to /configs/conf1/synonyms.txt
   [junit4]   2> 468829 INFO  (zkConnectionManagerCallback-3590-thread-1) [    ] o.a.s.c.c.ConnectionManager zkClient has connected
   [junit4]   2> 468830 INFO  (TEST-TestDynamicLoading.testDynamicLoading-seed#[1C894DE142694CE6]) [    ] o.a.s.c.AbstractFullDistribZkTestBase Will use NRT replicas unless explicitly asked otherwise
   [junit4]   2> 468909 WARN  (TEST-TestDynamicLoading.testDynamicLoading-seed#[1C894DE142694CE6]) [    ] o.e.j.s.AbstractConnector Ignoring deprecated socket close linger time
   [junit4]   2> 468910 INFO  (TEST-TestDynamicLoading.testDynamicLoading-seed#[1C894DE142694CE6]) [    ] o.a.s.c.s.e.JettySolrRunner Start Jetty (original configured port=0)
   [junit4]   2> 468910 INFO  (TEST-TestDynamicLoading.testDynamicLoading-seed#[1C894DE142694CE6]) [    ] o.a.s.c.s.e.JettySolrRunner Trying to start Jetty on port 0 try number 1 ...
   [junit4]   2> 468910 INFO  (TEST-TestDynamicLoading.testDynamicLoading-seed#[1C894DE142694CE6]) [    ] o.e.j.s.Server jetty-9.4.14.v20181114; built: 2018-11-14T21:20:31.478Z; git: c4550056e785fb5665914545889f21dc136ad9e6; jvm 1.8.0_201-b09
   [junit4]   2> 468943 INFO  (TEST-TestDynamicLoading.testDynamicLoading-seed#[1C894DE142694CE6]) [    ] o.e.j.s.session DefaultSessionIdManager workerName=node0
   [junit4]   2> 468943 INFO  (TEST-TestDynamicLoading.testDynamicLoading-seed#[1C894DE142694CE6]) [    ] o.e.j.s.session No SessionScavenger set, using defaults
   [junit4]   2> 468943 INFO  (TEST-TestDynamicLoading.testDynamicLoading-seed#[1C894DE142694CE6]) [    ] o.e.j.s.session node0 Scavenging every 600000ms
   [junit4]   2> 468944 INFO  (TEST-TestDynamicLoading.testDynamicLoading-seed#[1C894DE142694CE6]) [    ] o.e.j.s.h.ContextHandler Started o.e.j.s.ServletContextHandler@7ab63e3e{/mkb,null,AVAILABLE}
   [junit4]   2> 468945 WARN  (TEST-TestDynamicLoading.testDynamicLoading-seed#[1C894DE142694CE6]) [    ] o.e.j.u.s.S.config No Client EndPointIdentificationAlgorithm configured for SslContextFactory@390e23af[provider=null,keyStore=null,trustStore=null]
   [junit4]   2> 468946 INFO  (TEST-TestDynamicLoading.testDynamicLoading-seed#[1C894DE142694CE6]) [    ] o.e.j.s.AbstractConnector Started ServerConnector@14013da5{SSL,[ssl, http/1.1]}{127.0.0.1:36981}
   [junit4]   2> 468946 INFO  (TEST-TestDynamicLoading.testDynamicLoading-seed#[1C894DE142694CE6]) [    ] o.e.j.s.Server Started @468982ms
   [junit4]   2> 468946 INFO  (TEST-TestDynamicLoading.testDynamicLoading-seed#[1C894DE142694CE6]) [    ] o.a.s.c.s.e.JettySolrRunner Jetty properties: {solr.data.dir=/home/jenkins/workspace/Lucene-Solr-8.x-Linux/solr/build/solr-core/test/J2/temp/solr.core.TestDynamicLoading_1C894DE142694CE6-001/tempDir-001/control/data, replicaType=NRT, hostContext=/mkb, hostPort=36981, coreRootDirectory=/home/jenkins/workspace/Lucene-Solr-8.x-Linux/solr/build/solr-core/test/J2/temp/solr.core.TestDynamicLoading_1C894DE142694CE6-001/control-001/cores}
   [junit4]   2> 468946 ERROR (TEST-TestDynamicLoading.testDynamicLoading-seed#[1C894DE142694CE6]) [    ] o.a.s.u.StartupLoggingUtils Missing Java Option solr.log.dir. Logging may be missing or incomplete.
   [junit4]   2> 468946 INFO  (TEST-TestDynamicLoading.testDynamicLoading-seed#[1C894DE142694CE6]) [    ] o.a.s.s.SolrDispatchFilter Using logger factory org.apache.logging.slf4j.Log4jLoggerFactory
   [junit4]   2> 468946 INFO  (TEST-TestDynamicLoading.testDynamicLoading-seed#[1C894DE142694CE6]) [    ] o.a.s.s.SolrDispatchFilter  ___      _       Welcome to Apache Solr? version 8.2.0
   [junit4]   2> 468946 INFO  (TEST-TestDynamicLoading.testDynamicLoading-seed#[1C894DE142694CE6]) [    ] o.a.s.s.SolrDispatchFilter / __| ___| |_ _   Starting in cloud mode on port null
   [junit4]   2> 468946 INFO  (TEST-TestDynamicLoading.testDynamicLoading-seed#[1C894DE142694CE6]) [    ] o.a.s.s.SolrDispatchFilter \__ \/ _ \ | '_|  Install dir: null
   [junit4]   2> 468946 INFO  (TEST-TestDynamicLoading.testDynamicLoading-seed#[1C894DE142694CE6]) [    ] o.a.s.s.SolrDispatchFilter |___/\___/_|_|    Start time: 2019-05-18T09:51:54.252Z
   [junit4]   2> 468970 INFO  (zkConnectionManagerCallback-3592-thread-1) [    ] o.a.s.c.c.ConnectionManager zkClient has connected
   [junit4]   2> 468975 INFO  (TEST-TestDynamicLoading.testDynamicLoading-seed#[1C894DE142694CE6]) [    ] o.a.s.s.SolrDispatchFilter Loading solr.xml from SolrHome (not found in ZooKeeper)
   [junit4]   2> 468975 INFO  (TEST-TestDynamicLoading.testDynamicLoading-seed#[1C894DE142694CE6]) [    ] o.a.s.c.SolrXmlConfig Loading container configuration from /home/jenkins/workspace/Lucene-Solr-8.x-Linux/solr/build/solr-core/test/J2/temp/solr.core.TestDynamicLoading_1C894DE142694CE6-001/control-001/solr.xml
   [junit4]   2> 468978 INFO  (TEST-TestDynamicLoading.testDynamicLoading-seed#[1C894DE142694CE6]) [    ] o.a.s.c.SolrXmlConfig Configuration parameter autoReplicaFailoverWorkLoopDelay is ignored
   [junit4]   2> 468978 INFO  (TEST-TestDynamicLoading.testDynamicLoading-seed#[1C894DE142694CE6]) [    ] o.a.s.c.SolrXmlConfig Configuration parameter autoReplicaFailoverBadNodeExpiration is ignored
   [junit4]   2> 468979 INFO  (TEST-TestDynamicLoading.testDynamicLoading-seed#[1C894DE142694CE6]) [    ] o.a.s.c.SolrXmlConfig MBean server found: com.sun.jmx.mbeanserver.JmxMBeanServer@75939a61, but no JMX reporters were configured - adding default JMX reporter.
   [junit4]   2> 469115 INFO  (TEST-TestDynamicLoading.testDynamicLoading-seed#[1C894DE142694CE6]) [    ] o.a.s.h.c.HttpShardHandlerFactory Host whitelist initialized: WhitelistHostChecker [whitelistHosts=null, whitelistHostCheckingEnabled=false]
   [junit4]   2> 469116 WARN  (TEST-TestDynamicLoading.testDynamicLoading-seed#[1C894DE142694CE6]) [    ] o.a.s.c.s.i.Http2SolrClient Create Http2SolrClient with HTTP/1.1 transport since Java 8 or lower versions does not support SSL + HTTP/2
   [junit4]   2> 469117 WARN  (TEST-TestDynamicLoading.testDynamicLoading-seed#[1C894DE142694CE6]) [    ] o.e.j.u.s.S.config No Client EndPointIdentificationAlgorithm configured for SslContextFactory@6f13ff59[provider=null,keyStore=null,trustStore=null]
   [junit4]   2> 469130 WARN  (TEST-TestDynamicLoading.testDynamicLoading-seed#[1C894DE142694CE6]) [    ] o.a.s.c.s.i.Http2SolrClient Create Http2SolrClient with HTTP/1.1 transport since Java 8 or lower versions does not support SSL + HTTP/2
   [junit4]   2> 469141 WARN  (TEST-TestDynamicLoading.testDynamicLoading-seed#[1C894DE142694CE6]) [    ] o.e.j.u.s.S.config No Client EndPointIdentificationAlgorithm configured for SslContextFactory@33246800[provider=null,keyStore=null,trustStore=null]
   [junit4]   2> 469142 INFO  (TEST-TestDynamicLoading.testDynamicLoading-seed#[1C894DE142694CE6]) [    ] o.a.s.c.ZkContainer Zookeeper client=127.0.0.1:43041/solr
   [junit4]   2> 469162 INFO  (zkConnectionManagerCallback-3599-thread-1) [    ] o.a.s.c.c.ConnectionManager zkClient has connected
   [junit4]   2> 469164 INFO  (zkConnectionManagerCallback-3601-thread-1) [    ] o.a.s.c.c.ConnectionManager zkClient has connected
   [junit4]   2> 469196 INFO  (TEST-TestDynamicLoading.testDynamicLoading-seed#[1C894DE142694CE6]) [n:127.0.0.1:36981_mkb    ] o.a.s.c.OverseerElectionContext I am going to be the leader 127.0.0.1:36981_mkb
   [junit4]   2> 469196 INFO  (TEST-TestDynamicLoading.testDynamicLoading-seed#[1C894DE142694CE6]) [n:127.0.0.1:36981_mkb    ] o.a.s.c.Overseer Overseer (id=72271795127320581-127.0.0.1:36981_mkb-n_0000000000) starting
   [junit4]   2> 469209 INFO  (zkConnectionManagerCallback-3608-thread-1) [    ] o.a.s.c.c.ConnectionManager zkClient has connected
   [junit4]   2> 469211 INFO  (TEST-TestDynamicLoading.testDynamicLoading-seed#[1C894DE142694CE6]) [n:127.0.0.1:36981_mkb    ] o.a.s.c.s.i.ZkClientClusterStateProvider Cluster at 127.0.0.1:43041/solr ready
   [junit4]   2> 469214 INFO  (OverseerStateUpdate-72271795127320581-127.0.0.1:36981_mkb-n_0000000000) [n:127.0.0.1:36981_mkb    ] o.a.s.c.Overseer Starting to work on the main queue : 127.0.0.1:36981_mkb
   [junit4]   2> 469225 INFO  (TEST-TestDynamicLoading.testDynamicLoading-seed#[1C894DE142694CE6]) [n:127.0.0.1:36981_mkb    ] o.a.s.c.ZkController Register node as live in ZooKeeper:/live_nodes/127.0.0.1:36981_mkb
   [junit4]   2> 469242 INFO  (zkCallback-3607-thread-1) [    ] o.a.s.c.c.ZkStateReader Updated live nodes from ZooKeeper... (0) -> (1)
   [junit4]   2> 469242 INFO  (zkCallback-3600-thread-1) [    ] o.a.s.c.c.ZkStateReader Updated live nodes from ZooKeeper... (0) -> (1)
   [junit4]   2> 469242 INFO  (TEST-TestDynamicLoading.testDynamicLoading-seed#[1C894DE142694CE6]) [n:127.0.0.1:36981_mkb    ] o.a.s.h.a.MetricsHistoryHandler No .system collection, keeping metrics history in memory.
   [junit4]   2> 469256 INFO  (TEST-TestDynamicLoading.testDynamicLoading-seed#[1C894DE142694CE6]) [n:127.0.0.1:36981_mkb    ] o.a.s.m.r.SolrJmxReporter JMX monitoring for 'solr.node' (registry 'solr.node') enabled at server: com.sun.jmx.mbeanserver.JmxMBeanServer@75939a61
   [junit4]   2> 469278 INFO  (TEST-TestDynamicLoading.testDynamicLoading-seed#[1C894DE142694CE6]) [n:127.0.0.1:36981_mkb    ] o.a.s.m.r.SolrJmxReporter JMX monitoring for 'solr.jvm' (registry 'solr.jvm') enabled at server: com.sun.jmx.mbeanserver.JmxMBeanServer@75939a61
   [junit4]   2> 469278 INFO  (TEST-TestDynamicLoading.testDynamicLoading-seed#[1C894DE142694CE6]) [n:127.0.0.1:36981_mkb    ] o.a.s.m.r.SolrJmxReporter JMX monitoring for 'solr.jetty' (registry 'solr.jetty') enabled at server: com.sun.jmx.mbeanserver.JmxMBeanServer@75939a61
   [junit4]   2> 469278 INFO  (TEST-TestDynamicLoading.testDynamicLoading-seed#[1C894DE142694CE6]) [n:127.0.0.1:36981_mkb    ] o.a.s.c.CorePropertiesLocator Found 0 core definitions underneath /home/jenkins/workspace/Lucene-Solr-8.x-Linux/solr/build/solr-core/test/J2/temp/solr.core.TestDynamicLoading_1C894DE142694CE6-001/control-001/cores
   [junit4]   2> 469293 INFO  (zkConnectionManagerCallback-3614-thread-1) [    ] o.a.s.c.c.ConnectionManager zkClient has connected
   [junit4]   2> 469293 INFO  (TEST-TestDynamicLoading.testDynamicLoading-seed#[1C894DE142694CE6]) [    ] o.a.s.c.c.ZkStateReader Updated live nodes from ZooKeeper... (0) -> (1)
   [junit4]   2> 469294 INFO  (TEST-TestDynamicLoading.testDynamicLoading-seed#[1C894DE142694CE6]) [    ] o.a.s.c.s.i.ZkClientClusterStateProvider Cluster at 127.0.0.1:43041/solr ready
   [junit4]   2> 469305 INFO  (qtp834727002-10388) [n:127.0.0.1:36981_mkb    ] o.a.s.h.a.CollectionsHandler Invoked Collection Action :create with params collection.configName=conf1&name=control_collection&nrtReplicas=1&action=CREATE&numShards=1&createNodeSet=127.0.0.1:36981_mkb&wt=javabin&version=2 and sendToOCPQueue=true
   [junit4]   2> 469308 INFO  (OverseerThreadFactory-2772-thread-1-processing-n:127.0.0.1:36981_mkb) [n:127.0.0.1:36981_mkb    ] o.a.s.c.a.c.CreateCollectionCmd Create collection control_collection
   [junit4]   2> 469438 INFO  (qtp834727002-10389) [n:127.0.0.1:36981_mkb    x:control_collection_shard1_replica_n1] o.a.s.h.a.CoreAdminOperation core create command qt=/admin/cores&collection.configName=conf1&newCollection=true&name=control_collection_shard1_replica_n1&action=CREATE&numShards=1&collection=control_collection&shard=shard1&wt=javabin&version=2&replicaType=NRT
   [junit4]   2> 469438 INFO  (qtp834727002-10389) [n:127.0.0.1:36981_mkb    x:control_collection_shard1_replica_n1] o.a.s.c.TransientSolrCoreCacheDefault Allocating transient cache for 4 transient cores
   [junit4]   2> 470473 INFO  (qtp834727002-10389) [n:127.0.0.1:36981_mkb c:control_collection s:shard1  x:control_collection_shard1_replica_n1] o.a.s.c.SolrConfig Using Lucene MatchVersion: 8.2.0
   [junit4]   2> 470487 INFO  (qtp834727002-10389) [n:127.0.0.1:36981_mkb c:control_collection s:shard1  x:control_collection_shard1_replica_n1] o.a.s.s.IndexSchema [control_collection_shard1_replica_n1] Schema name=test
   [junit4]   2> 470580 INFO  (qtp834727002-10389) [n:127.0.0.1:36981_mkb c:control_collection s:shard1  x:control_collection_shard1_replica_n1] o.a.s.s.IndexSchema Loaded schema test/1.0 with uniqueid field id
   [junit4]   2> 470604 INFO  (qtp834727002-10389) [n:127.0.0.1:36981_mkb c:control_collection s:shard1  x:control_collection_shard1_replica_n1] o.a.s.c.CoreContainer Creating SolrCore 'control_collection_shard1_replica_n1' using configuration from collection control_collection, trusted=true
   [junit4]   2> 470604 INFO  (qtp834727002-10389) [n:127.0.0.1:36981_mkb c:control_collection s:shard1  x:control_collection_shard1_replica_n1] o.a.s.m.r.SolrJmxReporter JMX monitoring for 'solr.core.control_collection.shard1.replica_n1' (registry 'solr.core.control_collection.shard1.replica_n1') enabled at server: com.sun.jmx.mbeanserver.JmxMBeanServer@75939a61
   [junit4]   2> 470604 INFO  (qtp834727002-10389) [n:127.0.0.1:36981_mkb c:control_collection s:shard1  x:control_collection_shard1_replica_n1] o.a.s.c.SolrCore [[control_collection_shard1_replica_n1] ] Opening new SolrCore at [/home/jenkins/workspace/Lucene-Solr-8.x-Linux/solr/build/solr-core/test/J2/temp/solr.core.TestDynamicLoading_1C894DE142694CE6-001/control-001/cores/control_collection_shard1_replica_n1], dataDir=[/home/jenkins/workspace/Lucene-Solr-8.x-Linux/solr/build/solr-core/test/J2/temp/solr.core.TestDynamicLoading_1C894DE142694CE6-001/control-001/cores/control_collection_shard1_replica_n1/data/]
   [junit4]   2> 470606 INFO  (qtp834727002-10389) [n:127.0.0.1:36981_mkb c:control_collection s:shard1  x:control_collection_shard1_replica_n1] o.a.s.u.RandomMergePolicy RandomMergePolicy wrapping class org.apache.lucene.index.TieredMergePolicy: [TieredMergePolicy: maxMergeAtOnce=14, maxMergeAtOnceExplicit=38, maxMergedSegmentMB=30.3935546875, floorSegmentMB=0.8447265625, forceMergeDeletesPctAllowed=25.001717807465287, segmentsPerTier=20.0, maxCFSSegmentSizeMB=8.796093022207999E12, noCFSRatio=0.2853107958136259, deletesPctAllowed=34.72027039793569
   [junit4]   2> 470607 WARN  (qtp834727002-10389) [n:127.0.0.1:36981_mkb c:control_collection s:shard1  x:control_collection_shard1_replica_n1] o.a.s.c.RequestHandlers INVALID paramSet a in requestHandler {type = requestHandler,name = /dump,class = DumpRequestHandler,attributes = {initParams=a, name=/dump, class=DumpRequestHandler},args = {defaults={a=A,b=B}}}
   [junit4]   2> 470635 INFO  (qtp834727002-10389) [n:127.0.0.1:36981_mkb c:control_collection s:shard1  x:control_collection_shard1_replica_n1] o.a.s.u.UpdateHandler Using UpdateLog implementation: org.apache.solr.update.UpdateLog
   [junit4]   2> 470635 INFO  (qtp834727002-10389) [n:127.0.0.1:36981_mkb c:control_collection s:shard1  x:control_collection_shard1_replica_n1] o.a.s.u.UpdateLog Initializing UpdateLog: dataDir= defaultSyncLevel=FLUSH numRecordsToKeep=100 maxNumLogsToKeep=10 numVersionBuckets=65536
   [junit4]   2> 470636 INFO  (qtp834727002-10389) [n:127.0.0.1:36981_mkb c:control_collection s:shard1  x:control_collection_shard1_replica_n1] o.a.s.u.CommitTracker Hard AutoCommit: disabled
   [junit4]   2> 470636 INFO  (qtp834727002-10389) [n:127.0.0.1:36981_mkb c:control_collection s:shard1  x:control_collection_shard1_replica_n1] o.a.s.u.CommitTracker Soft AutoCommit: disabled
   [junit4]   2> 470636 INFO  (qtp834727002-10389) [n:127.0.0.1:36981_mkb c:control_collection s:shard1  x:control_collection_shard1_replica_n1] o.a.s.u.RandomMergePolicy RandomMergePolicy wrapping class org.apache.lucene.index.AlcoholicMergePolicy: [AlcoholicMergePolicy: minMergeSize=0, mergeFactor=10, maxMergeSize=1775058239, maxMergeSizeForForcedMerge=9223372036854775807, calibrateSizeByDeletes=true, maxMergeDocs=2147483647, maxCFSSegmentSizeMB=8.796093022207999E12, noCFSRatio=0.1]
   [junit4]   2> 470637 INFO  (qtp834727002-10389) [n:127.0.0.1:36981_mkb c:control_collection s:shard1  x:control_collection_shard1_replica_n1] o.a.s.s.SolrIndexSearcher Opening [Searcher@519e8bb1[control_collection_shard1_replica_n1] main]
   [junit4]   2> 470637 INFO  (qtp834727002-10389) [n:127.0.0.1:36981_mkb c:control_collection s:shard1  x:control_collection_shard1_replica_n1] o.a.s.r.ManagedResourceStorage Configured ZooKeeperStorageIO with znodeBase: /configs/conf1
   [junit4]   2> 470637 INFO  (qtp834727002-10389) [n:127.0.0.1:36981_mkb c:control_collection s:shard1  x:control_collection_shard1_replica_n1] o.a.s.r.ManagedResourceStorage Loaded null at path _rest_managed.json using ZooKeeperStorageIO:path=/configs/conf1
   [junit4]   2> 470638 INFO  (qtp834727002-10389) [n:127.0.0.1:36981_mkb c:control_collection s:shard1  x:control_collection_shard1_replica_n1] o.a.s.h.ReplicationHandler Commits will be reserved for 10000ms.
   [junit4]   2> 470638 INFO  (qtp834727002-10389) [n:127.0.0.1:36981_mkb c:control_collection s:shard1  x:control_collection_shard1_replica_n1] o.a.s.u.UpdateLog Could not find max version in index or recent updates, using new clock 1633862933224095744
   [junit4]   2> 470641 INFO  (searcherExecutor-2777-thread-1-processing-n:127.0.0.1:36981_mkb x:control_collection_shard1_replica_n1 c:control_collection s:shard1) [n:127.0.0.1:36981_mkb c:control_collection s:shard1  x:control_collection_shard1_replica_n1] o.a.s.c.SolrCore [control_collection_shard1_replica_n1] Registered new searcher Searcher@519e8bb1[control_collection_shard1_replica_n1] main{ExitableDirectoryReader(UninvertingDirectoryReader())}
   [junit4]   2> 470642 INFO  (qtp834727002-10389) [n:127.0.0.1:36981_mkb c:control_collection s:shard1  x:control_collection_shard1_replica_n1] o.a.s.c.ZkShardTerms Successful update of terms at /collections/control_collection/terms/shard1 to Terms{values={core_node2=0}, version=0}
   [junit4]   2> 470642 INFO  (qtp834727002-10389) [n:127.0.0.1:36981_mkb c:control_collection s:shard1  x:control_collection_shard1_replica_n1] o.a.s.c.ShardLeaderElectionContextBase make sure parent is created /collections/control_collection/leaders/shard1
   [junit4]   2> 470643 INFO  (qtp834727002-10389) [n:127.0.0.1:36981_mkb c:control_collection s:shard1  x:control_collection_shard1_replica_n1] o.a.s.c.ShardLeaderElectionContext Enough replicas found to continue.
   [junit4]   2> 470643 INFO  (qtp834727002-10389) [n:127.0.0.1:36981_mkb c:control_collection s:shard1  x:control_collection_shard1_replica_n1] o.a.s.c.ShardLeaderElectionContext I may be the new leader - try and sync
   [junit4]   2> 470643 INFO  (qtp834727002-10389) [n:127.0.0.1:36981_mkb c:control_collection s:shard1  x:control_collection_shard1_replica_n1] o.a.s.c.SyncStrategy Sync replicas to https://127.0.0.1:36981/mkb/control_collection_shard1_replica_n1/
   [junit4]   2> 470643 INFO  (qtp834727002-10389) [n:127.0.0.1:36981_mkb c:control_collection s:shard1  x:control_collection_shard1_replica_n1] o.a.s.c.SyncStrategy Sync Success - now sync replicas to me
   [junit4]   2> 470643 INFO  (qtp834727002-10389) [n:127.0.0.1:36981_mkb c:control_collection s:shard1  x:control_collection_shard1_replica_n1] o.a.s.c.SyncStrategy https://127.0.0.1:36981/mkb/control_collection_shard1_replica_n1/ has no replicas
   [junit4]   2> 470643 INFO  (qtp834727002-10389) [n:127.0.0.1:36981_mkb c:control_collection s:shard1  x:control_collection_shard1_replica_n1] o.a.s.c.ShardLeaderElectionContextBase Creating leader registration node /collections/control_collection/leaders/shard1/leader after winning as /collections/control_collection/leader_elect/shard1/election/72271795127320581-core_node2-n_0000000000
   [junit4]   2> 470644 INFO  (qtp834727002-10389) [n:127.0.0.1:36981_mkb c:control_collection s:shard1  x:control_collection_shard1_replica_n1] o.a.s.c.ShardLeaderElectionContext I am the new leader: https://127.0.0.1:36981/mkb/control_collection_shard1_replica_n1/ shard1
   [junit4]   2> 470745 INFO  (zkCallback-3600-thread-1) [    ] o.a.s.c.c.ZkStateReader A cluster state change: [WatchedEvent state:SyncConnected type:NodeDataChanged path:/collections/control_collection/state.json] for collection [control_collection] has occurred - updating... (live nodes size: [1])
   [junit4]   2> 470745 INFO  (zkCallback-3600-thread-2) [    ] o.a.s.c.c.ZkStateReader A cluster state change: [WatchedEvent state:SyncConnected type:NodeDataChanged path:/collections/control_collection/state.json] for collection [control_collection] has occurred - updating... (live nodes size: [1])
   [junit4]   2> 470746 INFO  (qtp834727002-10389) [n:127.0.0.1:36981_mkb c:control_collection s:shard1  x:control_collection_shard1_replica_n1] o.a.s.c.ZkController I am the leader, no recovery necessary
   [junit4]   2> 470747 INFO  (qtp834727002-10389) [n:127.0.0.1:36981_mkb c:control_collection s:shard1  x:control_collection_shard1_replica_n1] o.a.s.s.HttpSolrCall [admin] webapp=null path=/admin/cores params={qt=/admin/cores&collection.configName=conf1&newCollection=true&name=control_collection_shard1_replica_n1&action=CREATE&numShards=1&collection=control_collection&shard=shard1&wt=javabin&version=2&replicaType=NRT} status=0 QTime=1308
   [junit4]   2> 470748 INFO  (qtp834727002-10388) [n:127.0.0.1:36981_mkb    ] o.a.s.h.a.CollectionsHandler Wait for new collection to be active for at most 45 seconds. Check all shard replicas
   [junit4]   2> 470847 INFO  (zkCallback-3600-thread-2) [    ] o.a.s.c.c.ZkStateReader A cluster state change: [WatchedEvent state:SyncConnected type:NodeDataChanged path:/collections/control_collection/state.json] for collection [control_collection] has occurred - updating... (live nodes size: [1])
   [junit4]   2> 470847 INFO  (zkCallback-3600-thread-3) [    ] o.a.s.c.c.ZkStateReader A cluster state change: [WatchedEvent state:SyncConnected type:NodeDataChanged path:/collections/control_collection/state.json] for collection [control_collection] has occurred - updating... (live nodes size: [1])
   [junit4]   2> 470847 INFO  (zkCallback-3600-thread-1) [    ] o.a.s.c.c.ZkStateReader A cluster state change: [WatchedEvent state:SyncConnected type:NodeDataChanged path:/collections/control_collection/state.json] for collection [control_collection] has occurred - updating... (live nodes size: [1])
   [junit4]   2> 470847 INFO  (qtp834727002-10388) [n:127.0.0.1:36981_mkb    ] o.a.s.s.HttpSolrCall [admin] webapp=null path=/admin/collections params={collection.configName=conf1&name=control_collection&nrtReplicas=1&action=CREATE&numShards=1&createNodeSet=127.0.0.1:36981_mkb&wt=javabin&version=2} status=0 QTime=1541
   [junit4]   2> 470850 INFO  (zkConnectionManagerCallback-3620-thread-1) [    ] o.a.s.c.c.ConnectionManager zkClient has connected
   [junit4]   2> 470850 INFO  (TEST-TestDynamicLoading.testDynamicLoading-seed#[1C894DE142694CE6]) [    ] o.a.s.c.c.ZkStateReader Updated live nodes from ZooKeeper... (0) -> (1)
   [junit4]   2> 470851 INFO  (TEST-TestDynamicLoading.testDynamicLoading-seed#[1C894DE142694CE6]) [    ] o.a.s.c.s.i.ZkClientClusterStateProvider Cluster at 127.0.0.1:43041/solr ready
   [junit4]   2> 470851 INFO  (TEST-TestDynamicLoading.testDynamicLoading-seed#[1C894DE142694CE6]) [    ] o.a.s.c.ChaosMonkey monkey: init - expire sessions:false cause connection loss:false
   [junit4]   2> 470852 INFO  (qtp834727002-10389) [n:127.0.0.1:36981_mkb    ] o.a.s.h.a.CollectionsHandler Invoked Collection Action :create with params collection.configName=conf1&name=collection1&nrtReplicas=1&action=CREATE&numShards=2&createNodeSet=&stateFormat=2&wt=javabin&version=2 and sendToOCPQueue=true
   [junit4]   2> 470854 INFO  (OverseerCollectionConfigSetProcessor-72271795127320581-127.0.0.1:36981_mkb-n_0000000000) [n:127.0.0.1:36981_mkb    ] o.a.s.c.OverseerTaskQueue Response ZK path: /overseer/collection-queue-work/qnr-0000000000 doesn't exist.  Requestor may have disconnected from ZooKeeper
   [junit4]   2> 470854 INFO  (OverseerThreadFactory-2772-thread-2-processing-n:127.0.0.1:36981_mkb) [n:127.0.0.1:36981_mkb    ] o.a.s.c.a.c.CreateCollectionCmd Create collection collection1
   [junit4]   2> 471056 WARN  (OverseerThreadFactory-2772-thread-2-processing-n:127.0.0.1:36981_mkb) [n:127.0.0.1:36981_mkb    ] o.a.s.c.a.c.CreateCollectionCmd It is unusual to create a collection (collection1) without cores.
   [junit4]   2> 471057 INFO  (qtp834727002-10389) [n:127.0.0.1:36981_mkb    ] o.a.s.h.a.CollectionsHandler Wait for new collection to be active for at most 45 seconds. Check all shard replicas
   [junit4]   2> 471057 INFO  (qtp834727002-10389) [n:127.0.0.1:36981_mkb    ] o.a.s.s.HttpSolrCall [admin] webapp=null path=/admin/collections params={collection.configName=conf1&name=collection1&nrtReplicas=1&action=CREATE&numShards=2&createNodeSet=&stateFormat=2&wt=javabin&version=2} status=0 QTime=205
   [junit4]   2> 471058 INFO  (TEST-TestDynamicLoading.testDynamicLoading-seed#[1C894DE142694CE6]) [    ] o.a.s.c.AbstractFullDistribZkTestBase Creating jetty instances pullReplicaCount=0 numOtherReplicas=4
   [junit4]   2> 471137 INFO  (TEST-TestDynamicLoading.testDynamicLoading-seed#[1C894DE142694CE6]) [    ] o.a.s.c.AbstractFullDistribZkTestBase create jetty 1 in directory /home/jenkins/workspace/Lucene-Solr-8.x-Linux/solr/build/solr-core/test/J2/temp/solr.core.TestDynamicLoading_1C894DE142694CE6-001/shard-1-001 of type NRT
   [junit4]   2> 471137 WARN  (closeThreadPool-3621-thread-1) [    ] o.e.j.s.AbstractConnector Ignoring deprecated socket close linger time
   [junit4]   2> 471138 INFO  (closeThreadPool-3621-thread-1) [    ] o.a.s.c.s.e.JettySolrRunner Start Jetty (original configured port=0)
   [junit4]   2> 471138 INFO  (closeThreadPool-3621-thread-1) [    ] o.a.s.c.s.e.JettySolrRunner Trying to start Jetty on port 0 try number 1 ...
   [junit4]   2> 471138 INFO  (closeThreadPool-3621-thread-1) [    ] o.e.j.s.Server jetty-9.4.14.v20181114; built: 2018-11-14T21:20:31.478Z; git: c4550056e785fb5665914545889f21dc136ad9e6; jvm 1.8.0_201-b09
   [junit4]   2> 471157 INFO  (closeThreadPool-3621-thread-1) [    ] o.e.j.s.session DefaultSessionIdManager workerName=node0
   [junit4]   2> 471157 INFO  (closeThreadPool-3621-thread-1) [    ] o.e.j.s.session No SessionScavenger set, using defaults
   [junit4]   2> 471158 INFO  (closeThreadPool-3621-thread-1) [    ] o.e.j.s.session node0 Scavenging every 660000ms
   [junit4]   2> 471165 INFO  (closeThreadPool-3621-thread-1) [    ] o.e.j.s.h.ContextHandler Started o.e.j.s.ServletContextHandler@2b6f8af3{/mkb,null,AVAILABLE}
   [junit4]   2> 471165 WARN  (closeThreadPool-3621-thread-1) [    ] o.e.j.u.s.S.config No Client EndPointIdentificationAlgorithm configured for SslContextFactory@105e5980[provider=null,keyStore=null,trustStore=null]
   [junit4]   2> 471166 INFO  (closeThreadPool-3621-thread-1) [    ] o.e.j.s.AbstractConnector Started ServerConnector@4ddfb942{SSL,[ssl, http/1.1]}{127.0.0.1:39141}
   [junit4]   2> 471166 INFO  (closeThreadPool-3621-thread-1) [    ] o.e.j.s.Server Started @471202ms
   [junit4]   2> 471166 INFO  (closeThreadPool-3621-thread-1) [    ] o.a.s.c.s.e.JettySolrRunner Jetty properties: {solr.data.dir=/home/jenkins/workspace/Lucene-Solr-8.x-Linux/solr/build/solr-core/test/J2/temp/solr.core.TestDynamicLoading_1C894DE142694CE6-001/tempDir-001/jetty1, replicaType=NRT, solrconfig=solrconfig.xml, hostContext=/mkb, hostPort=39141, coreRootDirectory=/home/jenkins/workspace/Lucene-Solr-8.x-Linux/solr/build/solr-core/test/J2/temp/solr.core.TestDynamicLoading_1C894DE142694CE6-001/shard-1-001/cores}
   [junit4]   2> 471166 ERROR (closeThreadPool-3621-thread-1) [    ] o.a.s.u.StartupLoggingUtils Missing Java Option solr.log.dir. Logging may be missing or incomplete.
   [junit4]   2> 471166 INFO  (closeThreadPool-3621-thread-1) [    ] o.a.s.s.SolrDispatchFilter Using logger factory org.apache.logging.slf4j.Log4jLoggerFactory
   [junit4]   2> 471166 INFO  (closeThreadPool-3621-thread-1) [    ] o.a.s.s.SolrDispatchFilter  ___      _       Welcome to Apache Solr? version 8.2.0
   [junit4]   2> 471166 INFO  (closeThreadPool-3621-thread-1) [    ] o.a.s.s.SolrDispatchFilter / __| ___| |_ _   Starting in cloud mode on port null
   [junit4]   2> 471166 INFO  (closeThreadPool-3621-thread-1) [    ] o.a.s.s.SolrDispatchFilter \__ \/ _ \ | '_|  Install dir: null
   [junit4]   2> 471166 INFO  (closeThreadPool-3621-thread-1) [    ] o.a.s.s.SolrDispatchFilter |___/\___/_|_|    Start time: 2019-05-18T09:51:56.472Z
   [junit4]   2> 471177 INFO  (zkConnectionManagerCallback-3623-thread-1) [    ] o.a.s.c.c.ConnectionManager zkClient has connected
   [junit4]   2> 471178 INFO  (closeThreadPool-3621-thread-1) [    ] o.a.s.s.SolrDispatchFilter Loading solr.xml from SolrHome (not found in ZooKeeper)
   [junit4]   2> 471178 INFO  (closeThreadPool-3621-thread-1) [    ] o.a.s.c.SolrXmlConfig Loading container configuration from /home/jenkins/workspace/Lucene-Solr-8.x-Linux/solr/build/solr-core/test/J2/temp/solr.core.TestDynamicLoading_1C894DE142694CE6-001/shard-1-001/solr.xml
   [junit4]   2> 471180 INFO  (closeThreadPool-3621-thread-1) [    ] o.a.s.c.SolrXmlConfig Configuration parameter autoReplicaFailoverWorkLoopDelay is ignored
   [junit4]   2> 471180 INFO  (closeThreadPool-3621-thread-1) [    ] o.a.s.c.SolrXmlConfig Configuration parameter autoReplicaFailoverBadNodeExpiration is ignored
   [junit4]   2> 471181 INFO  (closeThreadPool-3621-thread-1) [    ] o.a.s.c.SolrXmlConfig MBean server found: com.sun.jmx.mbeanserver.JmxMBeanServer@75939a61, but no JMX reporters were configured - adding default JMX reporter.
   [junit4]   2> 471217 INFO  (TEST-TestDynamicLoading.testDynamicLoading-seed#[1C894DE142694CE6]) [    ] o.a.s.c.AbstractFullDistribZkTestBase create jetty 2 in directory /home/jenkins/workspace/Lucene-Solr-8.x-Linux/solr/build/solr-core/test/J2/temp/solr.core.TestDynamicLoading_1C894DE142694CE6-001/shard-2-001 of type NRT
   [junit4]   2> 471230 WARN  (closeThreadPool-3621-thread-2) [    ] o.e.j.s.AbstractConnector Ignoring deprecated socket close linger time
   [junit4]   2> 471230 INFO  (closeThreadPool-3621-thread-2) [    ] o.a.s.c.s.e.JettySolrRunner Start Jetty (original configured port=0)
   [junit4]   2> 471230 INFO  (closeThreadPool-3621-thread-2) [    ] o.a.s.c.s.e.JettySolrRunner Trying to start Jetty on port 0 try number 1 ...
   [junit4]   2> 471230 INFO  (closeThreadPool-3621-thread-2) [    ] o.e.j.s.Server jetty-9.4.14.v20181114; built: 2018-11-14T21:20:31.478Z; git: c4550056e785fb5665914545889f21dc136ad9e6; jvm 1.8.0_201-b09
   [junit4]   2> 471233 INFO  (closeThreadPool-3621-thread-2) [    ] o.e.j.s.session DefaultSessionIdManager workerName=node0
   [junit4]   2> 471233 INFO  (closeThreadPool-3621-thread-2) [    ] o.e.j.s.session No SessionScavenger set, using defaults
   [junit4]   2> 471233 INFO  (closeThreadPool-3621-thread-2) [    ] o.e.j.s.session node0 Scavenging every 600000ms
   [junit4]   2> 471233 INFO  (closeThreadPool-3621-thread-2) [    ] o.e.j.s.h.ContextHandler Started o.e.j.s.ServletContextHandler@29572c09{/mkb,null,AVAILABLE}
   [junit4]   2> 471233 WARN  (closeThreadPool-3621-thread-2) [    ] o.e.j.u.s.S.config No Client EndPointIdentificationAlgorithm configured for SslContextFactory@17fe1655[provider=null,keyStore=null,trustStore=null]
   [junit4]   2> 471234 INFO  (closeThreadPool-3621-thread-2) [    ] o.e.j.s.AbstractConnector Started ServerConnector@654b68ba{SSL,[ssl, http/1.1]}{127.0.0.1:33111}
   [junit4]   2> 471234 INFO  (closeThreadPool-3621-thread-2) [    ] o.e.j.s.Server Started @471270ms
   [junit4]   2> 471234 INFO  (closeThreadPool-3621-thread-2) [    ] o.a.s.c.s.e.JettySolrRunner Jetty properties: {solr.data.dir=/home/jenkins/workspace/Lucene-Solr-8.x-Linux/solr/build/solr-core/test/J2/temp/solr.core.TestDynamicLoading_1C894DE142694CE6-001/tempDir-001/jetty2, replicaType=NRT, solrconfig=solrconfig.xml, hostContext=/mkb, hostPort=33111, coreRootDirectory=/home/jenkins/workspace/Lucene-Solr-8.x-Linux/solr/build/solr-core/test/J2/temp/solr.core.TestDynamicLoading_1C894DE142694CE6-001/shard-2-001/cores}
   [junit4]   2> 471234 ERROR (closeThreadPool-3621-thread-2) [    ] o.a.s.u.StartupLoggingUtils Missing Java Option solr.log.dir. Logging may be missing or incomplete.
   [junit4]   2> 471234 INFO  (closeThreadPool-3621-thread-2) [    ] o.a.s.s.SolrDispatchFilter Using logger factory org.apache.logging.slf4j.Log4jLoggerFactory
   [junit4]   2> 471234 INFO  (closeThreadPool-3621-thread-2) [    ] o.a.s.s.SolrDispatchFilter  ___      _       Welcome to Apache Solr? version 8.2.0
   [junit4]   2> 471234 INFO  (closeThreadPool-3621-thread-2) [    ] o.a.s.s.SolrDispatchFilter / __| ___| |_ _   Starting in cloud mode on port null
   [junit4]   2> 471234 INFO  (closeThreadPool-3621-thread-2) [    ] o.a.s.s.SolrDispatchFilter \__ \/ _ \ | '_|  Install dir: null
   [junit4]   2> 471234 INFO  (closeThreadPool-3621-thread-2) [    ] o.a.s.s.SolrDispatchFilter |___/\___/_|_|    Start time: 2019-05-18T09:51:56.540Z
   [junit4]   2> 471237 INFO  (closeThreadPool-3621-thread-1) [    ] o.a.s.h.c.HttpShardHandlerFactory Host whitelist initialized: WhitelistHostChecker [whitelistHosts=null, whitelistHostCheckingEnabled=false]
   [junit4]   2> 471237 WARN  (closeThreadPool-3621-thread-1) [    ] o.a.s.c.s.i.Http2SolrClient Create Http2SolrClient with HTTP/1.1 transport since Java 8 or lower versions does not support SSL + HTTP/2
   [junit4]   2> 471251 INFO  (zkConnectionManagerCallback-3626-thread-1) [    ] o.a.s.c.c.ConnectionManager zkClient has connected
   [junit4]   2> 471251 WARN  (closeThreadPool-3621-thread-1) [    ] o.e.j.u.s.S.config No Client EndPointIdentificationAlgorithm configured for SslContextFactory@da85d1c[provider=null,keyStore=null,trustStore=null]
   [junit4]   2> 471253 WARN  (closeThreadPool-3621-thread-1) [    ] o.a.s.c.s.i.Http2SolrClient Create Http2SolrClient with HTTP/1.1 transport since Java 8 or lower versions does not support SSL + HTTP/2
   [junit4]   2> 471254 WARN  (closeThreadPool-3621-thread-1) [    ] o.e.j.u.s.S.config No Client EndPointIdentificationAlgorithm configured for SslContextFactory@18ee5d9c[provider=null,keyStore=null,trustStore=null]
   [junit4]   2> 471254 INFO  (closeThreadPool-3621-thread-2) [    ] o.a.s.s.SolrDispatchFilter Loading solr.xml from SolrHome (not found in ZooKeeper)
   [junit4]   2> 471254 INFO  (closeThreadPool-3621-thread-2) [    ] o.a.s.c.SolrXmlConfig Loading container configuration from /home/jenkins/workspace/Lucene-Solr-8.x-Linux/solr/build/solr-core/test/J2/temp/solr.core.TestDynamicLoading_1C894DE142694CE6-001/shard-2-001/solr.xml
   [junit4]   2> 471254 INFO  (closeThreadPool-3621-thread-1) [    ] o.a.s.c.ZkContainer Zookeeper client=127.0.0.1:43041/solr
   [junit4]   2> 471255 WARN  (NIOServerCxn.Factory:0.0.0.0/0.0.0.0:0) [    ] o.a.z.s.NIOServerCnxn Unable to read additional data from client sessionid 0x100c2d093d8000a, likely client has closed socket
   [junit4]   2> 471256 INFO  (closeThreadPool-3621-thread-2) [    ] o.a.s.c.SolrXmlConfig Configuration parameter autoReplicaFailoverWorkLoopDelay is ignored
   [junit4]   2> 471256 INFO  (closeThreadPool-3621-thread-2) [    ] o.a.s.c.SolrXmlConfig Configuration parameter autoReplicaFailoverBadNodeExpiration is ignored
   [junit4]   2> 471257 INFO  (closeThreadPool-3621-thread-2) [    ] o.a.s.c.SolrXmlConfig MBean server found: com.sun.jmx.mbeanserver.JmxMBeanServer@75939a61, but no JMX reporters were configured - adding default JMX reporter.
   [junit4]   2> 471281 INFO  (zkConnectionManagerCallback-3632-thread-1) [    ] o.a.s.c.c.ConnectionManager zkClient has connected
   [junit4]   2> 471294 INFO  (TEST-TestDynamicLoading.testDynamicLoading-seed#[1C894DE142694CE6]) [    ] o.a.s.c.AbstractFullDistribZkTestBase create jetty 3 in directory /home/jenkins/workspace/Lucene-Solr-8.x-Linux/solr/build/solr-core/test/J2/temp/solr.core.TestDynamicLoading_1C894DE142694CE6-001/shard-3-001 of type NRT
   [junit4]   2> 471306 WARN  (closeThreadPool-3621-thread-3) [    ] o.e.j.s.AbstractConnector Ignoring deprecated socket close linger time
   [junit4]   2> 471306 INFO  (closeThreadPool-3621-thread-3) [    ] o.a.s.c.s.e.JettySolrRunner Start Jetty (original configured port=0)
   [junit4]   2> 471306 INFO  (closeThreadPool-3621-thread-3) [    ] o.a.s.c.s.e.JettySolrRunner Trying to start Jetty on port 0 try number 1 ...
   [junit4]   2> 471306 INFO  (closeThreadPool-3621-thread-3) [    ] o.e.j.s.Server jetty-9.4.14.v20181114; built: 2018-11-14T21:20:31.478Z; git: c4550056e785fb5665914545889f21dc136ad9e6; jvm 1.8.0_201-b09
   [junit4]   2> 471313 INFO  (zkConnectionManagerCallback-3635-thread-1) [    ] o.a.s.c.c.ConnectionManager zkClient has connected
   [junit4]   2> 471316 INFO  (closeThreadPool-3621-thread-1) [n:127.0.0.1:39141_mkb    ] o.a.s.c.c.ZkStateReader Updated live nodes from ZooKeeper... (0) -> (1)
   [junit4]   2> 471318 INFO  (closeThreadPool-3621-thread-1) [n:127.0.0.1:39141_mkb    ] o.a.s.c.ZkController Publish node=127.0.0.1:39141_mkb as DOWN
   [junit4]   2> 471319 INFO  (closeThreadPool-3621-thread-1) [n:127.0.0.1:39141_mkb    ] o.a.s.c.TransientSolrCoreCacheDefault Allocating transient cache for 4 transient cores
   [junit4]   2> 471319 INFO  (closeThreadPool-3621-thread-1) [n:127.0.0.1:39141_mkb    ] o.a.s.c.ZkController Register node as live in ZooKeeper:/live_nodes/127.0.0.1:39141_mkb
   [junit4]   2> 471319 INFO  (zkCallback-3600-thread-4) [    ] o.a.s.c.c.ZkStateReader Updated live nodes from ZooKeeper... (1) -> (2)
   [junit4]   2> 471321 INFO  (zkCallback-3607-thread-1) [    ] o.a.s.c.c.ZkStateReader Updated live nodes from ZooKeeper... (1) -> (2)
   [junit4]   2> 471349 INFO  (closeThreadPool-3621-thread-3) [    ] o.e.j.s.session DefaultSessionIdManager workerName=node0
   [junit4]   2> 471349 INFO  (closeThreadPool-3621-thread-3) [    ] o.e.j.s.session No SessionScavenger set, using defaults
   [junit4]   2> 471349 INFO  (closeThreadPool-3621-thread-3) [    ] o.e.j.s.session node0 Scavenging every 600000ms
   [junit4]   2> 471353 INFO  (closeThreadPool-3621-thread-3) [    ] o.e.j.s.h.ContextHandler Started o.e.j.s.ServletContextHandler@7ce63383{/mkb,null,AVAILABLE}
   [junit4]   2> 471354 WARN  (closeThreadPool-3621-thread-3) [    ] o.e.j.u.s.S.config No Client EndPointIdentificationAlgorithm configured for SslContextFactory@41de6804[provider=null,keyStore=null,trustStore=null]
   [junit4]   2> 471361 INFO  (zkCallback-3619-thread-1) [    ] o.a.s.c.c.ZkStateReader Updated live nodes from ZooKeeper... (1) -> (2)
   [junit4]   2> 471381 INFO  (zkCallback-3634-thread-1) [    ] o.a.s.c.c.ZkStateReader Updated live nodes from ZooKeeper... (1) -> (2)
   [junit4]   2> 471405 INFO  (closeThreadPool-3621-thread-3) [    ] o.e.j.s.AbstractConnector Started ServerConnector@63a6cc48{SSL,[ssl, http/1.1]}{127.0.0.1:39313}
   [junit4]   2> 471405 INFO  (closeThreadPool-3621-thread-3) [    ] o.e.j.s.Server Started @471441ms
   [junit4]   2> 471405 INFO  (closeThreadPool-3621-thread-3) [    ] o.a.s.c.s.e.JettySolrRunner Jetty properties: {solr.data.dir=/home/jenkins/workspace/Lucene-Solr-8.x-Linux/solr/build/solr-core/test/J2/temp/solr.core.TestDynamicLoading_1C894DE142694CE6-001/tempDir-001/jetty3, replicaType=NRT, solrconfig=solrconfig.xml, hostContext=/mkb, hostPort=39313, coreRootDirectory=/home/jenkins/workspace/Lucene-Solr-8.x-Linux/solr/build/solr-core/test/J2/temp/solr.core.TestDynamicLoading_1C894DE142694CE6-001/shard-3-001/cores}
   [junit4]   2> 471405 ERROR (closeThreadPool-3621-thread-3) [    ] o.a.s.u.StartupLoggingUtils Missing Java Option solr.log.dir. Logging may be missing or incomplete.
   [junit4]   2> 471405 INFO  (closeThreadPool-3621-thread-3) [    ] o.a.s.s.SolrDispatchFilter Using logger factory org.apache.logging.slf4j.Log4jLoggerFactory
   [junit4]   2> 471405 INFO  (closeThreadPool-3621-thread-3) [    ] o.a.s.s.SolrDispatchFilter  ___      _       Welcome to Apache Solr? version 8.2.0
   [junit4]   2> 471405 INFO  (closeThreadPool-3621-thread-3) [    ] o.a.s.s.SolrDispatchFilter / __| ___| |_ _   Starting in cloud mode on port null
   [junit4]   2> 471405 INFO  (closeThreadPool-3621-thread-3) [    ] o.a.s.s.SolrDispatchFilter \__ \/ _ \ | '_|  Install dir: null
   [junit4]   2> 471405 INFO  (closeThreadPool-3621-thread-3) [    ] o.a.s.s.SolrDispatchFilter |___/\___/_|_|    Start time: 2019-05-18T09:51:56.711Z
   [junit4]   2> 471406 INFO  (zkConnectionManagerCallback-3642-thread-1) [    ] o.a.s.c.c.ConnectionManager zkClient has connected
   [junit4]   2> 471406 INFO  (closeThreadPool-3621-thread-2) [    ] o.a.s.h.c.HttpShardHandlerFactory Host whitelist initialized: WhitelistHostChecker [whitelistHosts=null, whitelistHostCheckingEnabled=false]
   [junit4]   2> 471406 WARN  (closeThreadPool-3621-thread-2) [    ] o.a.s.c.s.i.Http2SolrClient Create Http2SolrClient with HTTP/1.1 transport since Java 8 or lower versions does not support SSL + HTTP/2
   [junit4]   2> 471407 INFO  (closeThreadPool-3621-thread-1) [n:127.0.0.1:39141_mkb    ] o.a.s.c.c.ZkStateReader Updated live nodes from ZooKeeper... (0) -> (2)
   [junit4]   2> 471407 WARN  (closeThreadPool-3621-thread-2) [    ] o.e.j.u.s.S.config No Client EndPointIdentificationAlgorithm configured for SslContextFactory@606af773[provider=null,keyStore=null,trustStore=null]
   [junit4]   2> 471407 INFO  (closeThreadPool-3621-thread-1) [n:127.0.0.1:39141_mkb    ] o.a.s.c.s.i.ZkClientClusterStateProvider Cluster at 127.0.0.1:43041/solr ready
   [junit4]   2> 471409 WARN  (closeThreadPool-3621-thread-2) [    ] o.a.s.c.s.i.Http2SolrClient Create Http2SolrClient with HTTP/1.1 transport since Java 8 or lower versions does not support SSL + HTTP/2
   [junit4]   2> 471412 INFO  (TEST-TestDynamicLoading.testDynamicLoading-seed#[1C894DE142694CE6]) [    ] o.a.s.c.AbstractFullDistribZkTestBase create jetty 4 in directory /home/jenkins/workspace/Lucene-Solr-8.x-Linux/solr/build/solr-core/test/J2/temp/solr.core.TestDynamicLoading_1C894DE142694CE6-001/shard-4-001 of type NRT
   [junit4]   2> 471418 WARN  (closeThreadPool-3621-thread-4) [    ] o.e.j.s.AbstractConnector Ignoring deprecated socket close linger time
   [junit4]   2> 471418 INFO  (closeThreadPool-3621-thread-4) [    ] o.a.s.c.s.e.JettySolrRunner Start Jetty (original configured port=0)
   [junit4]   2> 471418 INFO  (closeThreadPool-3621-thread-4) [    ] o.a.s.c.s.e.JettySolrRunner Trying to start Jetty on port 0 try number 1 ...
   [junit4]   2> 471418 INFO  (closeThreadPool-3621-thread-4) [    ] o.e.j.s.Server jetty-9.4.14.v20181114; built: 2018-11-14T21:20:31.478Z; git: c4550056e785fb5665914545889f21dc136ad9e6; jvm 1.8.0_201-b09
   [junit4]   2> 471418 INFO  (zkConnectionManagerCallback-3644-thread-1) [    ] o.a.s.c.c.ConnectionManager zkClient has connected
   [junit4]   2> 471419 WARN  (closeThreadPool-3621-thread-2) [    ] o.e.j.u.s.S.config No Client EndPointIdentificationAlgorithm configured for SslContextFactory@508825a9[provider=null,keyStore=null,trustStore=null]
   [junit4]   2> 471419 INFO  (closeThreadPool-3621-thread-1) [n:127.0.0.1:39141_mkb    ] o.a.s.h.a.MetricsHistoryHandler No .system collection, keeping metrics history in memory.
   [junit4]   2> 471420 INFO  (closeThreadPool-3621-thread-2) [    ] o.a.s.c.ZkContainer Zookeeper client=127.0.0.1:43041/solr
   [junit4]   2> 471422 INFO  (closeThreadPool-3621-thread-3) [    ] o.a.s.s.SolrDispatchFilter Loading solr.xml from SolrHome (not found in ZooKeeper)
   [junit4]   2> 471422 INFO  (closeThreadPool-3621-thread-3) [    ] o.a.s.c.SolrXmlConfig Loading container configuration from /home/jenkins/workspace/Lucene-Solr-8.x-Linux/solr/build/solr-core/test/J2/temp/solr.core.TestDynamicLoading_1C894DE142694CE6-001/shard-3-001/solr.xml
   [junit4]   2> 471424 INFO  (closeThreadPool-3621-thread-3) [    ] o.a.s.c.SolrXmlConfig Configuration parameter autoReplicaFailoverWorkLoopDelay is ignored
   [junit4]   2> 471424 INFO  (closeThreadPool-3621-thread-3) [    ] o.a.s.c.SolrXmlConfig Configuration parameter autoReplicaFailoverBadNodeExpiration is ignored
   [junit4]   2> 471425 INFO  (closeThreadPool-3621-thread-3) [    ] o.a.s.c.SolrXmlConfig MBean server found: com.sun.jmx.mbeanserver.JmxMBeanServer@75939a61, but no JMX reporters were configured - adding default JMX reporter.
   [junit4]   2> 471429 INFO  (closeThreadPool-3621-thread-1) [n:127.0.0.1:39141_mkb    ] o.a.s.m.r.SolrJmxReporter JMX monitoring for 'solr.node' (registry 'solr.node') enabled at server: com.sun.jmx.mbeanserver.JmxMBeanServer@75939a61
   [junit4]   2> 471435 INFO  (closeThreadPool-3621-thread-1) [n:127.0.0.1:39141_mkb    ] o.a.s.m.r.SolrJmxReporter JMX monitoring for 'solr.jvm' (registry 'solr.jvm') enabled at server: com.sun.jmx.mbeanserver.JmxMBeanServer@75939a61
   [junit4]   2> 471435 INFO  (closeThreadPool-3621-thread-1) [n:127.0.0.1:39141_mkb    ] o.a.s.m.r.SolrJmxReporter JMX monitoring for 'solr.jetty' (registry 'solr.jetty') enabled at server: com.sun.jmx.mbeanserver.JmxMBeanServer@75939a61
   [junit4]   2> 471435 INFO  (closeThreadPool-3621-thread-1) [n:127.0.0.1:39141_mkb    ] o.a.s.c.CorePropertiesLocator Found 0 core definitions underneath /home/jenkins/workspace/Lucene-Solr-8.x-Linux/solr/build/solr-core/test/J2/temp/solr.core.TestDynamicLoading_1C894DE142694CE6-001/shard-1-001/cores
   [junit4]   2> 471445 INFO  (zkConnectionManagerCallback-3651-thread-1) [    ] o.a.s.c.c.ConnectionManager zkClient has connected
   [junit4]   2> 471461 INFO  (closeThreadPool-3621-thread-4) [    ] o.e.j.s.session DefaultSessionIdManager workerName=node0
   [junit4]   2> 471461 INFO  (closeThreadPool-3621-thread-4) [    ] o.e.j.s.session No SessionScavenger set, using defaults
   [junit4]   2> 471461 INFO  (closeThreadPool-3621-thread-4) [    ] o.e.j.s.session node0 Scavenging every 600000ms
   [junit4]   2> 471473 INFO  (closeThreadPool-3621-thread-3) [    ] o.a.s.h.c.HttpShardHandlerFactory Host whitelist initialized: WhitelistHostChecker [whitelistHosts=null, whitelistHostCheckingEnabled=false]
   [junit4]   2> 471474 WARN  (closeThreadPool-3621-thread-3) [    ] o.a.s.c.s.i.Http2SolrClient Create Http2SolrClient with HTTP/1.1 transport since Java 8 or lower versions does not support SSL + HTTP/2
   [junit4]   2> 471474 INFO  (closeThreadPool-3621-thread-4) [    ] o.e.j.s.h.ContextHandler Started o.e.j.s.ServletContextHandler@658290ff{/mkb,null,AVAILABLE}
   [junit4]   2> 471474 WARN  (closeThreadPool-3621-thread-4) [    ] o.e.j.u.s.S.config No Client EndPointIdentificationAlgorithm configured for SslContextFactory@5ea9cb57[provider=null,keyStore=null,trustStore=null]
   [junit4]   2> 471475 WARN  (closeThreadPool-3621-thread-3) [    ] o.e.j.u.s.S.config No Client EndPointIdentificationAlgorithm configured for SslContextFactory@630a6843[provider=null,keyStore=null,trustStore=null]
   [junit4]   2> 471475 INFO  (zkConnectionManagerCallback-3654-thread-1) [    ] o.a.s.c.c.ConnectionManager zkClient has connected
   [junit4]   2> 471476 WARN  (closeThreadPool-3621-thread-3) [    ] o.a.s.c.s.i.Http2SolrClient Create Http2SolrClient with HTTP/1.1 transport since Java 8 or lower versions does not support SSL + HTTP/2
   [junit4]   2> 471476 WARN  (closeThreadPool-3621-thread-3) [    ] o.e.j.u.s.S.config No Client EndPointIdentificationAlgorithm configured for SslContextFactory@1ffad0[provider=null,keyStore=null,trustStore=null]
   [junit4]   2> 471477 INFO  (closeThreadPool-3621-thread-3) [    ] o.a.s.c.ZkContainer Zookeeper client=127.0.0.1:43041/solr
   [junit4]   2> 471477 INFO  (closeThreadPool-3621-thread-4) [    ] o.e.j.s.AbstractConnector Started ServerConnector@13efaf57{SSL,[ssl, http/1.1]}{127.0.0.1:43751}
   [junit4]   2> 471477 INFO  (closeThreadPool-3621-thread-4) [    ] o.e.j.s.Server Started @471513ms
   [junit4]   2> 471477 INFO  (closeThreadPool-3621-thread-4) [    ] o.a.s.c.s.e.JettySolrRunner Jetty properties: {solr.data.dir=/home/jenkins/workspace/Lucene-Solr-8.x-Linux/solr/build/solr-core/test/J2/temp/solr.core.TestDynamicLoading_1C894DE142694CE6-001/tempDir-001/jetty4, replicaType=NRT, solrconfig=solrconfig.xml, hostContext=/mkb, hostPort=43751, coreRootDirectory=/home/jenkins/workspace/Lucene-Solr-8.x-Linux/solr/build/solr-core/test/J2/temp/solr.core.TestDynamicLoading_1C894DE142694CE6-001/shard-4-001/cores}
   [junit4]   2> 471477 ERROR (closeThreadPool-3621-thread-4) [    ] o.a.s.u.StartupLoggingUtils Missing Java Option solr.log.dir. Logging may be missing or incomplete.
   [junit4]   2> 471477 INFO  (closeThreadPool-3621-thread-4) [    ] o.a.s.s.SolrDispatchFilter Using logger factory org.apache.logging.slf4j.Log4jLoggerFactory
   [junit4]   2> 471477 INFO  (closeThreadPool-3621-thread-4) [    ] o.a.s.s.SolrDispatchFilter  ___      _       Welcome to Apache Solr? version 8.2.0
   [junit4]   2> 471477 INFO  (closeThreadPool-3621-thread-4) [    ] o.a.s.s.SolrDispatchFilter / __| ___| |_ _   Starting in cloud mode on port null
   [junit4]   2> 471477 INFO  (closeThreadPool-3621-thread-4) [    ] o.a.s.s.SolrDispatchFilter \__ \/ _ \ | '_|  Install dir: null
   [junit4]   2> 471477 INFO  (closeThreadPool-3621-thread-4) [    ] o.a.s.s.SolrDispatchFilter |___/\___/_|_|    Start time: 2019-05-18T09:51:56.783Z
   [junit4]   2> 471480 INFO  (closeThreadPool-3621-thread-2) [n:127.0.0.1:33111_mkb    ] o.a.s.c.c.ZkStateReader Updated live nodes from ZooKeeper... (0) -> (2)
   [junit4]   2> 471481 INFO  (closeThreadPool-3621-thread-2) [n:127.0.0.1:33111_mkb    ] o.a.s.c.ZkController Publish node=127.0.0.1:33111_mkb as DOWN
   [junit4]   2> 471481 INFO  (closeThreadPool-3621-thread-2) [n:127.0.0.1:33111_mkb    ] o.a.s.c.TransientSolrCoreCacheDefault Allocating transient cache for 4 transient cores
   [junit4]   2> 471481 INFO  (closeThreadPool-3621-thread-2) [n:127.0.0.1:33111_mkb    ] o.a.s.c.ZkController Register node as live in ZooKeeper:/live_nodes/127.0.0.1:33111_mkb
   [junit4]   2> 471486 INFO  (zkCallback-3607-thread-1) [    ] o.a.s.c.c.ZkStateReader Updated live nodes from ZooKeeper... (2) -> (3)
   [junit4]   2> 471486 INFO  (zkCallback-3600-thread-4) [    ] o.a.s.c.c.ZkStateReader Updated live nodes from ZooKeeper... (2) -> (3)
   [junit4]   2> 471509 INFO  (zkCallback-3634-thread-1) [    ] o.a.s.c.c.ZkStateReader Updated live nodes from ZooKeeper... (2) -> (3)
   [junit4]   2> 471517 INFO  (zkCallback-3619-thread-1) [    ] o.a.s.c.c.ZkStateReader Updated live nodes from ZooKeeper... (2) -> (3)
   [junit4]   2> 471518 INFO  (zkCallback-3653-thread-1) [    ] o.a.s.c.c.ZkStateReader Updated live nodes from ZooKeeper... (2) -> (3)
   [junit4]   2> 471532 INFO  (zkCallback-3641-thread-1) [    ] o.a.s.c.c.ZkStateReader Updated live nodes from ZooKeeper... (2) -> (3)
   [junit4]   2> 471540 INFO  (zkConnectionManagerCallback-3662-thread-1) [    ] o.a.s.c.c.ConnectionManager zkClient has connected
   [junit4]   2> 471540 INFO  (zkConnectionManagerCallback-3660-thread-1) [    ] o.a.s.c.c.ConnectionManager zkClient has connected
   [junit4]   2> 471541 INFO  (zkConnectionManagerCallback-3669-thread-1) [    ] o.a.s.c.c.ConnectionManager zkClient has connected
   [junit4]   2> 471541 INFO  (closeThreadPool-3621-thread-4) [    ] o.a.s.s.SolrDispatchFilter Loading solr.xml from SolrHome (not found in ZooKeeper)
   [junit4]   2> 471541 INFO  (closeThreadPool-3621-thread-4) [    ] o.a.s.c.SolrXmlConfig Loading container configuration from /home/jenkins/workspace/Lucene-Solr-8.x-Linux/solr/build/solr-core/test/J2/temp/solr.core.TestDynamicLoading_1C894DE142694CE6-001/shard-4-001/solr.xml
   [junit4]   2> 471543 INFO  (closeThreadPool-3621-thread-4) [    ] o.a.s.c.SolrXmlConfig Configuration parameter autoReplicaFailoverWorkLoopDelay is ignored
   [junit4]   2> 471543 INFO  (closeThreadPool-3621-thread-4) [    ] o.a.s.c.SolrXmlConfig Configuration parameter autoReplicaFailoverBadNodeExpiration is ignored
   [junit4]   2> 471544 INFO  (closeThreadPool-3621-thread-4) [    ] o.a.s.c.SolrXmlConfig MBean server found: com.sun.jmx.mbeanserver.JmxMBeanServer@75939a61, but no JMX reporters were configured - adding default JMX reporter.
   [junit4]   2> 471545 INFO  (closeThreadPool-3621-thread-2) [n:127.0.0.1:33111_mkb    ] o.a.s.c.c.ZkStateReader Updated live nodes from ZooKeeper... (0) -> (3)
   [junit4]   2> 471546 INFO  (closeThreadPool-3621-thread-2) [n:127.0.0.1:33111_mkb    ] o.a.s.c.s.i.ZkClientClusterStateProvider Cluster at 127.0.0.1:43041/solr ready
   [junit4]   2> 471553 INFO  (zkConnectionManagerCallback-3671-thread-1) [    ] o.a.s.c.c.ConnectionManager zkClient has connected
   [junit4]   2> 471555 INFO  (closeThreadPool-3621-thread-3) [n:127.0.0.1:39313_mkb    ] o.a.s.c.c.ZkStateReader Updated live nodes from ZooKeeper... (0) -> (3)
   [junit4]   2> 471556 INFO  (closeThreadPool-3621-thread-3) [n:127.0.0.1:39313_mkb    ] o.a.s.c.ZkController Publish node=127.0.0.1:39313_mkb as DOWN
   [junit4]   2> 471557 INFO  (closeThreadPool-3621-thread-3) [n:127.0.0.1:39313_mkb    ] o.a.s.c.TransientSolrCoreCacheDefault Allocating transient cache for 4 transient cores
   [junit4]   2> 471557 INFO  (closeThreadPool-3621-thread-3) [n:127.0.0.1:39313_mkb    ] o.a.s.c.ZkController Register node as live in ZooKeeper:/live_nodes/127.0.0.1:39313_mkb
   [junit4]   2> 471558 INFO  (zkCallback-3653-thread-1) [    ] o.a.s.c.c.ZkStateReader Updated live nodes from ZooKeeper... (3) -> (4)
   [junit4]   2> 471558 INFO  (zkCallback-3607-thread-1) [    ] o.a.s.c.c.ZkStateReader Updated live nodes from ZooKeeper... (3) -> (4)
   [junit4]   2> 471558 INFO  (zkCallback-3600-thread-4) [    ] o.a.s.c.c.ZkStateReader Updated live nodes from ZooKeeper... (3) -> (4)
   [junit4]   2> 471558 INFO  (zkCallback-3634-thread-1) [    ] o.a.s.c.c.ZkStateReader Updated live nodes from ZooKeeper... (3) -> (4)
   [junit4]   2> 471558 INFO  (zkCallback-3619-thread-1) [    ] o.a.s.c.c.ZkStateReader Updated live nodes from ZooKeeper... (3) -> (4)
   [junit4]   2> 471558 INFO  (zkCallback-3641-thread-1) [    ] o.a.s.c.c.ZkStateReader Updated live nodes from ZooKeeper... (3) -> (4)
   [junit4]   2> 471558 INFO  (zkCallback-3670-thread-1) [    ] o.a.s.c.c.ZkStateReader Updated live nodes from ZooKeeper... (3) -> (4)
   [junit4]   2> 471565 INFO  (closeThreadPool-3621-thread-2) [n:127.0.0.1:33111_mkb    ] o.a.s.h.a.MetricsHistoryHandler No .system collection, keeping metrics history in memory.
   [junit4]   2> 471566 INFO  (zkCallback-3668-thread-1) [    ] o.a.s.c.c.ZkStateReader Updated live nodes from ZooKeeper... (3) -> (4)
   [junit4]   2> 471566 INFO  (zkConnectionManagerCallback-3680-thread-1) [    ] o.a.s.c.c.ConnectionManager zkClient has connected
   [junit4]   2> 471576 INFO  (closeThreadPool-3621-thread-3) [n:127.0.0.1:39313_mkb    ] o.a.s.c.c.ZkStateReader Updated live nodes from ZooKeeper... (0) -> (4)
   [junit4]   2> 471579 INFO  (closeThreadPool-3621-thread-3) [n:127.0.0.1:39313_mkb    ] o.a.s.c.s.i.ZkClientClusterStateProvider Cluster at 127.0.0.1:43041/solr ready
   [junit4]   2> 471587 INFO  (closeThreadPool-3621-thread-2) [n:127.0.0.1:33111_mkb    ] o.a.s.m.r.SolrJmxReporter JMX monitoring for 'solr.node' (registry 'solr.node') enabled at server: com.sun.jmx.mbeanserver.JmxMBeanServer@75939a61
   [junit4]   2> 471595 INFO  (closeThreadPool-3621-thread-2) [n:127.0.0.1:33111_mkb    ] o.a.s.m.r.SolrJmxReporter JMX monitoring for 'solr.jvm' (registry 'solr.jvm') enabled at server: com.sun.jmx.mbeanserver.JmxMBeanServer@75939a61
   [junit4]   2> 471595 INFO  (closeThreadPool-3621-thread-2) [n:127.0.0.1:33111_mkb    ] o.a.s.m.r.SolrJmxReporter JMX monitoring for 'solr.jetty' (registry 'solr.jetty') enabled at server: com.sun.jmx.mbeanserver.JmxMBeanServer@75939a61
   [junit4]   2> 471596 INFO  (closeThreadPool-3621-thread-2) [n:127.0.0.1:33111_mkb    ] o.a.s.c.CorePropertiesLocator Found 0 core definitions underneath /home/jenkins/workspace/Lucene-Solr-8.x-Linux/solr/build/solr-core/test/J2/temp/solr.core.TestDynamicLoading_1C894DE142694CE6-001/shard-2-001/cores
   [junit4]   2> 471613 INFO  (closeThreadPool-3621-thread-3) [n:127.0.0.1:39313_mkb    ] o.a.s.h.a.MetricsHistoryHandler No .system collection, keeping metrics history in memory.
   [junit4]   2> 471626 INFO  (closeThreadPool-3621-thread-3) [n:127.0.0.1:39313_mkb    ] o.a.s.m.r.SolrJmxReporter JMX monitoring for 'solr.node' (registry 'solr.node') enabled at server: com.sun.jmx.mbeanserver.JmxMBeanServer@75939a61
   [junit4]   2> 471633 INFO  (closeThreadPool-3621-thread-3) [n:127.0.0.1:39313_mkb    ] o.a.s.m.r.SolrJmxReporter JMX monitoring for 'solr.jvm' (registry 'solr.jvm') enabled at server: com.sun.jmx.mbeanserver.JmxMBeanServer@75939a61
   [junit4]   2> 471633 INFO  (closeThreadPool-3621-thread-3) [n:127.0.0.1:39313_mkb    ] o.a.s.m.r.SolrJmxReporter JMX monitoring for 'solr.jetty' (registry 'solr.jetty') enabled at server: com.sun.jmx.mbeanserver.JmxMBeanServer@75939a61
   [junit4]   2> 471634 INFO  (closeThreadPool-3621-thread-3) [n:127.0.0.1:39313_mkb    ] o.a.s.c.CorePropertiesLocator Found 0 core definitions underneath /home/jenkins/workspace/Lucene-Solr-8.x-Linux/solr/build/solr-core/test/J2/temp/solr.core.TestDynamicLoading_1C894DE142694CE6-001/shard-3-001/cores
   [junit4]   2> 471776 INFO  (closeThreadPool-3621-thread-4) [    ] o.a.s.h.c.HttpShardHandlerFactory Host whitelist initialized: WhitelistHostChecker [whitelistHosts=null, whitelistHostCheckingEnabled=false]
   [junit4]   2> 471776 WARN  (closeThreadPool-3621-thread-4) [    ] o.a.s.c.s.i.Http2SolrClient Create Http2SolrClient with HTTP/1.1 transport since Java 8 or lower versions does not support SSL + HTTP/2
   [junit4]   2> 471777 WARN  (closeThreadPool-3621-thread-4) [    ] o.e.j.u.s.S.config No Client EndPointIdentificationAlgorithm configured for SslContextFactory@49e1bb4d[provider=null,keyStore=null,trustStore=null]
   [junit4]   2> 471778 WARN  (closeThreadPool-3621-thread-4) [    ] o.a.s.c.s.i.Http2SolrClient Create Http2SolrClient with HTTP/1.1 transport since Java 8 or lower versions does not support SSL + HTTP/2
   [junit4]   2> 471794 WARN  (closeThreadPool-3621-thread-4) [    ] o.e.j.u.s.S.config No Client EndPointIdentificationAlgorithm configured for SslContextFactory@6eb0ae19[provider=null,keyStore=null,trustStore=null]
   [junit4]   2> 471795 INFO  (closeThreadPool-3621-thread-4) [    ] o.a.s.c.ZkContainer Zookeeper client=127.0.0.1:43041/solr
   [junit4]   2> 471833 INFO  (zkConnectionManagerCallback-3687-thread-1) [    ] o.a.s.c.c.ConnectionManager zkClient has connected
   [junit4]   2> 471834 WARN  (NIOServerCxn.Factory:0.0.0.0/0.0.0.0:0) [    ] o.a.z.s.NIOServerCnxn Unable to read additional data from client sessionid 0x100c2d093d80016, likely client has closed socket
   [junit4]   2> 471847 INFO  (zkConnectionManagerCallback-3689-thread-1) [    ] o.a.s.c.c.ConnectionManager zkClient has connected
   [junit4]   2> 471850 INFO  (closeThreadPool-3621-thread-4) [n:127.0.0.1:43751_mkb    ] o.a.s.c.c.ZkStateReader Updated live nodes from ZooKeeper... (0) -> (4)
   [junit4]   2> 471852 INFO  (closeThreadPool-3621-thread-4) [n:127.0.0.1:43751_mkb    ] o.a.s.c.ZkController Publish node=127.0.0.1:43751_mkb as DOWN
   [junit4]   2> 471852 INFO  (closeThreadPool-3621-thread-4) [n:127.0.0.1:43751_mkb    ] o.a.s.c.TransientSolrCoreCacheDefault Allocating transient cache for 4 transient cores
   [junit4]   2> 471852 INFO  (closeThreadPool-3621-thread-4) [n:127.0.0.1:43751_mkb    ] o.a.s.c.ZkController Register node as live in ZooKeeper:/live_nodes/127.0.0.1:43751_mkb
   [junit4]   2> 471853 INFO  (zkCallback-3641-thread-1) [    ] o.a.s.c.c.ZkStateReader Updated live nodes from ZooKeeper... (4) -> (5)
   [junit4]   2> 471853 INFO  (zkCallback-3607-thread-1) [    ] o.a.s.c.c.ZkStateReader Updated live nodes from ZooKeeper... (4) -> (5)
   [junit4]   2> 471853 INFO  (zkCallback-3619-thread-1) [    ] o.a.s.c.c.ZkStateReader Updated live nodes from ZooKeeper... (4) -> (5)
   [junit4]   2> 471853 INFO  (zkCallback-3653-thread-1) [    ] o.a.s.c.c.ZkStateReader Updated live nodes from ZooKeeper... (4) -> (5)
   [junit4]   2> 471853 INFO  (zkCallback-3634-thread-1) [    ] o.a.s.c.c.ZkStateReader Updated live nodes from ZooKeeper... (4) -> (5)
   [junit4]   2> 471853 INFO  (zkCallback-3600-thread-4) [    ] o.a.s.c.c.ZkStateReader Updated live nodes from ZooKeeper... (4) -> (5)
   [junit4]   2> 471862 INFO  (zkCallback-3679-thread-1) [    ] o.a.s.c.c.ZkStateReader Updated live nodes from ZooKeeper... (4) -> (5)
   [junit4]   2> 471869 INFO  (zkCallback-3670-thread-1) [    ] o.a.s.c.c.ZkStateReader Updated live nodes from ZooKeeper... (4) -> (5)
   [junit4]   2> 471869 INFO  (zkCallback-3668-thread-1) [    ] o.a.s.c.c.ZkStateReader Updated live nodes from ZooKeeper... (4) -> (5)
   [junit4]   2> 471869 INFO  (zkCallback-3688-thread-1) [    ] o.a.s.c.c.ZkStateReader Updated live nodes from ZooKeeper... (4) -> (5)
   [junit4]   2> 471881 INFO  (zkConnectionManagerCallback-3696-thread-1) [    ] o.a.s.c.c.ConnectionManager zkClient has connected
   [junit4]   2> 471893 INFO  (closeThreadPool-3621-thread-4) [n:127.0.0.1:43751_mkb    ] o.a.s.c.c.ZkStateReader Updated live nodes from ZooKeeper... (0) -> (5)
   [junit4]   2> 471894 INFO  (closeThreadPool-3621-thread-4) [n:127.0.0.1:43751_mkb    ] o.a.s.c.s.i.ZkClientClusterStateProvider Cluster at 127.0.0.1:43041/solr ready
   [junit4]   2> 471910 INFO  (closeThreadPool-3621-thread-4) [n:127.0.0.1:43751_mkb    ] o.a.s.h.a.MetricsHistoryHandler No .system collection, keeping metrics history in memory.
   [junit4]   2> 471923 INFO  (closeThreadPool-3621-thread-4) [n:127.0.0.1:43751_mkb    ] o.a.s.m.r.SolrJmxReporter JMX monitoring for 'solr.node' (registry 'solr.node') enabled at server: com.sun.jmx.mbeanserver.JmxMBeanServer@75939a61
   [junit4]   2> 471929 INFO  (closeThreadPool-3621-thread-4) [n:127.0.0.1:43751_mkb    ] o.a.s.m.r.SolrJmxReporter JMX monitoring for 'solr.jvm' (registry 'solr.jvm') enabled at server: com.sun.jmx.mbeanserver.JmxMBeanServer@75939a61
   [junit4]   2> 471929 INFO  (closeThreadPool-3621-thread-4) [n:127.0.0.1:43751_mkb    ] o.a.s.m.r.SolrJmxReporter JMX monitoring for 'solr.jetty' (registry 'solr.jetty') enabled at server: com.sun.jmx.mbeanserver.JmxMBeanServer@75939a61
   [junit4]   2> 471930 INFO  (closeThreadPool-3621-thread-4) [n:127.0.0.1:43751_mkb    ] o.a.s.c.CorePropertiesLocator Found 0 core definitions underneath /home/jenkins/workspace/Lucene-Solr-8.x-Linux/solr/build/solr-core/test/J2/temp/solr.core.TestDynamicLoading_1C894DE142694CE6-001/shard-4-001/cores
   [junit4]   2> 472001 INFO  (qtp1804570216-10464) [n:127.0.0.1:33111_mkb    ] o.a.s.h.a.CollectionsHandler Invoked Collection Action :addreplica with params node=127.0.0.1:43751_mkb&action=ADDREPLICA&collection=collection1&shard=shard1&type=NRT&wt=javabin&version=2 and sendToOCPQueue=true
   [junit4]   2> 472004 INFO  (qtp1804570216-10592) [n:127.0.0.1:33111_mkb    ] o.a.s.h.a.CollectionsHandler Invoked Collection Action :addreplica with params node=127.0.0.1:39141_mkb&action=ADDREPLICA&collection=collection1&shard=shard2&type=NRT&wt=javabin&version=2 and sendToOCPQueue=true
   [junit4]   2> 472014 INFO  (qtp1804570216-10594) [n:127.0.0.1:33111_mkb    ] o.a.s.h.a.CollectionsHandler Invoked Collection Action :addreplica with params node=127.0.0.1:39313_mkb&action=ADDREPLICA&collection=collection1&shard=shard2&type=NRT&wt=javabin&version=2 and sendToOCPQueue=true
   [junit4]   2> 472017 INFO  (OverseerCollectionConfigSetProcessor-72271795127320581-127.0.0.1:36981_mkb-n_0000000000) [n:127.0.0.1:36981_mkb    ] o.a.s.c.OverseerTaskQueue Response ZK path: /overseer/collection-queue-work/qnr-0000000002 doesn't exist.  Requestor may have disconnected from ZooKeeper
   [junit4]   2> 472017 INFO  (qtp1804570216-10460) [n:127.0.0.1:33111_mkb    ] o.a.s.h.a.CollectionsHandler Invoked Collection Action :addreplica with params node=127.0.0.1:33111_mkb&action=ADDREPLICA&collection=collection1&shard=shard1&type=NRT&wt=javabin&version=2 and sendToOCPQueue=true
   [junit4]   2> 472018 INFO  (OverseerThreadFactory-2772-thread-3-processing-n:127.0.0.1:36981_mkb) [n:127.0.0.1:36981_mkb c:collection1 s:shard1  ] o.a.s.c.a.c.AddReplicaCmd Node Identified 127.0.0.1:43751_mkb for creating new replica of shard shard1 for collection collection1
   [junit4]   2> 472020 INFO  (OverseerThreadFactory-2772-thread-3-processing-n:127.0.0.1:36981_mkb) [n:127.0.0.1:36981_mkb c:collection1 s:shard1  ] o.a.s.c.a.c.AddReplicaCmd Returning CreateReplica command.
   [junit4]   2> 472020 INFO  (OverseerThreadFactory-2772-thread-4-processing-n:127.0.0.1:36981_mkb) [n:127.0.0.1:36981_mkb c:collection1 s:shard2  ] o.a.s.c.a.c.AddReplicaCmd Node Identified 127.0.0.1:39141_mkb for creating new replica of shard shard2 for collection collection1
   [junit4]   2> 472022 INFO  (OverseerThreadFactory-2772-thread-4-processing-n:127.0.0.1:36981_mkb) [n:127.0.0.1:36981_mkb c:collection1 s:shard2  ] o.a.s.c.a.c.AddReplicaCmd Returning CreateReplica command.
   [junit4]   2> 472110 INFO  (qtp387793842-10520) [n:127.0.0.1:43751_mkb    x:collection1_shard1_replica_n1] o.a.s.h.a.CoreAdminOperation core create command qt=/admin/cores&collection.configName=conf1&name=collection1_shard1_replica_n1&action=CREATE&collection=collection1&shard=shard1&wt=javabin&version=2&replicaType=NRT
   [junit4]   2> 472118 INFO  (qtp1799066151-10450) [n:127.0.0.1:39141_mkb    x:collection1_shard2_replica_n2] o.a.s.h.a.CoreAdminOperation core create command qt=/admin/cores&collection.configName=conf1&name=collection1_shard2_replica_n2&action=CREATE&collection=collection1&shard=shard2&wt=javabin&version=2&replicaType=NRT
   [junit4]   2> 473149 INFO  (qtp1799066151-10450) [n:127.0.0.1:39141_mkb c:collection1 s:shard2  x:collection1_shard2_replica_n2] o.a.s.c.SolrConfig Using Lucene MatchVersion: 8.2.0
   [junit4]   2> 473152 INFO  (qtp387793842-10520) [n:127.0.0.1:43751_mkb c:collection1 s:shard1  x:collection1_shard1_replica_n1] o.a.s.c.SolrConfig Using Lucene MatchVersion: 8.2.0
   [junit4]   2> 473166 INFO  (qtp387793842-10520) [n:127.0.0.1:43751_mkb c:collection1 s:shard1  x:collection1_shard1_replica_n1] o.a.s.s.IndexSchema [collection1_shard1_replica_n1] Schema name=test
   [junit4]   2> 473166 INFO  (qtp1799066151-10450) [n:127.0.0.1:39141_mkb c:collection1 s:shard2  x:collection1_shard2_replica_n2] o.a.s.s.IndexSchema [collection1_shard2_replica_n2] Schema name=test
   [junit4]   2> 473274 INFO  (qtp387793842-10520) [n:127.0.0.1:43751_mkb c:collection1 s:shard1  x:collection1_shard1_replica_n1] o.a.s.s.IndexSchema Loaded schema test/1.0 with uniqueid field id
   [junit4]   2> 473283 INFO  (qtp1799066151-10450) [n:127.0.0.1:39141_mkb c:collection1 s:shard2  x:collection1_shard2_replica_n2] o.a.s.s.IndexSchema Loaded schema test/1.0 with uniqueid field id
   [junit4]   2> 473292 INFO  (qtp387793842-10520) [n:127.0.0.1:43751_mkb c:collection1 s:shard1  x:collection1_shard1_replica_n1] o.a.s.c.CoreContainer Creating SolrCore 'collection1_shard1_replica_n1' using configuration from collection collection1, trusted=true
   [junit4]   2> 473292 INFO  (qtp387793842-10520) [n:127.0.0.1:43751_mkb c:collection1 s:shard1  x:collection1_shard1_replica_n1] o.a.s.m.r.SolrJmxReporter JMX monitoring for 'solr.core.collection1.shard1.replica_n1' (registry 'solr.core.collection1.shard1.replica_n1') enabled at server: com.sun.jmx.mbeanserver.JmxMBeanServer@75939a61
   [junit4]   2> 473293 INFO  (qtp387793842-10520) [n:127.0.0.1:43751_mkb c:collection1 s:shard1  x:collection1_shard1_replica_n1] o.a.s.c.SolrCore [[collection1_shard1_replica_n1] ] Opening new SolrCore at [/home/jenkins/workspace/Lucene-Solr-8.x-Linux/solr/build/solr-core/test/J2/temp/solr.core.TestDynamicLoading_1C894DE142694CE6-001/shard-4-001/cores/collection1_shard1_replica_n1], dataDir=[/home/jenkins/workspace/Lucene-Solr-8.x-Linux/solr/build/solr-core/test/J2/temp/solr.core.TestDynamicLoading_1C894DE142694CE6-001/shard-4-001/cores/collection1_shard1_replica_n1/data/]
   [junit4]   2> 473293 INFO  (qtp1799066151-10450) [n:127.0.0.1:39141_mkb c:collection1 s:shard2  x:collection1_shard2_replica_n2] o.a.s.c.CoreContainer Creating SolrCore 'collection1_shard2_replica_n2' using configuration from collection collection1, trusted=true
   [junit4]   2> 473294 INFO  (qtp1799066151-10450) [n:127.0.0.1:39141_mkb c:collection1 s:shard2  x:collection1_shard2_replica_n2] o.a.s.m.r.SolrJmxReporter JMX monitoring for 'solr.core.collection1.shard2.replica_n2' (registry 'solr.core.collection1.shard2.replica_n2') enabled at server: com.sun.jmx.mbeanserver.JmxMBeanServer@75939a61
   [junit4]   2> 473294 INFO  (qtp1799066151-10450) [n:127.0.0.1:39141_mkb c:collection1 s:shard2  x:collection1_shard2_replica_n2] o.a.s.c.SolrCore [[collection1_shard2_replica_n2] ] Opening new SolrCore at [/home/jenkins/workspace/Lucene-Solr-8.x-Linux/solr/build/solr-core/test/J2/temp/solr.core.TestDynamicLoading_1C894DE142694CE6-001/shard-1-001/cores/collection1_shard2_replica_n2], dataDir=[/home/jenkins/workspace/Lucene-Solr-8.x-Linux/solr/build/solr-core/test/J2/temp/solr.core.TestDynamicLoading_1C894DE142694CE6-001/shard-1-001/cores/collection1_shard2_replica_n2/data/]
   [junit4]   2> 473294 INFO  (qtp387793842-10520) [n:127.0.0.1:43751_mkb c:collection1 s:shard1  x:collection1_shard1_replica_n1] o.a.s.u.RandomMergePolicy RandomMergePolicy wrapping class org.apache.lucene.index.TieredMergePolicy: [TieredMergePolicy: maxMergeAtOnce=14, maxMergeAtOnceExplicit=38, maxMergedSegmentMB=30.3935546875, floorSegmentMB=0.8447265625, forceMergeDeletesPctAllowed=25.001717807465287, segmentsPerTier=20.0, maxCFSSegmentSizeMB=8.796093022207999E12, noCFSRatio=0.2853107958136259, deletesPctAllowed=34.72027039793569
   [junit4]   2> 473295 INFO  (qtp1799066151-10450) [n:127.0.0.1:39141_mkb c:collection1 s:shard2  x:collection1_shard2_replica_n2] o.a.s.u.RandomMergePolicy RandomMergePolicy wrapping class org.apache.lucene.index.TieredMergePolicy: [TieredMergePolicy: maxMergeAtOnce=14, maxMergeAtOnceExplicit=38, maxMergedSegmentMB=30.3935546875, floorSegmentMB=0.8447265625, forceMergeDeletesPctAllowed=25.001717807465287, segmentsPerTier=20.0, maxCFSSegmentSizeMB=8.796093022207999E12, noCFSRatio=0.2853107958136259, deletesPctAllowed=34.72027039793569
   [junit4]   2> 473296 WARN  (qtp387793842-10520) [n:127.0.0.1:43751_mkb c:collection1 s:shard1  x:collection1_shard1_replica_n1] o.a.s.c.RequestHandlers INVALID paramSet a in requestHandler {type = requestHandler,name = /dump,class = DumpRequestHandler,attributes = {initParams=a, name=/dump, class=DumpRequestHandler},args = {defaults={a=A,b=B}}}
   [junit4]   2> 473299 WARN  (qtp1799066151-10450) [n:127.0.0.1:39141_mkb c:collection1 s:shard2  x:collection1_shard2_replica_n2] o.a.s.c.RequestHandlers INVALID paramSet a in requestHandler {type = requestHandler,name = /dump,class = DumpRequestHandler,attributes = {initParams=a, name=/dump, class=DumpRequestHandler},args = {defaults={a=A,b=B}}}
   [junit4]   2> 473330 INFO  (qtp1799066151-10450) [n:127.0.0.1:39141_mkb c:collection1 s:shard2  x:collection1_shard2_replica_n2] o.a.s.u.UpdateHandler Using UpdateLog implementation: org.apache.solr.update.UpdateLog
   [junit4]   2> 473330 INFO  (qtp1799066151-10450) [n:127.0.0.1:39141_mkb c:collection1 s:shard2  x:collection1_shard2_replica_n2] o.a.s.u.UpdateLog Initializing UpdateLog: dataDir= defaultSyncLevel=FLUSH numRecordsToKeep=100 maxNumLogsToKeep=10 numVersionBuckets=65536
   [junit4]   2> 473330 INFO  (qtp1799066151-10450) [n:127.0.0.1:39141_mkb c:collection1 s:shard2  x:collection1_shard2_replica_n2] o.a.s.u.CommitTracker Hard AutoCommit: disabled
   [junit4]   2> 473330 INFO  (qtp1799066151-10450) [n:127.0.0.1:39141_mkb c:collection1 s:shard2  x:collection1_shard2_replica_n2] o.a.s.u.CommitTracker Soft AutoCommit: disabled
   [junit4]   2> 473331 INFO  (qtp1799066151-10450) [n:127.0.0.1:39141_mkb c:collection1 s:shard2  x:collection1_shard2_replica_n2] o.a.s.u.RandomMergePolicy RandomMergePolicy wrapping class org.apache.lucene.index.AlcoholicMergePolicy: [AlcoholicMergePolicy: minMergeSize=0, mergeFactor=10, maxMergeSize=1775058239, maxMergeSizeForForcedMerge=9223372036854775807, calibrateSizeByDeletes=true, maxMergeDocs=2147483647, maxCFSSegmentSizeMB=8.796093022207999E12, noCFSRatio=0.1]
   [junit4]   2> 473331 INFO  (qtp1799066151-10450) [n:127.0.0.1:39141_mkb c:collection1 s:shard2  x:collection1_shard2_replica_n2] o.a.s.s.SolrIndexSearcher Opening [Searcher@4878fe23[collection1_shard2_replica_n2] main]
   [junit4]   2> 473332 INFO  (qtp1799066151-10450) [n:127.0.0.1:39141_mkb c:collection1 s:shard2  x:collection1_shard2_replica_n2] o.a.s.r.ManagedResourceStorage Configured ZooKeeperStorageIO with znodeBase: /configs/conf1
   [junit4]   2> 473333 INFO  (qtp1799066151-10450) [n:127.0.0.1:39141_mkb c:collection1 s:shard2  x:collection1_shard2_replica_n2] o.a.s.r.ManagedResourceStorage Loaded null at path _rest_managed.json using ZooKeeperStorageIO:path=/configs/conf1
   [junit4]   2> 473333 INFO  (qtp1799066151-10450) [n:127.0.0.1:39141_mkb c:collection1 s:shard2  x:collection1_shard2_replica_n2] o.a.s.h.ReplicationHandler Commits will be reserved for 10000ms.
   [junit4]   2> 473333 INFO  (qtp1799066151-10450) [n:127.0.0.1:39141_mkb c:collection1 s:shard2  x:collection1_shard2_replica_n2] o.a.s.u.UpdateLog Could not find max version in index or recent updates, using new clock 1633862936050008064
   [junit4]   2> 473339 INFO  (qtp387793842-10520) [n:127.0.0.1:43751_mkb c:collection1 s:shard1  x:collection1_shard1_replica_n1] o.a.s.u.UpdateHandler Using UpdateLog implementation: org.apache.solr.update.UpdateLog
   [junit4]   2> 473339 INFO  (qtp387793842-10520) [n:127.0.0.1:43751_mkb c:collection1 s:shard1  x:collection1_shard1_replica_n1] o.a.s.u.UpdateLog Initializing UpdateLog: dataDir= defaultSyncLevel=FLUSH numRecordsToKeep=100 maxNumLogsToKeep=10 numVersionBuckets=65536
   [junit4]   2> 473340 INFO  (qtp387793842-10520) [n:127.0.0.1:43751_mkb c:collection1 s:shard1  x:collection1_shard1_replica_n1] o.a.s.u.CommitTracker Hard AutoCommit: disabled
   [junit4]   2> 473340 INFO  (qtp387793842-10520) [n:127.0.0.1:43751_mkb c:collection1 s:shard1  x:collection1_shard1_replica_n1] o.a.s.u.CommitTracker Soft AutoCommit: disabled
   [junit4]   2> 473341 INFO  (qtp387793842-10520) [n:127.0.0.1:43751_mkb c:collection1 s:shard1  x:collection1_shard1_replica_n1] o.a.s.u.RandomMergePolicy RandomMergePolicy wrapping class org.apache.lucene.index.AlcoholicMergePolicy: [AlcoholicMergePolicy: minMergeSize=0, mergeFactor=10, maxMergeSize=1775058239, maxMergeSizeForForcedMerge=9223372036854775807, calibrateSizeByDeletes=true, maxMergeDocs=2147483647, maxCFSSegmentSizeMB=8.796093022207999E12, noCFSRatio=0.1]
   [junit4]   2> 473341 INFO  (qtp387793842-10520) [n:127.0.0.1:43751_mkb c:collection1 s:shard1  x:collection1_shard1_replica_n1] o.a.s.s.SolrIndexSearcher Opening [Searcher@3830039d[collection1_shard1_replica_n1] main]
   [junit4]   2> 473342 INFO  (qtp387793842-10520) [n:127.0.0.1:43751_mkb c:collection1 s:shard1  x:collection1_shard1_replica_n1] o.a.s.r.ManagedResourceStorage Configured ZooKeeperStorageIO with znodeBase: /configs/conf1
   [junit4]   2> 473342 INFO  (qtp387793842-10520) [n:127.0.0.1:43751_mkb c:collection1 s:shard1  x:collection1_shard1_replica_n1] o.a.s.r.ManagedResourceStorage Loaded null at path _rest_managed.json using ZooKeeperStorageIO:path=/configs/conf1
   [junit4]   2> 473343 INFO  (qtp387793842-10520) [n:127.0.0.1:43751_mkb c:collection1 s:shard1  x:collection1_shard1_replica_n1] o.a.s.h.ReplicationHandler Commits will be reserved for 10000ms.
   [junit4]   2> 473343 INFO  (qtp387793842-10520) [n:127.0.0.1:43751_mkb c:collection1 s:shard1  x:collection1_shard1_replica_n1] o.a.s.u.UpdateLog Could not find max version in index or recent updates, using new clock 1633862936060493824
   [junit4]   2> 473354 INFO  (searcherExecutor-2818-thread-1-processing-n:127.0.0.1:43751_mkb x:collection1_shard1_replica_n1 c:collection1 s:shard1) [n:127.0.0.1:43751_mkb c:collection1 s:shard1  x:collection1_shard1_replica_n1] o.a.s.c.SolrCore [collection1_shard1_replica_n1] Registered new searcher Searcher@3830039d[collection1_shard1_replica_n1] main{ExitableDirectoryReader(UninvertingDirectoryReader())}
   [junit4]   2> 473357 INFO  (qtp387793842-10520) [n:127.0.0.1:43751_mkb c:collection1 s:shard1  x:collection1_shard1_replica_n1] o.a.s.c.ZkShardTerms Successful update of terms at /collections/collection1/terms/shard1 to Terms{values={core_node3=0}, version=0}
   [junit4]   2> 473357 INFO  (qtp387793842-10520) [n:127.0.0.1:43751_mkb c:collection1 s:shard1  x:collection1_shard1_replica_n1] o.a.s.c.ShardLeaderElectionContextBase make sure parent is created /collections/collection1/leaders/shard1
   [junit4]   2> 473358 INFO  (searcherExecutor-2819-thread-1-processing-n:127.0.0.1:39141_mkb x:collection1_shard2_replica_n2 c:collection1 s:shard2) [n:127.0.0.1:39141_mkb c:collection1 s:shard2  x:collection1_shard2_replica_n2] o.a.s.c.SolrCore [collection1_shard2_replica_n2] Registered new searcher Searcher@4878fe23[collection1_shard2_replica_n2] main{ExitableDirectoryReader(UninvertingDirectoryReader())}
   [junit4]   2> 473359 INFO  (qtp387793842-10520) [n:127.0.0.1:43751_mkb c:collection1 s:shard1  x:collection1_shard1_replica_n1] o.a.s.c.ShardLeaderElectionContext Enough replicas found to continue.
   [junit4]   2> 473359 INFO  (qtp387793842-10520) [n:127.0.0.1:43751_mkb c:collection1 s:shard1  x:collection1_shard1_replica_n1] o.a.s.c.ShardLeaderElectionContext I may be the new leader - try and sync
   [junit4]   2> 473359 INFO  (qtp387793842-10520) [n:127.0.0.1:43751_mkb c:collection1 s:shard1  x:collection1_shard1_replica_n1] o.a.s.c.SyncStrategy Sync replicas to https://127.0.0.1:43751/mkb/collection1_shard1_replica_n1/
   [junit4]   2> 473359 INFO  (qtp387793842-10520) [n:127.0.0.1:43751_mkb c:collection1 s:shard1  x:collection1_shard1_replica_n1] o.a.s.c.SyncStrategy Sync Success - now sync replicas to me
   [junit4]   2> 473359 INFO  (qtp387793842-10520) [n:127.0.0.1:43751_mkb c:collection1 s:shard1  x:collection1_shard1_replica_n1] o.a.s.c.SyncStrategy https://127.0.0.1:43751/mkb/collection1_shard1_replica_n1/ has no replicas
   [junit4]   2> 473359 INFO  (qtp387793842-10520) [n:127.0.0.1:43751_mkb c:collection1 s:shard1  x:collection1_shard1_replica_n1] o.a.s.c.ShardLeaderElectionContextBase Creating leader registration node /collections/collection1/leaders/shard1/leader after winning as /collections/collection1/leader_elect/shard1/election/72271795127320599-core_node3-n_0000000000
   [junit4]   2> 473360 INFO  (qtp387793842-10520) [n:127.0.0.1:43751_mkb c:collection1 s:shard1  x:collection1_shard1_replica_n1] o.a.s.c.ShardLeaderElectionContext I am the new leader: https://127.0.0.1:43751/mkb/collection1_shard1_replica_n1/ shard1
   [junit4]   2> 473363 INFO  (qtp1799066151-10450) [n:127.0.0.1:39141_mkb c:collection1 s:shard2  x:collection1_shard2_replica_n2] o.a.s.c.ZkShardTerms Successful update of terms at /collections/collection1/terms/shard2 to Terms{values={core_node4=0}, version=0}
   [junit4]   2> 473363 INFO  (qtp1799066151-10450) [n:127.0.0.1:39141_mkb c:collection1 s:shard2  x:collection1_shard2_replica_n2] o.a.s.c.ShardLeaderElectionContextBase make sure parent is created /collections/collection1/leaders/shard2
   [junit4]   2> 473364 INFO  (qtp1799066151-10450) [n:127.0.0.1:39141_mkb c:collection1 s:shard2  x:collection1_shard2_replica_n2] o.a.s.c.ShardLeaderElectionContext

[...truncated too long message...]

 [junit4]   2> 486847 INFO  (closeThreadPool-3733-thread-9) [    ] o.e.j.s.session node0 Stopped scavenging
   [junit4]   2> 486849 INFO  (closeThreadPool-3733-thread-7) [    ] o.e.j.s.AbstractConnector Stopped ServerConnector@654b68ba{SSL,[ssl, http/1.1]}{127.0.0.1:0}
   [junit4]   2> 486865 INFO  (closeThreadPool-3733-thread-2) [    ] o.e.j.s.AbstractConnector Stopped ServerConnector@14013da5{SSL,[ssl, http/1.1]}{127.0.0.1:0}
   [junit4]   2> 486866 INFO  (closeThreadPool-3733-thread-7) [    ] o.e.j.s.h.ContextHandler Stopped o.e.j.s.ServletContextHandler@29572c09{/mkb,null,UNAVAILABLE}
   [junit4]   2> 486866 INFO  (closeThreadPool-3733-thread-2) [    ] o.e.j.s.h.ContextHandler Stopped o.e.j.s.ServletContextHandler@7ab63e3e{/mkb,null,UNAVAILABLE}
   [junit4]   2> 486866 INFO  (closeThreadPool-3733-thread-7) [    ] o.e.j.s.session node0 Stopped scavenging
   [junit4]   2> 486866 INFO  (closeThreadPool-3733-thread-2) [    ] o.e.j.s.session node0 Stopped scavenging
   [junit4]   2> 486873 INFO  (closeThreadPool-3733-thread-8) [    ] o.e.j.s.AbstractConnector Stopped ServerConnector@63a6cc48{SSL,[ssl, http/1.1]}{127.0.0.1:0}
   [junit4]   2> 486874 INFO  (closeThreadPool-3733-thread-8) [    ] o.e.j.s.h.ContextHandler Stopped o.e.j.s.ServletContextHandler@7ce63383{/mkb,null,UNAVAILABLE}
   [junit4]   2> 486874 INFO  (closeThreadPool-3733-thread-8) [    ] o.e.j.s.session node0 Stopped scavenging
   [junit4]   2> 486875 INFO  (closeThreadPool-3733-thread-6) [    ] o.e.j.s.AbstractConnector Stopped ServerConnector@4ddfb942{SSL,[ssl, http/1.1]}{127.0.0.1:0}
   [junit4]   2> 486875 INFO  (closeThreadPool-3733-thread-6) [    ] o.e.j.s.h.ContextHandler Stopped o.e.j.s.ServletContextHandler@2b6f8af3{/mkb,null,UNAVAILABLE}
   [junit4]   2> 486875 INFO  (closeThreadPool-3733-thread-6) [    ] o.e.j.s.session node0 Stopped scavenging
   [junit4]   2> 486877 INFO  (TEST-TestDynamicLoading.testDynamicLoading-seed#[1C894DE142694CE6]) [    ] o.a.s.c.ZkTestServer Shutting down ZkTestServer.
   [junit4]   2> 486878 WARN  (ZkTestServer Run Thread) [    ] o.a.s.c.ZkTestServer Watch limit violations: 
   [junit4]   2> Maximum concurrent create/delete watches above limit:
   [junit4]   2> 
   [junit4]   2> 	15	/solr/configs/conf1
   [junit4]   2> 	12	/solr/aliases.json
   [junit4]   2> 	5	/solr/security.json
   [junit4]   2> 	5	/solr/collections/collection1/terms/shard1
   [junit4]   2> 	5	/solr/collections/collection1/terms/shard2
   [junit4]   2> 	2	/solr/collections/control_collection/terms/shard1
   [junit4]   2> 
   [junit4]   2> Maximum concurrent data watches above limit:
   [junit4]   2> 
   [junit4]   2> 	53	/solr/collections/collection1/state.json
   [junit4]   2> 	12	/solr/clusterprops.json
   [junit4]   2> 	12	/solr/clusterstate.json
   [junit4]   2> 	9	/solr/collections/control_collection/state.json
   [junit4]   2> 
   [junit4]   2> Maximum concurrent children watches above limit:
   [junit4]   2> 
   [junit4]   2> 	12	/solr/live_nodes
   [junit4]   2> 	12	/solr/collections
   [junit4]   2> 
   [junit4]   2> 486879 INFO  (TEST-TestDynamicLoading.testDynamicLoading-seed#[1C894DE142694CE6]) [    ] o.a.s.c.ZkTestServer parse host and port list: 127.0.0.1:43041
   [junit4]   2> 486879 INFO  (TEST-TestDynamicLoading.testDynamicLoading-seed#[1C894DE142694CE6]) [    ] o.a.s.c.ZkTestServer connecting to 127.0.0.1 43041
   [junit4]   2> NOTE: reproduce with: ant test  -Dtestcase=TestDynamicLoading -Dtests.method=testDynamicLoading -Dtests.seed=1C894DE142694CE6 -Dtests.multiplier=3 -Dtests.slow=true -Dtests.locale=it-CH -Dtests.timezone=MST -Dtests.asserts=true -Dtests.file.encoding=US-ASCII
   [junit4] FAILURE 18.3s J2 | TestDynamicLoading.testDynamicLoading <<<
   [junit4]    > Throwable #1: java.lang.AssertionError: Could not get expected value  'org.apache.solr.core.BlobStoreTestRequestHandler' for path 'overlay/requestHandler/\/test1/class' full output: {
   [junit4]    >   "responseHeader":{
   [junit4]    >     "status":0,
   [junit4]    >     "QTime":0},
   [junit4]    >   "overlay":{
   [junit4]    >     "znodeVersion":0,
   [junit4]    >     "runtimeLib":{"colltest":{
   [junit4]    >         "name":"colltest",
   [junit4]    >         "version":1}}}},  from server:  null
   [junit4]    > 	at __randomizedtesting.SeedInfo.seed([1C894DE142694CE6:C4C460B6B5B4E946]:0)
   [junit4]    > 	at org.apache.solr.core.TestSolrConfigHandler.testForResponseElement(TestSolrConfigHandler.java:589)
   [junit4]    > 	at org.apache.solr.core.TestDynamicLoading.testDynamicLoading(TestDynamicLoading.java:80)
   [junit4]    > 	at org.apache.solr.BaseDistributedSearchTestCase$ShardsRepeatRule$ShardsFixedStatement.callStatement(BaseDistributedSearchTestCase.java:1082)
   [junit4]    > 	at org.apache.solr.BaseDistributedSearchTestCase$ShardsRepeatRule$ShardsStatement.evaluate(BaseDistributedSearchTestCase.java:1054)
   [junit4]    > 	at java.lang.Thread.run(Thread.java:748)
   [junit4]   2> NOTE: leaving temporary files on disk at: /home/jenkins/workspace/Lucene-Solr-8.x-Linux/solr/build/solr-core/test/J2/temp/solr.core.TestDynamicLoading_1C894DE142694CE6-001
   [junit4]   2> May 18, 2019 9:52:12 AM com.carrotsearch.randomizedtesting.ThreadLeakControl checkThreadLeaks
   [junit4]   2> WARNING: Will linger awaiting termination of 1 leaked thread(s).
   [junit4]   2> NOTE: test params are: codec=Asserting(Lucene80), sim=Asserting(org.apache.lucene.search.similarities.AssertingSimilarity@45a626a4), locale=it-CH, timezone=MST
   [junit4]   2> NOTE: Linux 4.18.0-17-generic amd64/Oracle Corporation 1.8.0_201 (64-bit)/cpus=8,threads=1,free=106701896,total=518979584
   [junit4]   2> NOTE: All tests run in this JVM: [TestTrie, PropertiesRequestHandlerTest, TestLeaderElectionWithEmptyReplica, TestJoin, SolrCoreMetricManagerTest, DOMUtilTest, NodeLostTriggerTest, TestMacroExpander, TestIndexSearcher, FastVectorHighlighterTest, TestCorePropertiesReload, PhrasesIdentificationComponentTest, TestFieldCache, TestFoldingMultitermQuery, TestBulkSchemaAPI, TestSizeLimitedDistributedMap, TestSimLargeCluster, ConnectionManagerTest, MetricUtilsTest, TestSolrXml, MoveReplicaTest, TestSolrCloudWithKerberosAlt, TestPullReplica, ConcurrentDeleteAndCreateCollectionTest, ShowFileRequestHandlerTest, TestScoreJoinQPNoScore, TestFunctionQuery, TestDefaultStatsCache, HdfsChaosMonkeySafeLeaderTest, TestFieldSortValues, HighlighterTest, TestDelegationWithHadoopAuth, TestHdfsUpdateLog, CoreAdminCreateDiscoverTest, TestSerializedLuceneMatchVersion, BlockDirectoryTest, TestSimComputePlanAction, ReplaceNodeNoTargetTest, ResponseLogComponentTest, ChaosMonkeySafeLeaderTest, FieldMutatingUpdateProcessorTest, TestDistributedGrouping, SortSpecParsingTest, DeleteInactiveReplicaTest, TestTolerantUpdateProcessorCloud, TestCustomDocTransformer, ShufflingReplicaListTransformerTest, DistributedSpellCheckComponentTest, BlockJoinFacetDistribTest, TestFaceting, SolrRequestParserTest, TestRandomRequestDistribution, TaggerTest, IndexSchemaRuntimeFieldTest, TestWithCollection, TestStandardQParsers, SSLMigrationTest, OverseerRolesTest, TestJsonFacetsStatsParsing, TestInPlaceUpdatesRequiredField, TemplateUpdateProcessorTest, SolrCLIZkUtilsTest, TestSolrJ, ClusterStateUpdateTest, TestCollationFieldDocValues, TestDynamicLoading]
   [junit4] Completed [188/858 (1!)] on J2 in 18.88s, 1 test, 1 failure <<< FAILURES!

[...truncated 52228 lines...]
[asciidoctor:convert] asciidoctor: ERROR: about-this-guide.adoc: line 1: invalid part, must have at least one section (e.g., chapter, appendix, etc.)
[asciidoctor:convert] asciidoctor: ERROR: solr-glossary.adoc: line 1: invalid part, must have at least one section (e.g., chapter, appendix, etc.)
     [java] Processed 2531 links (2070 relative) to 3359 anchors in 253 files
     [echo] Validated Links & Anchors via: /home/jenkins/workspace/Lucene-Solr-8.x-Linux/solr/build/solr-ref-guide/bare-bones-html/

-documentation-lint:
    [jtidy] Checking for broken html (such as invalid tags)...
   [delete] Deleting directory /home/jenkins/workspace/Lucene-Solr-8.x-Linux/lucene/build/jtidy_tmp
     [echo] Checking for broken links...
     [exec] 
     [exec] Crawl/parse...
     [exec] 
     [exec] Verify...
     [echo] Checking for malformed docs...
     [exec] 
     [exec] /home/jenkins/workspace/Lucene-Solr-8.x-Linux/solr/build/docs/solr-solrj/overview-summary.html
     [exec]   missing description: org.noggit
     [exec] 
     [exec] Missing javadocs were found!

BUILD FAILED
/home/jenkins/workspace/Lucene-Solr-8.x-Linux/build.xml:634: The following error occurred while executing this line:
/home/jenkins/workspace/Lucene-Solr-8.x-Linux/build.xml:101: The following error occurred while executing this line:
/home/jenkins/workspace/Lucene-Solr-8.x-Linux/solr/build.xml:660: The following error occurred while executing this line:
/home/jenkins/workspace/Lucene-Solr-8.x-Linux/solr/build.xml:676: The following error occurred while executing this line:
/home/jenkins/workspace/Lucene-Solr-8.x-Linux/lucene/common-build.xml:2530: exec returned: 1

Total time: 83 minutes 22 seconds
Build step 'Invoke Ant' marked build as failure
Archiving artifacts
Setting ANT_1_8_2_HOME=/home/jenkins/tools/hudson.tasks.Ant_AntInstallation/ANT_1.8.2
[WARNINGS] Skipping publisher since build result is FAILURE
Recording test results
Setting ANT_1_8_2_HOME=/home/jenkins/tools/hudson.tasks.Ant_AntInstallation/ANT_1.8.2
Email was triggered for: Failure - Any
Sending email for trigger: Failure - Any
Setting ANT_1_8_2_HOME=/home/jenkins/tools/hudson.tasks.Ant_AntInstallation/ANT_1.8.2
Setting ANT_1_8_2_HOME=/home/jenkins/tools/hudson.tasks.Ant_AntInstallation/ANT_1.8.2
Setting ANT_1_8_2_HOME=/home/jenkins/tools/hudson.tasks.Ant_AntInstallation/ANT_1.8.2
Setting ANT_1_8_2_HOME=/home/jenkins/tools/hudson.tasks.Ant_AntInstallation/ANT_1.8.2
Setting ANT_1_8_2_HOME=/home/jenkins/tools/hudson.tasks.Ant_AntInstallation/ANT_1.8.2
Setting ANT_1_8_2_HOME=/home/jenkins/tools/hudson.tasks.Ant_AntInstallation/ANT_1.8.2

Mime
View raw message