lucene-dev mailing list archives

Site index · List index
Message view « Date » · « Thread »
Top « Date » · « Thread »
From Policeman Jenkins Server <jenk...@thetaphi.de>
Subject [JENKINS] Lucene-Solr-8.x-Windows (64bit/jdk-9.0.4) - Build # 281 - Unstable!
Date Thu, 30 May 2019 19:12:59 GMT
Build: https://jenkins.thetaphi.de/job/Lucene-Solr-8.x-Windows/281/
Java: 64bit/jdk-9.0.4 -XX:+UseCompressedOops -XX:+UseParallelGC

1 tests failed.
FAILED:  org.apache.solr.core.TestDynamicLoading.testDynamicLoading

Error Message:
Could not get expected value  'org.apache.solr.core.BlobStoreTestRequestHandler' for path 'overlay/requestHandler/\/test1/class' full output: {   "responseHeader":{     "status":0,     "QTime":0},   "overlay":{     "znodeVersion":0,     "runtimeLib":{"colltest":{         "name":"colltest",         "version":1}}}},  from server:  null

Stack Trace:
java.lang.AssertionError: Could not get expected value  'org.apache.solr.core.BlobStoreTestRequestHandler' for path 'overlay/requestHandler/\/test1/class' full output: {
  "responseHeader":{
    "status":0,
    "QTime":0},
  "overlay":{
    "znodeVersion":0,
    "runtimeLib":{"colltest":{
        "name":"colltest",
        "version":1}}}},  from server:  null
	at __randomizedtesting.SeedInfo.seed([C52433A3B496D20B:1D691EF4434B77AB]:0)
	at org.junit.Assert.fail(Assert.java:88)
	at org.junit.Assert.assertTrue(Assert.java:41)
	at org.apache.solr.core.TestSolrConfigHandler.testForResponseElement(TestSolrConfigHandler.java:589)
	at org.apache.solr.core.TestDynamicLoading.testDynamicLoading(TestDynamicLoading.java:80)
	at java.base/jdk.internal.reflect.NativeMethodAccessorImpl.invoke0(Native Method)
	at java.base/jdk.internal.reflect.NativeMethodAccessorImpl.invoke(NativeMethodAccessorImpl.java:62)
	at java.base/jdk.internal.reflect.DelegatingMethodAccessorImpl.invoke(DelegatingMethodAccessorImpl.java:43)
	at java.base/java.lang.reflect.Method.invoke(Method.java:564)
	at com.carrotsearch.randomizedtesting.RandomizedRunner.invoke(RandomizedRunner.java:1750)
	at com.carrotsearch.randomizedtesting.RandomizedRunner$8.evaluate(RandomizedRunner.java:938)
	at com.carrotsearch.randomizedtesting.RandomizedRunner$9.evaluate(RandomizedRunner.java:974)
	at com.carrotsearch.randomizedtesting.RandomizedRunner$10.evaluate(RandomizedRunner.java:988)
	at org.apache.solr.BaseDistributedSearchTestCase$ShardsRepeatRule$ShardsFixedStatement.callStatement(BaseDistributedSearchTestCase.java:1082)
	at org.apache.solr.BaseDistributedSearchTestCase$ShardsRepeatRule$ShardsStatement.evaluate(BaseDistributedSearchTestCase.java:1054)
	at com.carrotsearch.randomizedtesting.rules.SystemPropertiesRestoreRule$1.evaluate(SystemPropertiesRestoreRule.java:57)
	at org.apache.lucene.util.TestRuleSetupTeardownChained$1.evaluate(TestRuleSetupTeardownChained.java:49)
	at org.apache.lucene.util.AbstractBeforeAfterRule$1.evaluate(AbstractBeforeAfterRule.java:45)
	at org.apache.lucene.util.TestRuleThreadAndTestName$1.evaluate(TestRuleThreadAndTestName.java:48)
	at org.apache.lucene.util.TestRuleIgnoreAfterMaxFailures$1.evaluate(TestRuleIgnoreAfterMaxFailures.java:64)
	at org.apache.lucene.util.TestRuleMarkFailure$1.evaluate(TestRuleMarkFailure.java:47)
	at com.carrotsearch.randomizedtesting.rules.StatementAdapter.evaluate(StatementAdapter.java:36)
	at com.carrotsearch.randomizedtesting.ThreadLeakControl$StatementRunner.run(ThreadLeakControl.java:368)
	at com.carrotsearch.randomizedtesting.ThreadLeakControl.forkTimeoutingTask(ThreadLeakControl.java:817)
	at com.carrotsearch.randomizedtesting.ThreadLeakControl$3.evaluate(ThreadLeakControl.java:468)
	at com.carrotsearch.randomizedtesting.RandomizedRunner.runSingleTest(RandomizedRunner.java:947)
	at com.carrotsearch.randomizedtesting.RandomizedRunner$5.evaluate(RandomizedRunner.java:832)
	at com.carrotsearch.randomizedtesting.RandomizedRunner$6.evaluate(RandomizedRunner.java:883)
	at com.carrotsearch.randomizedtesting.RandomizedRunner$7.evaluate(RandomizedRunner.java:894)
	at com.carrotsearch.randomizedtesting.rules.StatementAdapter.evaluate(StatementAdapter.java:36)
	at com.carrotsearch.randomizedtesting.rules.SystemPropertiesRestoreRule$1.evaluate(SystemPropertiesRestoreRule.java:57)
	at org.apache.lucene.util.AbstractBeforeAfterRule$1.evaluate(AbstractBeforeAfterRule.java:45)
	at com.carrotsearch.randomizedtesting.rules.StatementAdapter.evaluate(StatementAdapter.java:36)
	at org.apache.lucene.util.TestRuleStoreClassName$1.evaluate(TestRuleStoreClassName.java:41)
	at com.carrotsearch.randomizedtesting.rules.NoShadowingOrOverridesOnMethodsRule$1.evaluate(NoShadowingOrOverridesOnMethodsRule.java:40)
	at com.carrotsearch.randomizedtesting.rules.NoShadowingOrOverridesOnMethodsRule$1.evaluate(NoShadowingOrOverridesOnMethodsRule.java:40)
	at com.carrotsearch.randomizedtesting.rules.StatementAdapter.evaluate(StatementAdapter.java:36)
	at com.carrotsearch.randomizedtesting.rules.StatementAdapter.evaluate(StatementAdapter.java:36)
	at org.apache.lucene.util.TestRuleAssertionsRequired$1.evaluate(TestRuleAssertionsRequired.java:53)
	at org.apache.lucene.util.TestRuleMarkFailure$1.evaluate(TestRuleMarkFailure.java:47)
	at org.apache.lucene.util.TestRuleIgnoreAfterMaxFailures$1.evaluate(TestRuleIgnoreAfterMaxFailures.java:64)
	at org.apache.lucene.util.TestRuleIgnoreTestSuites$1.evaluate(TestRuleIgnoreTestSuites.java:54)
	at com.carrotsearch.randomizedtesting.rules.StatementAdapter.evaluate(StatementAdapter.java:36)
	at com.carrotsearch.randomizedtesting.ThreadLeakControl$StatementRunner.run(ThreadLeakControl.java:368)
	at java.base/java.lang.Thread.run(Thread.java:844)




Build Log:
[...truncated 13230 lines...]
   [junit4] Suite: org.apache.solr.core.TestDynamicLoading
   [junit4]   2> 537718 INFO  (SUITE-TestDynamicLoading-seed#[C52433A3B496D20B]-worker) [    ] o.a.s.SolrTestCaseJ4 SecureRandom sanity checks: test.solr.allowed.securerandom=null & java.security.egd=file:/dev/./urandom
   [junit4]   2> Creating dataDir: C:\Users\jenkins\workspace\Lucene-Solr-8.x-Windows\solr\build\solr-core\test\J1\temp\solr.core.TestDynamicLoading_C52433A3B496D20B-001\init-core-data-001
   [junit4]   2> 537719 WARN  (SUITE-TestDynamicLoading-seed#[C52433A3B496D20B]-worker) [    ] o.a.s.SolrTestCaseJ4 startTrackingSearchers: numOpens=3 numCloses=3
   [junit4]   2> 537720 INFO  (SUITE-TestDynamicLoading-seed#[C52433A3B496D20B]-worker) [    ] o.a.s.SolrTestCaseJ4 Using PointFields (NUMERIC_POINTS_SYSPROP=true) w/NUMERIC_DOCVALUES_SYSPROP=false
   [junit4]   2> 537722 INFO  (SUITE-TestDynamicLoading-seed#[C52433A3B496D20B]-worker) [    ] o.a.s.SolrTestCaseJ4 Randomized ssl (false) and clientAuth (true) via: @org.apache.solr.util.RandomizeSSL(reason="", value=0.0/0.0, ssl=0.0/0.0, clientAuth=0.0/0.0)
   [junit4]   2> 537722 INFO  (SUITE-TestDynamicLoading-seed#[C52433A3B496D20B]-worker) [    ] o.a.s.BaseDistributedSearchTestCase Setting hostContext system property: /
   [junit4]   2> 537727 INFO  (TEST-TestDynamicLoading.testDynamicLoading-seed#[C52433A3B496D20B]) [    ] o.a.s.c.ZkTestServer STARTING ZK TEST SERVER
   [junit4]   2> 537732 INFO  (ZkTestServer Run Thread) [    ] o.a.s.c.ZkTestServer client port:0.0.0.0/0.0.0.0:0
   [junit4]   2> 537732 INFO  (ZkTestServer Run Thread) [    ] o.a.s.c.ZkTestServer Starting server
   [junit4]   2> 537831 INFO  (TEST-TestDynamicLoading.testDynamicLoading-seed#[C52433A3B496D20B]) [    ] o.a.s.c.ZkTestServer start zk server on port:50892
   [junit4]   2> 537831 INFO  (TEST-TestDynamicLoading.testDynamicLoading-seed#[C52433A3B496D20B]) [    ] o.a.s.c.ZkTestServer parse host and port list: 127.0.0.1:50892
   [junit4]   2> 537831 INFO  (TEST-TestDynamicLoading.testDynamicLoading-seed#[C52433A3B496D20B]) [    ] o.a.s.c.ZkTestServer connecting to 127.0.0.1 50892
   [junit4]   2> 537840 INFO  (zkConnectionManagerCallback-2483-thread-1) [    ] o.a.s.c.c.ConnectionManager zkClient has connected
   [junit4]   2> 537846 INFO  (zkConnectionManagerCallback-2485-thread-1) [    ] o.a.s.c.c.ConnectionManager zkClient has connected
   [junit4]   2> 537848 INFO  (TEST-TestDynamicLoading.testDynamicLoading-seed#[C52433A3B496D20B]) [    ] o.a.s.c.ZkTestServer put C:\Users\jenkins\workspace\Lucene-Solr-8.x-Windows\solr\core\src\test-files\solr\collection1\conf\solrconfig-tlog.xml to /configs/conf1/solrconfig.xml
   [junit4]   2> 537850 INFO  (TEST-TestDynamicLoading.testDynamicLoading-seed#[C52433A3B496D20B]) [    ] o.a.s.c.ZkTestServer put C:\Users\jenkins\workspace\Lucene-Solr-8.x-Windows\solr\core\src\test-files\solr\collection1\conf\schema.xml to /configs/conf1/schema.xml
   [junit4]   2> 537852 INFO  (TEST-TestDynamicLoading.testDynamicLoading-seed#[C52433A3B496D20B]) [    ] o.a.s.c.ZkTestServer put C:\Users\jenkins\workspace\Lucene-Solr-8.x-Windows\solr\core\src\test-files\solr\collection1\conf\solrconfig.snippet.randomindexconfig.xml to /configs/conf1/solrconfig.snippet.randomindexconfig.xml
   [junit4]   2> 537854 INFO  (TEST-TestDynamicLoading.testDynamicLoading-seed#[C52433A3B496D20B]) [    ] o.a.s.c.ZkTestServer put C:\Users\jenkins\workspace\Lucene-Solr-8.x-Windows\solr\core\src\test-files\solr\collection1\conf\stopwords.txt to /configs/conf1/stopwords.txt
   [junit4]   2> 537856 INFO  (TEST-TestDynamicLoading.testDynamicLoading-seed#[C52433A3B496D20B]) [    ] o.a.s.c.ZkTestServer put C:\Users\jenkins\workspace\Lucene-Solr-8.x-Windows\solr\core\src\test-files\solr\collection1\conf\protwords.txt to /configs/conf1/protwords.txt
   [junit4]   2> 537858 INFO  (TEST-TestDynamicLoading.testDynamicLoading-seed#[C52433A3B496D20B]) [    ] o.a.s.c.ZkTestServer put C:\Users\jenkins\workspace\Lucene-Solr-8.x-Windows\solr\core\src\test-files\solr\collection1\conf\currency.xml to /configs/conf1/currency.xml
   [junit4]   2> 537860 INFO  (TEST-TestDynamicLoading.testDynamicLoading-seed#[C52433A3B496D20B]) [    ] o.a.s.c.ZkTestServer put C:\Users\jenkins\workspace\Lucene-Solr-8.x-Windows\solr\core\src\test-files\solr\collection1\conf\enumsConfig.xml to /configs/conf1/enumsConfig.xml
   [junit4]   2> 537861 INFO  (TEST-TestDynamicLoading.testDynamicLoading-seed#[C52433A3B496D20B]) [    ] o.a.s.c.ZkTestServer put C:\Users\jenkins\workspace\Lucene-Solr-8.x-Windows\solr\core\src\test-files\solr\collection1\conf\open-exchange-rates.json to /configs/conf1/open-exchange-rates.json
   [junit4]   2> 537863 INFO  (TEST-TestDynamicLoading.testDynamicLoading-seed#[C52433A3B496D20B]) [    ] o.a.s.c.ZkTestServer put C:\Users\jenkins\workspace\Lucene-Solr-8.x-Windows\solr\core\src\test-files\solr\collection1\conf\mapping-ISOLatin1Accent.txt to /configs/conf1/mapping-ISOLatin1Accent.txt
   [junit4]   2> 537865 INFO  (TEST-TestDynamicLoading.testDynamicLoading-seed#[C52433A3B496D20B]) [    ] o.a.s.c.ZkTestServer put C:\Users\jenkins\workspace\Lucene-Solr-8.x-Windows\solr\core\src\test-files\solr\collection1\conf\old_synonyms.txt to /configs/conf1/old_synonyms.txt
   [junit4]   2> 537866 INFO  (TEST-TestDynamicLoading.testDynamicLoading-seed#[C52433A3B496D20B]) [    ] o.a.s.c.ZkTestServer put C:\Users\jenkins\workspace\Lucene-Solr-8.x-Windows\solr\core\src\test-files\solr\collection1\conf\synonyms.txt to /configs/conf1/synonyms.txt
   [junit4]   2> 537868 INFO  (TEST-TestDynamicLoading.testDynamicLoading-seed#[C52433A3B496D20B]) [    ] o.a.s.c.AbstractFullDistribZkTestBase Will use NRT replicas unless explicitly asked otherwise
   [junit4]   2> 538544 WARN  (TEST-TestDynamicLoading.testDynamicLoading-seed#[C52433A3B496D20B]) [    ] o.e.j.s.AbstractConnector Ignoring deprecated socket close linger time
   [junit4]   2> 538545 INFO  (TEST-TestDynamicLoading.testDynamicLoading-seed#[C52433A3B496D20B]) [    ] o.a.s.c.s.e.JettySolrRunner Start Jetty (original configured port=0)
   [junit4]   2> 538545 INFO  (TEST-TestDynamicLoading.testDynamicLoading-seed#[C52433A3B496D20B]) [    ] o.a.s.c.s.e.JettySolrRunner Trying to start Jetty on port 0 try number 1 ...
   [junit4]   2> 538545 INFO  (TEST-TestDynamicLoading.testDynamicLoading-seed#[C52433A3B496D20B]) [    ] o.e.j.s.Server jetty-9.4.14.v20181114; built: 2018-11-14T21:20:31.478Z; git: c4550056e785fb5665914545889f21dc136ad9e6; jvm 9.0.4+11
   [junit4]   2> 538545 INFO  (TEST-TestDynamicLoading.testDynamicLoading-seed#[C52433A3B496D20B]) [    ] o.e.j.s.session DefaultSessionIdManager workerName=node0
   [junit4]   2> 538545 INFO  (TEST-TestDynamicLoading.testDynamicLoading-seed#[C52433A3B496D20B]) [    ] o.e.j.s.session No SessionScavenger set, using defaults
   [junit4]   2> 538545 INFO  (TEST-TestDynamicLoading.testDynamicLoading-seed#[C52433A3B496D20B]) [    ] o.e.j.s.session node0 Scavenging every 600000ms
   [junit4]   2> 538546 INFO  (TEST-TestDynamicLoading.testDynamicLoading-seed#[C52433A3B496D20B]) [    ] o.e.j.s.h.ContextHandler Started o.e.j.s.ServletContextHandler@79b063e6{/,null,AVAILABLE}
   [junit4]   2> 538549 INFO  (TEST-TestDynamicLoading.testDynamicLoading-seed#[C52433A3B496D20B]) [    ] o.e.j.s.AbstractConnector Started ServerConnector@2e92a87b{HTTP/1.1,[http/1.1, h2c]}{127.0.0.1:50902}
   [junit4]   2> 538549 INFO  (TEST-TestDynamicLoading.testDynamicLoading-seed#[C52433A3B496D20B]) [    ] o.e.j.s.Server Started @538593ms
   [junit4]   2> 538549 INFO  (TEST-TestDynamicLoading.testDynamicLoading-seed#[C52433A3B496D20B]) [    ] o.a.s.c.s.e.JettySolrRunner Jetty properties: {hostContext=/, solr.data.dir=C:\Users\jenkins\workspace\Lucene-Solr-8.x-Windows\solr\build\solr-core\test\J1\temp\solr.core.TestDynamicLoading_C52433A3B496D20B-001\tempDir-001/control/data, hostPort=50902, coreRootDirectory=C:\Users\jenkins\workspace\Lucene-Solr-8.x-Windows\solr\build\solr-core\test\J1\temp\solr.core.TestDynamicLoading_C52433A3B496D20B-001\control-001\cores, replicaType=NRT}
   [junit4]   2> 538549 ERROR (TEST-TestDynamicLoading.testDynamicLoading-seed#[C52433A3B496D20B]) [    ] o.a.s.u.StartupLoggingUtils Missing Java Option solr.log.dir. Logging may be missing or incomplete.
   [junit4]   2> 538549 INFO  (TEST-TestDynamicLoading.testDynamicLoading-seed#[C52433A3B496D20B]) [    ] o.a.s.s.SolrDispatchFilter Using logger factory org.apache.logging.slf4j.Log4jLoggerFactory
   [junit4]   2> 538549 INFO  (TEST-TestDynamicLoading.testDynamicLoading-seed#[C52433A3B496D20B]) [    ] o.a.s.s.SolrDispatchFilter  ___      _       Welcome to Apache Solr™ version 8.2.0
   [junit4]   2> 538549 INFO  (TEST-TestDynamicLoading.testDynamicLoading-seed#[C52433A3B496D20B]) [    ] o.a.s.s.SolrDispatchFilter / __| ___| |_ _   Starting in cloud mode on port null
   [junit4]   2> 538549 INFO  (TEST-TestDynamicLoading.testDynamicLoading-seed#[C52433A3B496D20B]) [    ] o.a.s.s.SolrDispatchFilter \__ \/ _ \ | '_|  Install dir: null
   [junit4]   2> 538550 INFO  (TEST-TestDynamicLoading.testDynamicLoading-seed#[C52433A3B496D20B]) [    ] o.a.s.s.SolrDispatchFilter |___/\___/_|_|    Start time: 2019-05-30T17:50:47.415693300Z
   [junit4]   2> 538554 INFO  (zkConnectionManagerCallback-2487-thread-1) [    ] o.a.s.c.c.ConnectionManager zkClient has connected
   [junit4]   2> 538555 INFO  (TEST-TestDynamicLoading.testDynamicLoading-seed#[C52433A3B496D20B]) [    ] o.a.s.s.SolrDispatchFilter Loading solr.xml from SolrHome (not found in ZooKeeper)
   [junit4]   2> 538555 INFO  (TEST-TestDynamicLoading.testDynamicLoading-seed#[C52433A3B496D20B]) [    ] o.a.s.c.SolrXmlConfig Loading container configuration from C:\Users\jenkins\workspace\Lucene-Solr-8.x-Windows\solr\build\solr-core\test\J1\temp\solr.core.TestDynamicLoading_C52433A3B496D20B-001\control-001\solr.xml
   [junit4]   2> 538558 INFO  (TEST-TestDynamicLoading.testDynamicLoading-seed#[C52433A3B496D20B]) [    ] o.a.s.c.SolrXmlConfig Configuration parameter autoReplicaFailoverWorkLoopDelay is ignored
   [junit4]   2> 538558 INFO  (TEST-TestDynamicLoading.testDynamicLoading-seed#[C52433A3B496D20B]) [    ] o.a.s.c.SolrXmlConfig Configuration parameter autoReplicaFailoverBadNodeExpiration is ignored
   [junit4]   2> 538559 INFO  (TEST-TestDynamicLoading.testDynamicLoading-seed#[C52433A3B496D20B]) [    ] o.a.s.c.SolrXmlConfig MBean server found: com.sun.jmx.mbeanserver.JmxMBeanServer@1fd4b771, but no JMX reporters were configured - adding default JMX reporter.
   [junit4]   2> 539049 INFO  (TEST-TestDynamicLoading.testDynamicLoading-seed#[C52433A3B496D20B]) [    ] o.a.s.h.c.HttpShardHandlerFactory Host whitelist initialized: WhitelistHostChecker [whitelistHosts=null, whitelistHostCheckingEnabled=false]
   [junit4]   2> 539051 WARN  (TEST-TestDynamicLoading.testDynamicLoading-seed#[C52433A3B496D20B]) [    ] o.e.j.u.s.S.config No Client EndPointIdentificationAlgorithm configured for SslContextFactory@62336131[provider=null,keyStore=null,trustStore=null]
   [junit4]   2> 539056 WARN  (TEST-TestDynamicLoading.testDynamicLoading-seed#[C52433A3B496D20B]) [    ] o.e.j.u.s.S.config No Client EndPointIdentificationAlgorithm configured for SslContextFactory@7fdace53[provider=null,keyStore=null,trustStore=null]
   [junit4]   2> 539057 INFO  (TEST-TestDynamicLoading.testDynamicLoading-seed#[C52433A3B496D20B]) [    ] o.a.s.c.ZkContainer Zookeeper client=127.0.0.1:50892/solr
   [junit4]   2> 539062 INFO  (zkConnectionManagerCallback-2494-thread-1) [    ] o.a.s.c.c.ConnectionManager zkClient has connected
   [junit4]   2> 539067 INFO  (zkConnectionManagerCallback-2496-thread-1) [    ] o.a.s.c.c.ConnectionManager zkClient has connected
   [junit4]   2> 539234 INFO  (TEST-TestDynamicLoading.testDynamicLoading-seed#[C52433A3B496D20B]) [n:127.0.0.1:50902_    ] o.a.s.c.OverseerElectionContext I am going to be the leader 127.0.0.1:50902_
   [junit4]   2> 539235 INFO  (TEST-TestDynamicLoading.testDynamicLoading-seed#[C52433A3B496D20B]) [n:127.0.0.1:50902_    ] o.a.s.c.Overseer Overseer (id=72146742388719620-127.0.0.1:50902_-n_0000000000) starting
   [junit4]   2> 539254 INFO  (zkConnectionManagerCallback-2503-thread-1) [    ] o.a.s.c.c.ConnectionManager zkClient has connected
   [junit4]   2> 539258 INFO  (TEST-TestDynamicLoading.testDynamicLoading-seed#[C52433A3B496D20B]) [n:127.0.0.1:50902_    ] o.a.s.c.s.i.ZkClientClusterStateProvider Cluster at 127.0.0.1:50892/solr ready
   [junit4]   2> 539259 INFO  (OverseerStateUpdate-72146742388719620-127.0.0.1:50902_-n_0000000000) [n:127.0.0.1:50902_    ] o.a.s.c.Overseer Starting to work on the main queue : 127.0.0.1:50902_
   [junit4]   2> 539259 INFO  (TEST-TestDynamicLoading.testDynamicLoading-seed#[C52433A3B496D20B]) [n:127.0.0.1:50902_    ] o.a.s.c.ZkController Register node as live in ZooKeeper:/live_nodes/127.0.0.1:50902_
   [junit4]   2> 539264 INFO  (OverseerStateUpdate-72146742388719620-127.0.0.1:50902_-n_0000000000) [n:127.0.0.1:50902_    ] o.a.s.c.c.ZkStateReader Updated live nodes from ZooKeeper... (0) -> (1)
   [junit4]   2> 539282 INFO  (zkCallback-2502-thread-1) [    ] o.a.s.c.c.ZkStateReader Updated live nodes from ZooKeeper... (0) -> (1)
   [junit4]   2> 539308 INFO  (TEST-TestDynamicLoading.testDynamicLoading-seed#[C52433A3B496D20B]) [n:127.0.0.1:50902_    ] o.a.s.h.a.MetricsHistoryHandler No .system collection, keeping metrics history in memory.
   [junit4]   2> 539338 INFO  (TEST-TestDynamicLoading.testDynamicLoading-seed#[C52433A3B496D20B]) [n:127.0.0.1:50902_    ] o.a.s.m.r.SolrJmxReporter JMX monitoring for 'solr.node' (registry 'solr.node') enabled at server: com.sun.jmx.mbeanserver.JmxMBeanServer@1fd4b771
   [junit4]   2> 539352 INFO  (TEST-TestDynamicLoading.testDynamicLoading-seed#[C52433A3B496D20B]) [n:127.0.0.1:50902_    ] o.a.s.m.r.SolrJmxReporter JMX monitoring for 'solr.jvm' (registry 'solr.jvm') enabled at server: com.sun.jmx.mbeanserver.JmxMBeanServer@1fd4b771
   [junit4]   2> 539352 INFO  (TEST-TestDynamicLoading.testDynamicLoading-seed#[C52433A3B496D20B]) [n:127.0.0.1:50902_    ] o.a.s.m.r.SolrJmxReporter JMX monitoring for 'solr.jetty' (registry 'solr.jetty') enabled at server: com.sun.jmx.mbeanserver.JmxMBeanServer@1fd4b771
   [junit4]   2> 539355 INFO  (TEST-TestDynamicLoading.testDynamicLoading-seed#[C52433A3B496D20B]) [n:127.0.0.1:50902_    ] o.a.s.c.CorePropertiesLocator Found 0 core definitions underneath C:\Users\jenkins\workspace\Lucene-Solr-8.x-Windows\solr\build\solr-core\test\J1\temp\solr.core.TestDynamicLoading_C52433A3B496D20B-001\control-001\cores
   [junit4]   2> 539394 INFO  (zkConnectionManagerCallback-2509-thread-1) [    ] o.a.s.c.c.ConnectionManager zkClient has connected
   [junit4]   2> 539396 INFO  (TEST-TestDynamicLoading.testDynamicLoading-seed#[C52433A3B496D20B]) [    ] o.a.s.c.c.ZkStateReader Updated live nodes from ZooKeeper... (0) -> (1)
   [junit4]   2> 539397 INFO  (TEST-TestDynamicLoading.testDynamicLoading-seed#[C52433A3B496D20B]) [    ] o.a.s.c.s.i.ZkClientClusterStateProvider Cluster at 127.0.0.1:50892/solr ready
   [junit4]   2> 539401 INFO  (qtp2131136933-7332) [n:127.0.0.1:50902_    ] o.a.s.h.a.CollectionsHandler Invoked Collection Action :create with params collection.configName=conf1&name=control_collection&nrtReplicas=1&action=CREATE&numShards=1&createNodeSet=127.0.0.1:50902_&wt=javabin&version=2 and sendToOCPQueue=true
   [junit4]   2> 539406 INFO  (OverseerThreadFactory-2372-thread-1-processing-n:127.0.0.1:50902_) [n:127.0.0.1:50902_    ] o.a.s.c.a.c.CreateCollectionCmd Create collection control_collection
   [junit4]   2> 539517 INFO  (qtp2131136933-7334) [n:127.0.0.1:50902_    x:control_collection_shard1_replica_n1] o.a.s.h.a.CoreAdminOperation core create command qt=/admin/cores&collection.configName=conf1&newCollection=true&name=control_collection_shard1_replica_n1&action=CREATE&numShards=1&collection=control_collection&shard=shard1&wt=javabin&version=2&replicaType=NRT
   [junit4]   2> 539517 INFO  (qtp2131136933-7334) [n:127.0.0.1:50902_    x:control_collection_shard1_replica_n1] o.a.s.c.TransientSolrCoreCacheDefault Allocating transient cache for 4 transient cores
   [junit4]   2> 540538 INFO  (qtp2131136933-7334) [n:127.0.0.1:50902_ c:control_collection s:shard1  x:control_collection_shard1_replica_n1] o.a.s.c.SolrConfig Using Lucene MatchVersion: 8.2.0
   [junit4]   2> 540554 INFO  (qtp2131136933-7334) [n:127.0.0.1:50902_ c:control_collection s:shard1  x:control_collection_shard1_replica_n1] o.a.s.s.IndexSchema [control_collection_shard1_replica_n1] Schema name=test
   [junit4]   2> 540654 INFO  (qtp2131136933-7334) [n:127.0.0.1:50902_ c:control_collection s:shard1  x:control_collection_shard1_replica_n1] o.a.s.s.IndexSchema Loaded schema test/1.0 with uniqueid field id
   [junit4]   2> 540679 INFO  (qtp2131136933-7334) [n:127.0.0.1:50902_ c:control_collection s:shard1  x:control_collection_shard1_replica_n1] o.a.s.c.CoreContainer Creating SolrCore 'control_collection_shard1_replica_n1' using configuration from collection control_collection, trusted=true
   [junit4]   2> 540680 INFO  (qtp2131136933-7334) [n:127.0.0.1:50902_ c:control_collection s:shard1  x:control_collection_shard1_replica_n1] o.a.s.m.r.SolrJmxReporter JMX monitoring for 'solr.core.control_collection.shard1.replica_n1' (registry 'solr.core.control_collection.shard1.replica_n1') enabled at server: com.sun.jmx.mbeanserver.JmxMBeanServer@1fd4b771
   [junit4]   2> 540680 INFO  (qtp2131136933-7334) [n:127.0.0.1:50902_ c:control_collection s:shard1  x:control_collection_shard1_replica_n1] o.a.s.c.SolrCore [[control_collection_shard1_replica_n1] ] Opening new SolrCore at [C:\Users\jenkins\workspace\Lucene-Solr-8.x-Windows\solr\build\solr-core\test\J1\temp\solr.core.TestDynamicLoading_C52433A3B496D20B-001\control-001\cores\control_collection_shard1_replica_n1], dataDir=[C:\Users\jenkins\workspace\Lucene-Solr-8.x-Windows\solr\build\solr-core\test\J1\temp\solr.core.TestDynamicLoading_C52433A3B496D20B-001\control-001\cores\control_collection_shard1_replica_n1\data\]
   [junit4]   2> 540682 INFO  (qtp2131136933-7334) [n:127.0.0.1:50902_ c:control_collection s:shard1  x:control_collection_shard1_replica_n1] o.a.s.u.RandomMergePolicy RandomMergePolicy wrapping class org.apache.lucene.index.TieredMergePolicy: [TieredMergePolicy: maxMergeAtOnce=43, maxMergeAtOnceExplicit=19, maxMergedSegmentMB=0.6728515625, floorSegmentMB=1.9033203125, forceMergeDeletesPctAllowed=17.460662261213372, segmentsPerTier=45.0, maxCFSSegmentSizeMB=8.796093022207999E12, noCFSRatio=0.2752181799367386, deletesPctAllowed=33.38848913492407
   [junit4]   2> 540683 WARN  (qtp2131136933-7334) [n:127.0.0.1:50902_ c:control_collection s:shard1  x:control_collection_shard1_replica_n1] o.a.s.c.RequestHandlers INVALID paramSet a in requestHandler {type = requestHandler,name = /dump,class = DumpRequestHandler,attributes = {initParams=a, name=/dump, class=DumpRequestHandler},args = {defaults={a=A,b=B}}}
   [junit4]   2> 540750 INFO  (qtp2131136933-7334) [n:127.0.0.1:50902_ c:control_collection s:shard1  x:control_collection_shard1_replica_n1] o.a.s.u.UpdateHandler Using UpdateLog implementation: org.apache.solr.update.UpdateLog
   [junit4]   2> 540750 INFO  (qtp2131136933-7334) [n:127.0.0.1:50902_ c:control_collection s:shard1  x:control_collection_shard1_replica_n1] o.a.s.u.UpdateLog Initializing UpdateLog: dataDir= defaultSyncLevel=FLUSH numRecordsToKeep=100 maxNumLogsToKeep=10 numVersionBuckets=65536
   [junit4]   2> 540754 INFO  (qtp2131136933-7334) [n:127.0.0.1:50902_ c:control_collection s:shard1  x:control_collection_shard1_replica_n1] o.a.s.u.CommitTracker Hard AutoCommit: disabled
   [junit4]   2> 540754 INFO  (qtp2131136933-7334) [n:127.0.0.1:50902_ c:control_collection s:shard1  x:control_collection_shard1_replica_n1] o.a.s.u.CommitTracker Soft AutoCommit: disabled
   [junit4]   2> 540755 INFO  (qtp2131136933-7334) [n:127.0.0.1:50902_ c:control_collection s:shard1  x:control_collection_shard1_replica_n1] o.a.s.u.RandomMergePolicy RandomMergePolicy wrapping class org.apache.lucene.index.LogByteSizeMergePolicy: [LogByteSizeMergePolicy: minMergeSize=1677721, mergeFactor=44, maxMergeSize=2147483648, maxMergeSizeForForcedMerge=9223372036854775807, calibrateSizeByDeletes=true, maxMergeDocs=2147483647, maxCFSSegmentSizeMB=8.796093022207999E12, noCFSRatio=0.23006066099456587]
   [junit4]   2> 540755 INFO  (qtp2131136933-7334) [n:127.0.0.1:50902_ c:control_collection s:shard1  x:control_collection_shard1_replica_n1] o.a.s.s.SolrIndexSearcher Opening [Searcher@57d1daf7[control_collection_shard1_replica_n1] main]
   [junit4]   2> 540756 INFO  (qtp2131136933-7334) [n:127.0.0.1:50902_ c:control_collection s:shard1  x:control_collection_shard1_replica_n1] o.a.s.r.ManagedResourceStorage Configured ZooKeeperStorageIO with znodeBase: /configs/conf1
   [junit4]   2> 540757 INFO  (qtp2131136933-7334) [n:127.0.0.1:50902_ c:control_collection s:shard1  x:control_collection_shard1_replica_n1] o.a.s.r.ManagedResourceStorage Loaded null at path _rest_managed.json using ZooKeeperStorageIO:path=/configs/conf1
   [junit4]   2> 540757 INFO  (qtp2131136933-7334) [n:127.0.0.1:50902_ c:control_collection s:shard1  x:control_collection_shard1_replica_n1] o.a.s.h.ReplicationHandler Commits will be reserved for 10000ms.
   [junit4]   2> 540757 INFO  (qtp2131136933-7334) [n:127.0.0.1:50902_ c:control_collection s:shard1  x:control_collection_shard1_replica_n1] o.a.s.u.UpdateLog Could not find max version in index or recent updates, using new clock 1634980226267086848
   [junit4]   2> 540761 INFO  (searcherExecutor-2377-thread-1-processing-n:127.0.0.1:50902_ x:control_collection_shard1_replica_n1 c:control_collection s:shard1) [n:127.0.0.1:50902_ c:control_collection s:shard1  x:control_collection_shard1_replica_n1] o.a.s.c.SolrCore [control_collection_shard1_replica_n1] Registered new searcher Searcher@57d1daf7[control_collection_shard1_replica_n1] main{ExitableDirectoryReader(UninvertingDirectoryReader())}
   [junit4]   2> 540761 INFO  (qtp2131136933-7334) [n:127.0.0.1:50902_ c:control_collection s:shard1  x:control_collection_shard1_replica_n1] o.a.s.c.ZkShardTerms Successful update of terms at /collections/control_collection/terms/shard1 to Terms{values={core_node2=0}, version=0}
   [junit4]   2> 540761 INFO  (qtp2131136933-7334) [n:127.0.0.1:50902_ c:control_collection s:shard1  x:control_collection_shard1_replica_n1] o.a.s.c.ShardLeaderElectionContextBase make sure parent is created /collections/control_collection/leaders/shard1
   [junit4]   2> 540765 INFO  (qtp2131136933-7334) [n:127.0.0.1:50902_ c:control_collection s:shard1  x:control_collection_shard1_replica_n1] o.a.s.c.ShardLeaderElectionContext Enough replicas found to continue.
   [junit4]   2> 540765 INFO  (qtp2131136933-7334) [n:127.0.0.1:50902_ c:control_collection s:shard1  x:control_collection_shard1_replica_n1] o.a.s.c.ShardLeaderElectionContext I may be the new leader - try and sync
   [junit4]   2> 540765 INFO  (qtp2131136933-7334) [n:127.0.0.1:50902_ c:control_collection s:shard1  x:control_collection_shard1_replica_n1] o.a.s.c.SyncStrategy Sync replicas to http://127.0.0.1:50902/control_collection_shard1_replica_n1/
   [junit4]   2> 540765 INFO  (qtp2131136933-7334) [n:127.0.0.1:50902_ c:control_collection s:shard1  x:control_collection_shard1_replica_n1] o.a.s.c.SyncStrategy Sync Success - now sync replicas to me
   [junit4]   2> 540765 INFO  (qtp2131136933-7334) [n:127.0.0.1:50902_ c:control_collection s:shard1  x:control_collection_shard1_replica_n1] o.a.s.c.SyncStrategy http://127.0.0.1:50902/control_collection_shard1_replica_n1/ has no replicas
   [junit4]   2> 540765 INFO  (qtp2131136933-7334) [n:127.0.0.1:50902_ c:control_collection s:shard1  x:control_collection_shard1_replica_n1] o.a.s.c.ShardLeaderElectionContextBase Creating leader registration node /collections/control_collection/leaders/shard1/leader after winning as /collections/control_collection/leader_elect/shard1/election/72146742388719620-core_node2-n_0000000000
   [junit4]   2> 540767 INFO  (qtp2131136933-7334) [n:127.0.0.1:50902_ c:control_collection s:shard1  x:control_collection_shard1_replica_n1] o.a.s.c.ShardLeaderElectionContext I am the new leader: http://127.0.0.1:50902/control_collection_shard1_replica_n1/ shard1
   [junit4]   2> 540926 INFO  (zkCallback-2495-thread-1) [    ] o.a.s.c.c.ZkStateReader A cluster state change: [WatchedEvent state:SyncConnected type:NodeDataChanged path:/collections/control_collection/state.json] for collection [control_collection] has occurred - updating... (live nodes size: [1])
   [junit4]   2> 540928 INFO  (qtp2131136933-7334) [n:127.0.0.1:50902_ c:control_collection s:shard1  x:control_collection_shard1_replica_n1] o.a.s.c.ZkController I am the leader, no recovery necessary
   [junit4]   2> 540931 INFO  (qtp2131136933-7334) [n:127.0.0.1:50902_ c:control_collection s:shard1  x:control_collection_shard1_replica_n1] o.a.s.s.HttpSolrCall [admin] webapp=null path=/admin/cores params={qt=/admin/cores&collection.configName=conf1&newCollection=true&name=control_collection_shard1_replica_n1&action=CREATE&numShards=1&collection=control_collection&shard=shard1&wt=javabin&version=2&replicaType=NRT} status=0 QTime=1414
   [junit4]   2> 540937 INFO  (zkCallback-2495-thread-2) [    ] o.a.s.c.c.ZkStateReader A cluster state change: [WatchedEvent state:SyncConnected type:NodeDataChanged path:/collections/control_collection/state.json] for collection [control_collection] has occurred - updating... (live nodes size: [1])
   [junit4]   2> 540944 INFO  (qtp2131136933-7332) [n:127.0.0.1:50902_    ] o.a.s.h.a.CollectionsHandler Wait for new collection to be active for at most 45 seconds. Check all shard replicas
   [junit4]   2> 541046 INFO  (zkCallback-2495-thread-2) [    ] o.a.s.c.c.ZkStateReader A cluster state change: [WatchedEvent state:SyncConnected type:NodeDataChanged path:/collections/control_collection/state.json] for collection [control_collection] has occurred - updating... (live nodes size: [1])
   [junit4]   2> 541046 INFO  (zkCallback-2495-thread-1) [    ] o.a.s.c.c.ZkStateReader A cluster state change: [WatchedEvent state:SyncConnected type:NodeDataChanged path:/collections/control_collection/state.json] for collection [control_collection] has occurred - updating... (live nodes size: [1])
   [junit4]   2> 541046 INFO  (qtp2131136933-7332) [n:127.0.0.1:50902_    ] o.a.s.s.HttpSolrCall [admin] webapp=null path=/admin/collections params={collection.configName=conf1&name=control_collection&nrtReplicas=1&action=CREATE&numShards=1&createNodeSet=127.0.0.1:50902_&wt=javabin&version=2} status=0 QTime=1645
   [junit4]   2> 541046 INFO  (zkCallback-2495-thread-3) [    ] o.a.s.c.c.ZkStateReader A cluster state change: [WatchedEvent state:SyncConnected type:NodeDataChanged path:/collections/control_collection/state.json] for collection [control_collection] has occurred - updating... (live nodes size: [1])
   [junit4]   2> 541054 INFO  (zkConnectionManagerCallback-2515-thread-1) [    ] o.a.s.c.c.ConnectionManager zkClient has connected
   [junit4]   2> 541055 INFO  (TEST-TestDynamicLoading.testDynamicLoading-seed#[C52433A3B496D20B]) [    ] o.a.s.c.c.ZkStateReader Updated live nodes from ZooKeeper... (0) -> (1)
   [junit4]   2> 541057 INFO  (TEST-TestDynamicLoading.testDynamicLoading-seed#[C52433A3B496D20B]) [    ] o.a.s.c.s.i.ZkClientClusterStateProvider Cluster at 127.0.0.1:50892/solr ready
   [junit4]   2> 541057 INFO  (TEST-TestDynamicLoading.testDynamicLoading-seed#[C52433A3B496D20B]) [    ] o.a.s.c.ChaosMonkey monkey: init - expire sessions:false cause connection loss:false
   [junit4]   2> 541058 INFO  (qtp2131136933-7331) [n:127.0.0.1:50902_    ] o.a.s.h.a.CollectionsHandler Invoked Collection Action :create with params collection.configName=conf1&name=collection1&nrtReplicas=1&action=CREATE&numShards=2&createNodeSet=&stateFormat=2&wt=javabin&version=2 and sendToOCPQueue=true
   [junit4]   2> 541063 INFO  (OverseerCollectionConfigSetProcessor-72146742388719620-127.0.0.1:50902_-n_0000000000) [n:127.0.0.1:50902_    ] o.a.s.c.OverseerTaskQueue Response ZK path: /overseer/collection-queue-work/qnr-0000000000 doesn't exist.  Requestor may have disconnected from ZooKeeper
   [junit4]   2> 541063 INFO  (OverseerThreadFactory-2372-thread-2-processing-n:127.0.0.1:50902_) [n:127.0.0.1:50902_    ] o.a.s.c.a.c.CreateCollectionCmd Create collection collection1
   [junit4]   2> 541268 WARN  (OverseerThreadFactory-2372-thread-2-processing-n:127.0.0.1:50902_) [n:127.0.0.1:50902_    ] o.a.s.c.a.c.CreateCollectionCmd It is unusual to create a collection (collection1) without cores.
   [junit4]   2> 541269 INFO  (qtp2131136933-7331) [n:127.0.0.1:50902_    ] o.a.s.h.a.CollectionsHandler Wait for new collection to be active for at most 45 seconds. Check all shard replicas
   [junit4]   2> 541270 INFO  (qtp2131136933-7331) [n:127.0.0.1:50902_    ] o.a.s.s.HttpSolrCall [admin] webapp=null path=/admin/collections params={collection.configName=conf1&name=collection1&nrtReplicas=1&action=CREATE&numShards=2&createNodeSet=&stateFormat=2&wt=javabin&version=2} status=0 QTime=211
   [junit4]   2> 541270 INFO  (TEST-TestDynamicLoading.testDynamicLoading-seed#[C52433A3B496D20B]) [    ] o.a.s.c.AbstractFullDistribZkTestBase Creating jetty instances pullReplicaCount=0 numOtherReplicas=4
   [junit4]   2> 541844 INFO  (TEST-TestDynamicLoading.testDynamicLoading-seed#[C52433A3B496D20B]) [    ] o.a.s.c.AbstractFullDistribZkTestBase create jetty 1 in directory C:\Users\jenkins\workspace\Lucene-Solr-8.x-Windows\solr\build\solr-core\test\J1\temp\solr.core.TestDynamicLoading_C52433A3B496D20B-001\shard-1-001 of type NRT
   [junit4]   2> 541845 WARN  (closeThreadPool-2516-thread-1) [    ] o.e.j.s.AbstractConnector Ignoring deprecated socket close linger time
   [junit4]   2> 541845 INFO  (closeThreadPool-2516-thread-1) [    ] o.a.s.c.s.e.JettySolrRunner Start Jetty (original configured port=0)
   [junit4]   2> 541845 INFO  (closeThreadPool-2516-thread-1) [    ] o.a.s.c.s.e.JettySolrRunner Trying to start Jetty on port 0 try number 1 ...
   [junit4]   2> 541846 INFO  (closeThreadPool-2516-thread-1) [    ] o.e.j.s.Server jetty-9.4.14.v20181114; built: 2018-11-14T21:20:31.478Z; git: c4550056e785fb5665914545889f21dc136ad9e6; jvm 9.0.4+11
   [junit4]   2> 541846 INFO  (closeThreadPool-2516-thread-1) [    ] o.e.j.s.session DefaultSessionIdManager workerName=node0
   [junit4]   2> 541846 INFO  (closeThreadPool-2516-thread-1) [    ] o.e.j.s.session No SessionScavenger set, using defaults
   [junit4]   2> 541846 INFO  (closeThreadPool-2516-thread-1) [    ] o.e.j.s.session node0 Scavenging every 660000ms
   [junit4]   2> 541847 INFO  (closeThreadPool-2516-thread-1) [    ] o.e.j.s.h.ContextHandler Started o.e.j.s.ServletContextHandler@3dab677b{/,null,AVAILABLE}
   [junit4]   2> 541849 INFO  (closeThreadPool-2516-thread-1) [    ] o.e.j.s.AbstractConnector Started ServerConnector@62e7168f{HTTP/1.1,[http/1.1, h2c]}{127.0.0.1:50930}
   [junit4]   2> 541849 INFO  (closeThreadPool-2516-thread-1) [    ] o.e.j.s.Server Started @541893ms
   [junit4]   2> 541849 INFO  (closeThreadPool-2516-thread-1) [    ] o.a.s.c.s.e.JettySolrRunner Jetty properties: {hostContext=/, solrconfig=solrconfig.xml, solr.data.dir=C:\Users\jenkins\workspace\Lucene-Solr-8.x-Windows\solr\build\solr-core\test\J1\temp\solr.core.TestDynamicLoading_C52433A3B496D20B-001\tempDir-001/jetty1, hostPort=50930, coreRootDirectory=C:\Users\jenkins\workspace\Lucene-Solr-8.x-Windows\solr\build\solr-core\test\J1\temp\solr.core.TestDynamicLoading_C52433A3B496D20B-001\shard-1-001\cores}
   [junit4]   2> 541849 ERROR (closeThreadPool-2516-thread-1) [    ] o.a.s.u.StartupLoggingUtils Missing Java Option solr.log.dir. Logging may be missing or incomplete.
   [junit4]   2> 541849 INFO  (closeThreadPool-2516-thread-1) [    ] o.a.s.s.SolrDispatchFilter Using logger factory org.apache.logging.slf4j.Log4jLoggerFactory
   [junit4]   2> 541849 INFO  (closeThreadPool-2516-thread-1) [    ] o.a.s.s.SolrDispatchFilter  ___      _       Welcome to Apache Solr™ version 8.2.0
   [junit4]   2> 541850 INFO  (closeThreadPool-2516-thread-1) [    ] o.a.s.s.SolrDispatchFilter / __| ___| |_ _   Starting in cloud mode on port null
   [junit4]   2> 541850 INFO  (closeThreadPool-2516-thread-1) [    ] o.a.s.s.SolrDispatchFilter \__ \/ _ \ | '_|  Install dir: null
   [junit4]   2> 541850 INFO  (closeThreadPool-2516-thread-1) [    ] o.a.s.s.SolrDispatchFilter |___/\___/_|_|    Start time: 2019-05-30T17:50:50.716565600Z
   [junit4]   2> 541854 INFO  (zkConnectionManagerCallback-2518-thread-1) [    ] o.a.s.c.c.ConnectionManager zkClient has connected
   [junit4]   2> 541856 INFO  (closeThreadPool-2516-thread-1) [    ] o.a.s.s.SolrDispatchFilter Loading solr.xml from SolrHome (not found in ZooKeeper)
   [junit4]   2> 541856 INFO  (closeThreadPool-2516-thread-1) [    ] o.a.s.c.SolrXmlConfig Loading container configuration from C:\Users\jenkins\workspace\Lucene-Solr-8.x-Windows\solr\build\solr-core\test\J1\temp\solr.core.TestDynamicLoading_C52433A3B496D20B-001\shard-1-001\solr.xml
   [junit4]   2> 541860 INFO  (closeThreadPool-2516-thread-1) [    ] o.a.s.c.SolrXmlConfig Configuration parameter autoReplicaFailoverWorkLoopDelay is ignored
   [junit4]   2> 541860 INFO  (closeThreadPool-2516-thread-1) [    ] o.a.s.c.SolrXmlConfig Configuration parameter autoReplicaFailoverBadNodeExpiration is ignored
   [junit4]   2> 541862 INFO  (closeThreadPool-2516-thread-1) [    ] o.a.s.c.SolrXmlConfig MBean server found: com.sun.jmx.mbeanserver.JmxMBeanServer@1fd4b771, but no JMX reporters were configured - adding default JMX reporter.
   [junit4]   2> 542267 INFO  (closeThreadPool-2516-thread-1) [    ] o.a.s.h.c.HttpShardHandlerFactory Host whitelist initialized: WhitelistHostChecker [whitelistHosts=null, whitelistHostCheckingEnabled=false]
   [junit4]   2> 542270 WARN  (closeThreadPool-2516-thread-1) [    ] o.e.j.u.s.S.config No Client EndPointIdentificationAlgorithm configured for SslContextFactory@bbb2d8[provider=null,keyStore=null,trustStore=null]
   [junit4]   2> 542278 WARN  (closeThreadPool-2516-thread-1) [    ] o.e.j.u.s.S.config No Client EndPointIdentificationAlgorithm configured for SslContextFactory@4161d46f[provider=null,keyStore=null,trustStore=null]
   [junit4]   2> 542278 INFO  (closeThreadPool-2516-thread-1) [    ] o.a.s.c.ZkContainer Zookeeper client=127.0.0.1:50892/solr
   [junit4]   2> 542288 INFO  (zkConnectionManagerCallback-2525-thread-1) [    ] o.a.s.c.c.ConnectionManager zkClient has connected
   [junit4]   2> 542289 WARN  (NIOServerCxn.Factory:0.0.0.0/0.0.0.0:0) [    ] o.a.z.s.NIOServerCnxn Unable to read additional data from client sessionid 0x100511477c80009, likely client has closed socket
   [junit4]   2> 542295 INFO  (zkConnectionManagerCallback-2527-thread-1) [    ] o.a.s.c.c.ConnectionManager zkClient has connected
   [junit4]   2> 542312 INFO  (closeThreadPool-2516-thread-1) [n:127.0.0.1:50930_    ] o.a.s.c.c.ZkStateReader Updated live nodes from ZooKeeper... (0) -> (1)
   [junit4]   2> 542355 INFO  (closeThreadPool-2516-thread-1) [n:127.0.0.1:50930_    ] o.a.s.c.ZkController Publish node=127.0.0.1:50930_ as DOWN
   [junit4]   2> 542356 INFO  (closeThreadPool-2516-thread-1) [n:127.0.0.1:50930_    ] o.a.s.c.TransientSolrCoreCacheDefault Allocating transient cache for 4 transient cores
   [junit4]   2> 542356 INFO  (closeThreadPool-2516-thread-1) [n:127.0.0.1:50930_    ] o.a.s.c.ZkController Register node as live in ZooKeeper:/live_nodes/127.0.0.1:50930_
   [junit4]   2> 542357 INFO  (zkCallback-2495-thread-3) [    ] o.a.s.c.c.ZkStateReader Updated live nodes from ZooKeeper... (1) -> (2)
   [junit4]   2> 542360 INFO  (zkCallback-2502-thread-1) [    ] o.a.s.c.c.ZkStateReader Updated live nodes from ZooKeeper... (1) -> (2)
   [junit4]   2> 542360 INFO  (zkCallback-2514-thread-1) [    ] o.a.s.c.c.ZkStateReader Updated live nodes from ZooKeeper... (1) -> (2)
   [junit4]   2> 542362 INFO  (zkCallback-2526-thread-1) [    ] o.a.s.c.c.ZkStateReader Updated live nodes from ZooKeeper... (1) -> (2)
   [junit4]   2> 542368 INFO  (zkConnectionManagerCallback-2534-thread-1) [    ] o.a.s.c.c.ConnectionManager zkClient has connected
   [junit4]   2> 542373 INFO  (closeThreadPool-2516-thread-1) [n:127.0.0.1:50930_    ] o.a.s.c.c.ZkStateReader Updated live nodes from ZooKeeper... (0) -> (2)
   [junit4]   2> 542374 INFO  (closeThreadPool-2516-thread-1) [n:127.0.0.1:50930_    ] o.a.s.c.s.i.ZkClientClusterStateProvider Cluster at 127.0.0.1:50892/solr ready
   [junit4]   2> 542416 INFO  (closeThreadPool-2516-thread-1) [n:127.0.0.1:50930_    ] o.a.s.h.a.MetricsHistoryHandler No .system collection, keeping metrics history in memory.
   [junit4]   2> 542445 INFO  (closeThreadPool-2516-thread-1) [n:127.0.0.1:50930_    ] o.a.s.m.r.SolrJmxReporter JMX monitoring for 'solr.node' (registry 'solr.node') enabled at server: com.sun.jmx.mbeanserver.JmxMBeanServer@1fd4b771
   [junit4]   2> 542459 INFO  (closeThreadPool-2516-thread-1) [n:127.0.0.1:50930_    ] o.a.s.m.r.SolrJmxReporter JMX monitoring for 'solr.jvm' (registry 'solr.jvm') enabled at server: com.sun.jmx.mbeanserver.JmxMBeanServer@1fd4b771
   [junit4]   2> 542459 INFO  (closeThreadPool-2516-thread-1) [n:127.0.0.1:50930_    ] o.a.s.m.r.SolrJmxReporter JMX monitoring for 'solr.jetty' (registry 'solr.jetty') enabled at server: com.sun.jmx.mbeanserver.JmxMBeanServer@1fd4b771
   [junit4]   2> 542461 INFO  (closeThreadPool-2516-thread-1) [n:127.0.0.1:50930_    ] o.a.s.c.CorePropertiesLocator Found 0 core definitions underneath C:\Users\jenkins\workspace\Lucene-Solr-8.x-Windows\solr\build\solr-core\test\J1\temp\solr.core.TestDynamicLoading_C52433A3B496D20B-001\shard-1-001\cores
   [junit4]   2> 542543 INFO  (TEST-TestDynamicLoading.testDynamicLoading-seed#[C52433A3B496D20B]) [    ] o.a.s.c.AbstractFullDistribZkTestBase create jetty 2 in directory C:\Users\jenkins\workspace\Lucene-Solr-8.x-Windows\solr\build\solr-core\test\J1\temp\solr.core.TestDynamicLoading_C52433A3B496D20B-001\shard-2-001 of type NRT
   [junit4]   2> 542543 WARN  (closeThreadPool-2516-thread-1) [    ] o.e.j.s.AbstractConnector Ignoring deprecated socket close linger time
   [junit4]   2> 542544 INFO  (closeThreadPool-2516-thread-1) [    ] o.a.s.c.s.e.JettySolrRunner Start Jetty (original configured port=0)
   [junit4]   2> 542544 INFO  (closeThreadPool-2516-thread-1) [    ] o.a.s.c.s.e.JettySolrRunner Trying to start Jetty on port 0 try number 1 ...
   [junit4]   2> 542544 INFO  (closeThreadPool-2516-thread-1) [    ] o.e.j.s.Server jetty-9.4.14.v20181114; built: 2018-11-14T21:20:31.478Z; git: c4550056e785fb5665914545889f21dc136ad9e6; jvm 9.0.4+11
   [junit4]   2> 542545 INFO  (closeThreadPool-2516-thread-1) [    ] o.e.j.s.session DefaultSessionIdManager workerName=node0
   [junit4]   2> 542545 INFO  (closeThreadPool-2516-thread-1) [    ] o.e.j.s.session No SessionScavenger set, using defaults
   [junit4]   2> 542545 INFO  (closeThreadPool-2516-thread-1) [    ] o.e.j.s.session node0 Scavenging every 600000ms
   [junit4]   2> 542545 INFO  (closeThreadPool-2516-thread-1) [    ] o.e.j.s.h.ContextHandler Started o.e.j.s.ServletContextHandler@4c36a2dc{/,null,AVAILABLE}
   [junit4]   2> 542556 INFO  (closeThreadPool-2516-thread-1) [    ] o.e.j.s.AbstractConnector Started ServerConnector@64605821{HTTP/1.1,[http/1.1, h2c]}{127.0.0.1:50949}
   [junit4]   2> 542556 INFO  (closeThreadPool-2516-thread-1) [    ] o.e.j.s.Server Started @542601ms
   [junit4]   2> 542556 INFO  (closeThreadPool-2516-thread-1) [    ] o.a.s.c.s.e.JettySolrRunner Jetty properties: {hostContext=/, solrconfig=solrconfig.xml, solr.data.dir=C:\Users\jenkins\workspace\Lucene-Solr-8.x-Windows\solr\build\solr-core\test\J1\temp\solr.core.TestDynamicLoading_C52433A3B496D20B-001\tempDir-001/jetty2, hostPort=50949, coreRootDirectory=C:\Users\jenkins\workspace\Lucene-Solr-8.x-Windows\solr\build\solr-core\test\J1\..\..\..\..\..\..\..\..\..\Users\jenkins\workspace\Lucene-Solr-8.x-Windows\solr\build\solr-core\test\J1\temp\solr.core.TestDynamicLoading_C52433A3B496D20B-001\shard-2-001\cores}
   [junit4]   2> 542557 ERROR (closeThreadPool-2516-thread-1) [    ] o.a.s.u.StartupLoggingUtils Missing Java Option solr.log.dir. Logging may be missing or incomplete.
   [junit4]   2> 542557 INFO  (closeThreadPool-2516-thread-1) [    ] o.a.s.s.SolrDispatchFilter Using logger factory org.apache.logging.slf4j.Log4jLoggerFactory
   [junit4]   2> 542557 INFO  (closeThreadPool-2516-thread-1) [    ] o.a.s.s.SolrDispatchFilter  ___      _       Welcome to Apache Solr™ version 8.2.0
   [junit4]   2> 542557 INFO  (closeThreadPool-2516-thread-1) [    ] o.a.s.s.SolrDispatchFilter / __| ___| |_ _   Starting in cloud mode on port null
   [junit4]   2> 542557 INFO  (closeThreadPool-2516-thread-1) [    ] o.a.s.s.SolrDispatchFilter \__ \/ _ \ | '_|  Install dir: null
   [junit4]   2> 542557 INFO  (closeThreadPool-2516-thread-1) [    ] o.a.s.s.SolrDispatchFilter |___/\___/_|_|    Start time: 2019-05-30T17:50:51.423355300Z
   [junit4]   2> 542562 INFO  (zkConnectionManagerCallback-2537-thread-1) [    ] o.a.s.c.c.ConnectionManager zkClient has connected
   [junit4]   2> 542571 INFO  (closeThreadPool-2516-thread-1) [    ] o.a.s.s.SolrDispatchFilter Loading solr.xml from SolrHome (not found in ZooKeeper)
   [junit4]   2> 542571 INFO  (closeThreadPool-2516-thread-1) [    ] o.a.s.c.SolrXmlConfig Loading container configuration from C:\Users\jenkins\workspace\Lucene-Solr-8.x-Windows\solr\build\solr-core\test\J1\temp\solr.core.TestDynamicLoading_C52433A3B496D20B-001\shard-2-001\solr.xml
   [junit4]   2> 542571 WARN  (NIOServerCxn.Factory:0.0.0.0/0.0.0.0:0) [    ] o.a.z.s.NIOServerCnxn Unable to read additional data from client sessionid 0x100511477c8000c, likely client has closed socket
   [junit4]   2> 542574 INFO  (closeThreadPool-2516-thread-1) [    ] o.a.s.c.SolrXmlConfig Configuration parameter autoReplicaFailoverWorkLoopDelay is ignored
   [junit4]   2> 542574 INFO  (closeThreadPool-2516-thread-1) [    ] o.a.s.c.SolrXmlConfig Configuration parameter autoReplicaFailoverBadNodeExpiration is ignored
   [junit4]   2> 542576 INFO  (closeThreadPool-2516-thread-1) [    ] o.a.s.c.SolrXmlConfig MBean server found: com.sun.jmx.mbeanserver.JmxMBeanServer@1fd4b771, but no JMX reporters were configured - adding default JMX reporter.
   [junit4]   2> 543090 INFO  (closeThreadPool-2516-thread-1) [    ] o.a.s.h.c.HttpShardHandlerFactory Host whitelist initialized: WhitelistHostChecker [whitelistHosts=null, whitelistHostCheckingEnabled=false]
   [junit4]   2> 543092 INFO  (OverseerCollectionConfigSetProcessor-72146742388719620-127.0.0.1:50902_-n_0000000000) [n:127.0.0.1:50902_    ] o.a.s.c.OverseerTaskQueue Response ZK path: /overseer/collection-queue-work/qnr-0000000002 doesn't exist.  Requestor may have disconnected from ZooKeeper
   [junit4]   2> 543097 WARN  (closeThreadPool-2516-thread-1) [    ] o.e.j.u.s.S.config No Client EndPointIdentificationAlgorithm configured for SslContextFactory@308edc22[provider=null,keyStore=null,trustStore=null]
   [junit4]   2> 543112 WARN  (closeThreadPool-2516-thread-1) [    ] o.e.j.u.s.S.config No Client EndPointIdentificationAlgorithm configured for SslContextFactory@34f120ff[provider=null,keyStore=null,trustStore=null]
   [junit4]   2> 543113 INFO  (closeThreadPool-2516-thread-1) [    ] o.a.s.c.ZkContainer Zookeeper client=127.0.0.1:50892/solr
   [junit4]   2> 543134 INFO  (zkConnectionManagerCallback-2544-thread-1) [    ] o.a.s.c.c.ConnectionManager zkClient has connected
   [junit4]   2> 543156 INFO  (zkConnectionManagerCallback-2546-thread-1) [    ] o.a.s.c.c.ConnectionManager zkClient has connected
   [junit4]   2> 543159 INFO  (closeThreadPool-2516-thread-1) [    ] o.a.s.c.c.ZkStateReader Updated live nodes from ZooKeeper... (0) -> (2)
   [junit4]   2> 543167 INFO  (closeThreadPool-2516-thread-1) [    ] o.a.s.c.ZkController Publish node=127.0.0.1:50949_ as DOWN
   [junit4]   2> 543168 INFO  (closeThreadPool-2516-thread-1) [    ] o.a.s.c.TransientSolrCoreCacheDefault Allocating transient cache for 4 transient cores
   [junit4]   2> 543168 INFO  (closeThreadPool-2516-thread-1) [    ] o.a.s.c.ZkController Register node as live in ZooKeeper:/live_nodes/127.0.0.1:50949_
   [junit4]   2> 543174 INFO  (zkCallback-2502-thread-1) [    ] o.a.s.c.c.ZkStateReader Updated live nodes from ZooKeeper... (2) -> (3)
   [junit4]   2> 543174 INFO  (zkCallback-2495-thread-3) [    ] o.a.s.c.c.ZkStateReader Updated live nodes from ZooKeeper... (2) -> (3)
   [junit4]   2> 543174 INFO  (zkCallback-2514-thread-1) [    ] o.a.s.c.c.ZkStateReader Updated live nodes from ZooKeeper... (2) -> (3)
   [junit4]   2> 543174 INFO  (zkCallback-2526-thread-1) [    ] o.a.s.c.c.ZkStateReader Updated live nodes from ZooKeeper... (2) -> (3)
   [junit4]   2> 543177 INFO  (zkCallback-2533-thread-1) [    ] o.a.s.c.c.ZkStateReader Updated live nodes from ZooKeeper... (2) -> (3)
   [junit4]   2> 543178 INFO  (zkCallback-2545-thread-1) [    ] o.a.s.c.c.ZkStateReader Updated live nodes from ZooKeeper... (2) -> (3)
   [junit4]   2> 543181 INFO  (zkConnectionManagerCallback-2553-thread-1) [    ] o.a.s.c.c.ConnectionManager zkClient has connected
   [junit4]   2> 543182 INFO  (closeThreadPool-2516-thread-1) [    ] o.a.s.c.c.ZkStateReader Updated live nodes from ZooKeeper... (0) -> (3)
   [junit4]   2> 543184 INFO  (closeThreadPool-2516-thread-1) [    ] o.a.s.c.s.i.ZkClientClusterStateProvider Cluster at 127.0.0.1:50892/solr ready
   [junit4]   2> 543219 INFO  (closeThreadPool-2516-thread-1) [    ] o.a.s.h.a.MetricsHistoryHandler No .system collection, keeping metrics history in memory.
   [junit4]   2> 543248 INFO  (closeThreadPool-2516-thread-1) [    ] o.a.s.m.r.SolrJmxReporter JMX monitoring for 'solr.node' (registry 'solr.node') enabled at server: com.sun.jmx.mbeanserver.JmxMBeanServer@1fd4b771
   [junit4]   2> 543271 INFO  (closeThreadPool-2516-thread-1) [    ] o.a.s.m.r.SolrJmxReporter JMX monitoring for 'solr.jvm' (registry 'solr.jvm') enabled at server: com.sun.jmx.mbeanserver.JmxMBeanServer@1fd4b771
   [junit4]   2> 543271 INFO  (closeThreadPool-2516-thread-1) [    ] o.a.s.m.r.SolrJmxReporter JMX monitoring for 'solr.jetty' (registry 'solr.jetty') enabled at server: com.sun.jmx.mbeanserver.JmxMBeanServer@1fd4b771
   [junit4]   2> 543274 INFO  (closeThreadPool-2516-thread-1) [    ] o.a.s.c.CorePropertiesLocator Found 0 core definitions underneath C:\Users\jenkins\workspace\Lucene-Solr-8.x-Windows\solr\build\solr-core\test\J1\..\..\..\..\..\..\..\..\..\Users\jenkins\workspace\Lucene-Solr-8.x-Windows\solr\build\solr-core\test\J1\temp\solr.core.TestDynamicLoading_C52433A3B496D20B-001\shard-2-001\cores
   [junit4]   2> 543287 INFO  (TEST-TestDynamicLoading.testDynamicLoading-seed#[C52433A3B496D20B]) [    ] o.a.s.c.AbstractFullDistribZkTestBase create jetty 3 in directory C:\Users\jenkins\workspace\Lucene-Solr-8.x-Windows\solr\build\solr-core\test\J1\temp\solr.core.TestDynamicLoading_C52433A3B496D20B-001\shard-3-001 of type NRT
   [junit4]   2> 543296 WARN  (closeThreadPool-2516-thread-2) [    ] o.e.j.s.AbstractConnector Ignoring deprecated socket close linger time
   [junit4]   2> 543296 INFO  (closeThreadPool-2516-thread-2) [    ] o.a.s.c.s.e.JettySolrRunner Start Jetty (original configured port=0)
   [junit4]   2> 543296 INFO  (closeThreadPool-2516-thread-2) [    ] o.a.s.c.s.e.JettySolrRunner Trying to start Jetty on port 0 try number 1 ...
   [junit4]   2> 543296 INFO  (closeThreadPool-2516-thread-2) [    ] o.e.j.s.Server jetty-9.4.14.v20181114; built: 2018-11-14T21:20:31.478Z; git: c4550056e785fb5665914545889f21dc136ad9e6; jvm 9.0.4+11
   [junit4]   2> 543298 INFO  (closeThreadPool-2516-thread-2) [    ] o.e.j.s.session DefaultSessionIdManager workerName=node0
   [junit4]   2> 543298 INFO  (closeThreadPool-2516-thread-2) [    ] o.e.j.s.session No SessionScavenger set, using defaults
   [junit4]   2> 543298 INFO  (closeThreadPool-2516-thread-2) [    ] o.e.j.s.session node0 Scavenging every 660000ms
   [junit4]   2> 543298 INFO  (closeThreadPool-2516-thread-2) [    ] o.e.j.s.h.ContextHandler Started o.e.j.s.ServletContextHandler@5d6b2851{/,null,AVAILABLE}
   [junit4]   2> 543301 INFO  (closeThreadPool-2516-thread-2) [    ] o.e.j.s.AbstractConnector Started ServerConnector@a0a21ae{HTTP/1.1,[http/1.1, h2c]}{127.0.0.1:50969}
   [junit4]   2> 543301 INFO  (closeThreadPool-2516-thread-2) [    ] o.e.j.s.Server Started @543345ms
   [junit4]   2> 543301 INFO  (closeThreadPool-2516-thread-2) [    ] o.a.s.c.s.e.JettySolrRunner Jetty properties: {hostContext=/, solrconfig=solrconfig.xml, solr.data.dir=C:\Users\jenkins\workspace\Lucene-Solr-8.x-Windows\solr\build\solr-core\test\J1\temp\solr.core.TestDynamicLoading_C52433A3B496D20B-001\tempDir-001/jetty3, hostPort=50969, coreRootDirectory=C:\Users\jenkins\workspace\Lucene-Solr-8.x-Windows\solr\build\solr-core\test\J1\temp\solr.core.TestDynamicLoading_C52433A3B496D20B-001\shard-3-001\cores}
   [junit4]   2> 543301 ERROR (closeThreadPool-2516-thread-2) [    ] o.a.s.u.StartupLoggingUtils Missing Java Option solr.log.dir. Logging may be missing or incomplete.
   [junit4]   2> 543301 INFO  (closeThreadPool-2516-thread-2) [    ] o.a.s.s.SolrDispatchFilter Using logger factory org.apache.logging.slf4j.Log4jLoggerFactory
   [junit4]   2> 543301 INFO  (closeThreadPool-2516-thread-2) [    ] o.a.s.s.SolrDispatchFilter  ___      _       Welcome to Apache Solr™ version 8.2.0
   [junit4]   2> 543301 INFO  (closeThreadPool-2516-thread-2) [    ] o.a.s.s.SolrDispatchFilter / __| ___| |_ _   Starting in cloud mode on port null
   [junit4]   2> 543301 INFO  (closeThreadPool-2516-thread-2) [    ] o.a.s.s.SolrDispatchFilter \__ \/ _ \ | '_|  Install dir: null
   [junit4]   2> 543301 INFO  (closeThreadPool-2516-thread-2) [    ] o.a.s.s.SolrDispatchFilter |___/\___/_|_|    Start time: 2019-05-30T17:50:52.167186400Z
   [junit4]   2> 543356 INFO  (zkConnectionManagerCallback-2556-thread-1) [    ] o.a.s.c.c.ConnectionManager zkClient has connected
   [junit4]   2> 543357 INFO  (closeThreadPool-2516-thread-2) [    ] o.a.s.s.SolrDispatchFilter Loading solr.xml from SolrHome (not found in ZooKeeper)
   [junit4]   2> 543357 INFO  (closeThreadPool-2516-thread-2) [    ] o.a.s.c.SolrXmlConfig Loading container configuration from C:\Users\jenkins\workspace\Lucene-Solr-8.x-Windows\solr\build\solr-core\test\J1\temp\solr.core.TestDynamicLoading_C52433A3B496D20B-001\shard-3-001\solr.xml
   [junit4]   2> 543361 INFO  (closeThreadPool-2516-thread-2) [    ] o.a.s.c.SolrXmlConfig Configuration parameter autoReplicaFailoverWorkLoopDelay is ignored
   [junit4]   2> 543361 INFO  (closeThreadPool-2516-thread-2) [    ] o.a.s.c.SolrXmlConfig Configuration parameter autoReplicaFailoverBadNodeExpiration is ignored
   [junit4]   2> 543361 INFO  (closeThreadPool-2516-thread-2) [    ] o.a.s.c.SolrXmlConfig MBean server found: com.sun.jmx.mbeanserver.JmxMBeanServer@1fd4b771, but no JMX reporters were configured - adding default JMX reporter.
   [junit4]   2> 543559 INFO  (closeThreadPool-2516-thread-2) [    ] o.a.s.h.c.HttpShardHandlerFactory Host whitelist initialized: WhitelistHostChecker [whitelistHosts=null, whitelistHostCheckingEnabled=false]
   [junit4]   2> 543562 WARN  (closeThreadPool-2516-thread-2) [    ] o.e.j.u.s.S.config No Client EndPointIdentificationAlgorithm configured for SslContextFactory@7a91a685[provider=null,keyStore=null,trustStore=null]
   [junit4]   2> 543567 WARN  (closeThreadPool-2516-thread-2) [    ] o.e.j.u.s.S.config No Client EndPointIdentificationAlgorithm configured for SslContextFactory@632b57f0[provider=null,keyStore=null,trustStore=null]
   [junit4]   2> 543569 INFO  (closeThreadPool-2516-thread-2) [    ] o.a.s.c.ZkContainer Zookeeper client=127.0.0.1:50892/solr
   [junit4]   2> 543574 INFO  (zkConnectionManagerCallback-2563-thread-1) [    ] o.a.s.c.c.ConnectionManager zkClient has connected
   [junit4]   2> 543582 INFO  (zkConnectionManagerCallback-2565-thread-1) [    ] o.a.s.c.c.ConnectionManager zkClient has connected
   [junit4]   2> 543597 INFO  (closeThreadPool-2516-thread-2) [n:127.0.0.1:50969_    ] o.a.s.c.c.ZkStateReader Updated live nodes from ZooKeeper... (0) -> (3)
   [junit4]   2> 543602 INFO  (closeThreadPool-2516-thread-2) [n:127.0.0.1:50969_    ] o.a.s.c.ZkController Publish node=127.0.0.1:50969_ as DOWN
   [junit4]   2> 543603 INFO  (closeThreadPool-2516-thread-2) [n:127.0.0.1:50969_    ] o.a.s.c.TransientSolrCoreCacheDefault Allocating transient cache for 4 transient cores
   [junit4]   2> 543603 INFO  (closeThreadPool-2516-thread-2) [n:127.0.0.1:50969_    ] o.a.s.c.ZkController Register node as live in ZooKeeper:/live_nodes/127.0.0.1:50969_
   [junit4]   2> 543605 INFO  (zkCallback-2502-thread-1) [    ] o.a.s.c.c.ZkStateReader Updated live nodes from ZooKeeper... (3) -> (4)
   [junit4]   2> 543605 INFO  (zkCallback-2533-thread-1) [    ] o.a.s.c.c.ZkStateReader Updated live nodes from ZooKeeper... (3) -> (4)
   [junit4]   2> 543606 INFO  (zkCallback-2526-thread-1) [    ] o.a.s.c.c.ZkStateReader Updated live nodes from ZooKeeper... (3) -> (4)
   [junit4]   2> 543606 INFO  (zkCallback-2514-thread-1) [    ] o.a.s.c.c.ZkStateReader Updated live nodes from ZooKeeper... (3) -> (4)
   [junit4]   2> 543606 INFO  (zkCallback-2545-thread-1) [    ] o.a.s.c.c.ZkStateReader Updated live nodes from ZooKeeper... (3) -> (4)
   [junit4]   2> 543606 INFO  (zkCallback-2495-thread-3) [    ] o.a.s.c.c.ZkStateReader Updated live nodes from ZooKeeper... (3) -> (4)
   [junit4]   2> 543607 INFO  (zkCallback-2564-thread-1) [    ] o.a.s.c.c.ZkStateReader Updated live nodes from ZooKeeper... (3) -> (4)
   [junit4]   2> 543608 INFO  (zkCallback-2552-thread-1) [    ] o.a.s.c.c.ZkStateReader Updated live nodes from ZooKeeper... (3) -> (4)
   [junit4]   2> 543611 INFO  (zkConnectionManagerCallback-2572-thread-1) [    ] o.a.s.c.c.ConnectionManager zkClient has connected
   [junit4]   2> 543613 INFO  (closeThreadPool-2516-thread-2) [n:127.0.0.1:50969_    ] o.a.s.c.c.ZkStateReader Updated live nodes from ZooKeeper... (0) -> (4)
   [junit4]   2> 543614 INFO  (closeThreadPool-2516-thread-2) [n:127.0.0.1:50969_    ] o.a.s.c.s.i.ZkClientClusterStateProvider Cluster at 127.0.0.1:50892/solr ready
   [junit4]   2> 543651 INFO  (closeThreadPool-2516-thread-2) [n:127.0.0.1:50969_    ] o.a.s.h.a.MetricsHistoryHandler No .system collection, keeping metrics history in memory.
   [junit4]   2> 543674 INFO  (closeThreadPool-2516-thread-2) [n:127.0.0.1:50969_    ] o.a.s.m.r.SolrJmxReporter JMX monitoring for 'solr.node' (registry 'solr.node') enabled at server: com.sun.jmx.mbeanserver.JmxMBeanServer@1fd4b771
   [junit4]   2> 543685 INFO  (closeThreadPool-2516-thread-2) [n:127.0.0.1:50969_    ] o.a.s.m.r.SolrJmxReporter JMX monitoring for 'solr.jvm' (registry 'solr.jvm') enabled at server: com.sun.jmx.mbeanserver.JmxMBeanServer@1fd4b771
   [junit4]   2> 543685 INFO  (closeThreadPool-2516-thread-2) [n:127.0.0.1:50969_    ] o.a.s.m.r.SolrJmxReporter JMX monitoring for 'solr.jetty' (registry 'solr.jetty') enabled at server: com.sun.jmx.mbeanserver.JmxMBeanServer@1fd4b771
   [junit4]   2> 543686 INFO  (closeThreadPool-2516-thread-2) [n:127.0.0.1:50969_    ] o.a.s.c.CorePropertiesLocator Found 0 core definitions underneath C:\Users\jenkins\workspace\Lucene-Solr-8.x-Windows\solr\build\solr-core\test\J1\temp\solr.core.TestDynamicLoading_C52433A3B496D20B-001\shard-3-001\cores
   [junit4]   2> 543873 INFO  (TEST-TestDynamicLoading.testDynamicLoading-seed#[C52433A3B496D20B]) [    ] o.a.s.c.AbstractFullDistribZkTestBase create jetty 4 in directory C:\Users\jenkins\workspace\Lucene-Solr-8.x-Windows\solr\build\solr-core\test\J1\temp\solr.core.TestDynamicLoading_C52433A3B496D20B-001\shard-4-001 of type NRT
   [junit4]   2> 543873 WARN  (closeThreadPool-2516-thread-2) [    ] o.e.j.s.AbstractConnector Ignoring deprecated socket close linger time
   [junit4]   2> 543874 INFO  (closeThreadPool-2516-thread-2) [    ] o.a.s.c.s.e.JettySolrRunner Start Jetty (original configured port=0)
   [junit4]   2> 543874 INFO  (closeThreadPool-2516-thread-2) [    ] o.a.s.c.s.e.JettySolrRunner Trying to start Jetty on port 0 try number 1 ...
   [junit4]   2> 543874 INFO  (closeThreadPool-2516-thread-2) [    ] o.e.j.s.Server jetty-9.4.14.v20181114; built: 2018-11-14T21:20:31.478Z; git: c4550056e785fb5665914545889f21dc136ad9e6; jvm 9.0.4+11
   [junit4]   2> 543874 INFO  (closeThreadPool-2516-thread-2) [    ] o.e.j.s.session DefaultSessionIdManager workerName=node0
   [junit4]   2> 543874 INFO  (closeThreadPool-2516-thread-2) [    ] o.e.j.s.session No SessionScavenger set, using defaults
   [junit4]   2> 543874 INFO  (closeThreadPool-2516-thread-2) [    ] o.e.j.s.session node0 Scavenging every 660000ms
   [junit4]   2> 543875 INFO  (closeThreadPool-2516-thread-2) [    ] o.e.j.s.h.ContextHandler Started o.e.j.s.ServletContextHandler@2e309838{/,null,AVAILABLE}
   [junit4]   2> 543876 INFO  (closeThreadPool-2516-thread-2) [    ] o.e.j.s.AbstractConnector Started ServerConnector@629e7e0{HTTP/1.1,[http/1.1, h2c]}{127.0.0.1:50988}
   [junit4]   2> 543876 INFO  (closeThreadPool-2516-thread-2) [    ] o.e.j.s.Server Started @543920ms
   [junit4]   2> 543876 INFO  (closeThreadPool-2516-thread-2) [    ] o.a.s.c.s.e.JettySolrRunner Jetty properties: {hostContext=/, solrconfig=solrconfig.xml, solr.data.dir=C:\Users\jenkins\workspace\Lucene-Solr-8.x-Windows\solr\build\solr-core\test\J1\temp\solr.core.TestDynamicLoading_C52433A3B496D20B-001\tempDir-001/jetty4, hostPort=50988, coreRootDirectory=C:\Users\jenkins\workspace\Lucene-Solr-8.x-Windows\solr\build\solr-core\test\J1\..\..\..\..\..\..\..\..\..\Users\jenkins\workspace\Lucene-Solr-8.x-Windows\solr\build\solr-core\test\J1\temp\solr.core.TestDynamicLoading_C52433A3B496D20B-001\shard-4-001\cores}
   [junit4]   2> 543876 ERROR (closeThreadPool-2516-thread-2) [    ] o.a.s.u.StartupLoggingUtils Missing Java Option solr.log.dir. Logging may be missing or incomplete.
   [junit4]   2> 543876 INFO  (closeThreadPool-2516-thread-2) [    ] o.a.s.s.SolrDispatchFilter Using logger factory org.apache.logging.slf4j.Log4jLoggerFactory
   [junit4]   2> 543876 INFO  (closeThreadPool-2516-thread-2) [    ] o.a.s.s.SolrDispatchFilter  ___      _       Welcome to Apache Solr™ version 8.2.0
   [junit4]   2> 543876 INFO  (closeThreadPool-2516-thread-2) [    ] o.a.s.s.SolrDispatchFilter / __| ___| |_ _   Starting in cloud mode on port null
   [junit4]   2> 543876 INFO  (closeThreadPool-2516-thread-2) [    ] o.a.s.s.SolrDispatchFilter \__ \/ _ \ | '_|  Install dir: null
   [junit4]   2> 543877 INFO  (closeThreadPool-2516-thread-2) [    ] o.a.s.s.SolrDispatchFilter |___/\___/_|_|    Start time: 2019-05-30T17:50:52.742712400Z
   [junit4]   2> 543881 INFO  (zkConnectionManagerCallback-2575-thread-1) [    ] o.a.s.c.c.ConnectionManager zkClient has connected
   [junit4]   2> 543883 INFO  (closeThreadPool-2516-thread-2) [    ] o.a.s.s.SolrDispatchFilter Loading solr.xml from SolrHome (not found in ZooKeeper)
   [junit4]   2> 543883 INFO  (closeThreadPool-2516-thread-2) [    ] o.a.s.c.SolrXmlConfig Loading container configuration from C:\Users\jenkins\workspace\Lucene-Solr-8.x-Windows\solr\build\solr-core\test\J1\temp\solr.core.TestDynamicLoading_C52433A3B496D20B-001\shard-4-001\solr.xml
   [junit4]   2> 543886 INFO  (closeThreadPool-2516-thread-2) [    ] o.a.s.c.SolrXmlConfig Configuration parameter autoReplicaFailoverWorkLoopDelay is ignored
   [junit4]   2> 543886 INFO  (closeThreadPool-2516-thread-2) [    ] o.a.s.c.SolrXmlConfig Configuration parameter autoReplicaFailoverBadNodeExpiration is ignored
   [junit4]   2> 543887 INFO  (closeThreadPool-2516-thread-2) [    ] o.a.s.c.SolrXmlConfig MBean server found: com.sun.jmx.mbeanserver.JmxMBeanServer@1fd4b771, but no JMX reporters were configured - adding default JMX reporter.
   [junit4]   2> 543935 INFO  (closeThreadPool-2516-thread-2) [    ] o.a.s.h.c.HttpShardHandlerFactory Host whitelist initialized: WhitelistHostChecker [whitelistHosts=null, whitelistHostCheckingEnabled=false]
   [junit4]   2> 543936 WARN  (closeThreadPool-2516-thread-2) [    ] o.e.j.u.s.S.config No Client EndPointIdentificationAlgorithm configured for SslContextFactory@21e9f258[provider=null,keyStore=null,trustStore=null]
   [junit4]   2> 543941 WARN  (closeThreadPool-2516-thread-2) [    ] o.e.j.u.s.S.config No Client EndPointIdentificationAlgorithm configured for SslContextFactory@55fd0c64[provider=null,keyStore=null,trustStore=null]
   [junit4]   2> 543942 INFO  (closeThreadPool-2516-thread-2) [    ] o.a.s.c.ZkContainer Zookeeper client=127.0.0.1:50892/solr
   [junit4]   2> 543945 INFO  (zkConnectionManagerCallback-2582-thread-1) [    ] o.a.s.c.c.ConnectionManager zkClient has connected
   [junit4]   2> 543950 INFO  (zkConnectionManagerCallback-2584-thread-1) [    ] o.a.s.c.c.ConnectionManager zkClient has connected
   [junit4]   2> 543956 INFO  (closeThreadPool-2516-thread-2) [    ] o.a.s.c.c.ZkStateReader Updated live nodes from ZooKeeper... (0) -> (4)
   [junit4]   2> 543959 INFO  (closeThreadPool-2516-thread-2) [    ] o.a.s.c.ZkController Publish node=127.0.0.1:50988_ as DOWN
   [junit4]   2> 543960 INFO  (closeThreadPool-2516-thread-2) [    ] o.a.s.c.TransientSolrCoreCacheDefault Allocating transient cache for 4 transient cores
   [junit4]   2> 543960 INFO  (closeThreadPool-2516-thread-2) [    ] o.a.s.c.ZkController Register node as live in ZooKeeper:/live_nodes/127.0.0.1:50988_
   [junit4]   2> 543962 INFO  (zkCallback-2502-thread-1) [    ] o.a.s.c.c.ZkStateReader Updated live nodes from ZooKeeper... (4) -> (5)
   [junit4]   2> 543962 INFO  (zkCallback-2514-thread-1) [    ] o.a.s.c.c.ZkStateReader Updated live nodes from ZooKeeper... (4) -> (5)
   [junit4]   2> 543962 INFO  (zkCallback-2533-thread-1) [    ] o.a.s.c.c.ZkStateReader Updated live nodes from ZooKeeper... (4) -> (5)
   [junit4]   2> 543962 INFO  (zkCallback-2526-thread-1) [    ] o.a.s.c.c.ZkStateReader Updated live nodes from ZooKeeper... (4) -> (5)
   [junit4]   2> 543962 INFO  (zkCallback-2495-thread-3) [    ] o.a.s.c.c.ZkStateReader Updated live nodes from ZooKeeper... (4) -> (5)
   [junit4]   2> 543962 INFO  (zkCallback-2545-thread-1) [    ] o.a.s.c.c.ZkStateReader Updated live nodes from ZooKeeper... (4) -> (5)
   [junit4]   2> 543962 INFO  (zkCallback-2564-thread-1) [    ] o.a.s.c.c.ZkStateReader Updated live nodes from ZooKeeper... (4) -> (5)
   [junit4]   2> 543962 INFO  (zkCallback-2552-thread-1) [    ] o.a.s.c.c.ZkStateReader Updated live nodes from ZooKeeper... (4) -> (5)
   [junit4]   2> 543963 INFO  (zkCallback-2583-thread-1) [    ] o.a.s.c.c.ZkStateReader Updated live nodes from ZooKeeper... (4) -> (5)
   [junit4]   2> 543963 INFO  (zkCallback-2571-thread-1) [    ] o.a.s.c.c.ZkStateReader Updated live nodes from ZooKeeper... (4) -> (5)
   [junit4]   2> 543967 INFO  (zkConnectionManagerCallback-2591-thread-1) [    ] o.a.s.c.c.ConnectionManager zkClient has connected
   [junit4]   2> 543969 INFO  (closeThreadPool-2516-thread-2) [    ] o.a.s.c.c.ZkStateReader Updated live nodes from ZooKeeper... (0) -> (5)
   [junit4]   2> 543970 INFO  (closeThreadPool-2516-thread-2) [    ] o.a.s.c.s.i.ZkClientClusterStateProvider Cluster at 127.0.0.1:50892/solr ready
   [junit4]   2> 544001 INFO  (closeThreadPool-2516-thread-2) [    ] o.a.s.h.a.MetricsHistoryHandler No .system collection, keeping metrics history in memory.
   [junit4]   2> 544021 INFO  (closeThreadPool-2516-thread-2) [    ] o.a.s.m.r.SolrJmxReporter JMX monitoring for 'solr.node' (registry 'solr.node') enabled at server: com.sun.jmx.mbeanserver.JmxMBeanServer@1fd4b771
   [junit4]   2> 544029 INFO  (closeThreadPool-2516-thread-2) [    ] o.a.s.m.r.SolrJmxReporter JMX monitoring for 'solr.jvm' (registry 'solr.jvm') enabled at server: com.sun.jmx.mbeanserver.JmxMBeanServer@1fd4b771
   [junit4]   2> 544029 INFO  (closeThreadPool-2516-thread-2) [    ] o.a.s.m.r.SolrJmxReporter JMX monitoring for 'solr.jetty' (registry 'solr.jetty') enabled at server: com.sun.jmx.mbeanserver.JmxMBeanServer@1fd4b771
   [junit4]   2> 544031 INFO  (closeThreadPool-2516-thread-2) [    ] o.a.s.c.CorePropertiesLocator Found 0 core definitions underneath C:\Users\jenkins\workspace\Lucene-Solr-8.x-Windows\solr\build\solr-core\test\J1\..\..\..\..\..\..\..\..\..\Users\jenkins\workspace\Lucene-Solr-8.x-Windows\solr\build\solr-core\test\J1\temp\solr.core.TestDynamicLoading_C52433A3B496D20B-001\shard-4-001\cores
   [junit4]   2> 544078 INFO  (qtp2131136933-7334) [n:127.0.0.1:50902_    ] o.a.s.h.a.CollectionsHandler Invoked Collection Action :addreplica with params node=127.0.0.1:50930_&action=ADDREPLICA&collection=collection1&shard=shard2&type=NRT&wt=javabin&version=2 and sendToOCPQueue=true
   [junit4]   2> 544079 INFO  (qtp2131136933-7335) [n:127.0.0.1:50902_    ] o.a.s.h.a.CollectionsHandler Invoked Collection Action :addreplica with params node=127.0.0.1:50949_&action=ADDREPLICA&collection=collection1&shard=shard1&type=NRT&wt=javabin&version=2 and sendToOCPQueue=true
   [junit4]   2> 544079 INFO  (qtp2131136933-7333) [n:127.0.0.1:50902_    ] o.a.s.h.a.CollectionsHandler Invoked Collection Action :addreplica with params node=127.0.0.1:50969_&action=ADDREPLICA&collection=collection1&shard=shard2&type=NRT&wt=javabin&version=2 and sendToOCPQueue=true
   [junit4]   2> 544081 INFO  (qtp2131136933-7332) [n:127.0.0.1:50902_    ] o.a.s.h.a.CollectionsHandler Invoked Collection Action :addreplica with params node=127.0.0.1:50988_&action=ADDREPLICA&collection=collection1&shard=shard1&type=NRT&wt=javabin&version=2 and sendToOCPQueue=true
   [junit4]   2> 544083 INFO  (OverseerThreadFactory-2372-thread-3-processing-n:127.0.0.1:50902_) [n:127.0.0.1:50902_ c:collection1 s:shard2  ] o.a.s.c.a.c.AddReplicaCmd Node Identified 127.0.0.1:50930_ for creating new replica of shard shard2 for collection collection1
   [junit4]   2> 544084 INFO  (OverseerThreadFactory-2372-thread-4-processing-n:127.0.0.1:50902_) [n:127.0.0.1:50902_ c:collection1 s:shard1  ] o.a.s.c.a.c.AddReplicaCmd Node Identified 127.0.0.1:50949_ for creating new replica of shard shard1 for collection collection1
   [junit4]   2> 544085 INFO  (OverseerThreadFactory-2372-thread-3-processing-n:127.0.0.1:50902_) [n:127.0.0.1:50902_ c:collection1 s:shard2  ] o.a.s.c.a.c.AddReplicaCmd Returning CreateReplica command.
   [junit4]   2> 544086 INFO  (OverseerThreadFactory-2372-thread-4-processing-n:127.0.0.1:50902_) [n:127.0.0.1:50902_ c:collection1 s:shard1  ] o.a.s.c.a.c.AddReplicaCmd Returning CreateReplica command.
   [junit4]   2> 544092 INFO  (qtp495598240-7393) [n:127.0.0.1:50930_    x:collection1_shard2_replica_n1] o.a.s.h.a.CoreAdminOperation core create command qt=/admin/cores&collection.configName=conf1&name=collection1_shard2_replica_n1&action=CREATE&collection=collection1&shard=shard2&wt=javabin&version=2&replicaType=NRT
   [junit4]   2> 544092 INFO  (qtp523072403-7426) [n:127.0.0.1:50949_    x:collection1_shard1_replica_n2] o.a.s.h.a.CoreAdminOperation core create command qt=/admin/cores&collection.configName=conf1&name=collection1_shard1_replica_n2&action=CREATE&collection=collection1&shard=shard1&wt=javabin&version=2&replicaType=NRT
   [junit4]   2> 545111 INFO  (qtp523072403-7426) [n:127.0.0.1:50949_ c:collection1 s:shard1  x:collection1_shard1_replica_n2] o.a.s.c.SolrConfig Using Lucene MatchVersion: 8.2.0
   [junit4]   2> 545116 INFO  (qtp495598240-7393) [n:127.0.0.1:50930_ c:collection1 s:shard2  x:collection1_shard2_replica_n1] o.a.s.c.SolrConfig Using Lucene MatchVersion: 8.2.0
   [junit4]   2> 545129 INFO  (qtp523072403-7426) [n:127.0.0.1:50949_ c:collection1 s:shard1  x:collection1_shard1_replica_n2] o.a.s.s.IndexSchema [collection1_shard1_replica_n2] Schema name=test
   [junit4]   2> 545145 INFO  (qtp495598240-7393) [n:127.0.0.1:50930_ c:collection1 s:shard2  x:collection1_shard2_replica_n1] o.a.s.s.IndexSchema [collection1_shard2_replica_n1] Schema name=test
   [junit4]   2> 545232 INFO  (qtp495598240-7393) [n:127.0.0.1:50930_ c:collection1 s:shard2  x:collection1_shard2_replica_n1] o.a.s.s.IndexSchema Loaded schema test/1.0 with uniqueid field id
   [junit4]   2> 545242 INFO  (qtp523072403-7426) [n:127.0.0.1:50949_ c:collection1 s:shard1  x:collection1_shard1_replica_n2] o.a.s.s.IndexSchema Loaded schema test/1.0 with uniqueid field id
   [junit4]   2> 545264 INFO  (qtp495598240-7393) [n:127.0.0.1:50930_ c:collection1 s:shard2  x:collection1_shard2_replica_n1] o.a.s.c.CoreContainer Creating SolrCore 'collection1_shard2_replica_n1' using configuration from collection collection1, trusted=true
   [junit4]   2> 545265 INFO  (qtp495598240-7393) [n:127.0.0.1:50930_ c:collection1 s:shard2  x:collection1_shard2_replica_n1] o.a.s.m.r.SolrJmxReporter JMX monitoring for 'solr.core.collection1.shard2.replica_n1' (registry 'solr.core.collection1.shard2.replica_n1') enabled at server: com.sun.jmx.mbeanserver.JmxMBeanServer@1fd4b771
   [junit4]   2> 545265 INFO  (qtp495598240-7393) [n:127.0.0.1:50930_ c:collection1 s:shard2  x:collection1_shard2_replica_n1] o.a.s.c.SolrCore [[collection1_shard2_replica_n1] ] Opening new SolrCore at [C:\Users\jenkins\workspace\Lucene-Solr-8.x-Windows\solr\build\solr-core\test\J1\temp\solr.core.TestDynamicLoading_C52433A3B496D20B-001\shard-1-001\cores\collection1_shard2_replica_n1], dataDir=[C:\Users\jenkins\workspace\Lucene-Solr-8.x-Windows\solr\build\solr-core\test\J1\temp\solr.core.TestDynamicLoading_C52433A3B496D20B-001\shard-1-001\cores\collection1_shard2_replica_n1\data\]
   [junit4]   2> 545268 INFO  (qtp495598240-7393) [n:127.0.0.1:50930_ c:collection1 s:shard2  x:collection1_shard2_replica_n1] o.a.s.u.RandomMergePolicy RandomMergePolicy wrapping class org.apache.lucene.index.TieredMergePolicy: [TieredMergePolicy: maxMergeAtOnce=43, maxMergeAtOnceExplicit=19, maxMergedSegmentMB=0.6728515625, floorSegmentMB=1.9033203125, forceMergeDeletesPctAllowed=17.460662261213372, segmentsPerTier=45.0, maxCFSSegmentSizeMB=8.796093022207999E12, noCFSRatio=0.2752181799367386, deletesPctAllowed=33.38848913492407
   [junit4]   2> 545270 WARN  (qtp495598240-7393) [n:127.0.0.1:50930_ c:collection1 s:shard2  x:collection1_shard2_replica_n1] o.a.s.c.RequestHandlers INVALID paramSet a in requestHandler {type = requestHandler,name = /dump,class = DumpRequestHandler,attributes = {initParams=a, name=/dump, class=DumpRequestHandler},args = {defaults={a=A,b=B}}}
   [junit4]   2> 545270 INFO  (qtp523072403-7426) [n:127.0.0.1:50949_ c:collection1 s:shard1  x:collection1_shard1_replica_n2] o.a.s.c.CoreContainer Creating SolrCore 'collection1_shard1_replica_n2' using configuration from collection collection1, trusted=true
   [junit4]   2> 545270 INFO  (qtp523072403-7426) [n:127.0.0.1:50949_ c:collection1 s:shard1  x:collection1_shard1_replica_n2] o.a.s.m.r.SolrJmxReporter JMX monitoring for 'solr.core.collection1.shard1.replica_n2' (registry 'solr.core.collection1.shard1.replica_n2') enabled at server: com.sun.jmx.mbeanserver.JmxMBeanServer@1fd4b771
   [junit4]   2> 545272 INFO  (qtp523072403-7426) [n:127.0.0.1:50949_ c:collection1 s:shard1  x:collection1_shard1_replica_n2] o.a.s.c.SolrCore [[collection1_shard1_replica_n2] ] Opening new SolrCore at [C:\Users\jenkins\workspace\Lucene-Solr-8.x-Windows\solr\build\solr-core\test\J1\temp\solr.core.TestDynamicLoading_C52433A3B496D20B-001\shard-2-001\cores\collection1_shard1_replica_n2], dataDir=[C:\Users\jenkins\workspace\Lucene-Solr-8.x-Windows\solr\build\solr-core\test\J1\..\..\..\..\..\..\..\..\..\Users\jenkins\workspace\Lucene-Solr-8.x-Windows\solr\build\solr-core\test\J1\temp\solr.core.TestDynamicLoading_C52433A3B496D20B-001\shard-2-001\cores\collection1_shard1_replica_n2\data\]
   [junit4]   2> 545275 INFO  (qtp523072403-7426) [n:127.0.0.1:50949_ c:collection1 s:shard1  x:collection1_shard1_replica_n2] o.a.s.u.RandomMergePolicy RandomMergePolicy wrapping class org.apache.lucene.index.TieredMergePolicy: [TieredMergePolicy: maxMergeAtOnce=43, maxMergeAtOnceExplicit=19, maxMergedSegmentMB=0.6728515625, floorSegmentMB=1.9033203125, forceMergeDeletesPctAllowed=17.460662261213372, segmentsPerTier=45.0, maxCFSSegmentSizeMB=8.796093022207999E12, noCFSRatio=0.2752181799367386, deletesPctAllowed=33.38848913492407
   [junit4]   2> 545277 WARN  (qtp523072403-7426) [n:127.0.0.1:50949_ c:collection1 s:shard1  x:collection1_shard1_replica_n2] o.a.s.c.RequestHandlers INVALID paramSet a in requestHandler {type = requestHandler,name = /dump,class = DumpRequestHandler,attributes = {initParams=a, name=/dump, class=DumpRequestHandler},args = {defaults={a=A,b=B}}}
   [junit4]   2> 545364 INFO  (qtp523072403-7426) [n:127.0.0.1:50949_ c:collection1 s:shard1  x:collection1_shard1_replica_n2] o.a.s.u.UpdateHandler Using UpdateLog implementation: org.apache.solr.update.UpdateLog
   [junit4]   2> 545364 INFO  (qtp523072403-7426) [n:127.0.0.1:50949_ c:collection1 s:shard1  x:collection1_shard1_replica_n2] o.a.s.u.UpdateLog Initializing UpdateLog: dataDir= defaultSyncLevel=FLUSH numRecordsToKeep=100 maxNumLogsToKeep=10 numVersionBuckets=65536
   [junit4]   2> 545368 INFO  (qtp523072403-7426) [n:127.0.0.1:50949_ c:collection1 s:shard1  x:collection1_shard1_replica_n2] o.a.s.u.CommitTracker Hard AutoCommit: disabled
   [junit4]   2> 545368 INFO  (qtp523072403-7426) [n:127.0.0.1:50949_ c:collection1 s:shard1  x:collection1_shard1_replica_n2] o.a.s.u.CommitTracker Soft AutoCommit: disabled
   [junit4]   2> 545368 INFO  (qtp495598240-7393) [n:127.0.0.1:50930_ c:collection1 s:shard2  x:collection1_shard2_replica_n1] o.a.s.u.UpdateHandler Using UpdateLog implementation: org.apache.solr.update.UpdateLog
   [junit4]   2> 545368 INFO  (qtp495598240-7393) [n:127.0.0.1:50930_ c:collection1 s:shard2  x:collection1_shard2_replica_n1] o.a.s.u.UpdateLog Initializing UpdateLog: dataDir= defaultSyncLevel=FLUSH numRecordsToKeep=100 maxNumLogsToKeep=10 numVersionBuckets=65536
   [junit4]   2> 545368 INFO  (qtp523072403-7426) [n:127.0.0.1:50949_ c:collection1 s:shard1  x:collection1_shard1_replica_n2] o.a.s.u.RandomMergePolicy RandomMergePolicy wrapping class org.apache.lucene.index.LogByteSizeMergePolicy: [LogByteSizeMergePolicy: minMergeSize=1677721, mergeFactor=44, maxMergeSize=2147483648, maxMergeSizeForForcedMerge=9223372036854775807, calibrateSizeByDeletes=true, maxMergeDocs=2147483647, maxCFSSegmentSizeMB=8.796093022207999E12, noCFSRatio=0.23006066099456587]
   [junit4]   2> 545368 INFO  (qtp523072403-7426) [n:127.0.0.1:50949_ c:collection1 s:shard1  x:collection1_shard1_replica_n2] o.a.s.s.SolrIndexSearcher Opening [Searcher@5f879427[collection1_shard1_replica_n2] main]
   [junit4]   2> 545371 INFO  (qtp523072403-7426) [n:127.0.0.1:50949_ c:collection1 s:shard1  x:collection1_shard1_replica_n2] o.a.s.r.ManagedResourceStorage Configured ZooKeeperStorageIO with znodeBase: /configs/conf1
   [junit4]   2> 545371 INFO  (qtp523072403-7426) [n:127.0.0.1:50949_ c:collection1 s:shard1  x:collection1_shard1_replica_n2] o.a.s.r.ManagedResourceStorage Loaded null at path _rest_managed.json using ZooKeeperStorageIO:path=/configs/conf1
   [junit4]   2> 545372 INFO  (qtp523072403-7426) [n:127.0.0.1:50949_ c:collection1 s:shard1  x:collection1_shard1_replica_n2] o.a.s.h.ReplicationHandler Commits will be reserved for 10000ms.
   [junit4]   2> 545372 INFO  (qtp523072403-7426) [n:127.0.0.1:50949_ c:collection1 s:shard1  x:collection1_shard1_replica_n2] o.a.s.u.UpdateLog Could not find max version in index or recent updates, using new clock 1634980231106265088
   [junit4]   2> 545372 INFO  (qtp495598240-7393) [n:127.0.0.1:50930_ c:collection1 s:shard2  x:collection1_shard2_replica_n1] o.a.s.u.CommitTracker Hard AutoCommit: disabled
   [junit4]   2> 545372 INFO  (qtp495598240-7393) [n:127.0.0.1:50930_ c:collection1 s:shard2  x:collection1_shard2_replica_n1] o.a.s.u.CommitTracker Soft AutoCommit: disabled
   [junit4]   2> 545373 INFO  (qtp495598240-7393) [n:127.0.0.1:50930_ c:collection1 s:shard2  x:collection1_shard2_replica_n1] o.a.s.u.RandomMergePolicy RandomMergePolicy wrapping class org.apache.lucene.index.LogByteSizeMergePolicy: [LogByteSizeMergePolicy: minMergeSize=1677721, mergeFactor=44, maxMergeSize=2147483648, maxMergeSizeForForcedMerge=9223372036854775807, calibrateSizeByDeletes=true, maxMergeDocs=2147483647, maxCFSSegmentSizeMB=8.796093022207999E12, noCFSRatio=0.23006066099456587]
   [junit4]   2> 545374 INFO  (qtp495598240-7393) [n:127.0.0.1:50930_ c:collection1 s:shard2  x:collection1_shard2_replica_n1] o.a.s.s.SolrIndexSearcher Opening [Searcher@4056d111[collection1_shard2_replica_n1] main]
   [junit4]   2> 545376 INFO  (qtp495598240-7393) [n:127.0.0.1:50930_ c:collection1 s:shard2  x:collection1_shard2_replica_n1] o.a.s.r.ManagedResourceStorage Configured ZooKeeperStorageIO with znodeBase: /configs/conf1
   [junit4]   2> 545377 INFO  (qtp495598240-7393) [n:127.0.0.1:50930_ c:collection1 s:shard2  x:collection1_shard2_replica_n1] o.a.s.r.ManagedResourceStorage Loaded null at path _rest_managed.json using ZooKeeperStorageIO:path=/configs/conf1
   [junit4]   2> 545378 INFO  (qtp495598240-7393) [n:127.0.0.1:50930_ c:collection1 s:shard2  x:collection1_shard2_replica_n1] o.a.s.h.ReplicationHandler Commits will be reserved for 10000ms.
   [junit4]   2> 545378 INFO  (qtp495598240-7393) [n:127.0.0.1:50930_ c:collection1 s:shard2  x:collection1_shard2_replica_n1] o.a.s.u.UpdateLog Could not find max version in index or recent updates, using new clock 1634980231112556544
   [junit4]   2> 545382 INFO  (qtp523072403-7426) [n:127.0.0.1:50949_ c:collection1 s:shard1  x:collection1_shard1_replica_n2] o.a.s.c.ZkShardTerms Successful update of terms at /collections/collection1/terms/shard1 to Terms{values={core_node4=0}, version=0}
   [junit4]   2> 545382 INFO  (qtp523072403-7426) [n:127.0.0.1:50949_ c:collection1 s:shard1  x:collection1_shard1_replica_n2] o.a.s.c.ShardLeaderElectionContextBase make sure parent is created /collections/collection1/leaders/shard1
   [junit4]   2> 545387 INFO  (qtp495598240-7393) [n:127.0.0.1:50930_ c:collection1 s:shard2  x:collection1_shard2_replica_n1] o.a.s.c.ZkShardTerms Successful update of terms at /collections/collection1/terms/shard2 to Terms{values={core_node3=0}, version=0}
   [junit4]   2> 545387 INFO  (qtp495598240-7393) [n:127.0.0.1:50930_ c:collection1 s:shard2  x:collection1_shard2_replica_n1] o.a.s.c.ShardLeaderElectionContextBase make sure parent is created /collections/collection1/leaders/shard2
   [junit4]   2> 545392 INFO  (qtp523072403-7426) [n:127.0.0.1:50949_ c:collection1 s:shard1  x:collection1_shard1_replica_n2] o.a.s.c.ShardLeaderElectionContext Enough replicas found to continue.
   [junit4]   2> 545392 INFO  (qtp523072403-7426) [n:127.0.0.1:50949_ c:collection1 s:shard1  x:collection1_shard1_replica_n2] o.a.s.c.ShardLeaderElectionContext I may be the new leader - try and sync
   [junit4]   2> 545392 INFO  (qtp523072403-7426) [n:127.0.0.1:50949_ c:collection1 s:shard1  x:collection1_shard1_replica_n2] o.a.s.c.SyncStrategy Sync replicas to http://127.0.0.1:50949/collection1_shard1_replica_n2/
   [junit4]   2> 545393 INFO  (qtp523072403-7426) [n:127.0.0.1:50949_ c:collection1 s:shard1  x:collection1_shard1_replica_n2] o.a.s.c.SyncStrategy Sync Success - now sync replicas to me
   [junit4]   2> 545393 INFO  (qtp523072403-7426) [n:127.0.0.1:50949_ c:collection1 s:shard1  x:collection1_shard1_replica_n2] o.a.s.c.SyncStrategy http://127.0.0.1:50949/collection1_shard1_replica_n2/ has no replicas
   [junit4]   2> 545393 INFO  (qtp523072403-7426) [n:127.0.0.1:50949_ c:collection1 s:shard1  x:collection1_shard1_replica_n2] o.a.s.c.ShardLeaderElectionContextBase Creating leader registration node /collections/collection1/leaders/shard1/leader after winning as /collections/collection1/leader_elect/shard1/election/72146742388719630-core_node4-n_0000000000
   [junit4]   2> 545396 INFO  (searcherExecutor-2418-thread-1-processing-n:127.0.0.1:50930_ x:collection1_shard2_replica_n1 c:collection1 s:shard2) [n:127.0.0.1:50930_ c:collection1 s:shard2  x:collection1_shard2_replica_n1] o.a.s.c.SolrCore [collection1_shard2_replica_n1] Registered new searcher Searcher@4056d111[collection1_shard2_replica_n1] main{ExitableDirectoryReader(UninvertingDirectoryReader())}
   [junit4]   2> 545397 INFO  (qtp523072403-7426) [n:127.0.0.1:50949_ c:collection1 s:shard1  x:collection1_shard1_replica_n2] o.a.s.c.ShardLeaderElectionContext I am the new leader: http://127.0.0.1:50949/collection1_shard1_replica_n2/ shard1
   [junit4]   2> 545397 INFO  (qtp495598240-7393) [n:127.0.0.1:50930_ c:collection1 s:shard2  x:collection1_shard2_replica_n1] o.a.s.c.ShardLeaderElectionContext Enough replicas found to continue.
   [junit4]   2> 545397 INFO  (qtp495598240-7393) [n:127.0.0.1:50930_ c:collection1 s:shard2  x:collection1_shard2_replica_n1] o.a.s.c.ShardLeaderElectionContext I may be the new leader - try and sync
   [junit4]   2> 545397 INFO  (qtp495598240-7393) [n:127.0.0.1:50930_ c:collection1 s:shard2  x:collection1_shard2_replica_n1] o.a.s.c.SyncStrategy Sync replicas to http://127.0.0.1:50930/collection1_shard2_replica_n1/
   [junit4]   2> 545398 INFO  (qtp495598240-7393) [n:127.0.0.1:50930_ c:collection1 s:shard2  x:collection1_shard2_replica_n1] o.a.s.c.SyncStrategy Sync Success - now sync replicas to me
   [junit4]   2> 545398 INFO  (qtp495598240-7393) [n:127.0.0.1:50930_ c:collection1 s:shard2  x:collection1_shard2_replica_n1] o.a.s.c.SyncStrategy http://127.0.0.1:50930/collection1_shard2_replica_n1/ has no replicas
   [junit4]   2> 545398 INFO  (qtp495598240-7393) [n:127.0.0.1:50930_ c:collection1 s:shard2  x:collection1_shard2_replica_n1] o.a.s.c.ShardLeaderElectionContextBase Creating leader registration node /collections/collection1/leaders/shard2/leader after winning as /collections/collection1/leader_elect/shard2/election/72146742388719626-core_node3-n_0000000000
   [junit4]   2> 545400 INFO  (qtp495598240-7393) [n:127.0.0.1:50930_ c:collection1 s:shard2  x:collection1_shard2_replica_n1] o.a.s.c.ShardLeaderElectionContext I am the new leader: http://127.0.0.1:50930/collection1_shard2_replica_n1/ shard2
   [junit4]   2> 545401 INFO  (searcherExecutor-2419-thread-1-processing-n:127.0.0.1:50949_ x:collection1_shard1_replica_n2 c:collection1 s:shard1) [n:127.0.0.1:50949_ c:collection1 s:shard1  x:collection1_shard1_replica_n2] o.a.s.c.SolrCore [collection1_shard1_replica_n2] Registered new searcher Searcher@5f879427[collection1_shard1_replica_n2] main{ExitableDirectoryReader(UninvertingDirectoryReader())}
   [junit4]   2> 545502 INFO  (zkCallback-2545-thread-1) [    ] o.a.s.c.c.ZkStateReader A cluster state change: [WatchedEvent state:SyncConnected type:NodeDataChanged path:/collections/collection1/state.json] for collection [collection1] has occurred - updating... (live nodes size: [5])
   [junit4]   2> 545504 INFO  (qtp523072403-7426) [n:127.0.0.1:50949_ c:collection1 s:shard1  x:collection1_shard1_replica_n2] o.a.s.c.ZkController I am the leader, no recovery necessary
   [junit4]   2> 545507 INFO  (zkCallback-2526-thread-1) [    ] o.a.s.c.c.ZkStateReader A cluster state change: [WatchedEvent state:SyncConnected type:NodeDataChanged path:/collections/collection1/state.json] for collection [collection1] has occurred - updating... (live nodes size: [5])
   [junit4]   2> 545508 INFO  (qtp523072403-7426) [n:127.0.0.1:50949_ c:collection1 s:shard1  x:collection1_shard1_replica_n2] o.a.s.s.HttpSolrCall [admin] webapp=null path=/admin/cores params={qt=/admin/cores&collection.configName=conf1&name=collection1_shard1_replica_n2&action=CREATE&collection=collection1&shard=shard1&wt=javabin&version=2&replicaType=NRT} status=0 QTime=1415
   [junit4]   2> 545508 INFO  (qtp495598240-7393) [n:127.0.0.1:50930_ c:collection1 s:shard2  x:collection1_shard2_replica_n1] o.a.s.c.ZkController I am the leader, no recovery necessary
   [junit4]   2> 545514 INFO  (qtp495598240-7393) [n:127.0.0.1:50930_ c:collection1 s:shard2  x:collection1_shard2_replica_n1] o.a.s.s.HttpSolrCall [admin] webapp=null path=/admin/cores params={qt=/admin/cores&collection.configName=conf1&name=collection1_shard2_replica_n1&action=CREATE&collection=collection1&shard=shard2&wt=javabin&version=2&replicaType=NRT} status=0 QTime=1422
   [junit4]   2> 545515 INFO  (qtp2131136933-7335) [n:127.0.0.1:50902_ c:collection1   ] 

[...truncated too long message...]

00000000) closing
   [junit4]   2> 560207 INFO  (OverseerStateUpdate-72146742388719620-127.0.0.1:50902_-n_0000000000) [n:127.0.0.1:50902_    ] o.a.s.c.Overseer Overseer Loop exiting : 127.0.0.1:50902_
   [junit4]   2> 560226 INFO  (zkCallback-2571-thread-1) [    ] o.a.s.c.c.ZkStateReader Updated live nodes from ZooKeeper... (2) -> (0)
   [junit4]   2> 560226 INFO  (zkCallback-2552-thread-1) [    ] o.a.s.c.c.ZkStateReader Updated live nodes from ZooKeeper... (2) -> (0)
   [junit4]   2> 560226 INFO  (zkCallback-2533-thread-1) [    ] o.a.s.c.c.ZkStateReader Updated live nodes from ZooKeeper... (2) -> (0)
   [junit4]   2> 560226 INFO  (zkCallback-2502-thread-1) [    ] o.a.s.c.c.ZkStateReader Updated live nodes from ZooKeeper... (2) -> (0)
   [junit4]   2> 560226 INFO  (zkCallback-2590-thread-1) [    ] o.a.s.c.c.ZkStateReader Updated live nodes from ZooKeeper... (5) -> (0)
   [junit4]   2> 560241 INFO  (OverseerAutoScalingTriggerThread-72146742388719620-127.0.0.1:50902_-n_0000000000) [    ] o.a.s.c.a.OverseerTriggerThread OverseerTriggerThread woken up but we are closed, exiting.
   [junit4]   2> 560244 INFO  (closeThreadPool-2645-thread-1) [    ] o.a.s.c.Overseer Overseer (id=72146742388719620-127.0.0.1:50902_-n_0000000000) closing
   [junit4]   2> 560245 INFO  (closeThreadPool-2645-thread-2) [    ] o.a.s.c.Overseer Overseer (id=72146742388719620-127.0.0.1:50902_-n_0000000000) closing
   [junit4]   2> 560249 INFO  (closeThreadPool-2626-thread-9) [    ] o.e.j.s.AbstractConnector Stopped ServerConnector@629e7e0{HTTP/1.1,[http/1.1, h2c]}{127.0.0.1:0}
   [junit4]   2> 560251 INFO  (closeThreadPool-2626-thread-9) [    ] o.e.j.s.h.ContextHandler Stopped o.e.j.s.ServletContextHandler@2e309838{/,null,UNAVAILABLE}
   [junit4]   2> 560251 INFO  (closeThreadPool-2626-thread-9) [    ] o.e.j.s.session node0 Stopped scavenging
   [junit4]   2> 560252 INFO  (closeThreadPool-2626-thread-1) [    ] o.e.j.s.AbstractConnector Stopped ServerConnector@62e7168f{HTTP/1.1,[http/1.1, h2c]}{127.0.0.1:0}
   [junit4]   2> 560253 INFO  (closeThreadPool-2626-thread-1) [    ] o.e.j.s.h.ContextHandler Stopped o.e.j.s.ServletContextHandler@3dab677b{/,null,UNAVAILABLE}
   [junit4]   2> 560253 INFO  (closeThreadPool-2626-thread-1) [    ] o.e.j.s.session node0 Stopped scavenging
   [junit4]   2> 560254 INFO  (closeThreadPool-2626-thread-2) [    ] o.e.j.s.AbstractConnector Stopped ServerConnector@2e92a87b{HTTP/1.1,[http/1.1, h2c]}{127.0.0.1:0}
   [junit4]   2> 560255 INFO  (closeThreadPool-2626-thread-2) [    ] o.e.j.s.h.ContextHandler Stopped o.e.j.s.ServletContextHandler@79b063e6{/,null,UNAVAILABLE}
   [junit4]   2> 560256 INFO  (closeThreadPool-2626-thread-2) [    ] o.e.j.s.session node0 Stopped scavenging
   [junit4]   2> 560256 INFO  (closeThreadPool-2626-thread-7) [    ] o.e.j.s.AbstractConnector Stopped ServerConnector@64605821{HTTP/1.1,[http/1.1, h2c]}{127.0.0.1:0}
   [junit4]   2> 560256 INFO  (closeThreadPool-2626-thread-8) [    ] o.e.j.s.AbstractConnector Stopped ServerConnector@a0a21ae{HTTP/1.1,[http/1.1, h2c]}{127.0.0.1:0}
   [junit4]   2> 560257 INFO  (closeThreadPool-2626-thread-8) [    ] o.e.j.s.h.ContextHandler Stopped o.e.j.s.ServletContextHandler@5d6b2851{/,null,UNAVAILABLE}
   [junit4]   2> 560259 INFO  (closeThreadPool-2626-thread-7) [    ] o.e.j.s.h.ContextHandler Stopped o.e.j.s.ServletContextHandler@4c36a2dc{/,null,UNAVAILABLE}
   [junit4]   2> 560259 INFO  (closeThreadPool-2626-thread-8) [    ] o.e.j.s.session node0 Stopped scavenging
   [junit4]   2> 560259 INFO  (closeThreadPool-2626-thread-7) [    ] o.e.j.s.session node0 Stopped scavenging
   [junit4]   2> 560262 INFO  (TEST-TestDynamicLoading.testDynamicLoading-seed#[C52433A3B496D20B]) [    ] o.a.s.c.ZkTestServer Shutting down ZkTestServer.
   [junit4]   2> 560265 WARN  (ZkTestServer Run Thread) [    ] o.a.s.c.ZkTestServer Watch limit violations: 
   [junit4]   2> Maximum concurrent create/delete watches above limit:
   [junit4]   2> 
   [junit4]   2> 	15	/solr/configs/conf1
   [junit4]   2> 	12	/solr/aliases.json
   [junit4]   2> 	5	/solr/security.json
   [junit4]   2> 	5	/solr/collections/collection1/terms/shard1
   [junit4]   2> 	5	/solr/collections/collection1/terms/shard2
   [junit4]   2> 	2	/solr/collections/control_collection/terms/shard1
   [junit4]   2> 
   [junit4]   2> Maximum concurrent data watches above limit:
   [junit4]   2> 
   [junit4]   2> 	36	/solr/collections/collection1/state.json
   [junit4]   2> 	12	/solr/clusterstate.json
   [junit4]   2> 	12	/solr/clusterprops.json
   [junit4]   2> 	9	/solr/collections/control_collection/state.json
   [junit4]   2> 	2	/solr/overseer_elect/election/72146742388719620-127.0.0.1:50902_-n_0000000000
   [junit4]   2> 
   [junit4]   2> Maximum concurrent children watches above limit:
   [junit4]   2> 
   [junit4]   2> 	12	/solr/live_nodes
   [junit4]   2> 	12	/solr/collections
   [junit4]   2> 
   [junit4]   2> 560268 INFO  (TEST-TestDynamicLoading.testDynamicLoading-seed#[C52433A3B496D20B]) [    ] o.a.s.c.ZkTestServer parse host and port list: 127.0.0.1:50892
   [junit4]   2> 560268 INFO  (TEST-TestDynamicLoading.testDynamicLoading-seed#[C52433A3B496D20B]) [    ] o.a.s.c.ZkTestServer connecting to 127.0.0.1 50892
   [junit4]   2> NOTE: reproduce with: ant test  -Dtestcase=TestDynamicLoading -Dtests.method=testDynamicLoading -Dtests.seed=C52433A3B496D20B -Dtests.slow=true -Dtests.locale=kn -Dtests.timezone=America/Aruba -Dtests.asserts=true -Dtests.file.encoding=Cp1252
   [junit4] FAILURE 23.5s J1 | TestDynamicLoading.testDynamicLoading <<<
   [junit4]    > Throwable #1: java.lang.AssertionError: Could not get expected value  'org.apache.solr.core.BlobStoreTestRequestHandler' for path 'overlay/requestHandler/\/test1/class' full output: {
   [junit4]    >   "responseHeader":{
   [junit4]    >     "status":0,
   [junit4]    >     "QTime":0},
   [junit4]    >   "overlay":{
   [junit4]    >     "znodeVersion":0,
   [junit4]    >     "runtimeLib":{"colltest":{
   [junit4]    >         "name":"colltest",
   [junit4]    >         "version":1}}}},  from server:  null
   [junit4]    > 	at __randomizedtesting.SeedInfo.seed([C52433A3B496D20B:1D691EF4434B77AB]:0)
   [junit4]    > 	at org.apache.solr.core.TestSolrConfigHandler.testForResponseElement(TestSolrConfigHandler.java:589)
   [junit4]    > 	at org.apache.solr.core.TestDynamicLoading.testDynamicLoading(TestDynamicLoading.java:80)
   [junit4]    > 	at java.base/jdk.internal.reflect.NativeMethodAccessorImpl.invoke0(Native Method)
   [junit4]    > 	at java.base/jdk.internal.reflect.NativeMethodAccessorImpl.invoke(NativeMethodAccessorImpl.java:62)
   [junit4]    > 	at java.base/jdk.internal.reflect.DelegatingMethodAccessorImpl.invoke(DelegatingMethodAccessorImpl.java:43)
   [junit4]    > 	at java.base/java.lang.reflect.Method.invoke(Method.java:564)
   [junit4]    > 	at org.apache.solr.BaseDistributedSearchTestCase$ShardsRepeatRule$ShardsFixedStatement.callStatement(BaseDistributedSearchTestCase.java:1082)
   [junit4]    > 	at org.apache.solr.BaseDistributedSearchTestCase$ShardsRepeatRule$ShardsStatement.evaluate(BaseDistributedSearchTestCase.java:1054)
   [junit4]    > 	at java.base/java.lang.Thread.run(Thread.java:844)
   [junit4]   2> NOTE: leaving temporary files on disk at: C:\Users\jenkins\workspace\Lucene-Solr-8.x-Windows\solr\build\solr-core\test\J1\temp\solr.core.TestDynamicLoading_C52433A3B496D20B-001
   [junit4]   2> NOTE: test params are: codec=Asserting(Lucene80): {}, docValues:{}, maxPointsInLeafNode=1566, maxMBSortInHeap=6.584272057772511, sim=Asserting(org.apache.lucene.search.similarities.AssertingSimilarity@e05f852), locale=kn, timezone=America/Aruba
   [junit4]   2> NOTE: Windows 10 10.0 amd64/Oracle Corporation 9.0.4 (64-bit)/cpus=3,threads=1,free=86259496,total=363331584
   [junit4]   2> NOTE: All tests run in this JVM: [TestFieldTypeCollectionResource, TestSQLHandlerNonCloud, HdfsDirectoryFactoryTest, TestMaxScoreQueryParser, TestNumericTerms32, TestRestoreCore, TestSimTriggerIntegration, LeaderFailoverAfterPartitionTest, TolerantUpdateProcessorTest, TestNRTOpen, BlobRepositoryCloudTest, SaslZkACLProviderTest, OutOfBoxZkACLAndCredentialsProvidersTest, TestObjectReleaseTracker, TestFunctionQuery, CoreAdminOperationTest, TestPivotHelperCode, FastVectorHighlighterTest, ChaosMonkeyNothingIsSafeWithPullReplicasTest, TestLeaderElectionWithEmptyReplica, SolrCoreTest, DateMathParserTest, TestJettySolrRunner, TestBulkSchemaAPI, TestNoOpRegenerator, TestSimDistributedQueue, SubstringBytesRefFilterTest, OrderedExecutorTest, TestFieldCacheWithThreads, ResponseHeaderTest, QueryEqualityTest, DistributedVersionInfoTest, TestIndexingPerformance, ShardSplitTest, TestAnalyzeInfixSuggestions, DefaultValueUpdateProcessorTest, TestJsonFacetsWithNestedObjects, MetricTriggerIntegrationTest, RoutingToNodesWithPropertiesTest, ZookeeperStatusHandlerTest, RequestHandlersTest, TestDynamicLoading]
   [junit4] Completed [89/858 (1!)] on J1 in 23.80s, 1 test, 1 failure <<< FAILURES!

[...truncated 45864 lines...]
[repro] Jenkins log URL: https://jenkins.thetaphi.de/job/Lucene-Solr-8.x-Windows/281/consoleText

[repro] Revision: f0d1f9cc9055a1b94344d5e7930ec698ca019809

[repro] Ant options: "-Dargs=-XX:+UseCompressedOops -XX:+UseParallelGC"

[repro] ant clean

[...truncated 6 lines...]
[repro] Test suites by module:
[repro]    solr\core
[repro]       TestDynamicLoading
[repro] ant compile-test

[...truncated 3604 lines...]
[repro] ant test-nocompile -Dtests.dups=5 -Dtests.maxfailures=5 -Dtests.class="*.TestDynamicLoading" -Dtests.showOutput=onerror "-Dargs=-XX:+UseCompressedOops -XX:+UseParallelGC" -Dtests.seed=C52433A3B496D20B -Dtests.slow=true -Dtests.locale=kn -Dtests.timezone=America/Aruba -Dtests.asserts=true -Dtests.file.encoding=Cp1252

[...truncated 73 lines...]
[repro] Failures:
[repro]   0/5 failed: org.apache.solr.core.TestDynamicLoading
[repro] Exiting with code 0

[...truncated 78 lines...]

Mime
View raw message