lucene-dev mailing list archives

Site index · List index
Message view « Date » · « Thread »
Top « Date » · « Thread »
From Apache Jenkins Server <jenk...@builds.apache.org>
Subject [JENKINS] Lucene-Solr-NightlyTests-master - Build # 1850 - Still unstable
Date Fri, 17 May 2019 22:01:58 GMT
Build: https://builds.apache.org/job/Lucene-Solr-NightlyTests-master/1850/

2 tests failed.
FAILED:  junit.framework.TestSuite.org.apache.solr.cloud.hdfs.HdfsChaosMonkeyNothingIsSafeTest

Error Message:
ObjectTracker found 1 object(s) that were not released!!! [NRTCachingDirectory] org.apache.solr.common.util.ObjectReleaseTracker$ObjectTrackerException: org.apache.lucene.store.NRTCachingDirectory  at org.apache.solr.common.util.ObjectReleaseTracker.track(ObjectReleaseTracker.java:42)  at org.apache.solr.core.CachingDirectoryFactory.get(CachingDirectoryFactory.java:348)  at org.apache.solr.update.SolrIndexWriter.create(SolrIndexWriter.java:99)  at org.apache.solr.core.SolrCore.initIndex(SolrCore.java:779)  at org.apache.solr.core.SolrCore.<init>(SolrCore.java:976)  at org.apache.solr.core.SolrCore.<init>(SolrCore.java:883)  at org.apache.solr.core.CoreContainer.createFromDescriptor(CoreContainer.java:1227)  at org.apache.solr.core.CoreContainer.create(CoreContainer.java:1137)  at org.apache.solr.handler.admin.CoreAdminOperation.lambda$static$0(CoreAdminOperation.java:92)  at org.apache.solr.handler.admin.CoreAdminOperation.execute(CoreAdminOperation.java:360)  at org.apache.solr.handler.admin.CoreAdminHandler$CallInfo.call(CoreAdminHandler.java:396)  at org.apache.solr.handler.admin.CoreAdminHandler.handleRequestBody(CoreAdminHandler.java:180)  at org.apache.solr.handler.RequestHandlerBase.handleRequest(RequestHandlerBase.java:199)  at org.apache.solr.servlet.HttpSolrCall.handleAdmin(HttpSolrCall.java:796)  at org.apache.solr.servlet.HttpSolrCall.handleAdminRequest(HttpSolrCall.java:762)  at org.apache.solr.servlet.HttpSolrCall.call(HttpSolrCall.java:522)  at org.apache.solr.servlet.SolrDispatchFilter.doFilter(SolrDispatchFilter.java:397)  at org.apache.solr.servlet.SolrDispatchFilter.doFilter(SolrDispatchFilter.java:343)  at org.eclipse.jetty.servlet.ServletHandler$CachedChain.doFilter(ServletHandler.java:1610)  at org.apache.solr.client.solrj.embedded.JettySolrRunner$DebugFilter.doFilter(JettySolrRunner.java:165)  at org.eclipse.jetty.servlet.ServletHandler$CachedChain.doFilter(ServletHandler.java:1610)  at org.eclipse.jetty.servlet.ServletHandler.doHandle(ServletHandler.java:540)  at org.eclipse.jetty.server.handler.ScopedHandler.nextHandle(ScopedHandler.java:255)  at org.eclipse.jetty.server.session.SessionHandler.doHandle(SessionHandler.java:1588)  at org.eclipse.jetty.server.handler.ScopedHandler.nextHandle(ScopedHandler.java:255)  at org.eclipse.jetty.server.handler.ContextHandler.doHandle(ContextHandler.java:1345)  at org.eclipse.jetty.server.handler.ScopedHandler.nextScope(ScopedHandler.java:203)  at org.eclipse.jetty.servlet.ServletHandler.doScope(ServletHandler.java:480)  at org.eclipse.jetty.server.session.SessionHandler.doScope(SessionHandler.java:1557)  at org.eclipse.jetty.server.handler.ScopedHandler.nextScope(ScopedHandler.java:201)  at org.eclipse.jetty.server.handler.ContextHandler.doScope(ContextHandler.java:1247)  at org.eclipse.jetty.server.handler.ScopedHandler.handle(ScopedHandler.java:144)  at org.eclipse.jetty.server.handler.gzip.GzipHandler.handle(GzipHandler.java:703)  at org.eclipse.jetty.server.handler.HandlerWrapper.handle(HandlerWrapper.java:132)  at org.eclipse.jetty.server.Server.handle(Server.java:502)  at org.eclipse.jetty.server.HttpChannel.handle(HttpChannel.java:364)  at org.eclipse.jetty.server.HttpChannel.run(HttpChannel.java:305)  at org.eclipse.jetty.util.thread.QueuedThreadPool.runJob(QueuedThreadPool.java:765)  at org.eclipse.jetty.util.thread.QueuedThreadPool$2.run(QueuedThreadPool.java:683)  at java.base/java.lang.Thread.run(Thread.java:834)   expected null, but was:<ObjectTracker found 1 object(s) that were not released!!! [NRTCachingDirectory] org.apache.solr.common.util.ObjectReleaseTracker$ObjectTrackerException: org.apache.lucene.store.NRTCachingDirectory  at org.apache.solr.common.util.ObjectReleaseTracker.track(ObjectReleaseTracker.java:42)  at org.apache.solr.core.CachingDirectoryFactory.get(CachingDirectoryFactory.java:348)  at org.apache.solr.update.SolrIndexWriter.create(SolrIndexWriter.java:99)  at org.apache.solr.core.SolrCore.initIndex(SolrCore.java:779)  at org.apache.solr.core.SolrCore.<init>(SolrCore.java:976)  at org.apache.solr.core.SolrCore.<init>(SolrCore.java:883)  at org.apache.solr.core.CoreContainer.createFromDescriptor(CoreContainer.java:1227)  at org.apache.solr.core.CoreContainer.create(CoreContainer.java:1137)  at org.apache.solr.handler.admin.CoreAdminOperation.lambda$static$0(CoreAdminOperation.java:92)  at org.apache.solr.handler.admin.CoreAdminOperation.execute(CoreAdminOperation.java:360)  at org.apache.solr.handler.admin.CoreAdminHandler$CallInfo.call(CoreAdminHandler.java:396)  at org.apache.solr.handler.admin.CoreAdminHandler.handleRequestBody(CoreAdminHandler.java:180)  at org.apache.solr.handler.RequestHandlerBase.handleRequest(RequestHandlerBase.java:199)  at org.apache.solr.servlet.HttpSolrCall.handleAdmin(HttpSolrCall.java:796)  at org.apache.solr.servlet.HttpSolrCall.handleAdminRequest(HttpSolrCall.java:762)  at org.apache.solr.servlet.HttpSolrCall.call(HttpSolrCall.java:522)  at org.apache.solr.servlet.SolrDispatchFilter.doFilter(SolrDispatchFilter.java:397)  at org.apache.solr.servlet.SolrDispatchFilter.doFilter(SolrDispatchFilter.java:343)  at org.eclipse.jetty.servlet.ServletHandler$CachedChain.doFilter(ServletHandler.java:1610)  at org.apache.solr.client.solrj.embedded.JettySolrRunner$DebugFilter.doFilter(JettySolrRunner.java:165)  at org.eclipse.jetty.servlet.ServletHandler$CachedChain.doFilter(ServletHandler.java:1610)  at org.eclipse.jetty.servlet.ServletHandler.doHandle(ServletHandler.java:540)  at org.eclipse.jetty.server.handler.ScopedHandler.nextHandle(ScopedHandler.java:255)  at org.eclipse.jetty.server.session.SessionHandler.doHandle(SessionHandler.java:1588)  at org.eclipse.jetty.server.handler.ScopedHandler.nextHandle(ScopedHandler.java:255)  at org.eclipse.jetty.server.handler.ContextHandler.doHandle(ContextHandler.java:1345)  at org.eclipse.jetty.server.handler.ScopedHandler.nextScope(ScopedHandler.java:203)  at org.eclipse.jetty.servlet.ServletHandler.doScope(ServletHandler.java:480)  at org.eclipse.jetty.server.session.SessionHandler.doScope(SessionHandler.java:1557)  at org.eclipse.jetty.server.handler.ScopedHandler.nextScope(ScopedHandler.java:201)  at org.eclipse.jetty.server.handler.ContextHandler.doScope(ContextHandler.java:1247)  at org.eclipse.jetty.server.handler.ScopedHandler.handle(ScopedHandler.java:144)  at org.eclipse.jetty.server.handler.gzip.GzipHandler.handle(GzipHandler.java:703)  at org.eclipse.jetty.server.handler.HandlerWrapper.handle(HandlerWrapper.java:132)  at org.eclipse.jetty.server.Server.handle(Server.java:502)  at org.eclipse.jetty.server.HttpChannel.handle(HttpChannel.java:364)  at org.eclipse.jetty.server.HttpChannel.run(HttpChannel.java:305)  at org.eclipse.jetty.util.thread.QueuedThreadPool.runJob(QueuedThreadPool.java:765)  at org.eclipse.jetty.util.thread.QueuedThreadPool$2.run(QueuedThreadPool.java:683)  at java.base/java.lang.Thread.run(Thread.java:834)  >

Stack Trace:
java.lang.AssertionError: ObjectTracker found 1 object(s) that were not released!!! [NRTCachingDirectory]
org.apache.solr.common.util.ObjectReleaseTracker$ObjectTrackerException: org.apache.lucene.store.NRTCachingDirectory
	at org.apache.solr.common.util.ObjectReleaseTracker.track(ObjectReleaseTracker.java:42)
	at org.apache.solr.core.CachingDirectoryFactory.get(CachingDirectoryFactory.java:348)
	at org.apache.solr.update.SolrIndexWriter.create(SolrIndexWriter.java:99)
	at org.apache.solr.core.SolrCore.initIndex(SolrCore.java:779)
	at org.apache.solr.core.SolrCore.<init>(SolrCore.java:976)
	at org.apache.solr.core.SolrCore.<init>(SolrCore.java:883)
	at org.apache.solr.core.CoreContainer.createFromDescriptor(CoreContainer.java:1227)
	at org.apache.solr.core.CoreContainer.create(CoreContainer.java:1137)
	at org.apache.solr.handler.admin.CoreAdminOperation.lambda$static$0(CoreAdminOperation.java:92)
	at org.apache.solr.handler.admin.CoreAdminOperation.execute(CoreAdminOperation.java:360)
	at org.apache.solr.handler.admin.CoreAdminHandler$CallInfo.call(CoreAdminHandler.java:396)
	at org.apache.solr.handler.admin.CoreAdminHandler.handleRequestBody(CoreAdminHandler.java:180)
	at org.apache.solr.handler.RequestHandlerBase.handleRequest(RequestHandlerBase.java:199)
	at org.apache.solr.servlet.HttpSolrCall.handleAdmin(HttpSolrCall.java:796)
	at org.apache.solr.servlet.HttpSolrCall.handleAdminRequest(HttpSolrCall.java:762)
	at org.apache.solr.servlet.HttpSolrCall.call(HttpSolrCall.java:522)
	at org.apache.solr.servlet.SolrDispatchFilter.doFilter(SolrDispatchFilter.java:397)
	at org.apache.solr.servlet.SolrDispatchFilter.doFilter(SolrDispatchFilter.java:343)
	at org.eclipse.jetty.servlet.ServletHandler$CachedChain.doFilter(ServletHandler.java:1610)
	at org.apache.solr.client.solrj.embedded.JettySolrRunner$DebugFilter.doFilter(JettySolrRunner.java:165)
	at org.eclipse.jetty.servlet.ServletHandler$CachedChain.doFilter(ServletHandler.java:1610)
	at org.eclipse.jetty.servlet.ServletHandler.doHandle(ServletHandler.java:540)
	at org.eclipse.jetty.server.handler.ScopedHandler.nextHandle(ScopedHandler.java:255)
	at org.eclipse.jetty.server.session.SessionHandler.doHandle(SessionHandler.java:1588)
	at org.eclipse.jetty.server.handler.ScopedHandler.nextHandle(ScopedHandler.java:255)
	at org.eclipse.jetty.server.handler.ContextHandler.doHandle(ContextHandler.java:1345)
	at org.eclipse.jetty.server.handler.ScopedHandler.nextScope(ScopedHandler.java:203)
	at org.eclipse.jetty.servlet.ServletHandler.doScope(ServletHandler.java:480)
	at org.eclipse.jetty.server.session.SessionHandler.doScope(SessionHandler.java:1557)
	at org.eclipse.jetty.server.handler.ScopedHandler.nextScope(ScopedHandler.java:201)
	at org.eclipse.jetty.server.handler.ContextHandler.doScope(ContextHandler.java:1247)
	at org.eclipse.jetty.server.handler.ScopedHandler.handle(ScopedHandler.java:144)
	at org.eclipse.jetty.server.handler.gzip.GzipHandler.handle(GzipHandler.java:703)
	at org.eclipse.jetty.server.handler.HandlerWrapper.handle(HandlerWrapper.java:132)
	at org.eclipse.jetty.server.Server.handle(Server.java:502)
	at org.eclipse.jetty.server.HttpChannel.handle(HttpChannel.java:364)
	at org.eclipse.jetty.server.HttpChannel.run(HttpChannel.java:305)
	at org.eclipse.jetty.util.thread.QueuedThreadPool.runJob(QueuedThreadPool.java:765)
	at org.eclipse.jetty.util.thread.QueuedThreadPool$2.run(QueuedThreadPool.java:683)
	at java.base/java.lang.Thread.run(Thread.java:834)

 expected null, but was:<ObjectTracker found 1 object(s) that were not released!!! [NRTCachingDirectory]
org.apache.solr.common.util.ObjectReleaseTracker$ObjectTrackerException: org.apache.lucene.store.NRTCachingDirectory
	at org.apache.solr.common.util.ObjectReleaseTracker.track(ObjectReleaseTracker.java:42)
	at org.apache.solr.core.CachingDirectoryFactory.get(CachingDirectoryFactory.java:348)
	at org.apache.solr.update.SolrIndexWriter.create(SolrIndexWriter.java:99)
	at org.apache.solr.core.SolrCore.initIndex(SolrCore.java:779)
	at org.apache.solr.core.SolrCore.<init>(SolrCore.java:976)
	at org.apache.solr.core.SolrCore.<init>(SolrCore.java:883)
	at org.apache.solr.core.CoreContainer.createFromDescriptor(CoreContainer.java:1227)
	at org.apache.solr.core.CoreContainer.create(CoreContainer.java:1137)
	at org.apache.solr.handler.admin.CoreAdminOperation.lambda$static$0(CoreAdminOperation.java:92)
	at org.apache.solr.handler.admin.CoreAdminOperation.execute(CoreAdminOperation.java:360)
	at org.apache.solr.handler.admin.CoreAdminHandler$CallInfo.call(CoreAdminHandler.java:396)
	at org.apache.solr.handler.admin.CoreAdminHandler.handleRequestBody(CoreAdminHandler.java:180)
	at org.apache.solr.handler.RequestHandlerBase.handleRequest(RequestHandlerBase.java:199)
	at org.apache.solr.servlet.HttpSolrCall.handleAdmin(HttpSolrCall.java:796)
	at org.apache.solr.servlet.HttpSolrCall.handleAdminRequest(HttpSolrCall.java:762)
	at org.apache.solr.servlet.HttpSolrCall.call(HttpSolrCall.java:522)
	at org.apache.solr.servlet.SolrDispatchFilter.doFilter(SolrDispatchFilter.java:397)
	at org.apache.solr.servlet.SolrDispatchFilter.doFilter(SolrDispatchFilter.java:343)
	at org.eclipse.jetty.servlet.ServletHandler$CachedChain.doFilter(ServletHandler.java:1610)
	at org.apache.solr.client.solrj.embedded.JettySolrRunner$DebugFilter.doFilter(JettySolrRunner.java:165)
	at org.eclipse.jetty.servlet.ServletHandler$CachedChain.doFilter(ServletHandler.java:1610)
	at org.eclipse.jetty.servlet.ServletHandler.doHandle(ServletHandler.java:540)
	at org.eclipse.jetty.server.handler.ScopedHandler.nextHandle(ScopedHandler.java:255)
	at org.eclipse.jetty.server.session.SessionHandler.doHandle(SessionHandler.java:1588)
	at org.eclipse.jetty.server.handler.ScopedHandler.nextHandle(ScopedHandler.java:255)
	at org.eclipse.jetty.server.handler.ContextHandler.doHandle(ContextHandler.java:1345)
	at org.eclipse.jetty.server.handler.ScopedHandler.nextScope(ScopedHandler.java:203)
	at org.eclipse.jetty.servlet.ServletHandler.doScope(ServletHandler.java:480)
	at org.eclipse.jetty.server.session.SessionHandler.doScope(SessionHandler.java:1557)
	at org.eclipse.jetty.server.handler.ScopedHandler.nextScope(ScopedHandler.java:201)
	at org.eclipse.jetty.server.handler.ContextHandler.doScope(ContextHandler.java:1247)
	at org.eclipse.jetty.server.handler.ScopedHandler.handle(ScopedHandler.java:144)
	at org.eclipse.jetty.server.handler.gzip.GzipHandler.handle(GzipHandler.java:703)
	at org.eclipse.jetty.server.handler.HandlerWrapper.handle(HandlerWrapper.java:132)
	at org.eclipse.jetty.server.Server.handle(Server.java:502)
	at org.eclipse.jetty.server.HttpChannel.handle(HttpChannel.java:364)
	at org.eclipse.jetty.server.HttpChannel.run(HttpChannel.java:305)
	at org.eclipse.jetty.util.thread.QueuedThreadPool.runJob(QueuedThreadPool.java:765)
	at org.eclipse.jetty.util.thread.QueuedThreadPool$2.run(QueuedThreadPool.java:683)
	at java.base/java.lang.Thread.run(Thread.java:834)

>
	at __randomizedtesting.SeedInfo.seed([B0F37023B4FB2C09]:0)
	at org.junit.Assert.fail(Assert.java:88)
	at org.junit.Assert.failNotNull(Assert.java:755)
	at org.junit.Assert.assertNull(Assert.java:737)
	at org.apache.solr.SolrTestCaseJ4.teardownTestCases(SolrTestCaseJ4.java:333)
	at java.base/jdk.internal.reflect.NativeMethodAccessorImpl.invoke0(Native Method)
	at java.base/jdk.internal.reflect.NativeMethodAccessorImpl.invoke(NativeMethodAccessorImpl.java:62)
	at java.base/jdk.internal.reflect.DelegatingMethodAccessorImpl.invoke(DelegatingMethodAccessorImpl.java:43)
	at java.base/java.lang.reflect.Method.invoke(Method.java:566)
	at com.carrotsearch.randomizedtesting.RandomizedRunner.invoke(RandomizedRunner.java:1750)
	at com.carrotsearch.randomizedtesting.RandomizedRunner$7.evaluate(RandomizedRunner.java:901)
	at com.carrotsearch.randomizedtesting.rules.StatementAdapter.evaluate(StatementAdapter.java:36)
	at com.carrotsearch.randomizedtesting.rules.SystemPropertiesRestoreRule$1.evaluate(SystemPropertiesRestoreRule.java:57)
	at org.apache.lucene.util.AbstractBeforeAfterRule$1.evaluate(AbstractBeforeAfterRule.java:45)
	at com.carrotsearch.randomizedtesting.rules.StatementAdapter.evaluate(StatementAdapter.java:36)
	at org.apache.lucene.util.TestRuleStoreClassName$1.evaluate(TestRuleStoreClassName.java:41)
	at com.carrotsearch.randomizedtesting.rules.NoShadowingOrOverridesOnMethodsRule$1.evaluate(NoShadowingOrOverridesOnMethodsRule.java:40)
	at com.carrotsearch.randomizedtesting.rules.NoShadowingOrOverridesOnMethodsRule$1.evaluate(NoShadowingOrOverridesOnMethodsRule.java:40)
	at com.carrotsearch.randomizedtesting.rules.StatementAdapter.evaluate(StatementAdapter.java:36)
	at com.carrotsearch.randomizedtesting.rules.StatementAdapter.evaluate(StatementAdapter.java:36)
	at org.apache.lucene.util.TestRuleAssertionsRequired$1.evaluate(TestRuleAssertionsRequired.java:53)
	at org.apache.lucene.util.TestRuleMarkFailure$1.evaluate(TestRuleMarkFailure.java:47)
	at org.apache.lucene.util.TestRuleIgnoreAfterMaxFailures$1.evaluate(TestRuleIgnoreAfterMaxFailures.java:64)
	at org.apache.lucene.util.TestRuleIgnoreTestSuites$1.evaluate(TestRuleIgnoreTestSuites.java:54)
	at com.carrotsearch.randomizedtesting.rules.StatementAdapter.evaluate(StatementAdapter.java:36)
	at com.carrotsearch.randomizedtesting.ThreadLeakControl$StatementRunner.run(ThreadLeakControl.java:368)
	at java.base/java.lang.Thread.run(Thread.java:834)


FAILED:  org.apache.solr.metrics.rrd.SolrRrdBackendFactoryTest.testBasic

Error Message:
{} expected:<1> but was:<0>

Stack Trace:
java.lang.AssertionError: {} expected:<1> but was:<0>
	at __randomizedtesting.SeedInfo.seed([B0F37023B4FB2C09:1B096D366B27AA27]:0)
	at org.junit.Assert.fail(Assert.java:88)
	at org.junit.Assert.failNotEquals(Assert.java:834)
	at org.junit.Assert.assertEquals(Assert.java:645)
	at org.apache.solr.metrics.rrd.SolrRrdBackendFactoryTest.testBasic(SolrRrdBackendFactoryTest.java:94)
	at java.base/jdk.internal.reflect.NativeMethodAccessorImpl.invoke0(Native Method)
	at java.base/jdk.internal.reflect.NativeMethodAccessorImpl.invoke(NativeMethodAccessorImpl.java:62)
	at java.base/jdk.internal.reflect.DelegatingMethodAccessorImpl.invoke(DelegatingMethodAccessorImpl.java:43)
	at java.base/java.lang.reflect.Method.invoke(Method.java:566)
	at com.carrotsearch.randomizedtesting.RandomizedRunner.invoke(RandomizedRunner.java:1750)
	at com.carrotsearch.randomizedtesting.RandomizedRunner$8.evaluate(RandomizedRunner.java:938)
	at com.carrotsearch.randomizedtesting.RandomizedRunner$9.evaluate(RandomizedRunner.java:974)
	at com.carrotsearch.randomizedtesting.RandomizedRunner$10.evaluate(RandomizedRunner.java:988)
	at com.carrotsearch.randomizedtesting.rules.SystemPropertiesRestoreRule$1.evaluate(SystemPropertiesRestoreRule.java:57)
	at org.apache.lucene.util.TestRuleSetupTeardownChained$1.evaluate(TestRuleSetupTeardownChained.java:49)
	at org.apache.lucene.util.AbstractBeforeAfterRule$1.evaluate(AbstractBeforeAfterRule.java:45)
	at org.apache.lucene.util.TestRuleThreadAndTestName$1.evaluate(TestRuleThreadAndTestName.java:48)
	at org.apache.lucene.util.TestRuleIgnoreAfterMaxFailures$1.evaluate(TestRuleIgnoreAfterMaxFailures.java:64)
	at org.apache.lucene.util.TestRuleMarkFailure$1.evaluate(TestRuleMarkFailure.java:47)
	at com.carrotsearch.randomizedtesting.rules.StatementAdapter.evaluate(StatementAdapter.java:36)
	at com.carrotsearch.randomizedtesting.ThreadLeakControl$StatementRunner.run(ThreadLeakControl.java:368)
	at com.carrotsearch.randomizedtesting.ThreadLeakControl.forkTimeoutingTask(ThreadLeakControl.java:817)
	at com.carrotsearch.randomizedtesting.ThreadLeakControl$3.evaluate(ThreadLeakControl.java:468)
	at com.carrotsearch.randomizedtesting.RandomizedRunner.runSingleTest(RandomizedRunner.java:947)
	at com.carrotsearch.randomizedtesting.RandomizedRunner$5.evaluate(RandomizedRunner.java:832)
	at com.carrotsearch.randomizedtesting.RandomizedRunner$6.evaluate(RandomizedRunner.java:883)
	at com.carrotsearch.randomizedtesting.RandomizedRunner$7.evaluate(RandomizedRunner.java:894)
	at com.carrotsearch.randomizedtesting.rules.StatementAdapter.evaluate(StatementAdapter.java:36)
	at com.carrotsearch.randomizedtesting.rules.SystemPropertiesRestoreRule$1.evaluate(SystemPropertiesRestoreRule.java:57)
	at org.apache.lucene.util.AbstractBeforeAfterRule$1.evaluate(AbstractBeforeAfterRule.java:45)
	at com.carrotsearch.randomizedtesting.rules.StatementAdapter.evaluate(StatementAdapter.java:36)
	at org.apache.lucene.util.TestRuleStoreClassName$1.evaluate(TestRuleStoreClassName.java:41)
	at com.carrotsearch.randomizedtesting.rules.NoShadowingOrOverridesOnMethodsRule$1.evaluate(NoShadowingOrOverridesOnMethodsRule.java:40)
	at com.carrotsearch.randomizedtesting.rules.NoShadowingOrOverridesOnMethodsRule$1.evaluate(NoShadowingOrOverridesOnMethodsRule.java:40)
	at com.carrotsearch.randomizedtesting.rules.StatementAdapter.evaluate(StatementAdapter.java:36)
	at com.carrotsearch.randomizedtesting.rules.StatementAdapter.evaluate(StatementAdapter.java:36)
	at org.apache.lucene.util.TestRuleAssertionsRequired$1.evaluate(TestRuleAssertionsRequired.java:53)
	at org.apache.lucene.util.TestRuleMarkFailure$1.evaluate(TestRuleMarkFailure.java:47)
	at org.apache.lucene.util.TestRuleIgnoreAfterMaxFailures$1.evaluate(TestRuleIgnoreAfterMaxFailures.java:64)
	at org.apache.lucene.util.TestRuleIgnoreTestSuites$1.evaluate(TestRuleIgnoreTestSuites.java:54)
	at com.carrotsearch.randomizedtesting.rules.StatementAdapter.evaluate(StatementAdapter.java:36)
	at com.carrotsearch.randomizedtesting.ThreadLeakControl$StatementRunner.run(ThreadLeakControl.java:368)
	at java.base/java.lang.Thread.run(Thread.java:834)




Build Log:
[...truncated 14102 lines...]
   [junit4] Suite: org.apache.solr.metrics.rrd.SolrRrdBackendFactoryTest
   [junit4]   2> Creating dataDir: /home/jenkins/jenkins-slave/workspace/Lucene-Solr-NightlyTests-master/checkout/solr/build/solr-core/test/J0/temp/solr.metrics.rrd.SolrRrdBackendFactoryTest_B0F37023B4FB2C09-001/init-core-data-001
   [junit4]   2> 2420157 WARN  (SUITE-SolrRrdBackendFactoryTest-seed#[B0F37023B4FB2C09]-worker) [    ] o.a.s.SolrTestCaseJ4 startTrackingSearchers: numOpens=5 numCloses=5
   [junit4]   2> 2420157 INFO  (SUITE-SolrRrdBackendFactoryTest-seed#[B0F37023B4FB2C09]-worker) [    ] o.a.s.SolrTestCaseJ4 Using PointFields (NUMERIC_POINTS_SYSPROP=true) w/NUMERIC_DOCVALUES_SYSPROP=false
   [junit4]   2> 2420158 INFO  (SUITE-SolrRrdBackendFactoryTest-seed#[B0F37023B4FB2C09]-worker) [    ] o.a.s.SolrTestCaseJ4 Randomized ssl (false) and clientAuth (false) via: @org.apache.solr.util.RandomizeSSL(reason="", ssl=0.0/0.0, value=0.0/0.0, clientAuth=0.0/0.0)
   [junit4]   2> 2420158 INFO  (SUITE-SolrRrdBackendFactoryTest-seed#[B0F37023B4FB2C09]-worker) [    ] o.a.s.SolrTestCaseJ4 SecureRandom sanity checks: test.solr.allowed.securerandom=null & java.security.egd=file:/dev/./urandom
   [junit4]   2> 2420232 INFO  (TEST-SolrRrdBackendFactoryTest.testBasic-seed#[B0F37023B4FB2C09]) [    ] o.a.s.SolrTestCaseJ4 ###Starting testBasic
   [junit4]   2> 2420232 DEBUG (TEST-SolrRrdBackendFactoryTest.testBasic-seed#[B0F37023B4FB2C09]) [    ] o.a.s.m.r.SolrRrdBackendFactory Created 949206482
   [junit4]   2> 2420323 DEBUG (SolrRrdBackendFactory-9336-thread-1) [    ] o.a.s.m.r.SolrRrdBackendFactory -- maybe sync backends: [foo]
   [junit4]   2> 2420338 DEBUG (SolrRrdBackendFactory-9336-thread-1) [    ] o.a.s.m.r.SolrRrdBackendFactory -- syncing [foo]
   [junit4]   2> 2420411 DEBUG (TEST-SolrRrdBackendFactoryTest.testBasic-seed#[B0F37023B4FB2C09]) [    ] o.a.s.m.r.SolrRrdBackendFactory Closing 949206482
   [junit4]   2> 2420411 INFO  (TEST-SolrRrdBackendFactoryTest.testBasic-seed#[B0F37023B4FB2C09]) [    ] o.a.s.SolrTestCaseJ4 ###Ending testBasic
   [junit4]   2> NOTE: download the large Jenkins line-docs file by running 'ant get-jenkins-line-docs' in the lucene directory.
   [junit4]   2> NOTE: reproduce with: ant test  -Dtestcase=SolrRrdBackendFactoryTest -Dtests.method=testBasic -Dtests.seed=B0F37023B4FB2C09 -Dtests.multiplier=2 -Dtests.nightly=true -Dtests.slow=true -Dtests.linedocsfile=/home/jenkins/jenkins-slave/workspace/Lucene-Solr-NightlyTests-master/test-data/enwiki.random.lines.txt -Dtests.locale=ca-FR -Dtests.timezone=Asia/Omsk -Dtests.asserts=true -Dtests.file.encoding=UTF-8
   [junit4] FAILURE 0.26s J0 | SolrRrdBackendFactoryTest.testBasic <<<
   [junit4]    > Throwable #1: java.lang.AssertionError: {} expected:<1> but was:<0>
   [junit4]    > 	at __randomizedtesting.SeedInfo.seed([B0F37023B4FB2C09:1B096D366B27AA27]:0)
   [junit4]    > 	at org.apache.solr.metrics.rrd.SolrRrdBackendFactoryTest.testBasic(SolrRrdBackendFactoryTest.java:94)
   [junit4]    > 	at java.base/jdk.internal.reflect.NativeMethodAccessorImpl.invoke0(Native Method)
   [junit4]    > 	at java.base/jdk.internal.reflect.NativeMethodAccessorImpl.invoke(NativeMethodAccessorImpl.java:62)
   [junit4]    > 	at java.base/jdk.internal.reflect.DelegatingMethodAccessorImpl.invoke(DelegatingMethodAccessorImpl.java:43)
   [junit4]    > 	at java.base/java.lang.reflect.Method.invoke(Method.java:566)
   [junit4]    > 	at java.base/java.lang.Thread.run(Thread.java:834)
   [junit4]   2> NOTE: leaving temporary files on disk at: /home/jenkins/jenkins-slave/workspace/Lucene-Solr-NightlyTests-master/checkout/solr/build/solr-core/test/J0/temp/solr.metrics.rrd.SolrRrdBackendFactoryTest_B0F37023B4FB2C09-001
   [junit4]   2> NOTE: test params are: codec=Asserting(Lucene80): {}, docValues:{}, maxPointsInLeafNode=485, maxMBSortInHeap=6.602216966345267, sim=Asserting(org.apache.lucene.search.similarities.AssertingSimilarity@2ebf9c25), locale=ca-FR, timezone=Asia/Omsk
   [junit4]   2> NOTE: Linux 4.4.0-112-generic amd64/Oracle Corporation 11.0.1 (64-bit)/cpus=4,threads=1,free=243499376,total=536870912
   [junit4]   2> NOTE: All tests run in this JVM: [AsyncCallRequestStatusResponseTest, PreAnalyzedFieldManagedSchemaCloudTest, DataDrivenBlockJoinTest, TestAtomicUpdateErrorCases, TestStressLiveNodes, SimplePostToolTest, CursorMarkTest, TestFieldCollectionResource, TestPhraseSuggestions, TestSimpleTextCodec, SimpleMLTQParserTest, TestClusterProperties, MetricsHandlerTest, DocumentAnalysisRequestHandlerTest, TestQuerySenderNoQuery, CdcrReplicationHandlerTest, MultiSolrCloudTestCaseTest, TestIntervalFaceting, SolrCloudExampleTest, MoveReplicaHDFSFailoverTest, ZookeeperStatusHandlerTest, TestInitParams, DistributedUpdateProcessorTest, TestRequestStatusCollectionAPI, TestLMDirichletSimilarityFactory, TestNumericRangeQuery64, CollectionPropsTest, MetricsHistoryWithAuthIntegrationTest, ResponseBuilderTest, TestConfigSetImmutable, MetricTriggerIntegrationTest, CoreAdminHandlerTest, ConjunctionSolrSpellCheckerTest, UninvertDocValuesMergePolicyTest, TestZkChroot, IndexSchemaTest, DateMathParserTest, TestUseDocValuesAsStored, SolrIndexConfigTest, TestLRUStatsCache, TestCoreContainer, NodeMutatorTest, AddReplicaTest, TestExportWriter, TestMergePolicyConfig, TestXIncludeConfig, ForceLeaderWithTlogReplicasTest, CustomCollectionTest, ConcurrentCreateRoutedAliasTest, UUIDUpdateProcessorFallbackTest, DocValuesMissingTest, TestConfigSetsAPIZkFailure, TestSolrConfigHandlerConcurrent, TestSafeXMLParsing, TestCloudPhrasesIdentificationComponent, TestSimNodeAddedTrigger, TestFreeTextSuggestions, TestDistributedMissingSort, TestFilteredDocIdSet, TestSimExtremeIndexing, NoCacheHeaderTest, TestReplicationHandlerDiskOverFlow, SpellPossibilityIteratorTest, TestManagedResourceStorage, TestSearchPerf, TestSQLHandler, HighlighterConfigTest, SyncSliceTest, TestPostingsSolrHighlighter, TestOverriddenPrefixQueryForCustomFieldType, TestDistribDocBasedVersion, TestSolrDeletionPolicy2, ZkShardTermsTest, JWTAuthPluginTest, AdminHandlersProxyTest, TestDynamicURP, SearchRateTriggerTest, SecurityConfHandlerTest, TestCloudNestedDocsSort, TestDFISimilarityFactory, LeaderFailoverAfterPartitionTest, TestJsonFacetsWithNestedObjects, SubstringBytesRefFilterTest, TestNonDefinedSimilarityFactory, IgnoreCommitOptimizeUpdateProcessorFactoryTest, AutoScalingHandlerTest, UpdateParamsTest, TestLegacyNumericRangeQueryBuilder, NodeAddedTriggerTest, TestExclusionRuleCollectionAccess, TestMaxTokenLenTokenizer, ScheduledTriggerIntegrationTest, SolrRrdBackendFactoryTest]
   [junit4] Completed [239/858 (1!)] on J0 in 0.73s, 1 test, 1 failure <<< FAILURES!

[...truncated 1193 lines...]
   [junit4] Suite: org.apache.solr.cloud.hdfs.HdfsChaosMonkeyNothingIsSafeTest
   [junit4]   2> 6493220 INFO  (SUITE-HdfsChaosMonkeyNothingIsSafeTest-seed#[B0F37023B4FB2C09]-worker) [    ] o.a.s.SolrTestCaseJ4 SecureRandom sanity checks: test.solr.allowed.securerandom=null & java.security.egd=file:/dev/./urandom
   [junit4]   2> Creating dataDir: /home/jenkins/jenkins-slave/workspace/Lucene-Solr-NightlyTests-master/checkout/solr/build/solr-core/test/J1/temp/solr.cloud.hdfs.HdfsChaosMonkeyNothingIsSafeTest_B0F37023B4FB2C09-001/init-core-data-001
   [junit4]   2> 6493221 WARN  (SUITE-HdfsChaosMonkeyNothingIsSafeTest-seed#[B0F37023B4FB2C09]-worker) [    ] o.a.s.SolrTestCaseJ4 startTrackingSearchers: numOpens=1711 numCloses=1711
   [junit4]   2> 6493221 INFO  (SUITE-HdfsChaosMonkeyNothingIsSafeTest-seed#[B0F37023B4FB2C09]-worker) [    ] o.a.s.SolrTestCaseJ4 Using PointFields (NUMERIC_POINTS_SYSPROP=true) w/NUMERIC_DOCVALUES_SYSPROP=false
   [junit4]   2> 6493222 INFO  (SUITE-HdfsChaosMonkeyNothingIsSafeTest-seed#[B0F37023B4FB2C09]-worker) [    ] o.a.s.SolrTestCaseJ4 Randomized ssl (false) and clientAuth (false) via: @org.apache.solr.SolrTestCaseJ4$SuppressSSL(bugUrl="https://issues.apache.org/jira/browse/SOLR-5776")
   [junit4]   2> 6493222 INFO  (SUITE-HdfsChaosMonkeyNothingIsSafeTest-seed#[B0F37023B4FB2C09]-worker) [    ] o.a.s.BaseDistributedSearchTestCase Setting hostContext system property: /_/u
   [junit4]   1> Formatting using clusterid: testClusterID
   [junit4]   2> 6493583 WARN  (SUITE-HdfsChaosMonkeyNothingIsSafeTest-seed#[B0F37023B4FB2C09]-worker) [    ] o.a.h.m.i.MetricsConfig Cannot locate configuration: tried hadoop-metrics2-namenode.properties,hadoop-metrics2.properties
   [junit4]   2> 6493628 WARN  (SUITE-HdfsChaosMonkeyNothingIsSafeTest-seed#[B0F37023B4FB2C09]-worker) [    ] o.a.h.h.HttpRequestLog Jetty request log can only be enabled using Log4j
   [junit4]   2> 6493642 INFO  (SUITE-HdfsChaosMonkeyNothingIsSafeTest-seed#[B0F37023B4FB2C09]-worker) [    ] o.e.j.s.Server jetty-9.4.14.v20181114; built: 2018-11-14T21:20:31.478Z; git: c4550056e785fb5665914545889f21dc136ad9e6; jvm 11.0.1+13-LTS
   [junit4]   2> 6493643 INFO  (SUITE-HdfsChaosMonkeyNothingIsSafeTest-seed#[B0F37023B4FB2C09]-worker) [    ] o.e.j.s.session DefaultSessionIdManager workerName=node0
   [junit4]   2> 6493643 INFO  (SUITE-HdfsChaosMonkeyNothingIsSafeTest-seed#[B0F37023B4FB2C09]-worker) [    ] o.e.j.s.session No SessionScavenger set, using defaults
   [junit4]   2> 6493643 INFO  (SUITE-HdfsChaosMonkeyNothingIsSafeTest-seed#[B0F37023B4FB2C09]-worker) [    ] o.e.j.s.session node0 Scavenging every 600000ms
   [junit4]   2> 6493643 INFO  (SUITE-HdfsChaosMonkeyNothingIsSafeTest-seed#[B0F37023B4FB2C09]-worker) [    ] o.e.j.s.h.ContextHandler Started o.e.j.s.ServletContextHandler@3487f5b5{static,/static,jar:file:/home/jenkins/.ivy2/cache/org.apache.hadoop/hadoop-hdfs/tests/hadoop-hdfs-3.2.0-tests.jar!/webapps/static,AVAILABLE}
   [junit4]   2> 6494807 INFO  (SUITE-HdfsChaosMonkeyNothingIsSafeTest-seed#[B0F37023B4FB2C09]-worker) [    ] o.e.j.s.h.ContextHandler Started o.e.j.w.WebAppContext@39e40c56{hdfs,/,file:///home/jenkins/jenkins-slave/workspace/Lucene-Solr-NightlyTests-master/checkout/solr/build/solr-core/test/J1/temp/jetty-lucene2-us-west.apache.org-38548-hdfs-_-any-4519862239333594203.dir/webapp/,AVAILABLE}{/hdfs}
   [junit4]   2> 6494832 INFO  (SUITE-HdfsChaosMonkeyNothingIsSafeTest-seed#[B0F37023B4FB2C09]-worker) [    ] o.e.j.s.AbstractConnector Started ServerConnector@2b7961c8{HTTP/1.1,[http/1.1]}{lucene2-us-west.apache.org:38548}
   [junit4]   2> 6494832 INFO  (SUITE-HdfsChaosMonkeyNothingIsSafeTest-seed#[B0F37023B4FB2C09]-worker) [    ] o.e.j.s.Server Started @6495330ms
   [junit4]   2> 6495226 WARN  (SUITE-HdfsChaosMonkeyNothingIsSafeTest-seed#[B0F37023B4FB2C09]-worker) [    ] o.a.h.h.HttpRequestLog Jetty request log can only be enabled using Log4j
   [junit4]   2> 6495227 INFO  (SUITE-HdfsChaosMonkeyNothingIsSafeTest-seed#[B0F37023B4FB2C09]-worker) [    ] o.e.j.s.Server jetty-9.4.14.v20181114; built: 2018-11-14T21:20:31.478Z; git: c4550056e785fb5665914545889f21dc136ad9e6; jvm 11.0.1+13-LTS
   [junit4]   2> 6495265 INFO  (SUITE-HdfsChaosMonkeyNothingIsSafeTest-seed#[B0F37023B4FB2C09]-worker) [    ] o.e.j.s.session DefaultSessionIdManager workerName=node0
   [junit4]   2> 6495265 INFO  (SUITE-HdfsChaosMonkeyNothingIsSafeTest-seed#[B0F37023B4FB2C09]-worker) [    ] o.e.j.s.session No SessionScavenger set, using defaults
   [junit4]   2> 6495265 INFO  (SUITE-HdfsChaosMonkeyNothingIsSafeTest-seed#[B0F37023B4FB2C09]-worker) [    ] o.e.j.s.session node0 Scavenging every 600000ms
   [junit4]   2> 6495266 INFO  (SUITE-HdfsChaosMonkeyNothingIsSafeTest-seed#[B0F37023B4FB2C09]-worker) [    ] o.e.j.s.h.ContextHandler Started o.e.j.s.ServletContextHandler@71d5c69d{static,/static,jar:file:/home/jenkins/.ivy2/cache/org.apache.hadoop/hadoop-hdfs/tests/hadoop-hdfs-3.2.0-tests.jar!/webapps/static,AVAILABLE}
   [junit4]   2> 6495892 INFO  (SUITE-HdfsChaosMonkeyNothingIsSafeTest-seed#[B0F37023B4FB2C09]-worker) [    ] o.e.j.s.h.ContextHandler Started o.e.j.w.WebAppContext@31acfbec{datanode,/,file:///home/jenkins/jenkins-slave/workspace/Lucene-Solr-NightlyTests-master/checkout/solr/build/solr-core/test/J1/temp/jetty-localhost-41436-datanode-_-any-14027637800994684085.dir/webapp/,AVAILABLE}{/datanode}
   [junit4]   2> 6495893 INFO  (SUITE-HdfsChaosMonkeyNothingIsSafeTest-seed#[B0F37023B4FB2C09]-worker) [    ] o.e.j.s.AbstractConnector Started ServerConnector@7a0519bb{HTTP/1.1,[http/1.1]}{localhost:41436}
   [junit4]   2> 6495893 INFO  (SUITE-HdfsChaosMonkeyNothingIsSafeTest-seed#[B0F37023B4FB2C09]-worker) [    ] o.e.j.s.Server Started @6496390ms
   [junit4]   2> 6496148 WARN  (SUITE-HdfsChaosMonkeyNothingIsSafeTest-seed#[B0F37023B4FB2C09]-worker) [    ] o.a.h.h.HttpRequestLog Jetty request log can only be enabled using Log4j
   [junit4]   2> 6496149 INFO  (SUITE-HdfsChaosMonkeyNothingIsSafeTest-seed#[B0F37023B4FB2C09]-worker) [    ] o.e.j.s.Server jetty-9.4.14.v20181114; built: 2018-11-14T21:20:31.478Z; git: c4550056e785fb5665914545889f21dc136ad9e6; jvm 11.0.1+13-LTS
   [junit4]   2> 6496150 INFO  (SUITE-HdfsChaosMonkeyNothingIsSafeTest-seed#[B0F37023B4FB2C09]-worker) [    ] o.e.j.s.session DefaultSessionIdManager workerName=node0
   [junit4]   2> 6496150 INFO  (SUITE-HdfsChaosMonkeyNothingIsSafeTest-seed#[B0F37023B4FB2C09]-worker) [    ] o.e.j.s.session No SessionScavenger set, using defaults
   [junit4]   2> 6496150 INFO  (SUITE-HdfsChaosMonkeyNothingIsSafeTest-seed#[B0F37023B4FB2C09]-worker) [    ] o.e.j.s.session node0 Scavenging every 660000ms
   [junit4]   2> 6496151 INFO  (SUITE-HdfsChaosMonkeyNothingIsSafeTest-seed#[B0F37023B4FB2C09]-worker) [    ] o.e.j.s.h.ContextHandler Started o.e.j.s.ServletContextHandler@e8884f4{static,/static,jar:file:/home/jenkins/.ivy2/cache/org.apache.hadoop/hadoop-hdfs/tests/hadoop-hdfs-3.2.0-tests.jar!/webapps/static,AVAILABLE}
   [junit4]   2> 6496469 INFO  (Block report processor) [    ] BlockStateChange BLOCK* processReport 0x48396ea2d656cf8: Processing first storage report for DS-5c1ba598-3cd0-46c8-b53c-5129adef5baf from datanode 6531e369-4065-4d6c-a816-9cc1124bcebc
   [junit4]   2> 6496470 INFO  (Block report processor) [    ] BlockStateChange BLOCK* processReport 0x48396ea2d656cf8: from storage DS-5c1ba598-3cd0-46c8-b53c-5129adef5baf node DatanodeRegistration(127.0.0.1:39272, datanodeUuid=6531e369-4065-4d6c-a816-9cc1124bcebc, infoPort=37228, infoSecurePort=0, ipcPort=43463, storageInfo=lv=-57;cid=testClusterID;nsid=1419631018;c=1558124255489), blocks: 0, hasStaleStorage: true, processing time: 1 msecs, invalidatedBlocks: 0
   [junit4]   2> 6496470 INFO  (Block report processor) [    ] BlockStateChange BLOCK* processReport 0x48396ea2d656cf8: Processing first storage report for DS-f0848054-56cd-4aab-a5d7-885151f0368b from datanode 6531e369-4065-4d6c-a816-9cc1124bcebc
   [junit4]   2> 6496470 INFO  (Block report processor) [    ] BlockStateChange BLOCK* processReport 0x48396ea2d656cf8: from storage DS-f0848054-56cd-4aab-a5d7-885151f0368b node DatanodeRegistration(127.0.0.1:39272, datanodeUuid=6531e369-4065-4d6c-a816-9cc1124bcebc, infoPort=37228, infoSecurePort=0, ipcPort=43463, storageInfo=lv=-57;cid=testClusterID;nsid=1419631018;c=1558124255489), blocks: 0, hasStaleStorage: false, processing time: 0 msecs, invalidatedBlocks: 0
   [junit4]   2> 6496817 INFO  (SUITE-HdfsChaosMonkeyNothingIsSafeTest-seed#[B0F37023B4FB2C09]-worker) [    ] o.e.j.s.h.ContextHandler Started o.e.j.w.WebAppContext@53464a0e{datanode,/,file:///home/jenkins/jenkins-slave/workspace/Lucene-Solr-NightlyTests-master/checkout/solr/build/solr-core/test/J1/temp/jetty-localhost-43251-datanode-_-any-10771087546256842728.dir/webapp/,AVAILABLE}{/datanode}
   [junit4]   2> 6496818 INFO  (SUITE-HdfsChaosMonkeyNothingIsSafeTest-seed#[B0F37023B4FB2C09]-worker) [    ] o.e.j.s.AbstractConnector Started ServerConnector@5485a410{HTTP/1.1,[http/1.1]}{localhost:43251}
   [junit4]   2> 6496818 INFO  (SUITE-HdfsChaosMonkeyNothingIsSafeTest-seed#[B0F37023B4FB2C09]-worker) [    ] o.e.j.s.Server Started @6497316ms
   [junit4]   2> 6497173 INFO  (Block report processor) [    ] BlockStateChange BLOCK* processReport 0x1c020402c6544a60: Processing first storage report for DS-fc9688e1-d38d-4afd-90a4-378aab682dff from datanode dc8cd766-ad05-4495-a501-4511214e149e
   [junit4]   2> 6497173 INFO  (Block report processor) [    ] BlockStateChange BLOCK* processReport 0x1c020402c6544a60: from storage DS-fc9688e1-d38d-4afd-90a4-378aab682dff node DatanodeRegistration(127.0.0.1:34463, datanodeUuid=dc8cd766-ad05-4495-a501-4511214e149e, infoPort=34172, infoSecurePort=0, ipcPort=46204, storageInfo=lv=-57;cid=testClusterID;nsid=1419631018;c=1558124255489), blocks: 0, hasStaleStorage: true, processing time: 0 msecs, invalidatedBlocks: 0
   [junit4]   2> 6497173 INFO  (Block report processor) [    ] BlockStateChange BLOCK* processReport 0x1c020402c6544a60: Processing first storage report for DS-e95c7c78-f67a-41ac-a25a-322da8a1ebb7 from datanode dc8cd766-ad05-4495-a501-4511214e149e
   [junit4]   2> 6497173 INFO  (Block report processor) [    ] BlockStateChange BLOCK* processReport 0x1c020402c6544a60: from storage DS-e95c7c78-f67a-41ac-a25a-322da8a1ebb7 node DatanodeRegistration(127.0.0.1:34463, datanodeUuid=dc8cd766-ad05-4495-a501-4511214e149e, infoPort=34172, infoSecurePort=0, ipcPort=46204, storageInfo=lv=-57;cid=testClusterID;nsid=1419631018;c=1558124255489), blocks: 0, hasStaleStorage: false, processing time: 0 msecs, invalidatedBlocks: 0
   [junit4]   2> 6497656 INFO  (TEST-HdfsChaosMonkeyNothingIsSafeTest.test-seed#[B0F37023B4FB2C09]) [    ] o.a.s.c.ZkTestServer STARTING ZK TEST SERVER
   [junit4]   2> 6497657 INFO  (ZkTestServer Run Thread) [    ] o.a.s.c.ZkTestServer client port:0.0.0.0/0.0.0.0:0
   [junit4]   2> 6497657 INFO  (ZkTestServer Run Thread) [    ] o.a.s.c.ZkTestServer Starting server
   [junit4]   2> 6497768 INFO  (TEST-HdfsChaosMonkeyNothingIsSafeTest.test-seed#[B0F37023B4FB2C09]) [    ] o.a.s.c.ZkTestServer start zk server on port:34018
   [junit4]   2> 6497768 INFO  (TEST-HdfsChaosMonkeyNothingIsSafeTest.test-seed#[B0F37023B4FB2C09]) [    ] o.a.s.c.ZkTestServer parse host and port list: 127.0.0.1:34018
   [junit4]   2> 6497768 INFO  (TEST-HdfsChaosMonkeyNothingIsSafeTest.test-seed#[B0F37023B4FB2C09]) [    ] o.a.s.c.ZkTestServer connecting to 127.0.0.1 34018
   [junit4]   2> 6497776 INFO  (zkConnectionManagerCallback-19294-thread-1) [    ] o.a.s.c.c.ConnectionManager zkClient has connected
   [junit4]   2> 6497817 INFO  (zkConnectionManagerCallback-19296-thread-1) [    ] o.a.s.c.c.ConnectionManager zkClient has connected
   [junit4]   2> 6497818 INFO  (TEST-HdfsChaosMonkeyNothingIsSafeTest.test-seed#[B0F37023B4FB2C09]) [    ] o.a.s.c.ZkTestServer put /home/jenkins/jenkins-slave/workspace/Lucene-Solr-NightlyTests-master/checkout/solr/core/src/test-files/solr/collection1/conf/solrconfig-tlog.xml to /configs/conf1/solrconfig.xml
   [junit4]   2> 6497820 INFO  (TEST-HdfsChaosMonkeyNothingIsSafeTest.test-seed#[B0F37023B4FB2C09]) [    ] o.a.s.c.ZkTestServer put /home/jenkins/jenkins-slave/workspace/Lucene-Solr-NightlyTests-master/checkout/solr/core/src/test-files/solr/collection1/conf/schema15.xml to /configs/conf1/schema.xml
   [junit4]   2> 6497835 INFO  (TEST-HdfsChaosMonkeyNothingIsSafeTest.test-seed#[B0F37023B4FB2C09]) [    ] o.a.s.c.ZkTestServer put /home/jenkins/jenkins-slave/workspace/Lucene-Solr-NightlyTests-master/checkout/solr/core/src/test-files/solr/collection1/conf/solrconfig.snippet.randomindexconfig.xml to /configs/conf1/solrconfig.snippet.randomindexconfig.xml
   [junit4]   2> 6497846 INFO  (TEST-HdfsChaosMonkeyNothingIsSafeTest.test-seed#[B0F37023B4FB2C09]) [    ] o.a.s.c.ZkTestServer put /home/jenkins/jenkins-slave/workspace/Lucene-Solr-NightlyTests-master/checkout/solr/core/src/test-files/solr/collection1/conf/stopwords.txt to /configs/conf1/stopwords.txt
   [junit4]   2> 6497848 INFO  (TEST-HdfsChaosMonkeyNothingIsSafeTest.test-seed#[B0F37023B4FB2C09]) [    ] o.a.s.c.ZkTestServer put /home/jenkins/jenkins-slave/workspace/Lucene-Solr-NightlyTests-master/checkout/solr/core/src/test-files/solr/collection1/conf/protwords.txt to /configs/conf1/protwords.txt
   [junit4]   2> 6497849 INFO  (TEST-HdfsChaosMonkeyNothingIsSafeTest.test-seed#[B0F37023B4FB2C09]) [    ] o.a.s.c.ZkTestServer put /home/jenkins/jenkins-slave/workspace/Lucene-Solr-NightlyTests-master/checkout/solr/core/src/test-files/solr/collection1/conf/currency.xml to /configs/conf1/currency.xml
   [junit4]   2> 6497863 INFO  (TEST-HdfsChaosMonkeyNothingIsSafeTest.test-seed#[B0F37023B4FB2C09]) [    ] o.a.s.c.ZkTestServer put /home/jenkins/jenkins-slave/workspace/Lucene-Solr-NightlyTests-master/checkout/solr/core/src/test-files/solr/collection1/conf/enumsConfig.xml to /configs/conf1/enumsConfig.xml
   [junit4]   2> 6497873 INFO  (TEST-HdfsChaosMonkeyNothingIsSafeTest.test-seed#[B0F37023B4FB2C09]) [    ] o.a.s.c.ZkTestServer put /home/jenkins/jenkins-slave/workspace/Lucene-Solr-NightlyTests-master/checkout/solr/core/src/test-files/solr/collection1/conf/open-exchange-rates.json to /configs/conf1/open-exchange-rates.json
   [junit4]   2> 6497875 INFO  (TEST-HdfsChaosMonkeyNothingIsSafeTest.test-seed#[B0F37023B4FB2C09]) [    ] o.a.s.c.ZkTestServer put /home/jenkins/jenkins-slave/workspace/Lucene-Solr-NightlyTests-master/checkout/solr/core/src/test-files/solr/collection1/conf/mapping-ISOLatin1Accent.txt to /configs/conf1/mapping-ISOLatin1Accent.txt
   [junit4]   2> 6497876 INFO  (TEST-HdfsChaosMonkeyNothingIsSafeTest.test-seed#[B0F37023B4FB2C09]) [    ] o.a.s.c.ZkTestServer put /home/jenkins/jenkins-slave/workspace/Lucene-Solr-NightlyTests-master/checkout/solr/core/src/test-files/solr/collection1/conf/old_synonyms.txt to /configs/conf1/old_synonyms.txt
   [junit4]   2> 6497890 INFO  (TEST-HdfsChaosMonkeyNothingIsSafeTest.test-seed#[B0F37023B4FB2C09]) [    ] o.a.s.c.ZkTestServer put /home/jenkins/jenkins-slave/workspace/Lucene-Solr-NightlyTests-master/checkout/solr/core/src/test-files/solr/collection1/conf/synonyms.txt to /configs/conf1/synonyms.txt
   [junit4]   2> 6497892 INFO  (TEST-HdfsChaosMonkeyNothingIsSafeTest.test-seed#[B0F37023B4FB2C09]) [    ] o.a.s.c.AbstractFullDistribZkTestBase Will use NRT replicas unless explicitly asked otherwise
   [junit4]   2> 6499116 WARN  (TEST-HdfsChaosMonkeyNothingIsSafeTest.test-seed#[B0F37023B4FB2C09]) [    ] o.e.j.s.AbstractConnector Ignoring deprecated socket close linger time
   [junit4]   2> 6499116 INFO  (TEST-HdfsChaosMonkeyNothingIsSafeTest.test-seed#[B0F37023B4FB2C09]) [    ] o.a.s.c.s.e.JettySolrRunner Start Jetty (original configured port=0)
   [junit4]   2> 6499116 INFO  (TEST-HdfsChaosMonkeyNothingIsSafeTest.test-seed#[B0F37023B4FB2C09]) [    ] o.a.s.c.s.e.JettySolrRunner Trying to start Jetty on port 0 try number 1 ...
   [junit4]   2> 6499116 INFO  (TEST-HdfsChaosMonkeyNothingIsSafeTest.test-seed#[B0F37023B4FB2C09]) [    ] o.e.j.s.Server jetty-9.4.14.v20181114; built: 2018-11-14T21:20:31.478Z; git: c4550056e785fb5665914545889f21dc136ad9e6; jvm 11.0.1+13-LTS
   [junit4]   2> 6499117 INFO  (TEST-HdfsChaosMonkeyNothingIsSafeTest.test-seed#[B0F37023B4FB2C09]) [    ] o.e.j.s.session DefaultSessionIdManager workerName=node0
   [junit4]   2> 6499117 INFO  (TEST-HdfsChaosMonkeyNothingIsSafeTest.test-seed#[B0F37023B4FB2C09]) [    ] o.e.j.s.session No SessionScavenger set, using defaults
   [junit4]   2> 6499117 INFO  (TEST-HdfsChaosMonkeyNothingIsSafeTest.test-seed#[B0F37023B4FB2C09]) [    ] o.e.j.s.session node0 Scavenging every 600000ms
   [junit4]   2> 6499118 INFO  (TEST-HdfsChaosMonkeyNothingIsSafeTest.test-seed#[B0F37023B4FB2C09]) [    ] o.e.j.s.h.ContextHandler Started o.e.j.s.ServletContextHandler@4d7af40a{/_/u,null,AVAILABLE}
   [junit4]   2> 6499118 INFO  (TEST-HdfsChaosMonkeyNothingIsSafeTest.test-seed#[B0F37023B4FB2C09]) [    ] o.e.j.s.AbstractConnector Started ServerConnector@1b84f5d1{HTTP/1.1,[http/1.1, h2c]}{127.0.0.1:41499}
   [junit4]   2> 6499118 INFO  (TEST-HdfsChaosMonkeyNothingIsSafeTest.test-seed#[B0F37023B4FB2C09]) [    ] o.e.j.s.Server Started @6499616ms
   [junit4]   2> 6499118 INFO  (TEST-HdfsChaosMonkeyNothingIsSafeTest.test-seed#[B0F37023B4FB2C09]) [    ] o.a.s.c.s.e.JettySolrRunner Jetty properties: {hostContext=/_/u, solr.data.dir=hdfs://lucene2-us-west.apache.org:45359/hdfs__lucene2-us-west.apache.org_45359__home_jenkins_jenkins-slave_workspace_Lucene-Solr-NightlyTests-master_checkout_solr_build_solr-core_test_J1_temp_solr.cloud.hdfs.HdfsChaosMonkeyNothingIsSafeTest_B0F37023B4FB2C09-001_tempDir-002_control_data, hostPort=41499, coreRootDirectory=/home/jenkins/jenkins-slave/workspace/Lucene-Solr-NightlyTests-master/checkout/solr/build/solr-core/test/J1/../../../../../../../../../../../home/jenkins/jenkins-slave/workspace/Lucene-Solr-NightlyTests-master/checkout/solr/build/solr-core/test/J1/temp/solr.cloud.hdfs.HdfsChaosMonkeyNothingIsSafeTest_B0F37023B4FB2C09-001/control-001/cores}
   [junit4]   2> 6499118 ERROR (TEST-HdfsChaosMonkeyNothingIsSafeTest.test-seed#[B0F37023B4FB2C09]) [    ] o.a.s.u.StartupLoggingUtils Missing Java Option solr.log.dir. Logging may be missing or incomplete.
   [junit4]   2> 6499118 INFO  (TEST-HdfsChaosMonkeyNothingIsSafeTest.test-seed#[B0F37023B4FB2C09]) [    ] o.a.s.s.SolrDispatchFilter Using logger factory org.apache.logging.slf4j.Log4jLoggerFactory
   [junit4]   2> 6499118 INFO  (TEST-HdfsChaosMonkeyNothingIsSafeTest.test-seed#[B0F37023B4FB2C09]) [    ] o.a.s.s.SolrDispatchFilter  ___      _       Welcome to Apache Solr™ version 9.0.0
   [junit4]   2> 6499118 INFO  (TEST-HdfsChaosMonkeyNothingIsSafeTest.test-seed#[B0F37023B4FB2C09]) [    ] o.a.s.s.SolrDispatchFilter / __| ___| |_ _   Starting in cloud mode on port null
   [junit4]   2> 6499118 INFO  (TEST-HdfsChaosMonkeyNothingIsSafeTest.test-seed#[B0F37023B4FB2C09]) [    ] o.a.s.s.SolrDispatchFilter \__ \/ _ \ | '_|  Install dir: null
   [junit4]   2> 6499118 INFO  (TEST-HdfsChaosMonkeyNothingIsSafeTest.test-seed#[B0F37023B4FB2C09]) [    ] o.a.s.s.SolrDispatchFilter |___/\___/_|_|    Start time: 2019-05-17T20:17:41.190981Z
   [junit4]   2> 6499141 INFO  (zkConnectionManagerCallback-19298-thread-1) [    ] o.a.s.c.c.ConnectionManager zkClient has connected
   [junit4]   2> 6499142 INFO  (TEST-HdfsChaosMonkeyNothingIsSafeTest.test-seed#[B0F37023B4FB2C09]) [    ] o.a.s.s.SolrDispatchFilter Loading solr.xml from SolrHome (not found in ZooKeeper)
   [junit4]   2> 6499142 INFO  (TEST-HdfsChaosMonkeyNothingIsSafeTest.test-seed#[B0F37023B4FB2C09]) [    ] o.a.s.c.SolrXmlConfig Loading container configuration from /home/jenkins/jenkins-slave/workspace/Lucene-Solr-NightlyTests-master/checkout/solr/build/solr-core/test/J1/temp/solr.cloud.hdfs.HdfsChaosMonkeyNothingIsSafeTest_B0F37023B4FB2C09-001/control-001/solr.xml
   [junit4]   2> 6499145 INFO  (TEST-HdfsChaosMonkeyNothingIsSafeTest.test-seed#[B0F37023B4FB2C09]) [    ] o.a.s.c.SolrXmlConfig Configuration parameter autoReplicaFailoverWorkLoopDelay is ignored
   [junit4]   2> 6499145 INFO  (TEST-HdfsChaosMonkeyNothingIsSafeTest.test-seed#[B0F37023B4FB2C09]) [    ] o.a.s.c.SolrXmlConfig Configuration parameter autoReplicaFailoverBadNodeExpiration is ignored
   [junit4]   2> 6499179 INFO  (TEST-HdfsChaosMonkeyNothingIsSafeTest.test-seed#[B0F37023B4FB2C09]) [    ] o.a.s.c.SolrXmlConfig MBean server found: com.sun.jmx.mbeanserver.JmxMBeanServer@105999ac, but no JMX reporters were configured - adding default JMX reporter.
   [junit4]   2> 6499632 INFO  (TEST-HdfsChaosMonkeyNothingIsSafeTest.test-seed#[B0F37023B4FB2C09]) [    ] o.a.s.h.c.HttpShardHandlerFactory Host whitelist initialized: WhitelistHostChecker [whitelistHosts=null, whitelistHostCheckingEnabled=false]
   [junit4]   2> 6499633 WARN  (TEST-HdfsChaosMonkeyNothingIsSafeTest.test-seed#[B0F37023B4FB2C09]) [    ] o.e.j.u.s.S.config No Client EndPointIdentificationAlgorithm configured for SslContextFactory@67295bbc[provider=null,keyStore=null,trustStore=null]
   [junit4]   2> 6499655 WARN  (TEST-HdfsChaosMonkeyNothingIsSafeTest.test-seed#[B0F37023B4FB2C09]) [    ] o.e.j.u.s.S.config No Client EndPointIdentificationAlgorithm configured for SslContextFactory@613a9bbd[provider=null,keyStore=null,trustStore=null]
   [junit4]   2> 6499660 INFO  (TEST-HdfsChaosMonkeyNothingIsSafeTest.test-seed#[B0F37023B4FB2C09]) [    ] o.a.s.c.ZkContainer Zookeeper client=127.0.0.1:34018/solr
   [junit4]   2> 6499817 INFO  (zkConnectionManagerCallback-19305-thread-1) [    ] o.a.s.c.c.ConnectionManager zkClient has connected
   [junit4]   2> 6499949 INFO  (zkConnectionManagerCallback-19307-thread-1) [    ] o.a.s.c.c.ConnectionManager zkClient has connected
   [junit4]   2> 6500308 INFO  (TEST-HdfsChaosMonkeyNothingIsSafeTest.test-seed#[B0F37023B4FB2C09]) [n:127.0.0.1:41499__%2Fu    ] o.a.s.c.OverseerElectionContext I am going to be the leader 127.0.0.1:41499__%2Fu
   [junit4]   2> 6500309 INFO  (TEST-HdfsChaosMonkeyNothingIsSafeTest.test-seed#[B0F37023B4FB2C09]) [n:127.0.0.1:41499__%2Fu    ] o.a.s.c.Overseer Overseer (id=74709289431465988-127.0.0.1:41499__%2Fu-n_0000000000) starting
   [junit4]   2> 6500315 INFO  (zkConnectionManagerCallback-19314-thread-1) [    ] o.a.s.c.c.ConnectionManager zkClient has connected
   [junit4]   2> 6500329 INFO  (TEST-HdfsChaosMonkeyNothingIsSafeTest.test-seed#[B0F37023B4FB2C09]) [n:127.0.0.1:41499__%2Fu    ] o.a.s.c.s.i.ZkClientClusterStateProvider Cluster at 127.0.0.1:34018/solr ready
   [junit4]   2> 6500330 INFO  (OverseerStateUpdate-74709289431465988-127.0.0.1:41499__%2Fu-n_0000000000) [n:127.0.0.1:41499__%2Fu    ] o.a.s.c.Overseer Starting to work on the main queue : 127.0.0.1:41499__%2Fu
   [junit4]   2> 6500330 INFO  (TEST-HdfsChaosMonkeyNothingIsSafeTest.test-seed#[B0F37023B4FB2C09]) [n:127.0.0.1:41499__%2Fu    ] o.a.s.c.ZkController Register node as live in ZooKeeper:/live_nodes/127.0.0.1:41499__%2Fu
   [junit4]   2> 6500340 INFO  (zkCallback-19306-thread-1) [    ] o.a.s.c.c.ZkStateReader Updated live nodes from ZooKeeper... (0) -> (1)
   [junit4]   2> 6500344 INFO  (zkCallback-19313-thread-1) [    ] o.a.s.c.c.ZkStateReader Updated live nodes from ZooKeeper... (0) -> (1)
   [junit4]   2> 6500441 INFO  (TEST-HdfsChaosMonkeyNothingIsSafeTest.test-seed#[B0F37023B4FB2C09]) [n:127.0.0.1:41499__%2Fu    ] o.a.s.h.a.MetricsHistoryHandler No .system collection, keeping metrics history in memory.
   [junit4]   2> 6500509 INFO  (TEST-HdfsChaosMonkeyNothingIsSafeTest.test-seed#[B0F37023B4FB2C09]) [n:127.0.0.1:41499__%2Fu    ] o.a.s.m.r.SolrJmxReporter JMX monitoring for 'solr.node' (registry 'solr.node') enabled at server: com.sun.jmx.mbeanserver.JmxMBeanServer@105999ac
   [junit4]   2> 6500559 INFO  (TEST-HdfsChaosMonkeyNothingIsSafeTest.test-seed#[B0F37023B4FB2C09]) [n:127.0.0.1:41499__%2Fu    ] o.a.s.m.r.SolrJmxReporter JMX monitoring for 'solr.jvm' (registry 'solr.jvm') enabled at server: com.sun.jmx.mbeanserver.JmxMBeanServer@105999ac
   [junit4]   2> 6500559 INFO  (TEST-HdfsChaosMonkeyNothingIsSafeTest.test-seed#[B0F37023B4FB2C09]) [n:127.0.0.1:41499__%2Fu    ] o.a.s.m.r.SolrJmxReporter JMX monitoring for 'solr.jetty' (registry 'solr.jetty') enabled at server: com.sun.jmx.mbeanserver.JmxMBeanServer@105999ac
   [junit4]   2> 6500560 INFO  (TEST-HdfsChaosMonkeyNothingIsSafeTest.test-seed#[B0F37023B4FB2C09]) [n:127.0.0.1:41499__%2Fu    ] o.a.s.c.CorePropertiesLocator Found 0 core definitions underneath /home/jenkins/jenkins-slave/workspace/Lucene-Solr-NightlyTests-master/checkout/solr/build/solr-core/test/J1/../../../../../../../../../../../home/jenkins/jenkins-slave/workspace/Lucene-Solr-NightlyTests-master/checkout/solr/build/solr-core/test/J1/temp/solr.cloud.hdfs.HdfsChaosMonkeyNothingIsSafeTest_B0F37023B4FB2C09-001/control-001/cores
   [junit4]   2> 6500640 INFO  (zkConnectionManagerCallback-19320-thread-1) [    ] o.a.s.c.c.ConnectionManager zkClient has connected
   [junit4]   2> 6500648 INFO  (TEST-HdfsChaosMonkeyNothingIsSafeTest.test-seed#[B0F37023B4FB2C09]) [    ] o.a.s.c.c.ZkStateReader Updated live nodes from ZooKeeper... (0) -> (1)
   [junit4]   2> 6500650 INFO  (TEST-HdfsChaosMonkeyNothingIsSafeTest.test-seed#[B0F37023B4FB2C09]) [    ] o.a.s.c.s.i.ZkClientClusterStateProvider Cluster at 127.0.0.1:34018/solr ready
   [junit4]   2> 6500660 INFO  (qtp408243211-98628) [n:127.0.0.1:41499__%2Fu    ] o.a.s.h.a.CollectionsHandler Invoked Collection Action :create with params collection.configName=conf1&name=control_collection&nrtReplicas=1&action=CREATE&numShards=1&createNodeSet=127.0.0.1:41499__%252Fu&wt=javabin&version=2 and sendToOCPQueue=true
   [junit4]   2> 6500684 INFO  (OverseerThreadFactory-14726-thread-1-processing-n:127.0.0.1:41499__%2Fu) [n:127.0.0.1:41499__%2Fu    ] o.a.s.c.a.c.CreateCollectionCmd Create collection control_collection
   [junit4]   2> 6500836 INFO  (qtp408243211-98630) [n:127.0.0.1:41499__%2Fu    x:control_collection_shard1_replica_n1] o.a.s.h.a.CoreAdminOperation core create command qt=/admin/cores&collection.configName=conf1&newCollection=true&name=control_collection_shard1_replica_n1&action=CREATE&numShards=1&collection=control_collection&shard=shard1&wt=javabin&version=2&replicaType=NRT
   [junit4]   2> 6500836 INFO  (qtp408243211-98630) [n:127.0.0.1:41499__%2Fu    x:control_collection_shard1_replica_n1] o.a.s.c.TransientSolrCoreCacheDefault Allocating transient cache for 4 transient cores
   [junit4]   2> 6501902 INFO  (qtp408243211-98630) [n:127.0.0.1:41499__%2Fu c:control_collection s:shard1  x:control_collection_shard1_replica_n1] o.a.s.c.SolrConfig Using Lucene MatchVersion: 9.0.0
   [junit4]   2> 6501975 INFO  (qtp408243211-98630) [n:127.0.0.1:41499__%2Fu c:control_collection s:shard1  x:control_collection_shard1_replica_n1] o.a.s.s.IndexSchema [control_collection_shard1_replica_n1] Schema name=test
   [junit4]   2> 6502385 INFO  (qtp408243211-98630) [n:127.0.0.1:41499__%2Fu c:control_collection s:shard1  x:control_collection_shard1_replica_n1] o.a.s.s.IndexSchema Loaded schema test/1.6 with uniqueid field id
   [junit4]   2> 6502501 INFO  (qtp408243211-98630) [n:127.0.0.1:41499__%2Fu c:control_collection s:shard1  x:control_collection_shard1_replica_n1] o.a.s.c.CoreContainer Creating SolrCore 'control_collection_shard1_replica_n1' using configuration from collection control_collection, trusted=true
   [junit4]   2> 6502502 INFO  (qtp408243211-98630) [n:127.0.0.1:41499__%2Fu c:control_collection s:shard1  x:control_collection_shard1_replica_n1] o.a.s.m.r.SolrJmxReporter JMX monitoring for 'solr.core.control_collection.shard1.replica_n1' (registry 'solr.core.control_collection.shard1.replica_n1') enabled at server: com.sun.jmx.mbeanserver.JmxMBeanServer@105999ac
   [junit4]   2> 6502502 INFO  (qtp408243211-98630) [n:127.0.0.1:41499__%2Fu c:control_collection s:shard1  x:control_collection_shard1_replica_n1] o.a.s.c.HdfsDirectoryFactory solr.hdfs.home=hdfs://lucene2-us-west.apache.org:45359/solr_hdfs_home
   [junit4]   2> 6502502 INFO  (qtp408243211-98630) [n:127.0.0.1:41499__%2Fu c:control_collection s:shard1  x:control_collection_shard1_replica_n1] o.a.s.c.HdfsDirectoryFactory Solr Kerberos Authentication disabled
   [junit4]   2> 6502502 INFO  (qtp408243211-98630) [n:127.0.0.1:41499__%2Fu c:control_collection s:shard1  x:control_collection_shard1_replica_n1] o.a.s.c.SolrCore [[control_collection_shard1_replica_n1] ] Opening new SolrCore at [/home/jenkins/jenkins-slave/workspace/Lucene-Solr-NightlyTests-master/checkout/solr/build/solr-core/test/J1/temp/solr.cloud.hdfs.HdfsChaosMonkeyNothingIsSafeTest_B0F37023B4FB2C09-001/control-001/cores/control_collection_shard1_replica_n1], dataDir=[hdfs://lucene2-us-west.apache.org:45359/solr_hdfs_home/control_collection/core_node2/data/]
   [junit4]   2> 6502503 INFO  (qtp408243211-98630) [n:127.0.0.1:41499__%2Fu c:control_collection s:shard1  x:control_collection_shard1_replica_n1] o.a.s.c.HdfsDirectoryFactory creating directory factory for path hdfs://lucene2-us-west.apache.org:45359/solr_hdfs_home/control_collection/core_node2/data/snapshot_metadata
   [junit4]   2> 6502539 INFO  (qtp408243211-98630) [n:127.0.0.1:41499__%2Fu c:control_collection s:shard1  x:control_collection_shard1_replica_n1] o.a.s.c.HdfsDirectoryFactory Number of slabs of block cache [1] with direct memory allocation set to [true]
   [junit4]   2> 6502539 INFO  (qtp408243211-98630) [n:127.0.0.1:41499__%2Fu c:control_collection s:shard1  x:control_collection_shard1_replica_n1] o.a.s.c.HdfsDirectoryFactory Block cache target memory usage, slab size of [33554432] will allocate [1] slabs and use ~[33554432] bytes
   [junit4]   2> 6502589 INFO  (qtp408243211-98630) [n:127.0.0.1:41499__%2Fu c:control_collection s:shard1  x:control_collection_shard1_replica_n1] o.a.s.s.b.BlockDirectory Block cache on write is disabled
   [junit4]   2> 6502590 INFO  (qtp408243211-98630) [n:127.0.0.1:41499__%2Fu c:control_collection s:shard1  x:control_collection_shard1_replica_n1] o.a.s.c.HdfsDirectoryFactory creating directory factory for path hdfs://lucene2-us-west.apache.org:45359/solr_hdfs_home/control_collection/core_node2/data
   [junit4]   2> 6502661 INFO  (qtp408243211-98630) [n:127.0.0.1:41499__%2Fu c:control_collection s:shard1  x:control_collection_shard1_replica_n1] o.a.s.c.HdfsDirectoryFactory creating directory factory for path hdfs://lucene2-us-west.apache.org:45359/solr_hdfs_home/control_collection/core_node2/data/index
   [junit4]   2> 6502711 INFO  (qtp408243211-98630) [n:127.0.0.1:41499__%2Fu c:control_collection s:shard1  x:control_collection_shard1_replica_n1] o.a.s.c.HdfsDirectoryFactory Number of slabs of block cache [1] with direct memory allocation set to [true]
   [junit4]   2> 6502711 INFO  (qtp408243211-98630) [n:127.0.0.1:41499__%2Fu c:control_collection s:shard1  x:control_collection_shard1_replica_n1] o.a.s.c.HdfsDirectoryFactory Block cache target memory usage, slab size of [33554432] will allocate [1] slabs and use ~[33554432] bytes
   [junit4]   2> 6502731 INFO  (qtp408243211-98630) [n:127.0.0.1:41499__%2Fu c:control_collection s:shard1  x:control_collection_shard1_replica_n1] o.a.s.s.b.BlockDirectory Block cache on write is disabled
   [junit4]   2> 6502732 INFO  (qtp408243211-98630) [n:127.0.0.1:41499__%2Fu c:control_collection s:shard1  x:control_collection_shard1_replica_n1] o.a.s.u.RandomMergePolicy RandomMergePolicy wrapping class org.apache.lucene.index.MockRandomMergePolicy: org.apache.lucene.index.MockRandomMergePolicy@40fc7228
   [junit4]   2> 6503259 WARN  (qtp408243211-98630) [n:127.0.0.1:41499__%2Fu c:control_collection s:shard1  x:control_collection_shard1_replica_n1] o.a.s.c.RequestHandlers INVALID paramSet a in requestHandler {type = requestHandler,name = /dump,class = DumpRequestHandler,attributes = {initParams=a, name=/dump, class=DumpRequestHandler},args = {defaults={a=A,b=B}}}
   [junit4]   2> 6503604 INFO  (qtp408243211-98630) [n:127.0.0.1:41499__%2Fu c:control_collection s:shard1  x:control_collection_shard1_replica_n1] o.a.s.u.UpdateHandler Using UpdateLog implementation: org.apache.solr.update.HdfsUpdateLog
   [junit4]   2> 6503604 INFO  (qtp408243211-98630) [n:127.0.0.1:41499__%2Fu c:control_collection s:shard1  x:control_collection_shard1_replica_n1] o.a.s.u.UpdateLog Initializing UpdateLog: dataDir= defaultSyncLevel=FLUSH numRecordsToKeep=100 maxNumLogsToKeep=10 numVersionBuckets=65536
   [junit4]   2> 6503604 INFO  (qtp408243211-98630) [n:127.0.0.1:41499__%2Fu c:control_collection s:shard1  x:control_collection_shard1_replica_n1] o.a.s.u.HdfsUpdateLog Initializing HdfsUpdateLog: tlogDfsReplication=2
   [junit4]   2> 6503658 INFO  (qtp408243211-98630) [n:127.0.0.1:41499__%2Fu c:control_collection s:shard1  x:control_collection_shard1_replica_n1] o.a.s.u.CommitTracker Hard AutoCommit: if uncommitted for 15000ms; 
   [junit4]   2> 6503658 INFO  (qtp408243211-98630) [n:127.0.0.1:41499__%2Fu c:control_collection s:shard1  x:control_collection_shard1_replica_n1] o.a.s.u.CommitTracker Soft AutoCommit: disabled
   [junit4]   2> 6503660 INFO  (qtp408243211-98630) [n:127.0.0.1:41499__%2Fu c:control_collection s:shard1  x:control_collection_shard1_replica_n1] o.a.s.u.RandomMergePolicy RandomMergePolicy wrapping class org.apache.lucene.index.TieredMergePolicy: [TieredMergePolicy: maxMergeAtOnce=13, maxMergeAtOnceExplicit=44, maxMergedSegmentMB=7.220703125, floorSegmentMB=2.1640625, forceMergeDeletesPctAllowed=8.946179839446046, segmentsPerTier=35.0, maxCFSSegmentSizeMB=8.796093022207999E12, noCFSRatio=0.0, deletesPctAllowed=45.357671993833165
   [junit4]   2> 6503678 INFO  (qtp408243211-98630) [n:127.0.0.1:41499__%2Fu c:control_collection s:shard1  x:control_collection_shard1_replica_n1] o.a.s.s.SolrIndexSearcher Opening [Searcher@654af086[control_collection_shard1_replica_n1] main]
   [junit4]   2> 6503696 INFO  (qtp408243211-98630) [n:127.0.0.1:41499__%2Fu c:control_collection s:shard1  x:control_collection_shard1_replica_n1] o.a.s.r.ManagedResourceStorage Configured ZooKeeperStorageIO with znodeBase: /configs/conf1
   [junit4]   2> 6503696 INFO  (qtp408243211-98630) [n:127.0.0.1:41499__%2Fu c:control_collection s:shard1  x:control_collection_shard1_replica_n1] o.a.s.r.ManagedResourceStorage Loaded null at path _rest_managed.json using ZooKeeperStorageIO:path=/configs/conf1
   [junit4]   2> 6503697 INFO  (qtp408243211-98630) [n:127.0.0.1:41499__%2Fu c:control_collection s:shard1  x:control_collection_shard1_replica_n1] o.a.s.h.ReplicationHandler Commits will be reserved for 10000ms.
   [junit4]   2> 6503697 INFO  (qtp408243211-98630) [n:127.0.0.1:41499__%2Fu c:control_collection s:shard1  x:control_collection_shard1_replica_n1] o.a.s.u.UpdateLog Could not find max version in index or recent updates, using new clock 1633811710102994944
   [junit4]   2> 6503737 INFO  (searcherExecutor-14731-thread-1-processing-n:127.0.0.1:41499__%2Fu x:control_collection_shard1_replica_n1 c:control_collection s:shard1) [n:127.0.0.1:41499__%2Fu c:control_collection s:shard1  x:control_collection_shard1_replica_n1] o.a.s.c.SolrCore [control_collection_shard1_replica_n1] Registered new searcher Searcher@654af086[control_collection_shard1_replica_n1] main{ExitableDirectoryReader(UninvertingDirectoryReader())}
   [junit4]   2> 6503749 INFO  (qtp408243211-98630) [n:127.0.0.1:41499__%2Fu c:control_collection s:shard1  x:control_collection_shard1_replica_n1] o.a.s.c.ZkShardTerms Successful update of terms at /collections/control_collection/terms/shard1 to Terms{values={core_node2=0}, version=0}
   [junit4]   2> 6503749 INFO  (qtp408243211-98630) [n:127.0.0.1:41499__%2Fu c:control_collection s:shard1  x:control_collection_shard1_replica_n1] o.a.s.c.ShardLeaderElectionContextBase make sure parent is created /collections/control_collection/leaders/shard1
   [junit4]   2> 6503761 INFO  (qtp408243211-98630) [n:127.0.0.1:41499__%2Fu c:control_collection s:shard1  x:control_collection_shard1_replica_n1] o.a.s.c.ShardLeaderElectionContext Enough replicas found to continue.
   [junit4]   2> 6503761 INFO  (qtp408243211-98630) [n:127.0.0.1:41499__%2Fu c:control_collection s:shard1  x:control_collection_shard1_replica_n1] o.a.s.c.ShardLeaderElectionContext I may be the new leader - try and sync
   [junit4]   2> 6503761 INFO  (qtp408243211-98630) [n:127.0.0.1:41499__%2Fu c:control_collection s:shard1  x:control_collection_shard1_replica_n1] o.a.s.c.SyncStrategy Sync replicas to http://127.0.0.1:41499/_/u/control_collection_shard1_replica_n1/
   [junit4]   2> 6503761 INFO  (qtp408243211-98630) [n:127.0.0.1:41499__%2Fu c:control_collection s:shard1  x:control_collection_shard1_replica_n1] o.a.s.c.SyncStrategy Sync Success - now sync replicas to me
   [junit4]   2> 6503762 INFO  (qtp408243211-98630) [n:127.0.0.1:41499__%2Fu c:control_collection s:shard1  x:control_collection_shard1_replica_n1] o.a.s.c.SyncStrategy http://127.0.0.1:41499/_/u/control_collection_shard1_replica_n1/ has no replicas
   [junit4]   2> 6503762 INFO  (qtp408243211-98630) [n:127.0.0.1:41499__%2Fu c:control_collection s:shard1  x:control_collection_shard1_replica_n1] o.a.s.c.ShardLeaderElectionContextBase Creating leader registration node /collections/control_collection/leaders/shard1/leader after winning as /collections/control_collection/leader_elect/shard1/election/74709289431465988-core_node2-n_0000000000
   [junit4]   2> 6503776 INFO  (qtp408243211-98630) [n:127.0.0.1:41499__%2Fu c:control_collection s:shard1  x:control_collection_shard1_replica_n1] o.a.s.c.ShardLeaderElectionContext I am the new leader: http://127.0.0.1:41499/_/u/control_collection_shard1_replica_n1/ shard1
   [junit4]   2> 6503777 INFO  (zkCallback-19306-thread-1) [    ] o.a.s.c.c.ZkStateReader A cluster state change: [WatchedEvent state:SyncConnected type:NodeDataChanged path:/collections/control_collection/state.json] for collection [control_collection] has occurred - updating... (live nodes size: [1])
   [junit4]   2> 6503778 INFO  (qtp408243211-98630) [n:127.0.0.1:41499__%2Fu c:control_collection s:shard1  x:control_collection_shard1_replica_n1] o.a.s.c.ZkController I am the leader, no recovery necessary
   [junit4]   2> 6503779 INFO  (qtp408243211-98630) [n:127.0.0.1:41499__%2Fu c:control_collection s:shard1  x:control_collection_shard1_replica_n1] o.a.s.s.HttpSolrCall [admin] webapp=null path=/admin/cores params={qt=/admin/cores&collection.configName=conf1&newCollection=true&name=control_collection_shard1_replica_n1&action=CREATE&numShards=1&collection=control_collection&shard=shard1&wt=javabin&version=2&replicaType=NRT} status=0 QTime=2943
   [junit4]   2> 6503789 INFO  (qtp408243211-98628) [n:127.0.0.1:41499__%2Fu    ] o.a.s.h.a.CollectionsHandler Wait for new collection to be active for at most 45 seconds. Check all shard replicas
   [junit4]   2> 6503882 INFO  (zkCallback-19306-thread-2) [    ] o.a.s.c.c.ZkStateReader A cluster state change: [WatchedEvent state:SyncConnected type:NodeDataChanged path:/collections/control_collection/state.json] for collection [control_collection] has occurred - updating... (live nodes size: [1])
   [junit4]   2> 6503882 INFO  (zkCallback-19306-thread-1) [    ] o.a.s.c.c.ZkStateReader A cluster state change: [WatchedEvent state:SyncConnected type:NodeDataChanged path:/collections/control_collection/state.json] for collection [control_collection] has occurred - updating... (live nodes size: [1])
   [junit4]   2> 6503882 INFO  (qtp408243211-98628) [n:127.0.0.1:41499__%2Fu    ] o.a.s.s.HttpSolrCall [admin] webapp=null path=/admin/collections params={collection.configName=conf1&name=control_collection&nrtReplicas=1&action=CREATE&numShards=1&createNodeSet=127.0.0.1:41499__%252Fu&wt=javabin&version=2} status=0 QTime=3222
   [junit4]   2> 6503926 INFO  (zkConnectionManagerCallback-19326-thread-1) [    ] o.a.s.c.c.ConnectionManager zkClient has connected
   [junit4]   2> 6503927 INFO  (TEST-HdfsChaosMonkeyNothingIsSafeTest.test-seed#[B0F37023B4FB2C09]) [    ] o.a.s.c.c.ZkStateReader Updated live nodes from ZooKeeper... (0) -> (1)
   [junit4]   2> 6503933 INFO  (TEST-HdfsChaosMonkeyNothingIsSafeTest.test-seed#[B0F37023B4FB2C09]) [    ] o.a.s.c.s.i.ZkClientClusterStateProvider Cluster at 127.0.0.1:34018/solr ready
   [junit4]   2> 6503933 INFO  (TEST-HdfsChaosMonkeyNothingIsSafeTest.test-seed#[B0F37023B4FB2C09]) [    ] o.a.s.c.ChaosMonkey monkey: init - expire sessions:false cause connection loss:false
   [junit4]   2> 6503955 INFO  (qtp408243211-98630) [n:127.0.0.1:41499__%2Fu    ] o.a.s.h.a.CollectionsHandler Invoked Collection Action :create with params collection.configName=conf1&name=collection1&nrtReplicas=1&action=CREATE&numShards=1&createNodeSet=&stateFormat=2&wt=javabin&version=2 and sendToOCPQueue=true
   [junit4]   2> 6503978 INFO  (OverseerThreadFactory-14726-thread-2-processing-n:127.0.0.1:41499__%2Fu) [n:127.0.0.1:41499__%2Fu    ] o.a.s.c.a.c.CreateCollectionCmd Create collection collection1
   [junit4]   2> 6503978 INFO  (OverseerCollectionConfigSetProcessor-74709289431465988-127.0.0.1:41499__%2Fu-n_0000000000) [n:127.0.0.1:41499__%2Fu    ] o.a.s.c.OverseerTaskQueue Response ZK path: /overseer/collection-queue-work/qnr-0000000000 doesn't exist.  Requestor may have disconnected from ZooKeeper
   [junit4]   2> 6504201 WARN  (OverseerThreadFactory-14726-thread-2-processing-n:127.0.0.1:41499__%2Fu) [n:127.0.0.1:41499__%2Fu    ] o.a.s.c.a.c.CreateCollectionCmd It is unusual to create a collection (collection1) without cores.
   [junit4]   2> 6504203 INFO  (qtp408243211-98630) [n:127.0.0.1:41499__%2Fu    ] o.a.s.h.a.CollectionsHandler Wait for new collection to be active for at most 45 seconds. Check all shard replicas
   [junit4]   2> 6504203 INFO  (qtp408243211-98630) [n:127.0.0.1:41499__%2Fu    ] o.a.s.s.HttpSolrCall [admin] webapp=null path=/admin/collections params={collection.configName=conf1&name=collection1&nrtReplicas=1&action=CREATE&numShards=1&createNodeSet=&stateFormat=2&wt=javabin&version=2} status=0 QTime=248
   [junit4]   2> 6504204 INFO  (TEST-HdfsChaosMonkeyNothingIsSafeTest.test-seed#[B0F37023B4FB2C09]) [    ] o.a.s.c.AbstractFullDistribZkTestBase Creating jetty instances pullReplicaCount=0 numOtherReplicas=3
   [junit4]   2> 6505179 INFO  (TEST-HdfsChaosMonkeyNothingIsSafeTest.test-seed#[B0F37023B4FB2C09]) [    ] o.a.s.c.AbstractFullDistribZkTestBase create jetty 1 in directory /home/jenkins/jenkins-slave/workspace/Lucene-Solr-NightlyTests-master/checkout/solr/build/solr-core/test/J1/temp/solr.cloud.hdfs.HdfsChaosMonkeyNothingIsSafeTest_B0F37023B4FB2C09-001/shard-1-001 of type NRT
   [junit4]   2> 6505200 WARN  (closeThreadPool-19327-thread-1) [    ] o.e.j.s.AbstractConnector Ignoring deprecated socket close linger time
   [junit4]   2> 6505201 INFO  (closeThreadPool-19327-thread-1) [    ] o.a.s.c.s.e.JettySolrRunner Start Jetty (original configured port=0)
   [junit4]   2> 6505201 INFO  (closeThreadPool-19327-thread-1) [    ] o.a.s.c.s.e.JettySolrRunner Trying to start Jetty on port 0 try number 1 ...
   [junit4]   2> 6505201 INFO  (closeThreadPool-19327-thread-1) [    ] o.e.j.s.Server jetty-9.4.14.v20181114; built: 2018-11-14T21:20:31.478Z; git: c4550056e785fb5665914545889f21dc136ad9e6; jvm 11.0.1+13-LTS
   [junit4]   2> 6505207 INFO  (closeThreadPool-19327-thread-1) [    ] o.e.j.s.session DefaultSessionIdManager workerName=node0
   [junit4]   2> 6505207 INFO  (closeThreadPool-19327-thread-1) [    ] o.e.j.s.session No SessionScavenger set, using defaults
   [junit4]   2> 6505207 INFO  (closeThreadPool-19327-thread-1) [    ] o.e.j.s.session node0 Scavenging every 600000ms
   [junit4]   2> 6505208 INFO  (closeThreadPool-19327-thread-1) [    ] o.e.j.s.h.ContextHandler Started o.e.j.s.ServletContextHandler@67668571{/_/u,null,AVAILABLE}
   [junit4]   2> 6505208 INFO  (closeThreadPool-19327-thread-1) [    ] o.e.j.s.AbstractConnector Started ServerConnector@354d755a{HTTP/1.1,[http/1.1, h2c]}{127.0.0.1:44123}
   [junit4]   2> 6505208 INFO  (closeThreadPool-19327-thread-1) [    ] o.e.j.s.Server Started @6505706ms
   [junit4]   2> 6505208 INFO  (closeThreadPool-19327-thread-1) [    ] o.a.s.c.s.e.JettySolrRunner Jetty properties: {hostContext=/_/u, solrconfig=solrconfig.xml, solr.data.dir=hdfs://lucene2-us-west.apache.org:45359/hdfs__lucene2-us-west.apache.org_45359__home_jenkins_jenkins-slave_workspace_Lucene-Solr-NightlyTests-master_checkout_solr_build_solr-core_test_J1_temp_solr.cloud.hdfs.HdfsChaosMonkeyNothingIsSafeTest_B0F37023B4FB2C09-001_tempDir-002_jetty1, hostPort=44123, coreRootDirectory=/home/jenkins/jenkins-slave/workspace/Lucene-Solr-NightlyTests-master/checkout/solr/build/solr-core/test/J1/../../../../../../../../../../../home/jenkins/jenkins-slave/workspace/Lucene-Solr-NightlyTests-master/checkout/solr/build/solr-core/test/J1/temp/solr.cloud.hdfs.HdfsChaosMonkeyNothingIsSafeTest_B0F37023B4FB2C09-001/shard-1-001/cores}
   [junit4]   2> 6505208 ERROR (closeThreadPool-19327-thread-1) [    ] o.a.s.u.StartupLoggingUtils Missing Java Option solr.log.dir. Logging may be missing or incomplete.
   [junit4]   2> 6505208 INFO  (closeThreadPool-19327-thread-1) [    ] o.a.s.s.SolrDispatchFilter Using logger factory org.apache.logging.slf4j.Log4jLoggerFactory
   [junit4]   2> 6505208 INFO  (closeThreadPool-19327-thread-1) [    ] o.a.s.s.SolrDispatchFilter  ___      _       Welcome to Apache Solr™ version 9.0.0
   [junit4]   2> 6505208 INFO  (closeThreadPool-19327-thread-1) [    ] o.a.s.s.SolrDispatchFilter / __| ___| |_ _   Starting in cloud mode on port null
   [junit4]   2> 6505208 INFO  (closeThreadPool-19327-thread-1) [    ] o.a.s.s.SolrDispatchFilter \__ \/ _ \ | '_|  Install dir: null
   [junit4]   2> 6505208 INFO  (closeThreadPool-19327-thread-1) [    ] o.a.s.s.SolrDispatchFilter |___/\___/_|_|    Start time: 2019-05-17T20:17:47.280735Z
   [junit4]   2> 6505266 INFO  (zkConnectionManagerCallback-19329-thread-1) [    ] o.a.s.c.c.ConnectionManager zkClient has connected
   [junit4]   2> 6505339 INFO  (closeThreadPool-19327-thread-1) [    ] o.a.s.s.SolrDispatchFilter Loading solr.xml from SolrHome (not found in ZooKeeper)
   [junit4]   2> 6505339 INFO  (closeThreadPool-19327-thread-1) [    ] o.a.s.c.SolrXmlConfig Loading container configuration from /home/jenkins/jenkins-slave/workspace/Lucene-Solr-NightlyTests-master/checkout/solr/build/solr-core/test/J1/temp/solr.cloud.hdfs.HdfsChaosMonkeyNothingIsSafeTest_B0F37023B4FB2C09-001/shard-1-001/solr.xml
   [junit4]   2> 6505342 INFO  (closeThreadPool-19327-thread-1) [    ] o.a.s.c.SolrXmlConfig Configuration parameter autoReplicaFailoverWorkLoopDelay is ignored
   [junit4]   2> 6505342 INFO  (closeThreadPool-19327-thread-1) [    ] o.a.s.c.SolrXmlConfig Configuration parameter autoReplicaFailoverBadNodeExpiration is ignored
   [junit4]   2> 6505343 INFO  (closeThreadPool-19327-thread-1) [    ] o.a.s.c.SolrXmlConfig MBean server found: com.sun.jmx.mbeanserver.JmxMBeanServer@105999ac, but no JMX reporters were configured - adding default JMX reporter.
   [junit4]   2> 6505873 INFO  (closeThreadPool-19327-thread-1) [    ] o.a.s.h.c.HttpShardHandlerFactory Host whitelist initialized: WhitelistHostChecker [whitelistHosts=null, whitelistHostCheckingEnabled=false]
   [junit4]   2> 6505895 WARN  (closeThreadPool-19327-thread-1) [    ] o.e.j.u.s.S.config No Client EndPointIdentificationAlgorithm configured for SslContextFactory@5e480f94[provider=null,keyStore=null,trustStore=null]
   [junit4]   2> 6505939 WARN  (closeThreadPool-19327-thread-1) [    ] o.e.j.u.s.S.config No Client EndPointIdentificationAlgorithm configured for SslContextFactory@71649434[provider=null,keyStore=null,trustStore=null]
   [junit4]   2> 6505940 INFO  (closeThreadPool-19327-thread-1) [    ] o.a.s.c.ZkContainer Zookeeper client=127.0.0.1:34018/solr
   [junit4]   2> 6505984 INFO  (zkConnectionManagerCallback-19336-thread-1) [    ] o.a.s.c.c.ConnectionManager zkClient has connected
   [junit4]   2> 6506020 INFO  (zkConnectionManagerCallback-19338-thread-1) [    ] o.a.s.c.c.ConnectionManager zkClient has connected
   [junit4]   2> 6506023 INFO  (OverseerCollectionConfigSetProcessor-74709289431465988-127.0.0.1:41499__%2Fu-n_0000000000) [n:127.0.0.1:41499__%2Fu    ] o.a.s.c.OverseerTaskQueue Response ZK path: /overseer/collection-queue-work/qnr-0000000002 doesn't exist.  Requestor may have disconnected from ZooKeeper
   [junit4]   2> 6506034 INFO  (closeThreadPool-19327-thread-1) [n:127.0.0.1:44123__%2Fu    ] o.a.s.c.c.ZkStateReader Updated live nodes from ZooKeeper... (0) -> (1)
   [junit4]   2> 6506049 INFO  (closeThreadPool-19327-thread-1) [n:127.0.0.1:44123__%2Fu    ] o.a.s.c.ZkController Publish node=127.0.0.1:44123__%2Fu as DOWN
   [junit4]   2> 6506050 INFO  (closeThreadPool-19327-thread-1) [n:127.0.0.1:44123__%2Fu    ] o.a.s.c.TransientSolrCoreCacheDefault Allocating transient cache for 4 transient cores
   [junit4]   2> 6506050 INFO  (closeThreadPool-19327-thread-1) [n:127.0.0.1:44123__%2Fu    ] o.a.s.c.ZkController Register node as live in ZooKeeper:/live_nodes/127.0.0.1:44123__%2Fu
   [junit4]   2> 6506051 INFO  (zkCallback-19306-thread-3) [    ] o.a.s.c.c.ZkStateReader Updated live nodes from ZooKeeper... (1) -> (2)
   [junit4]   2> 6506061 INFO  (zkCallback-19313-thread-1) [    ] o.a.s.c.c.ZkStateReader Updated live nodes from ZooKeeper... (1) -> (2)
   [junit4]   2> 6506061 INFO  (zkCallback-19337-thread-1) [    ] o.a.s.c.c.ZkStateReader Updated live nodes from ZooKeeper... (1) -> (2)
   [junit4]   2> 6506062 INFO  (zkCallback-19325-thread-1) [    ] o.a.s.c.c.ZkStateReader Updated live nodes from ZooKeeper... (1) -> (2)
   [junit4]   2> 6506062 INFO  (zkConnectionManagerCallback-19345-thread-1) [    ] o.a.s.c.c.ConnectionManager zkClient has connected
   [junit4]   2> 6506073 INFO  (closeThreadPool-19327-thread-1) [n:127.0.0.1:44123__%2Fu    ] o.a.s.c.c.ZkStateReader Updated live nodes from ZooKeeper... (0) -> (2)
   [junit4]   2> 6506074 INFO  (closeThreadPool-19327-thread-1) [n:127.0.0.1:44123__%2Fu    ] o.a.s.c.s.i.ZkClientClusterStateProvider Cluster at 127.0.0.1:34018/solr ready
   [junit4]   2> 6506157 INFO  (closeThreadPool-19327-thread-1) [n:127.0.0.1:44123__%2Fu    ] o.a.s.h.a.MetricsHistoryHandler No .system collection, keeping metrics history in memory.
   [junit4]   2> 6506231 INFO  (closeThreadPool-19327-thread-1) [n:127.0.0.1:44123__%2Fu    ] o.a.s.m.r.SolrJmxReporter JMX monitoring for 'solr.node' (registry 'solr.node') enabled at server: com.sun.jmx.mbeanserver.JmxMBeanServer@105999ac
   [junit4]   2> 6506316 INFO  (closeThreadPool-19327-thread-1) [n:127.0.0.1:44123__%2Fu    ] o.a.s.m.r.SolrJmxReporter JMX monitoring for 'solr.jvm' (registry 'solr.jvm') enabled at server: com.sun.jmx.mbeanserver.JmxMBeanServer@105999ac
   [junit4]   2> 6506316 INFO  (closeThreadPool-19327-thread-1) [n:127.0.0.1:44123__%2Fu    ] o.a.s.m.r.SolrJmxReporter JMX monitoring for 'solr.jetty' (registry 'solr.jetty') enabled at server: com.sun.jmx.mbeanserver.JmxMBeanServer@105999ac
   [junit4]   2> 6506318 INFO  (closeThreadPool-19327-thread-1) [n:127.0.0.1:44123__%2Fu    ] o.a.s.c.CorePropertiesLocator Found 0 core definitions underneath /home/jenkins/jenkins-slave/workspace/Lucene-Solr-NightlyTests-master/checkout/solr/build/solr-core/test/J1/../../../../../../../../../../../home/jenkins/jenkins-slave/workspace/Lucene-Solr-NightlyTests-master/checkout/solr/build/solr-core/test/J1/temp/solr.cloud.hdfs.HdfsChaosMonkeyNothingIsSafeTest_B0F37023B4FB2C09-001/shard-1-001/cores
   [junit4]   2> 6506603 INFO  (TEST-HdfsChaosMonkeyNothingIsSafeTest.test-seed#[B0F37023B4FB2C09]) [    ] o.a.s.c.AbstractFullDistribZkTestBase create jetty 2 in directory /home/jenkins/jenkins-slave/workspace/Lucene-Solr-NightlyTests-master/checkout/solr/build/solr-core/test/J1/temp/solr.cloud.hdfs.HdfsChaosMonkeyNothingIsSafeTest_B0F37023B4FB2C09-001/shard-2-001 of type NRT
   [junit4]   2> 6506604 WARN  (closeThreadPool-19327-thread-1) [    ] o.e.j.s.AbstractConnector Ignoring deprecated socket close linger time
   [junit4]   2> 6506604 INFO  (closeThreadPool-19327-thread-1) [    ] o.a.s.c.s.e.JettySolrRunner Start Jetty (original configured port=0)
   [junit4]   2> 6506604 INFO  (closeThreadPool-19327-thread-1) [    ] o.a.s.c.s.e.JettySolrRunner Trying to start Jetty on port 0 try number 1 ...
   [junit4]   2> 6506604 INFO  (closeThreadPool-19327-thread-1) [    ] o.e.j.s.Server jetty-9.4.14.v20181114; built: 2018-11-14T21:20:31.478Z; git: c4550056e785fb5665914545889f21dc136ad9e6; jvm 11.0.1+13-LTS
   [junit4]   2> 6506605 INFO  (closeThreadPool-19327-thread-1) [    ] o.e.j.s.session DefaultSessionIdManager workerName=node0
   [junit4]   2> 6506605 INFO  (closeThreadPool-19327-thread-1) [    ] o.e.j.s.session No SessionScavenger set, using defaults
   [junit4]   2> 6506605 INFO  (closeThreadPool-19327-thread-1) [    ] o.e.j.s.session node0 Scavenging every 600000ms
   [junit4]   2> 6506606 INFO  (closeThreadPool-19327-thread-1) [    ] o.e.j.s.h.ContextHandler Started o.e.j.s.ServletContextHandler@7e512f3c{/_/u,null,AVAILABLE}
   [junit4]   2> 6506606 INFO  (closeThreadPool-19327-thread-1) [    ] o.e.j.s.AbstractConnector Started ServerConnector@56cf3646{HTTP/1.1,[http/1.1, h2c]}{127.0.0.1:37112}
   [junit4]   2> 6506606 INFO  (closeThreadPool-19327-thread-1) [    ] o.e.j.s.Server Started @6507104ms
   [junit4]   2> 6506606 INFO  (closeThreadPool-19327-thread-1) [    ] o.a.s.c.s.e.JettySolrRunner Jetty properties: {hostContext=/_/u, solrconfig=solrconfig.xml, solr.data.dir=hdfs://lucene2-us-west.apache.org:45359/hdfs__lucene2-us-west.apache.org_45359__home_jenkins_jenkins-slave_workspace_Lucene-Solr-NightlyTests-master_checkout_solr_build_solr-core_test_J1_temp_solr.cloud.hdfs.HdfsChaosMonkeyNothingIsSafeTest_B0F37023B4FB2C09-001_tempDir-002_jetty2, hostPort=37112, coreRootDirectory=/home/jenkins/jenkins-slave/workspace/Lucene-Solr-NightlyTests-master/checkout/solr/build/solr-core/test/J1/../../../../../../../../../../../home/jenkins/jenkins-slave/workspace/Lucene-Solr-NightlyTests-master/checkout/solr/build/solr-core/test/J1/temp/solr.cloud.hdfs.HdfsChaosMonkeyNothingIsSafeTest_B0F37023B4FB2C09-001/shard-2-001/cores, replicaType=NRT}
   [junit4]   2> 6506606 ERROR (closeThreadPool-19327-thread-1) [    ] o.a.s.u.StartupLoggingUtils Missing Java Option solr.log.dir. Logging may be missing or incomplete.
   [junit4]   2> 6506606 INFO  (closeThreadPool-19327-thread-1) [    ] o.a.s.s.SolrDispatchFilter Using logger factory org.apache.logging.slf4j.Log4jLoggerFactory
   [junit4]   2> 6506606 INFO  (closeThreadPool-19327-thread-1) [    ] o.a.s.s.SolrDispatchFilter  ___      _       Welcome to Apache Solr™ version 9.0.0
   [junit4]   2> 6506606 INFO  (closeThreadPool-19327-thread-1) [    ] o.a.s.s.SolrDispatchFilter / __| ___| |_ _   Starting in cloud mode on port null
   [junit4]   2> 6506606 INFO  (closeThreadPool-19327-thread-1) [    ] o.a.s.s.SolrDispatchFilter \__ \/ _ \ | '_|  Install dir: null
   [junit4]   2> 6506606 INFO  (closeThreadPool-19327-thread-1) [    ] o.a.s.s.SolrDispatchFilter |___/\___/_|_|    Start time: 2019-05-17T20:17:48.678721Z
   [junit4]   2> 6506641 INFO  (zkConnectionManagerCallback-19348-thread-1) [    ] o.a.s.c.c.ConnectionManager zkClient has connected
   [junit4]   2> 6506645 INFO  (closeThreadPool-19327-thread-1) [    ] o.a.s.s.SolrDispatchFilter Loading solr.xml from SolrHome (not found in ZooKeeper)
   [junit4]   2> 6506645 INFO  (closeThreadPool-19327-thread-1) [    ] o.a.s.c.SolrXmlConfig Loading container configuration from /home/jenkins/jenkins-slave/workspace/Lucene-Solr-NightlyTests-master/checkout/solr/build/solr-core/test/J1/temp/solr.cloud.hdfs.HdfsChaosMonkeyNothingIsSafeTest_B0F37023B4FB2C09-001/shard-2-001/solr.xml
   [junit4]   2> 6506647 INFO  (closeThreadPool-19327-thread-1) [    ] o.a.s.c.SolrXmlConfig Configuration parameter autoReplicaFailoverWorkLoopDelay is ignored
   [junit4]   2> 6506647 INFO  (closeThreadPool-19327-thread-1) [    ] o.a.s.c.SolrXmlConfig Configuration parameter autoReplicaFailoverBadNodeExpiration is ignored
   [junit4]   2> 6506690 INFO  (closeThreadPool-19327-thread-1) [    ] o.a.s.c.SolrXmlConfig MBean server found: com.sun.jmx.mbeanserver.JmxMBeanServer@105999ac, but no JMX reporters were configured - adding default JMX reporter.
   [junit4]   2> 6507592 INFO  (closeThreadPool-19327-thread-1) [    ] o.a.s.h.c.HttpShardHandlerFactory Host whitelist initialized: WhitelistHostChecker [whitelistHosts=null, whitelistHostCheckingEnabled=false]
   [junit4]   2> 6507608 WARN  (closeThreadPool-19327-thread-1) [    ] o.e.j.u.s.S.config No Client EndPointIdentificationAlgorithm configured for SslContextFactory@6284da83[provider=null,keyStore=null,trustStore=null]
   [junit4]   2> 6507612 WARN  (closeThreadPool-19327-thread-1) [    ] o.e.j.u.s.S.config No Client EndPointIdentificationAlgorithm configured for SslContextFactory@71cf73d7[provider=null,keyStore=null,trustStore=null]
   [junit4]   2> 6507621 INFO  (closeThreadPool-19327-thread-1) [    ] o.a.s.c.ZkContainer Zookeeper client=127.0.0.1:34018/solr
   [junit4]   2> 6507788 INFO  (zkConnectionManagerCallback-19355-thread-1) [    ] o.a.s.c.c.ConnectionManager zkClient has connected
   [junit4]   2> 6507815 INFO  (zkConnectionManagerCallback-19357-thread-1) [    ] o.a.s.c.c.ConnectionManager zkClient has connected
   [junit4]   2> 6507828 INFO  (closeThreadPool-19327-thread-1) [    ] o.a.s.c.c.ZkStateReader Updated live nodes from ZooKeeper... (0) -> (2)
   [junit4]   2> 6507831 INFO  (closeThreadPool-19327-thread-1) [    ] o.a.s.c.ZkController Publish node=127.0.0.1:37112__%2Fu as DOWN
   [junit4]   2> 6507832 INFO  (closeThreadPool-19327-thread-1) [    ] o.a.s.c.TransientSolrCoreCacheDefault Allocating transient cache for 4 transient cores
   [junit4]   2> 6507832 INFO  (closeThreadPool-19327-thread-1) [    ] o.a.s.c.ZkController Register node as live in ZooKeeper:/live_nodes/127.0.0.1:37112__%2Fu
   [junit4]   2> 6507835 INFO  (zkCallback-19313-thread-1) [    ] o.a.s.c.c.ZkStateReader Updated live nodes from ZooKeeper... (2) -> (3)
   [junit4]   2> 6507835 INFO  (zkCallback-19344-thread-1) [    ] o.a.s.c.c.ZkStateReader Updated live nodes from ZooKeeper... (2) -> (3)
   [junit4]   2> 6507843 INFO  (zkCallback-19306-thread-1) [    ] o.a.s.c.c.ZkStateReader Updated live nodes from ZooKeeper... (2) -> (3)
   [junit4]   2> 6507847 INFO  (zkCallback-19337-thread-1) [    ] o.a.s.c.c.ZkStateReader Updated live nodes from ZooKeeper... (2) -> (3)
   [junit4]   2> 6507847 INFO  (zkCallback-19356-thread-1) [    ] o.a.s.c.c.ZkStateReader Updated live nodes from ZooKeeper... (2) -> (3)
   [junit4]   2> 6507851 INFO  (zkCallback-19325-thread-1) [    ] o.a.s.c.c.ZkStateReader Updated live nodes from ZooKeeper... (2) -> (3)
   [junit4]   2> 6507864 INFO  (zkConnectionManagerCallback-19364-thread-1) [    ] o.a.s.c.c.ConnectionManager zkClient has connected
   [junit4]   2> 6507866 INFO  (closeThreadPool-19327-thread-1) [    ] o.a.s.c.c.ZkStateReader Updated live nodes from ZooKeeper... (0) -> (3)
   [junit4]   2> 6507867 INFO  (closeThreadPool-19327-thread-1) [    ] o.a.s.c.s.i.ZkClientClusterStateProvider Cluster at 127.0.0.1:34018/solr ready
   [junit4]   2> 6507944 INFO  (closeThreadPool-19327-thread-1) [    ] o.a.s.h.a.MetricsHistoryHandler No .system collection, keeping metrics history in memory.
   [junit4]   2> 6508015 INFO  (closeThreadPool-19327-thread-1) [    ] o.a.s.m.r.SolrJmxReporter JMX monitoring for 'solr.node' (registry 'solr.node') enabled at server: com.sun.jmx.mbeanserver.JmxMBeanServer@105999ac
   [junit4]   2> 6508072 INFO  (closeThreadPool-19327-thread-1) [    ] o.a.s.m.r.SolrJmxReporter JMX monitoring for 'solr.jvm' (registry 'solr.jvm') enabled at server: com.sun.jmx.mbeanserver.JmxMBeanServer@105999ac
   [junit4]   2> 6508072 INFO  (closeThreadPool-19327-thread-1) [    ] o.a.s.m.r.SolrJmxReporter JMX monitoring for 'solr.jetty' (registry 'solr.jetty') enabled at server: com.sun.jmx.mbeanserver.JmxMBeanServer@105999ac
   [junit4]   2> 6508073 INFO  (closeThreadPool-19327-thread-1) [    ] o.a.s.c.CorePropertiesLocator Found 0 core definitions underneath /home/jenkins/jenkins-slave/workspace/Lucene-Solr-NightlyTests-master/checkout/solr/build/solr-core/test/J1/../../../../../../../../../../../home/jenkins/jenkins-slave/workspace/Lucene-Solr-NightlyTests-master/checkout/solr/build/solr-core/test/J1/temp/solr.cloud.hdfs.HdfsChaosMonkeyNothingIsSafeTest_B0F37023B4FB2C09-001/shard-2-001/cores
   [junit4]   2> 6508671 INFO  (TEST-HdfsChaosMonkeyNothingIsSafeTest.test-seed#[B0F37023B4FB2C09]) [    ] o.a.s.c.AbstractFullDistribZkTestBase create jetty 3 in directory /home/jenkins/jenkins-slave/workspace/Lucene-Solr-NightlyTests-master/checkout/solr/build/solr-core/test/J1/temp/solr.cloud.hdfs.HdfsChaosMonkeyNothingIsSafeTest_B0F37023B4FB2C09-001/shard-3-001 of type NRT
   [junit4]   2> 6508672 WARN  (closeThreadPool-19327-thread-1) [    ] o.e.j.s.AbstractConnector Ignoring deprecated socket close linger time
   [junit4]   2> 6508672 INFO  (closeThreadPool-19327-thread-1) [    ] o.a.s.c.s.e.JettySolrRunner Start Jetty (original configured port=0)
   [junit4]   2> 6508672 INFO  (closeThreadPool-19327-thread-1) [    ] o.a.s.c.s.e.JettySolrRunner Trying to start Jetty on port 0 try number 1 ...
   [junit4]   2> 6508672 INFO  (closeThreadPool-19327-thread-1) [    ] o.e.j.s.Server jetty-9.4.14.v20181114; built: 2018-11-14T21:20:31.478Z; git: c4550056e785fb5665914545889f21dc136ad9e6; jvm 11.0.1+13-LTS
   [junit4]   2> 6508698 INFO  (closeThreadPool-19327-thread-1) [    ] o.e.j.s.session DefaultSessionIdManager workerName=node0
   [junit4]   2> 6508698 INFO  (closeThreadPool-19327-thread-1) [    ] o.e.j.s.session No SessionScavenger set, using defaults
   [junit4]   2> 6508698 INFO  (closeThreadPool-19327-thread-1) [    ] o.e.j.s.session node0 Scavenging every 660000ms
   [junit4]   2> 6508698 INFO  (closeThreadPool-19327-thread-1) [    ] o.e.j.s.h.ContextHandler Started o.e.j.s.ServletContextHandler@68851679{/_/u,null,AVAILABLE}
   [junit4]   2> 6508698 INFO  (closeThreadPool-19327-thread-1) [    ] o.e.j.s.AbstractConnector Started ServerConnector@151250c3{HTTP/1.1,[http/1.1, h2c]}{127.0.0.1:39934}
   [junit4]   2> 6508698 INFO  (closeThreadPool-19327-thread-1) [    ] o.e.j.s.Server Started @6509196ms
   [junit4]   2> 6508698 INFO  (closeThreadPool-19327-thread-1) [    ] o.a.s.c.s.e.JettySolrRunner Jetty properties: {hostContext=/_/u, solrconfig=solrconfig.xml, solr.data.dir=hdfs://lucene2-us-west.apache.org:45359/hdfs__lucene2-us-west.apache.org_45359__home_jenkins_jenk

[...truncated too long message...]

ettings :: file = /home/jenkins/jenkins-slave/workspace/Lucene-Solr-NightlyTests-master/checkout/lucene/top-level-ivy-settings.xml

resolve:

ivy-availability-check:
[loadresource] Do not set property disallowed.ivy.jars.list as its length is 0.

-ivy-fail-disallowed-ivy-version:

ivy-fail:

ivy-configure:
[ivy:configure] :: loading settings :: file = /home/jenkins/jenkins-slave/workspace/Lucene-Solr-NightlyTests-master/checkout/lucene/top-level-ivy-settings.xml

resolve:

ivy-availability-check:
[loadresource] Do not set property disallowed.ivy.jars.list as its length is 0.

-ivy-fail-disallowed-ivy-version:

ivy-fail:

ivy-fail:

ivy-configure:
[ivy:configure] :: loading settings :: file = /home/jenkins/jenkins-slave/workspace/Lucene-Solr-NightlyTests-master/checkout/lucene/top-level-ivy-settings.xml

resolve:

ivy-availability-check:
[loadresource] Do not set property disallowed.ivy.jars.list as its length is 0.

-ivy-fail-disallowed-ivy-version:

ivy-fail:

ivy-configure:
[ivy:configure] :: loading settings :: file = /home/jenkins/jenkins-slave/workspace/Lucene-Solr-NightlyTests-master/checkout/lucene/top-level-ivy-settings.xml

resolve:

ivy-availability-check:
[loadresource] Do not set property disallowed.ivy.jars.list as its length is 0.

-ivy-fail-disallowed-ivy-version:

ivy-fail:

ivy-fail:

ivy-configure:
[ivy:configure] :: loading settings :: file = /home/jenkins/jenkins-slave/workspace/Lucene-Solr-NightlyTests-master/checkout/lucene/top-level-ivy-settings.xml

resolve:

ivy-availability-check:
[loadresource] Do not set property disallowed.ivy.jars.list as its length is 0.

-ivy-fail-disallowed-ivy-version:

ivy-fail:

ivy-fail:

ivy-configure:
[ivy:configure] :: loading settings :: file = /home/jenkins/jenkins-slave/workspace/Lucene-Solr-NightlyTests-master/checkout/lucene/top-level-ivy-settings.xml

resolve:

ivy-availability-check:
[loadresource] Do not set property disallowed.ivy.jars.list as its length is 0.

-ivy-fail-disallowed-ivy-version:

ivy-fail:

ivy-fail:

ivy-configure:
[ivy:configure] :: loading settings :: file = /home/jenkins/jenkins-slave/workspace/Lucene-Solr-NightlyTests-master/checkout/lucene/top-level-ivy-settings.xml

resolve:

ivy-availability-check:
[loadresource] Do not set property disallowed.ivy.jars.list as its length is 0.

-ivy-fail-disallowed-ivy-version:

ivy-fail:

ivy-fail:

ivy-configure:
[ivy:configure] :: loading settings :: file = /home/jenkins/jenkins-slave/workspace/Lucene-Solr-NightlyTests-master/checkout/lucene/top-level-ivy-settings.xml

resolve:

ivy-availability-check:
[loadresource] Do not set property disallowed.ivy.jars.list as its length is 0.

-ivy-fail-disallowed-ivy-version:

ivy-fail:

ivy-fail:

ivy-configure:
[ivy:configure] :: loading settings :: file = /home/jenkins/jenkins-slave/workspace/Lucene-Solr-NightlyTests-master/checkout/lucene/top-level-ivy-settings.xml

resolve:

ivy-availability-check:
[loadresource] Do not set property disallowed.ivy.jars.list as its length is 0.

-ivy-fail-disallowed-ivy-version:

ivy-fail:

ivy-fail:

ivy-configure:
[ivy:configure] :: loading settings :: file = /home/jenkins/jenkins-slave/workspace/Lucene-Solr-NightlyTests-master/checkout/lucene/top-level-ivy-settings.xml

resolve:

ivy-availability-check:
[loadresource] Do not set property disallowed.ivy.jars.list as its length is 0.

-ivy-fail-disallowed-ivy-version:

ivy-fail:

ivy-fail:

ivy-configure:
[ivy:configure] :: loading settings :: file = /home/jenkins/jenkins-slave/workspace/Lucene-Solr-NightlyTests-master/checkout/lucene/top-level-ivy-settings.xml

resolve:

ivy-availability-check:
[loadresource] Do not set property disallowed.ivy.jars.list as its length is 0.

-ivy-fail-disallowed-ivy-version:

ivy-fail:

ivy-fail:

ivy-configure:
[ivy:configure] :: loading settings :: file = /home/jenkins/jenkins-slave/workspace/Lucene-Solr-NightlyTests-master/checkout/lucene/top-level-ivy-settings.xml

resolve:

ivy-availability-check:
[loadresource] Do not set property disallowed.ivy.jars.list as its length is 0.

-ivy-fail-disallowed-ivy-version:

ivy-fail:

ivy-fail:

ivy-configure:
[ivy:configure] :: loading settings :: file = /home/jenkins/jenkins-slave/workspace/Lucene-Solr-NightlyTests-master/checkout/lucene/top-level-ivy-settings.xml

resolve:

ivy-availability-check:
[loadresource] Do not set property disallowed.ivy.jars.list as its length is 0.

-ivy-fail-disallowed-ivy-version:

ivy-fail:

ivy-fail:

ivy-configure:
[ivy:configure] :: loading settings :: file = /home/jenkins/jenkins-slave/workspace/Lucene-Solr-NightlyTests-master/checkout/lucene/top-level-ivy-settings.xml

resolve:

jar-checksums:
    [mkdir] Created dir: /home/jenkins/jenkins-slave/workspace/Lucene-Solr-NightlyTests-master/checkout/solr/null1100710537
     [copy] Copying 240 files to /home/jenkins/jenkins-slave/workspace/Lucene-Solr-NightlyTests-master/checkout/solr/null1100710537
   [delete] Deleting directory /home/jenkins/jenkins-slave/workspace/Lucene-Solr-NightlyTests-master/checkout/solr/null1100710537

check-working-copy:
[ivy:cachepath] :: resolving dependencies :: #;working@lucene2-us-west.apache.org
[ivy:cachepath] 	confs: [default]
[ivy:cachepath] 	found org.eclipse.jgit#org.eclipse.jgit;5.3.0.201903130848-r in public
[ivy:cachepath] 	found com.jcraft#jsch;0.1.54 in public
[ivy:cachepath] 	found com.jcraft#jzlib;1.1.1 in public
[ivy:cachepath] 	found com.googlecode.javaewah#JavaEWAH;1.1.6 in public
[ivy:cachepath] 	found org.slf4j#slf4j-api;1.7.2 in public
[ivy:cachepath] 	found org.bouncycastle#bcpg-jdk15on;1.60 in public
[ivy:cachepath] 	found org.bouncycastle#bcprov-jdk15on;1.60 in public
[ivy:cachepath] 	found org.bouncycastle#bcpkix-jdk15on;1.60 in public
[ivy:cachepath] 	found org.slf4j#slf4j-nop;1.7.2 in public
[ivy:cachepath] :: resolution report :: resolve 76ms :: artifacts dl 5ms
	---------------------------------------------------------------------
	|                  |            modules            ||   artifacts   |
	|       conf       | number| search|dwnlded|evicted|| number|dwnlded|
	---------------------------------------------------------------------
	|      default     |   9   |   0   |   0   |   0   ||   9   |   0   |
	---------------------------------------------------------------------
[wc-checker] Initializing working copy...
[wc-checker] Checking working copy status...

-jenkins-base:

BUILD SUCCESSFUL
Total time: 630 minutes 54 seconds
Archiving artifacts
java.lang.InterruptedException: no matches found within 10000
	at hudson.FilePath$ValidateAntFileMask.hasMatch(FilePath.java:2847)
	at hudson.FilePath$ValidateAntFileMask.invoke(FilePath.java:2726)
	at hudson.FilePath$ValidateAntFileMask.invoke(FilePath.java:2707)
	at hudson.FilePath$FileCallableWrapper.call(FilePath.java:3086)
Also:   hudson.remoting.Channel$CallSiteStackTrace: Remote call to lucene2
		at hudson.remoting.Channel.attachCallSiteStackTrace(Channel.java:1741)
		at hudson.remoting.UserRequest$ExceptionResponse.retrieve(UserRequest.java:357)
		at hudson.remoting.Channel.call(Channel.java:955)
		at hudson.FilePath.act(FilePath.java:1072)
		at hudson.FilePath.act(FilePath.java:1061)
		at hudson.FilePath.validateAntFileMask(FilePath.java:2705)
		at hudson.tasks.ArtifactArchiver.perform(ArtifactArchiver.java:243)
		at hudson.tasks.BuildStepCompatibilityLayer.perform(BuildStepCompatibilityLayer.java:81)
		at hudson.tasks.BuildStepMonitor$1.perform(BuildStepMonitor.java:20)
		at hudson.model.AbstractBuild$AbstractBuildExecution.perform(AbstractBuild.java:744)
		at hudson.model.AbstractBuild$AbstractBuildExecution.performAllBuildSteps(AbstractBuild.java:690)
		at hudson.model.Build$BuildExecution.post2(Build.java:186)
		at hudson.model.AbstractBuild$AbstractBuildExecution.post(AbstractBuild.java:635)
		at hudson.model.Run.execute(Run.java:1835)
		at hudson.model.FreeStyleBuild.run(FreeStyleBuild.java:43)
		at hudson.model.ResourceController.execute(ResourceController.java:97)
		at hudson.model.Executor.run(Executor.java:429)
Caused: hudson.FilePath$TunneledInterruptedException
	at hudson.FilePath$FileCallableWrapper.call(FilePath.java:3088)
	at hudson.remoting.UserRequest.perform(UserRequest.java:212)
	at hudson.remoting.UserRequest.perform(UserRequest.java:54)
	at hudson.remoting.Request$2.run(Request.java:369)
	at hudson.remoting.InterceptingExecutorService$1.call(InterceptingExecutorService.java:72)
	at java.util.concurrent.FutureTask.run(FutureTask.java:266)
	at java.util.concurrent.ThreadPoolExecutor.runWorker(ThreadPoolExecutor.java:1142)
	at java.util.concurrent.ThreadPoolExecutor$Worker.run(ThreadPoolExecutor.java:617)
	at java.lang.Thread.run(Thread.java:748)
Caused: java.lang.InterruptedException: java.lang.InterruptedException: no matches found within 10000
	at hudson.FilePath.act(FilePath.java:1074)
	at hudson.FilePath.act(FilePath.java:1061)
	at hudson.FilePath.validateAntFileMask(FilePath.java:2705)
	at hudson.tasks.ArtifactArchiver.perform(ArtifactArchiver.java:243)
	at hudson.tasks.BuildStepCompatibilityLayer.perform(BuildStepCompatibilityLayer.java:81)
	at hudson.tasks.BuildStepMonitor$1.perform(BuildStepMonitor.java:20)
	at hudson.model.AbstractBuild$AbstractBuildExecution.perform(AbstractBuild.java:744)
	at hudson.model.AbstractBuild$AbstractBuildExecution.performAllBuildSteps(AbstractBuild.java:690)
	at hudson.model.Build$BuildExecution.post2(Build.java:186)
	at hudson.model.AbstractBuild$AbstractBuildExecution.post(AbstractBuild.java:635)
	at hudson.model.Run.execute(Run.java:1835)
	at hudson.model.FreeStyleBuild.run(FreeStyleBuild.java:43)
	at hudson.model.ResourceController.execute(ResourceController.java:97)
	at hudson.model.Executor.run(Executor.java:429)
No artifacts found that match the file pattern "**/*.events,heapdumps/**,**/hs_err_pid*". Configuration error?
Recording test results
Build step 'Publish JUnit test result report' changed build result to UNSTABLE
Email was triggered for: Unstable (Test Failures)
Sending email for trigger: Unstable (Test Failures)

Mime
View raw message