lucene-dev mailing list archives

Site index · List index
Message view « Date » · « Thread »
Top « Date » · « Thread »
From Policeman Jenkins Server <jenk...@thetaphi.de>
Subject [JENKINS-EA] Lucene-Solr-BadApples-master-Linux (64bit/jdk-13-ea+shipilev-fastdebug) - Build # 207 - Unstable!
Date Sat, 18 May 2019 05:09:14 GMT
Build: https://jenkins.thetaphi.de/job/Lucene-Solr-BadApples-master-Linux/207/
Java: 64bit/jdk-13-ea+shipilev-fastdebug -XX:+UseCompressedOops -XX:+UseSerialGC

1 tests failed.
FAILED:  org.apache.solr.metrics.rrd.SolrRrdBackendFactoryTest.testBasic

Error Message:
{} expected:<1> but was:<0>

Stack Trace:
java.lang.AssertionError: {} expected:<1> but was:<0>
	at __randomizedtesting.SeedInfo.seed([DDDDF199399AD84:A627C20C4C452BAA]:0)
	at org.junit.Assert.fail(Assert.java:88)
	at org.junit.Assert.failNotEquals(Assert.java:834)
	at org.junit.Assert.assertEquals(Assert.java:645)
	at org.apache.solr.metrics.rrd.SolrRrdBackendFactoryTest.testBasic(SolrRrdBackendFactoryTest.java:94)
	at java.base/jdk.internal.reflect.NativeMethodAccessorImpl.invoke0(Native Method)
	at java.base/jdk.internal.reflect.NativeMethodAccessorImpl.invoke(NativeMethodAccessorImpl.java:62)
	at java.base/jdk.internal.reflect.DelegatingMethodAccessorImpl.invoke(DelegatingMethodAccessorImpl.java:43)
	at java.base/java.lang.reflect.Method.invoke(Method.java:567)
	at com.carrotsearch.randomizedtesting.RandomizedRunner.invoke(RandomizedRunner.java:1750)
	at com.carrotsearch.randomizedtesting.RandomizedRunner$8.evaluate(RandomizedRunner.java:938)
	at com.carrotsearch.randomizedtesting.RandomizedRunner$9.evaluate(RandomizedRunner.java:974)
	at com.carrotsearch.randomizedtesting.RandomizedRunner$10.evaluate(RandomizedRunner.java:988)
	at com.carrotsearch.randomizedtesting.rules.SystemPropertiesRestoreRule$1.evaluate(SystemPropertiesRestoreRule.java:57)
	at org.apache.lucene.util.TestRuleSetupTeardownChained$1.evaluate(TestRuleSetupTeardownChained.java:49)
	at org.apache.lucene.util.AbstractBeforeAfterRule$1.evaluate(AbstractBeforeAfterRule.java:45)
	at org.apache.lucene.util.TestRuleThreadAndTestName$1.evaluate(TestRuleThreadAndTestName.java:48)
	at org.apache.lucene.util.TestRuleIgnoreAfterMaxFailures$1.evaluate(TestRuleIgnoreAfterMaxFailures.java:64)
	at org.apache.lucene.util.TestRuleMarkFailure$1.evaluate(TestRuleMarkFailure.java:47)
	at com.carrotsearch.randomizedtesting.rules.StatementAdapter.evaluate(StatementAdapter.java:36)
	at com.carrotsearch.randomizedtesting.ThreadLeakControl$StatementRunner.run(ThreadLeakControl.java:368)
	at com.carrotsearch.randomizedtesting.ThreadLeakControl.forkTimeoutingTask(ThreadLeakControl.java:817)
	at com.carrotsearch.randomizedtesting.ThreadLeakControl$3.evaluate(ThreadLeakControl.java:468)
	at com.carrotsearch.randomizedtesting.RandomizedRunner.runSingleTest(RandomizedRunner.java:947)
	at com.carrotsearch.randomizedtesting.RandomizedRunner$5.evaluate(RandomizedRunner.java:832)
	at com.carrotsearch.randomizedtesting.RandomizedRunner$6.evaluate(RandomizedRunner.java:883)
	at com.carrotsearch.randomizedtesting.RandomizedRunner$7.evaluate(RandomizedRunner.java:894)
	at com.carrotsearch.randomizedtesting.rules.StatementAdapter.evaluate(StatementAdapter.java:36)
	at com.carrotsearch.randomizedtesting.rules.SystemPropertiesRestoreRule$1.evaluate(SystemPropertiesRestoreRule.java:57)
	at org.apache.lucene.util.AbstractBeforeAfterRule$1.evaluate(AbstractBeforeAfterRule.java:45)
	at com.carrotsearch.randomizedtesting.rules.StatementAdapter.evaluate(StatementAdapter.java:36)
	at org.apache.lucene.util.TestRuleStoreClassName$1.evaluate(TestRuleStoreClassName.java:41)
	at com.carrotsearch.randomizedtesting.rules.NoShadowingOrOverridesOnMethodsRule$1.evaluate(NoShadowingOrOverridesOnMethodsRule.java:40)
	at com.carrotsearch.randomizedtesting.rules.NoShadowingOrOverridesOnMethodsRule$1.evaluate(NoShadowingOrOverridesOnMethodsRule.java:40)
	at com.carrotsearch.randomizedtesting.rules.StatementAdapter.evaluate(StatementAdapter.java:36)
	at com.carrotsearch.randomizedtesting.rules.StatementAdapter.evaluate(StatementAdapter.java:36)
	at org.apache.lucene.util.TestRuleAssertionsRequired$1.evaluate(TestRuleAssertionsRequired.java:53)
	at org.apache.lucene.util.TestRuleMarkFailure$1.evaluate(TestRuleMarkFailure.java:47)
	at org.apache.lucene.util.TestRuleIgnoreAfterMaxFailures$1.evaluate(TestRuleIgnoreAfterMaxFailures.java:64)
	at org.apache.lucene.util.TestRuleIgnoreTestSuites$1.evaluate(TestRuleIgnoreTestSuites.java:54)
	at com.carrotsearch.randomizedtesting.rules.StatementAdapter.evaluate(StatementAdapter.java:36)
	at com.carrotsearch.randomizedtesting.ThreadLeakControl$StatementRunner.run(ThreadLeakControl.java:368)
	at java.base/java.lang.Thread.run(Thread.java:830)




Build Log:
[...truncated 14816 lines...]
   [junit4] Suite: org.apache.solr.metrics.rrd.SolrRrdBackendFactoryTest
   [junit4]   2> Creating dataDir: /home/jenkins/workspace/Lucene-Solr-BadApples-master-Linux/solr/build/solr-core/test/J2/temp/solr.metrics.rrd.SolrRrdBackendFactoryTest_DDDDF199399AD84-001/init-core-data-001
   [junit4]   2> 3535776 INFO  (SUITE-SolrRrdBackendFactoryTest-seed#[DDDDF199399AD84]-worker)
[    ] o.a.s.SolrTestCaseJ4 SecureRandom sanity checks: test.solr.allowed.securerandom=null
& java.security.egd=file:/dev/./urandom
   [junit4]   2> 3535778 WARN  (SUITE-SolrRrdBackendFactoryTest-seed#[DDDDF199399AD84]-worker)
[    ] o.a.s.SolrTestCaseJ4 startTrackingSearchers: numOpens=66 numCloses=66
   [junit4]   2> 3535778 INFO  (SUITE-SolrRrdBackendFactoryTest-seed#[DDDDF199399AD84]-worker)
[    ] o.a.s.SolrTestCaseJ4 Using TrieFields (NUMERIC_POINTS_SYSPROP=false) w/NUMERIC_DOCVALUES_SYSPROP=false
   [junit4]   2> 3535779 INFO  (SUITE-SolrRrdBackendFactoryTest-seed#[DDDDF199399AD84]-worker)
[    ] o.a.s.SolrTestCaseJ4 Randomized ssl (false) and clientAuth (true) via: @org.apache.solr.util.RandomizeSSL(reason="",
value=0.0/0.0, ssl=0.0/0.0, clientAuth=0.0/0.0)
   [junit4]   2> 3535822 INFO  (TEST-SolrRrdBackendFactoryTest.testBasic-seed#[DDDDF199399AD84])
[    ] o.a.s.SolrTestCaseJ4 ###Starting testBasic
   [junit4]   2> 3535823 DEBUG (TEST-SolrRrdBackendFactoryTest.testBasic-seed#[DDDDF199399AD84])
[    ] o.a.s.m.r.SolrRrdBackendFactory Created 1221873054
   [junit4]   2> 3535846 DEBUG (SolrRrdBackendFactory-14036-thread-1) [    ] o.a.s.m.r.SolrRrdBackendFactory
-- maybe sync backends: [foo]
   [junit4]   2> 3535846 DEBUG (SolrRrdBackendFactory-14036-thread-1) [    ] o.a.s.m.r.SolrRrdBackendFactory
-- syncing [foo]
   [junit4]   2> 3535908 DEBUG (TEST-SolrRrdBackendFactoryTest.testBasic-seed#[DDDDF199399AD84])
[    ] o.a.s.m.r.SolrRrdBackendFactory Closing 1221873054
   [junit4]   2> 3535908 INFO  (TEST-SolrRrdBackendFactoryTest.testBasic-seed#[DDDDF199399AD84])
[    ] o.a.s.SolrTestCaseJ4 ###Ending testBasic
   [junit4]   2> NOTE: reproduce with: ant test  -Dtestcase=SolrRrdBackendFactoryTest -Dtests.method=testBasic
-Dtests.seed=DDDDF199399AD84 -Dtests.multiplier=3 -Dtests.slow=true -Dtests.badapples=true
-Dtests.locale=en-GH -Dtests.timezone=Asia/Chungking -Dtests.asserts=true -Dtests.file.encoding=ISO-8859-1
   [junit4] FAILURE 0.20s J2 | SolrRrdBackendFactoryTest.testBasic <<<
   [junit4]    > Throwable #1: java.lang.AssertionError: {} expected:<1> but was:<0>
   [junit4]    > 	at __randomizedtesting.SeedInfo.seed([DDDDF199399AD84:A627C20C4C452BAA]:0)
   [junit4]    > 	at org.apache.solr.metrics.rrd.SolrRrdBackendFactoryTest.testBasic(SolrRrdBackendFactoryTest.java:94)
   [junit4]    > 	at java.base/jdk.internal.reflect.NativeMethodAccessorImpl.invoke0(Native
Method)
   [junit4]    > 	at java.base/jdk.internal.reflect.NativeMethodAccessorImpl.invoke(NativeMethodAccessorImpl.java:62)
   [junit4]    > 	at java.base/jdk.internal.reflect.DelegatingMethodAccessorImpl.invoke(DelegatingMethodAccessorImpl.java:43)
   [junit4]    > 	at java.base/java.lang.reflect.Method.invoke(Method.java:567)
   [junit4]    > 	at java.base/java.lang.Thread.run(Thread.java:830)
   [junit4]   2> NOTE: leaving temporary files on disk at: /home/jenkins/workspace/Lucene-Solr-BadApples-master-Linux/solr/build/solr-core/test/J2/temp/solr.metrics.rrd.SolrRrdBackendFactoryTest_DDDDF199399AD84-001
   [junit4]   2> NOTE: test params are: codec=CheapBastard, sim=Asserting(org.apache.lucene.search.similarities.AssertingSimilarity@58e2fc1f),
locale=en-GH, timezone=Asia/Chungking
   [junit4]   2> NOTE: Linux 4.18.0-17-generic amd64/Aleksey Shipilev 13-testing (64-bit)/cpus=8,threads=1,free=229527368,total=518979584
   [junit4]   2> NOTE: All tests run in this JVM: [TestFaceting, ExecutePlanActionTest,
SolrMetricsIntegrationTest, TestManagedSynonymFilterFactory, PeerSyncWithBufferUpdatesTest,
AutoAddReplicasPlanActionTest, TestDefaultStatsCache, TestCloudSearcherWarming, TestSortableTextField,
MoveReplicaTest, TestAuthenticationFramework, TestAnalyzeInfixSuggestions, V2ApiIntegrationTest,
TestMinHashQParser, SSLMigrationTest, TestSimpleQParserPlugin, TestStreamBody, TestJoin, AuditLoggerPluginTest,
NodeLostTriggerTest, HdfsLockFactoryTest, SolrIndexSplitterTest, ResponseLogComponentTest,
CustomHighlightComponentTest, TestSolrConfigHandlerCloud, TestMiniSolrCloudClusterSSL, CdcrUpdateLogTest,
TestRandomRequestDistribution, SearchRateTriggerIntegrationTest, TestSystemIdResolver, TestCoreBackup,
InfoHandlerTest, TestTolerantUpdateProcessorCloud, HighlighterTest, HttpPartitionWithTlogReplicasTest,
TestScoreJoinQPNoScore, TestFieldTypeCollectionResource, TestCharFilters, TestSuggestSpellingConverter,
TestReplicaProperties, TestSolrCloudWithKerberosAlt, ZkCLITest, DateRangeFieldTest, TestReversedWildcardFilterFactory,
TestLazyCores, ConvertedLegacyTest, HdfsThreadLeakTest, TestQuerySenderListener, TestSortByMinMaxFunction,
RequestLoggingTest, CollectionsAPISolrJTest, ZkNodePropsTest, TestCoreAdminApis, SmileWriterTest,
TestSolrXml, SplitShardTest, TimeZoneUtilsTest, ZkStateReaderTest, BaseCdcrDistributedZkTest,
RangeFacetCloudTest, BlobRepositoryCloudTest, PhrasesIdentificationComponentTest, TestClassicSimilarityFactory,
TestEmbeddedSolrServerSchemaAPI, TestDistributedGrouping, FieldMutatingUpdateProcessorTest,
TestCorePropertiesReload, TestCloudInspectUtil, HdfsChaosMonkeySafeLeaderTest, PluginInfoTest,
PropertiesRequestHandlerTest, DeleteInactiveReplicaTest, TestMacroExpander, TestSolrCloudSnapshots,
MergeStrategyTest, AssignBackwardCompatibilityTest, IndexSchemaRuntimeFieldTest, TestComponentsName,
TestDynamicFieldResource, LeaderElectionTest, CurrencyRangeFacetCloudTest, TestSolrDeletionPolicy1,
DocumentBuilderTest, JsonLoaderTest, SolrShardReporterTest, SolrJmxReporterTest, TestStandardQParsers,
ReplaceNodeNoTargetTest, MissingSegmentRecoveryTest, TestBlobHandler, HttpSolrCallGetCoreTest,
MetricsHistoryIntegrationTest, TestRangeQuery, RecoveryZkTest, FastVectorHighlighterTest,
TestDocumentBuilder, TestCollationFieldDocValues, TestRecovery, TriggerIntegrationTest, TestCollapseQParserPlugin,
IndexSizeTriggerTest, DistributedDebugComponentTest, TestSolrQueryResponse, NotRequiredUniqueKeyTest,
TestFunctionQuery, TestHighFrequencyDictionaryFactory, ActionThrottleTest, TestZkAclsWithHadoopAuth,
DefaultValueUpdateProcessorTest, TestSimpleTrackingShardHandler, TestIBSimilarityFactory,
TestLogWatcher, TestConfigOverlay, BadIndexSchemaTest, TestSlowCompositeReaderWrapper, DistributedQueueTest,
PeerSyncWithLeaderTest, TestRTimerTree, DistribCursorPagingTest, HLLSerializationTest, TestFoldingMultitermQuery,
BlockJoinFacetDistribTest, TestCloudPseudoReturnFields, DeleteReplicaTest, TemplateUpdateProcessorTest,
SolrCoreMetricManagerTest, TestXmlQParser, TestExactStatsCache, CSVRequestHandlerTest, XsltUpdateRequestHandlerTest,
DistributedSpellCheckComponentTest, HealthCheckHandlerTest, SchemaVersionSpecificBehaviorTest,
TestCustomDocTransformer, ShowFileRequestHandlerTest, ClassificationUpdateProcessorIntegrationTest,
SuggesterTSTTest, RestartWhileUpdatingTest, CopyFieldTest, TestPolicyCloud, TestUninvertingReader,
CursorPagingTest, DisMaxRequestHandlerTest, DistributedIntervalFacetingTest, EchoParamsTest,
MinimalSchemaTest, OutputWriterTest, SampleTest, SolrTestCaseJ4Test, TestSolrCoreProperties,
TestTolerantSearch, TestTrie, TestWordDelimiterFilterFactory, TokenizerChainTest, TestLuceneIndexBackCompat,
BasicDistributedZkTest, ChaosMonkeySafeLeaderWithPullReplicasTest, DistributedVersionInfoTest,
LeaderTragicEventTest, MultiSolrCloudTestCaseTest, MultiThreadedOCPTest, TestConfigSetsAPIExclusivity,
TestDeleteCollectionOnDownNodes, TestDistribDocBasedVersion, TestDistributedMap, TestDownShardTolerantSearch,
TestHashPartitioner, TestPrepRecovery, TestShortCircuitedRequests, TestSizeLimitedDistributedMap,
TestSolrCloudWithSecureImpersonation, TestStressCloudBlindAtomicUpdates, ZkSolrClientTest,
CollectionTooManyReplicasTest, CollectionsAPIDistributedZkTest, TestCollectionsAPIViaSolrCloudCluster,
MetricTriggerIntegrationTest, NodeMarkersRegistrationTest, RestoreTriggerStateTest, TestSimComputePlanAction,
TestSimDistribStateManager, TestSimExecutePlanAction, TestSimExtremeIndexing, TestSimGenericDistributedQueue,
TestSimNodeAddedTrigger, TestSimNodeLostTrigger, TestSimPolicyCloud, CdcrBidirectionalTest,
CdcrBootstrapTest, CdcrOpsAndBoundariesTest, CdcrReplicationHandlerTest, CdcrRequestHandlerTest,
CdcrVersionReplicationTest, CdcrWithNodesRestartsTest, HDFSCollectionsAPITest, ConfigureRecoveryStrategyTest,
CoreSorterTest, DirectoryFactoryTest, QueryResultKeyTest, RAMDirectoryFactoryTest, RequestHandlersTest,
ResourceLoaderTest, SOLR749Test, SolrCoreCheckLockOnStartupTest, TestBackupRepositoryFactory,
TestBadConfig, TestDirectoryFactory, TestDynamicLoading, TestReplicationHandler, DistributedFacetPivotLongTailTest,
DistributedMLTComponentTest, DistributedSuggestComponentTest, ShufflingReplicaListTransformerTest,
SpellCheckComponentTest, SuggestComponentTest, TermVectorComponentTest, TermsComponentTest,
TestExpandComponent, TestPivotHelperCode, TestTrackingShardHandlerFactory, Tagger2Test, UninvertDocValuesMergePolicyTest,
TestLegacyField, TestLegacyFieldReuse, TestLegacyNumericUtils, TestLegacyTerms, TestMultiValuedNumericRangeQuery,
TestNumericRangeQuery32, SolrRrdBackendFactoryTest]
   [junit4] Completed [653/858 (1!)] on J2 in 2.03s, 1 test, 1 failure <<< FAILURES!

[...truncated 43823 lines...]
[repro] Jenkins log URL: https://jenkins.thetaphi.de/job/Lucene-Solr-BadApples-master-Linux/207/consoleText

[repro] Revision: 18cb42ee80854e2159201fe550b13d894425a4f8

[repro] Repro line:  ant test  -Dtestcase=SolrRrdBackendFactoryTest -Dtests.method=testBasic
-Dtests.seed=DDDDF199399AD84 -Dtests.multiplier=3 -Dtests.slow=true -Dtests.badapples=true
-Dtests.locale=en-GH -Dtests.timezone=Asia/Chungking -Dtests.asserts=true -Dtests.file.encoding=ISO-8859-1

[repro] ant clean

[...truncated 6 lines...]
[repro] Test suites by module:
[repro]    solr/core
[repro]       SolrRrdBackendFactoryTest
[repro] ant compile-test

[...truncated 3309 lines...]
[repro] ant test-nocompile -Dtests.dups=5 -Dtests.maxfailures=5 -Dtests.class="*.SolrRrdBackendFactoryTest"
-Dtests.showOutput=onerror  -Dtests.seed=DDDDF199399AD84 -Dtests.multiplier=3 -Dtests.slow=true
-Dtests.badapples=true -Dtests.locale=en-GH -Dtests.timezone=Asia/Chungking -Dtests.asserts=true
-Dtests.file.encoding=ISO-8859-1

[...truncated 75 lines...]
[repro] Failures:
[repro]   0/5 failed: org.apache.solr.metrics.rrd.SolrRrdBackendFactoryTest
[repro] Exiting with code 0

[...truncated 43 lines...]

Mime
View raw message