lucene-dev mailing list archives

Site index · List index
Message view « Date » · « Thread »
Top « Date » · « Thread »
From Apache Jenkins Server <jenk...@builds.apache.org>
Subject [JENKINS] Lucene-Solr-BadApples-Tests-8.x - Build # 104 - Still Failing
Date Sat, 18 May 2019 05:37:00 GMT
Build: https://builds.apache.org/job/Lucene-Solr-BadApples-Tests-8.x/104/

2 tests failed.
FAILED:  junit.framework.TestSuite.org.apache.solr.handler.TestReplicationHandler

Error Message:
ObjectTracker found 4 object(s) that were not released!!! [SolrCore, MockDirectoryWrapper, InternalHttpClient, MockDirectoryWrapper] org.apache.solr.common.util.ObjectReleaseTracker$ObjectTrackerException: org.apache.solr.core.SolrCore  at org.apache.solr.common.util.ObjectReleaseTracker.track(ObjectReleaseTracker.java:42)  at org.apache.solr.core.SolrCore.<init>(SolrCore.java:1063)  at org.apache.solr.core.SolrCore.<init>(SolrCore.java:883)  at org.apache.solr.core.CoreContainer.createFromDescriptor(CoreContainer.java:1238)  at org.apache.solr.core.CoreContainer.lambda$load$13(CoreContainer.java:749)  at com.codahale.metrics.InstrumentedExecutorService$InstrumentedCallable.call(InstrumentedExecutorService.java:202)  at java.util.concurrent.FutureTask.run(FutureTask.java:266)  at org.apache.solr.common.util.ExecutorUtil$MDCAwareThreadPoolExecutor.lambda$execute$0(ExecutorUtil.java:209)  at java.util.concurrent.ThreadPoolExecutor.runWorker(ThreadPoolExecutor.java:1149)  at java.util.concurrent.ThreadPoolExecutor$Worker.run(ThreadPoolExecutor.java:624)  at java.lang.Thread.run(Thread.java:748)  org.apache.solr.common.util.ObjectReleaseTracker$ObjectTrackerException: org.apache.lucene.store.MockDirectoryWrapper  at org.apache.solr.common.util.ObjectReleaseTracker.track(ObjectReleaseTracker.java:42)  at org.apache.solr.core.CachingDirectoryFactory.get(CachingDirectoryFactory.java:348)  at org.apache.solr.core.SolrCore.initSnapshotMetaDataManager(SolrCore.java:517)  at org.apache.solr.core.SolrCore.<init>(SolrCore.java:968)  at org.apache.solr.core.SolrCore.<init>(SolrCore.java:883)  at org.apache.solr.core.CoreContainer.createFromDescriptor(CoreContainer.java:1238)  at org.apache.solr.core.CoreContainer.lambda$load$13(CoreContainer.java:749)  at com.codahale.metrics.InstrumentedExecutorService$InstrumentedCallable.call(InstrumentedExecutorService.java:202)  at java.util.concurrent.FutureTask.run(FutureTask.java:266)  at org.apache.solr.common.util.ExecutorUtil$MDCAwareThreadPoolExecutor.lambda$execute$0(ExecutorUtil.java:209)  at java.util.concurrent.ThreadPoolExecutor.runWorker(ThreadPoolExecutor.java:1149)  at java.util.concurrent.ThreadPoolExecutor$Worker.run(ThreadPoolExecutor.java:624)  at java.lang.Thread.run(Thread.java:748)  org.apache.solr.common.util.ObjectReleaseTracker$ObjectTrackerException: org.apache.http.impl.client.InternalHttpClient  at org.apache.solr.common.util.ObjectReleaseTracker.track(ObjectReleaseTracker.java:42)  at org.apache.solr.client.solrj.impl.HttpClientUtil.createClient(HttpClientUtil.java:321)  at org.apache.solr.client.solrj.impl.HttpClientUtil.createClient(HttpClientUtil.java:330)  at org.apache.solr.handler.IndexFetcher.createHttpClient(IndexFetcher.java:230)  at org.apache.solr.handler.IndexFetcher.<init>(IndexFetcher.java:272)  at org.apache.solr.handler.ReplicationHandler.inform(ReplicationHandler.java:1224)  at org.apache.solr.core.SolrResourceLoader.inform(SolrResourceLoader.java:696)  at org.apache.solr.core.SolrCore.<init>(SolrCore.java:1009)  at org.apache.solr.core.SolrCore.<init>(SolrCore.java:883)  at org.apache.solr.core.CoreContainer.createFromDescriptor(CoreContainer.java:1238)  at org.apache.solr.core.CoreContainer.lambda$load$13(CoreContainer.java:749)  at com.codahale.metrics.InstrumentedExecutorService$InstrumentedCallable.call(InstrumentedExecutorService.java:202)  at java.util.concurrent.FutureTask.run(FutureTask.java:266)  at org.apache.solr.common.util.ExecutorUtil$MDCAwareThreadPoolExecutor.lambda$execute$0(ExecutorUtil.java:209)  at java.util.concurrent.ThreadPoolExecutor.runWorker(ThreadPoolExecutor.java:1149)  at java.util.concurrent.ThreadPoolExecutor$Worker.run(ThreadPoolExecutor.java:624)  at java.lang.Thread.run(Thread.java:748)  org.apache.solr.common.util.ObjectReleaseTracker$ObjectTrackerException: org.apache.lucene.store.MockDirectoryWrapper  at org.apache.solr.common.util.ObjectReleaseTracker.track(ObjectReleaseTracker.java:42)  at org.apache.solr.core.CachingDirectoryFactory.get(CachingDirectoryFactory.java:348)  at org.apache.solr.update.SolrIndexWriter.create(SolrIndexWriter.java:99)  at org.apache.solr.core.SolrCore.initIndex(SolrCore.java:779)  at org.apache.solr.core.SolrCore.<init>(SolrCore.java:976)  at org.apache.solr.core.SolrCore.<init>(SolrCore.java:883)  at org.apache.solr.core.CoreContainer.createFromDescriptor(CoreContainer.java:1238)  at org.apache.solr.core.CoreContainer.lambda$load$13(CoreContainer.java:749)  at com.codahale.metrics.InstrumentedExecutorService$InstrumentedCallable.call(InstrumentedExecutorService.java:202)  at java.util.concurrent.FutureTask.run(FutureTask.java:266)  at org.apache.solr.common.util.ExecutorUtil$MDCAwareThreadPoolExecutor.lambda$execute$0(ExecutorUtil.java:209)  at java.util.concurrent.ThreadPoolExecutor.runWorker(ThreadPoolExecutor.java:1149)  at java.util.concurrent.ThreadPoolExecutor$Worker.run(ThreadPoolExecutor.java:624)  at java.lang.Thread.run(Thread.java:748)   expected null, but was:<ObjectTracker found 4 object(s) that were not released!!! [SolrCore, MockDirectoryWrapper, InternalHttpClient, MockDirectoryWrapper] org.apache.solr.common.util.ObjectReleaseTracker$ObjectTrackerException: org.apache.solr.core.SolrCore  at org.apache.solr.common.util.ObjectReleaseTracker.track(ObjectReleaseTracker.java:42)  at org.apache.solr.core.SolrCore.<init>(SolrCore.java:1063)  at org.apache.solr.core.SolrCore.<init>(SolrCore.java:883)  at org.apache.solr.core.CoreContainer.createFromDescriptor(CoreContainer.java:1238)  at org.apache.solr.core.CoreContainer.lambda$load$13(CoreContainer.java:749)  at com.codahale.metrics.InstrumentedExecutorService$InstrumentedCallable.call(InstrumentedExecutorService.java:202)  at java.util.concurrent.FutureTask.run(FutureTask.java:266)  at org.apache.solr.common.util.ExecutorUtil$MDCAwareThreadPoolExecutor.lambda$execute$0(ExecutorUtil.java:209)  at java.util.concurrent.ThreadPoolExecutor.runWorker(ThreadPoolExecutor.java:1149)  at java.util.concurrent.ThreadPoolExecutor$Worker.run(ThreadPoolExecutor.java:624)  at java.lang.Thread.run(Thread.java:748)  org.apache.solr.common.util.ObjectReleaseTracker$ObjectTrackerException: org.apache.lucene.store.MockDirectoryWrapper  at org.apache.solr.common.util.ObjectReleaseTracker.track(ObjectReleaseTracker.java:42)  at org.apache.solr.core.CachingDirectoryFactory.get(CachingDirectoryFactory.java:348)  at org.apache.solr.core.SolrCore.initSnapshotMetaDataManager(SolrCore.java:517)  at org.apache.solr.core.SolrCore.<init>(SolrCore.java:968)  at org.apache.solr.core.SolrCore.<init>(SolrCore.java:883)  at org.apache.solr.core.CoreContainer.createFromDescriptor(CoreContainer.java:1238)  at org.apache.solr.core.CoreContainer.lambda$load$13(CoreContainer.java:749)  at com.codahale.metrics.InstrumentedExecutorService$InstrumentedCallable.call(InstrumentedExecutorService.java:202)  at java.util.concurrent.FutureTask.run(FutureTask.java:266)  at org.apache.solr.common.util.ExecutorUtil$MDCAwareThreadPoolExecutor.lambda$execute$0(ExecutorUtil.java:209)  at java.util.concurrent.ThreadPoolExecutor.runWorker(ThreadPoolExecutor.java:1149)  at java.util.concurrent.ThreadPoolExecutor$Worker.run(ThreadPoolExecutor.java:624)  at java.lang.Thread.run(Thread.java:748)  org.apache.solr.common.util.ObjectReleaseTracker$ObjectTrackerException: org.apache.http.impl.client.InternalHttpClient  at org.apache.solr.common.util.ObjectReleaseTracker.track(ObjectReleaseTracker.java:42)  at org.apache.solr.client.solrj.impl.HttpClientUtil.createClient(HttpClientUtil.java:321)  at org.apache.solr.client.solrj.impl.HttpClientUtil.createClient(HttpClientUtil.java:330)  at org.apache.solr.handler.IndexFetcher.createHttpClient(IndexFetcher.java:230)  at org.apache.solr.handler.IndexFetcher.<init>(IndexFetcher.java:272)  at org.apache.solr.handler.ReplicationHandler.inform(ReplicationHandler.java:1224)  at org.apache.solr.core.SolrResourceLoader.inform(SolrResourceLoader.java:696)  at org.apache.solr.core.SolrCore.<init>(SolrCore.java:1009)  at org.apache.solr.core.SolrCore.<init>(SolrCore.java:883)  at org.apache.solr.core.CoreContainer.createFromDescriptor(CoreContainer.java:1238)  at org.apache.solr.core.CoreContainer.lambda$load$13(CoreContainer.java:749)  at com.codahale.metrics.InstrumentedExecutorService$InstrumentedCallable.call(InstrumentedExecutorService.java:202)  at java.util.concurrent.FutureTask.run(FutureTask.java:266)  at org.apache.solr.common.util.ExecutorUtil$MDCAwareThreadPoolExecutor.lambda$execute$0(ExecutorUtil.java:209)  at java.util.concurrent.ThreadPoolExecutor.runWorker(ThreadPoolExecutor.java:1149)  at java.util.concurrent.ThreadPoolExecutor$Worker.run(ThreadPoolExecutor.java:624)  at java.lang.Thread.run(Thread.java:748)  org.apache.solr.common.util.ObjectReleaseTracker$ObjectTrackerException: org.apache.lucene.store.MockDirectoryWrapper  at org.apache.solr.common.util.ObjectReleaseTracker.track(ObjectReleaseTracker.java:42)  at org.apache.solr.core.CachingDirectoryFactory.get(CachingDirectoryFactory.java:348)  at org.apache.solr.update.SolrIndexWriter.create(SolrIndexWriter.java:99)  at org.apache.solr.core.SolrCore.initIndex(SolrCore.java:779)  at org.apache.solr.core.SolrCore.<init>(SolrCore.java:976)  at org.apache.solr.core.SolrCore.<init>(SolrCore.java:883)  at org.apache.solr.core.CoreContainer.createFromDescriptor(CoreContainer.java:1238)  at org.apache.solr.core.CoreContainer.lambda$load$13(CoreContainer.java:749)  at com.codahale.metrics.InstrumentedExecutorService$InstrumentedCallable.call(InstrumentedExecutorService.java:202)  at java.util.concurrent.FutureTask.run(FutureTask.java:266)  at org.apache.solr.common.util.ExecutorUtil$MDCAwareThreadPoolExecutor.lambda$execute$0(ExecutorUtil.java:209)  at java.util.concurrent.ThreadPoolExecutor.runWorker(ThreadPoolExecutor.java:1149)  at java.util.concurrent.ThreadPoolExecutor$Worker.run(ThreadPoolExecutor.java:624)  at java.lang.Thread.run(Thread.java:748)  >

Stack Trace:
java.lang.AssertionError: ObjectTracker found 4 object(s) that were not released!!! [SolrCore, MockDirectoryWrapper, InternalHttpClient, MockDirectoryWrapper]
org.apache.solr.common.util.ObjectReleaseTracker$ObjectTrackerException: org.apache.solr.core.SolrCore
	at org.apache.solr.common.util.ObjectReleaseTracker.track(ObjectReleaseTracker.java:42)
	at org.apache.solr.core.SolrCore.<init>(SolrCore.java:1063)
	at org.apache.solr.core.SolrCore.<init>(SolrCore.java:883)
	at org.apache.solr.core.CoreContainer.createFromDescriptor(CoreContainer.java:1238)
	at org.apache.solr.core.CoreContainer.lambda$load$13(CoreContainer.java:749)
	at com.codahale.metrics.InstrumentedExecutorService$InstrumentedCallable.call(InstrumentedExecutorService.java:202)
	at java.util.concurrent.FutureTask.run(FutureTask.java:266)
	at org.apache.solr.common.util.ExecutorUtil$MDCAwareThreadPoolExecutor.lambda$execute$0(ExecutorUtil.java:209)
	at java.util.concurrent.ThreadPoolExecutor.runWorker(ThreadPoolExecutor.java:1149)
	at java.util.concurrent.ThreadPoolExecutor$Worker.run(ThreadPoolExecutor.java:624)
	at java.lang.Thread.run(Thread.java:748)

org.apache.solr.common.util.ObjectReleaseTracker$ObjectTrackerException: org.apache.lucene.store.MockDirectoryWrapper
	at org.apache.solr.common.util.ObjectReleaseTracker.track(ObjectReleaseTracker.java:42)
	at org.apache.solr.core.CachingDirectoryFactory.get(CachingDirectoryFactory.java:348)
	at org.apache.solr.core.SolrCore.initSnapshotMetaDataManager(SolrCore.java:517)
	at org.apache.solr.core.SolrCore.<init>(SolrCore.java:968)
	at org.apache.solr.core.SolrCore.<init>(SolrCore.java:883)
	at org.apache.solr.core.CoreContainer.createFromDescriptor(CoreContainer.java:1238)
	at org.apache.solr.core.CoreContainer.lambda$load$13(CoreContainer.java:749)
	at com.codahale.metrics.InstrumentedExecutorService$InstrumentedCallable.call(InstrumentedExecutorService.java:202)
	at java.util.concurrent.FutureTask.run(FutureTask.java:266)
	at org.apache.solr.common.util.ExecutorUtil$MDCAwareThreadPoolExecutor.lambda$execute$0(ExecutorUtil.java:209)
	at java.util.concurrent.ThreadPoolExecutor.runWorker(ThreadPoolExecutor.java:1149)
	at java.util.concurrent.ThreadPoolExecutor$Worker.run(ThreadPoolExecutor.java:624)
	at java.lang.Thread.run(Thread.java:748)

org.apache.solr.common.util.ObjectReleaseTracker$ObjectTrackerException: org.apache.http.impl.client.InternalHttpClient
	at org.apache.solr.common.util.ObjectReleaseTracker.track(ObjectReleaseTracker.java:42)
	at org.apache.solr.client.solrj.impl.HttpClientUtil.createClient(HttpClientUtil.java:321)
	at org.apache.solr.client.solrj.impl.HttpClientUtil.createClient(HttpClientUtil.java:330)
	at org.apache.solr.handler.IndexFetcher.createHttpClient(IndexFetcher.java:230)
	at org.apache.solr.handler.IndexFetcher.<init>(IndexFetcher.java:272)
	at org.apache.solr.handler.ReplicationHandler.inform(ReplicationHandler.java:1224)
	at org.apache.solr.core.SolrResourceLoader.inform(SolrResourceLoader.java:696)
	at org.apache.solr.core.SolrCore.<init>(SolrCore.java:1009)
	at org.apache.solr.core.SolrCore.<init>(SolrCore.java:883)
	at org.apache.solr.core.CoreContainer.createFromDescriptor(CoreContainer.java:1238)
	at org.apache.solr.core.CoreContainer.lambda$load$13(CoreContainer.java:749)
	at com.codahale.metrics.InstrumentedExecutorService$InstrumentedCallable.call(InstrumentedExecutorService.java:202)
	at java.util.concurrent.FutureTask.run(FutureTask.java:266)
	at org.apache.solr.common.util.ExecutorUtil$MDCAwareThreadPoolExecutor.lambda$execute$0(ExecutorUtil.java:209)
	at java.util.concurrent.ThreadPoolExecutor.runWorker(ThreadPoolExecutor.java:1149)
	at java.util.concurrent.ThreadPoolExecutor$Worker.run(ThreadPoolExecutor.java:624)
	at java.lang.Thread.run(Thread.java:748)

org.apache.solr.common.util.ObjectReleaseTracker$ObjectTrackerException: org.apache.lucene.store.MockDirectoryWrapper
	at org.apache.solr.common.util.ObjectReleaseTracker.track(ObjectReleaseTracker.java:42)
	at org.apache.solr.core.CachingDirectoryFactory.get(CachingDirectoryFactory.java:348)
	at org.apache.solr.update.SolrIndexWriter.create(SolrIndexWriter.java:99)
	at org.apache.solr.core.SolrCore.initIndex(SolrCore.java:779)
	at org.apache.solr.core.SolrCore.<init>(SolrCore.java:976)
	at org.apache.solr.core.SolrCore.<init>(SolrCore.java:883)
	at org.apache.solr.core.CoreContainer.createFromDescriptor(CoreContainer.java:1238)
	at org.apache.solr.core.CoreContainer.lambda$load$13(CoreContainer.java:749)
	at com.codahale.metrics.InstrumentedExecutorService$InstrumentedCallable.call(InstrumentedExecutorService.java:202)
	at java.util.concurrent.FutureTask.run(FutureTask.java:266)
	at org.apache.solr.common.util.ExecutorUtil$MDCAwareThreadPoolExecutor.lambda$execute$0(ExecutorUtil.java:209)
	at java.util.concurrent.ThreadPoolExecutor.runWorker(ThreadPoolExecutor.java:1149)
	at java.util.concurrent.ThreadPoolExecutor$Worker.run(ThreadPoolExecutor.java:624)
	at java.lang.Thread.run(Thread.java:748)

 expected null, but was:<ObjectTracker found 4 object(s) that were not released!!! [SolrCore, MockDirectoryWrapper, InternalHttpClient, MockDirectoryWrapper]
org.apache.solr.common.util.ObjectReleaseTracker$ObjectTrackerException: org.apache.solr.core.SolrCore
	at org.apache.solr.common.util.ObjectReleaseTracker.track(ObjectReleaseTracker.java:42)
	at org.apache.solr.core.SolrCore.<init>(SolrCore.java:1063)
	at org.apache.solr.core.SolrCore.<init>(SolrCore.java:883)
	at org.apache.solr.core.CoreContainer.createFromDescriptor(CoreContainer.java:1238)
	at org.apache.solr.core.CoreContainer.lambda$load$13(CoreContainer.java:749)
	at com.codahale.metrics.InstrumentedExecutorService$InstrumentedCallable.call(InstrumentedExecutorService.java:202)
	at java.util.concurrent.FutureTask.run(FutureTask.java:266)
	at org.apache.solr.common.util.ExecutorUtil$MDCAwareThreadPoolExecutor.lambda$execute$0(ExecutorUtil.java:209)
	at java.util.concurrent.ThreadPoolExecutor.runWorker(ThreadPoolExecutor.java:1149)
	at java.util.concurrent.ThreadPoolExecutor$Worker.run(ThreadPoolExecutor.java:624)
	at java.lang.Thread.run(Thread.java:748)

org.apache.solr.common.util.ObjectReleaseTracker$ObjectTrackerException: org.apache.lucene.store.MockDirectoryWrapper
	at org.apache.solr.common.util.ObjectReleaseTracker.track(ObjectReleaseTracker.java:42)
	at org.apache.solr.core.CachingDirectoryFactory.get(CachingDirectoryFactory.java:348)
	at org.apache.solr.core.SolrCore.initSnapshotMetaDataManager(SolrCore.java:517)
	at org.apache.solr.core.SolrCore.<init>(SolrCore.java:968)
	at org.apache.solr.core.SolrCore.<init>(SolrCore.java:883)
	at org.apache.solr.core.CoreContainer.createFromDescriptor(CoreContainer.java:1238)
	at org.apache.solr.core.CoreContainer.lambda$load$13(CoreContainer.java:749)
	at com.codahale.metrics.InstrumentedExecutorService$InstrumentedCallable.call(InstrumentedExecutorService.java:202)
	at java.util.concurrent.FutureTask.run(FutureTask.java:266)
	at org.apache.solr.common.util.ExecutorUtil$MDCAwareThreadPoolExecutor.lambda$execute$0(ExecutorUtil.java:209)
	at java.util.concurrent.ThreadPoolExecutor.runWorker(ThreadPoolExecutor.java:1149)
	at java.util.concurrent.ThreadPoolExecutor$Worker.run(ThreadPoolExecutor.java:624)
	at java.lang.Thread.run(Thread.java:748)

org.apache.solr.common.util.ObjectReleaseTracker$ObjectTrackerException: org.apache.http.impl.client.InternalHttpClient
	at org.apache.solr.common.util.ObjectReleaseTracker.track(ObjectReleaseTracker.java:42)
	at org.apache.solr.client.solrj.impl.HttpClientUtil.createClient(HttpClientUtil.java:321)
	at org.apache.solr.client.solrj.impl.HttpClientUtil.createClient(HttpClientUtil.java:330)
	at org.apache.solr.handler.IndexFetcher.createHttpClient(IndexFetcher.java:230)
	at org.apache.solr.handler.IndexFetcher.<init>(IndexFetcher.java:272)
	at org.apache.solr.handler.ReplicationHandler.inform(ReplicationHandler.java:1224)
	at org.apache.solr.core.SolrResourceLoader.inform(SolrResourceLoader.java:696)
	at org.apache.solr.core.SolrCore.<init>(SolrCore.java:1009)
	at org.apache.solr.core.SolrCore.<init>(SolrCore.java:883)
	at org.apache.solr.core.CoreContainer.createFromDescriptor(CoreContainer.java:1238)
	at org.apache.solr.core.CoreContainer.lambda$load$13(CoreContainer.java:749)
	at com.codahale.metrics.InstrumentedExecutorService$InstrumentedCallable.call(InstrumentedExecutorService.java:202)
	at java.util.concurrent.FutureTask.run(FutureTask.java:266)
	at org.apache.solr.common.util.ExecutorUtil$MDCAwareThreadPoolExecutor.lambda$execute$0(ExecutorUtil.java:209)
	at java.util.concurrent.ThreadPoolExecutor.runWorker(ThreadPoolExecutor.java:1149)
	at java.util.concurrent.ThreadPoolExecutor$Worker.run(ThreadPoolExecutor.java:624)
	at java.lang.Thread.run(Thread.java:748)

org.apache.solr.common.util.ObjectReleaseTracker$ObjectTrackerException: org.apache.lucene.store.MockDirectoryWrapper
	at org.apache.solr.common.util.ObjectReleaseTracker.track(ObjectReleaseTracker.java:42)
	at org.apache.solr.core.CachingDirectoryFactory.get(CachingDirectoryFactory.java:348)
	at org.apache.solr.update.SolrIndexWriter.create(SolrIndexWriter.java:99)
	at org.apache.solr.core.SolrCore.initIndex(SolrCore.java:779)
	at org.apache.solr.core.SolrCore.<init>(SolrCore.java:976)
	at org.apache.solr.core.SolrCore.<init>(SolrCore.java:883)
	at org.apache.solr.core.CoreContainer.createFromDescriptor(CoreContainer.java:1238)
	at org.apache.solr.core.CoreContainer.lambda$load$13(CoreContainer.java:749)
	at com.codahale.metrics.InstrumentedExecutorService$InstrumentedCallable.call(InstrumentedExecutorService.java:202)
	at java.util.concurrent.FutureTask.run(FutureTask.java:266)
	at org.apache.solr.common.util.ExecutorUtil$MDCAwareThreadPoolExecutor.lambda$execute$0(ExecutorUtil.java:209)
	at java.util.concurrent.ThreadPoolExecutor.runWorker(ThreadPoolExecutor.java:1149)
	at java.util.concurrent.ThreadPoolExecutor$Worker.run(ThreadPoolExecutor.java:624)
	at java.lang.Thread.run(Thread.java:748)

>
	at __randomizedtesting.SeedInfo.seed([EA2B0C83FDDF2B9B]:0)
	at org.junit.Assert.fail(Assert.java:88)
	at org.junit.Assert.failNotNull(Assert.java:755)
	at org.junit.Assert.assertNull(Assert.java:737)
	at org.apache.solr.SolrTestCaseJ4.teardownTestCases(SolrTestCaseJ4.java:333)
	at sun.reflect.GeneratedMethodAccessor61.invoke(Unknown Source)
	at sun.reflect.DelegatingMethodAccessorImpl.invoke(DelegatingMethodAccessorImpl.java:43)
	at java.lang.reflect.Method.invoke(Method.java:498)
	at com.carrotsearch.randomizedtesting.RandomizedRunner.invoke(RandomizedRunner.java:1750)
	at com.carrotsearch.randomizedtesting.RandomizedRunner$7.evaluate(RandomizedRunner.java:901)
	at com.carrotsearch.randomizedtesting.rules.StatementAdapter.evaluate(StatementAdapter.java:36)
	at com.carrotsearch.randomizedtesting.rules.SystemPropertiesRestoreRule$1.evaluate(SystemPropertiesRestoreRule.java:57)
	at org.apache.lucene.util.AbstractBeforeAfterRule$1.evaluate(AbstractBeforeAfterRule.java:45)
	at com.carrotsearch.randomizedtesting.rules.StatementAdapter.evaluate(StatementAdapter.java:36)
	at org.apache.lucene.util.TestRuleStoreClassName$1.evaluate(TestRuleStoreClassName.java:41)
	at com.carrotsearch.randomizedtesting.rules.NoShadowingOrOverridesOnMethodsRule$1.evaluate(NoShadowingOrOverridesOnMethodsRule.java:40)
	at com.carrotsearch.randomizedtesting.rules.NoShadowingOrOverridesOnMethodsRule$1.evaluate(NoShadowingOrOverridesOnMethodsRule.java:40)
	at com.carrotsearch.randomizedtesting.rules.StatementAdapter.evaluate(StatementAdapter.java:36)
	at com.carrotsearch.randomizedtesting.rules.StatementAdapter.evaluate(StatementAdapter.java:36)
	at com.carrotsearch.randomizedtesting.rules.StatementAdapter.evaluate(StatementAdapter.java:36)
	at org.apache.lucene.util.TestRuleAssertionsRequired$1.evaluate(TestRuleAssertionsRequired.java:53)
	at org.apache.lucene.util.TestRuleMarkFailure$1.evaluate(TestRuleMarkFailure.java:47)
	at org.apache.lucene.util.TestRuleIgnoreAfterMaxFailures$1.evaluate(TestRuleIgnoreAfterMaxFailures.java:64)
	at org.apache.lucene.util.TestRuleIgnoreTestSuites$1.evaluate(TestRuleIgnoreTestSuites.java:54)
	at com.carrotsearch.randomizedtesting.rules.StatementAdapter.evaluate(StatementAdapter.java:36)
	at com.carrotsearch.randomizedtesting.ThreadLeakControl$StatementRunner.run(ThreadLeakControl.java:368)
	at java.lang.Thread.run(Thread.java:748)


FAILED:  org.apache.solr.metrics.rrd.SolrRrdBackendFactoryTest.testBasic

Error Message:
{} expected:<1> but was:<0>

Stack Trace:
java.lang.AssertionError: {} expected:<1> but was:<0>
	at __randomizedtesting.SeedInfo.seed([EA2B0C83FDDF2B9B:41D111962203ADB5]:0)
	at org.junit.Assert.fail(Assert.java:88)
	at org.junit.Assert.failNotEquals(Assert.java:834)
	at org.junit.Assert.assertEquals(Assert.java:645)
	at org.apache.solr.metrics.rrd.SolrRrdBackendFactoryTest.testBasic(SolrRrdBackendFactoryTest.java:94)
	at sun.reflect.NativeMethodAccessorImpl.invoke0(Native Method)
	at sun.reflect.NativeMethodAccessorImpl.invoke(NativeMethodAccessorImpl.java:62)
	at sun.reflect.DelegatingMethodAccessorImpl.invoke(DelegatingMethodAccessorImpl.java:43)
	at java.lang.reflect.Method.invoke(Method.java:498)
	at com.carrotsearch.randomizedtesting.RandomizedRunner.invoke(RandomizedRunner.java:1750)
	at com.carrotsearch.randomizedtesting.RandomizedRunner$8.evaluate(RandomizedRunner.java:938)
	at com.carrotsearch.randomizedtesting.RandomizedRunner$9.evaluate(RandomizedRunner.java:974)
	at com.carrotsearch.randomizedtesting.RandomizedRunner$10.evaluate(RandomizedRunner.java:988)
	at com.carrotsearch.randomizedtesting.rules.SystemPropertiesRestoreRule$1.evaluate(SystemPropertiesRestoreRule.java:57)
	at org.apache.lucene.util.TestRuleSetupTeardownChained$1.evaluate(TestRuleSetupTeardownChained.java:49)
	at org.apache.lucene.util.AbstractBeforeAfterRule$1.evaluate(AbstractBeforeAfterRule.java:45)
	at org.apache.lucene.util.TestRuleThreadAndTestName$1.evaluate(TestRuleThreadAndTestName.java:48)
	at org.apache.lucene.util.TestRuleIgnoreAfterMaxFailures$1.evaluate(TestRuleIgnoreAfterMaxFailures.java:64)
	at org.apache.lucene.util.TestRuleMarkFailure$1.evaluate(TestRuleMarkFailure.java:47)
	at com.carrotsearch.randomizedtesting.rules.StatementAdapter.evaluate(StatementAdapter.java:36)
	at com.carrotsearch.randomizedtesting.ThreadLeakControl$StatementRunner.run(ThreadLeakControl.java:368)
	at com.carrotsearch.randomizedtesting.ThreadLeakControl.forkTimeoutingTask(ThreadLeakControl.java:817)
	at com.carrotsearch.randomizedtesting.ThreadLeakControl$3.evaluate(ThreadLeakControl.java:468)
	at com.carrotsearch.randomizedtesting.RandomizedRunner.runSingleTest(RandomizedRunner.java:947)
	at com.carrotsearch.randomizedtesting.RandomizedRunner$5.evaluate(RandomizedRunner.java:832)
	at com.carrotsearch.randomizedtesting.RandomizedRunner$6.evaluate(RandomizedRunner.java:883)
	at com.carrotsearch.randomizedtesting.RandomizedRunner$7.evaluate(RandomizedRunner.java:894)
	at com.carrotsearch.randomizedtesting.rules.StatementAdapter.evaluate(StatementAdapter.java:36)
	at com.carrotsearch.randomizedtesting.rules.SystemPropertiesRestoreRule$1.evaluate(SystemPropertiesRestoreRule.java:57)
	at org.apache.lucene.util.AbstractBeforeAfterRule$1.evaluate(AbstractBeforeAfterRule.java:45)
	at com.carrotsearch.randomizedtesting.rules.StatementAdapter.evaluate(StatementAdapter.java:36)
	at org.apache.lucene.util.TestRuleStoreClassName$1.evaluate(TestRuleStoreClassName.java:41)
	at com.carrotsearch.randomizedtesting.rules.NoShadowingOrOverridesOnMethodsRule$1.evaluate(NoShadowingOrOverridesOnMethodsRule.java:40)
	at com.carrotsearch.randomizedtesting.rules.NoShadowingOrOverridesOnMethodsRule$1.evaluate(NoShadowingOrOverridesOnMethodsRule.java:40)
	at com.carrotsearch.randomizedtesting.rules.StatementAdapter.evaluate(StatementAdapter.java:36)
	at com.carrotsearch.randomizedtesting.rules.StatementAdapter.evaluate(StatementAdapter.java:36)
	at com.carrotsearch.randomizedtesting.rules.StatementAdapter.evaluate(StatementAdapter.java:36)
	at org.apache.lucene.util.TestRuleAssertionsRequired$1.evaluate(TestRuleAssertionsRequired.java:53)
	at org.apache.lucene.util.TestRuleMarkFailure$1.evaluate(TestRuleMarkFailure.java:47)
	at org.apache.lucene.util.TestRuleIgnoreAfterMaxFailures$1.evaluate(TestRuleIgnoreAfterMaxFailures.java:64)
	at org.apache.lucene.util.TestRuleIgnoreTestSuites$1.evaluate(TestRuleIgnoreTestSuites.java:54)
	at com.carrotsearch.randomizedtesting.rules.StatementAdapter.evaluate(StatementAdapter.java:36)
	at com.carrotsearch.randomizedtesting.ThreadLeakControl$StatementRunner.run(ThreadLeakControl.java:368)
	at java.lang.Thread.run(Thread.java:748)




Build Log:
[...truncated 13411 lines...]
   [junit4] Suite: org.apache.solr.metrics.rrd.SolrRrdBackendFactoryTest
   [junit4]   2> Creating dataDir: /home/jenkins/jenkins-slave/workspace/Lucene-Solr-BadApples-Tests-8.x/solr/build/solr-core/test/J0/temp/solr.metrics.rrd.SolrRrdBackendFactoryTest_EA2B0C83FDDF2B9B-001/init-core-data-001
   [junit4]   2> 1067588 INFO  (SUITE-SolrRrdBackendFactoryTest-seed#[EA2B0C83FDDF2B9B]-worker) [    ] o.a.s.SolrTestCaseJ4 SecureRandom sanity checks: test.solr.allowed.securerandom=null & java.security.egd=file:/dev/./urandom
   [junit4]   2> 1067589 INFO  (SUITE-SolrRrdBackendFactoryTest-seed#[EA2B0C83FDDF2B9B]-worker) [    ] o.a.s.SolrTestCaseJ4 Using PointFields (NUMERIC_POINTS_SYSPROP=true) w/NUMERIC_DOCVALUES_SYSPROP=true
   [junit4]   2> 1067590 INFO  (SUITE-SolrRrdBackendFactoryTest-seed#[EA2B0C83FDDF2B9B]-worker) [    ] o.a.s.SolrTestCaseJ4 Randomized ssl (false) and clientAuth (false) via: @org.apache.solr.util.RandomizeSSL(reason=, ssl=NaN, value=NaN, clientAuth=NaN)
   [junit4]   2> 1067624 INFO  (TEST-SolrRrdBackendFactoryTest.testBasic-seed#[EA2B0C83FDDF2B9B]) [    ] o.a.s.SolrTestCaseJ4 ###Starting testBasic
   [junit4]   2> 1067624 DEBUG (TEST-SolrRrdBackendFactoryTest.testBasic-seed#[EA2B0C83FDDF2B9B]) [    ] o.a.s.m.r.SolrRrdBackendFactory Created 1766526979
   [junit4]   2> 1067676 DEBUG (SolrRrdBackendFactory-1964-thread-1) [    ] o.a.s.m.r.SolrRrdBackendFactory -- maybe sync backends: [foo]
   [junit4]   2> 1067677 DEBUG (SolrRrdBackendFactory-1964-thread-1) [    ] o.a.s.m.r.SolrRrdBackendFactory -- syncing [foo]
   [junit4]   2> 1067713 DEBUG (TEST-SolrRrdBackendFactoryTest.testBasic-seed#[EA2B0C83FDDF2B9B]) [    ] o.a.s.m.r.SolrRrdBackendFactory Closing 1766526979
   [junit4]   2> 1067713 INFO  (TEST-SolrRrdBackendFactoryTest.testBasic-seed#[EA2B0C83FDDF2B9B]) [    ] o.a.s.SolrTestCaseJ4 ###Ending testBasic
   [junit4]   2> NOTE: reproduce with: ant test  -Dtestcase=SolrRrdBackendFactoryTest -Dtests.method=testBasic -Dtests.seed=EA2B0C83FDDF2B9B -Dtests.multiplier=2 -Dtests.slow=true -Dtests.badapples=true -Dtests.locale=vi -Dtests.timezone=Asia/Vientiane -Dtests.asserts=true -Dtests.file.encoding=ISO-8859-1
   [junit4] FAILURE 0.23s J0 | SolrRrdBackendFactoryTest.testBasic <<<
   [junit4]    > Throwable #1: java.lang.AssertionError: {} expected:<1> but was:<0>
   [junit4]    > 	at __randomizedtesting.SeedInfo.seed([EA2B0C83FDDF2B9B:41D111962203ADB5]:0)
   [junit4]    > 	at org.apache.solr.metrics.rrd.SolrRrdBackendFactoryTest.testBasic(SolrRrdBackendFactoryTest.java:94)
   [junit4]    > 	at java.lang.Thread.run(Thread.java:748)
   [junit4]   2> NOTE: leaving temporary files on disk at: /home/jenkins/jenkins-slave/workspace/Lucene-Solr-BadApples-Tests-8.x/solr/build/solr-core/test/J0/temp/solr.metrics.rrd.SolrRrdBackendFactoryTest_EA2B0C83FDDF2B9B-001
   [junit4]   2> NOTE: test params are: codec=Asserting(Lucene80): {}, docValues:{}, maxPointsInLeafNode=649, maxMBSortInHeap=7.581555475583958, sim=Asserting(org.apache.lucene.search.similarities.AssertingSimilarity@6aa5e08c), locale=vi, timezone=Asia/Vientiane
   [junit4]   2> NOTE: Linux 4.4.0-112-generic amd64/Oracle Corporation 1.8.0_191 (64-bit)/cpus=4,threads=1,free=244186264,total=522715136
   [junit4]   2> NOTE: All tests run in this JVM: [TestSimTriggerIntegration, TestSolrCoreParser, ZkControllerTest, IndexBasedSpellCheckerTest, TestCloudNestedDocsSort, TestFieldCacheVsDocValues, SolrLogAuditLoggerPluginTest, TestOnReconnectListenerSupport, TestJsonFacetsWithNestedObjects, PeerSyncReplicationTest, TestReRankQParserPlugin, DocumentAnalysisRequestHandlerTest, InfixSuggestersTest, HighlighterConfigTest, TestSweetSpotSimilarityFactory, NodeMutatorTest, SimplePostToolTest, TestEmbeddedSolrServerAdminHandler, UnloadDistributedZkTest, TestDynamicURP, HdfsNNFailoverTest, ZkStateWriterTest, CdcrBidirectionalTest, SolrCloudExampleTest, AsyncCallRequestStatusResponseTest, TermsComponentTest, StressHdfsTest, TestMacros, TestSolrCloudWithSecureImpersonation, TestSolrCoreSnapshots, TestMissingGroups, TestTrieFacet, HdfsAutoAddReplicasIntegrationTest, HdfsRestartWhileUpdatingTest, PathHierarchyTokenizerFactoryTest, TestXIncludeConfig, EchoParamsTest, MetricTriggerIntegrationTest, TestInitQParser, TestDocBasedVersionConstraints, DeleteLastCustomShardedReplicaTest, TestClusterProperties, CoreAdminHandlerTest, DistributedUpdateProcessorTest, UpdateParamsTest, DistanceFunctionTest, TestLRUStatsCache, TestRebalanceLeaders, CursorPagingTest, ReturnFieldsTest, ReplaceNodeTest, TestManagedSynonymGraphFilterFactory, TestStressLucene, SolrRrdBackendFactoryTest]
   [junit4] Completed [158/858 (1!)] on J0 in 0.89s, 1 test, 1 failure <<< FAILURES!

[...truncated 533 lines...]
   [junit4] Suite: org.apache.solr.handler.TestReplicationHandler
   [junit4]   2> 1493540 INFO  (SUITE-TestReplicationHandler-seed#[EA2B0C83FDDF2B9B]-worker) [    ] o.a.s.SolrTestCaseJ4 SecureRandom sanity checks: test.solr.allowed.securerandom=null & java.security.egd=file:/dev/./urandom
   [junit4]   2> Creating dataDir: /home/jenkins/jenkins-slave/workspace/Lucene-Solr-BadApples-Tests-8.x/solr/build/solr-core/test/J1/temp/solr.handler.TestReplicationHandler_EA2B0C83FDDF2B9B-001/init-core-data-001
   [junit4]   2> 1493541 WARN  (SUITE-TestReplicationHandler-seed#[EA2B0C83FDDF2B9B]-worker) [    ] o.a.s.SolrTestCaseJ4 startTrackingSearchers: numOpens=27 numCloses=27
   [junit4]   2> 1493541 INFO  (SUITE-TestReplicationHandler-seed#[EA2B0C83FDDF2B9B]-worker) [    ] o.a.s.SolrTestCaseJ4 Using TrieFields (NUMERIC_POINTS_SYSPROP=false) w/NUMERIC_DOCVALUES_SYSPROP=false
   [junit4]   2> 1493543 INFO  (SUITE-TestReplicationHandler-seed#[EA2B0C83FDDF2B9B]-worker) [    ] o.a.s.SolrTestCaseJ4 Randomized ssl (false) and clientAuth (false) via: @org.apache.solr.SolrTestCaseJ4$SuppressSSL(bugUrl=None)
   [junit4]   2> 1493557 INFO  (TEST-TestReplicationHandler.doTestHandlerPathUnchanged-seed#[EA2B0C83FDDF2B9B]) [    ] o.a.s.SolrTestCaseJ4 ###Starting doTestHandlerPathUnchanged
   [junit4]   2> 1493558 INFO  (TEST-TestReplicationHandler.doTestHandlerPathUnchanged-seed#[EA2B0C83FDDF2B9B]) [    ] o.a.s.SolrTestCaseJ4 Writing core.properties file to /home/jenkins/jenkins-slave/workspace/Lucene-Solr-BadApples-Tests-8.x/solr/build/solr-core/test/J1/temp/solr.handler.TestReplicationHandler_EA2B0C83FDDF2B9B-001/solr-instance-001/collection1
   [junit4]   2> 1493614 WARN  (TEST-TestReplicationHandler.doTestHandlerPathUnchanged-seed#[EA2B0C83FDDF2B9B]) [    ] o.e.j.s.AbstractConnector Ignoring deprecated socket close linger time
   [junit4]   2> 1493614 INFO  (TEST-TestReplicationHandler.doTestHandlerPathUnchanged-seed#[EA2B0C83FDDF2B9B]) [    ] o.a.s.c.s.e.JettySolrRunner Start Jetty (original configured port=0)
   [junit4]   2> 1493614 INFO  (TEST-TestReplicationHandler.doTestHandlerPathUnchanged-seed#[EA2B0C83FDDF2B9B]) [    ] o.a.s.c.s.e.JettySolrRunner Trying to start Jetty on port 0 try number 1 ...
   [junit4]   2> 1493614 INFO  (TEST-TestReplicationHandler.doTestHandlerPathUnchanged-seed#[EA2B0C83FDDF2B9B]) [    ] o.e.j.s.Server jetty-9.4.14.v20181114; built: 2018-11-14T21:20:31.478Z; git: c4550056e785fb5665914545889f21dc136ad9e6; jvm 1.8.0_191-b12
   [junit4]   2> 1493726 INFO  (TEST-TestReplicationHandler.doTestHandlerPathUnchanged-seed#[EA2B0C83FDDF2B9B]) [    ] o.e.j.s.session DefaultSessionIdManager workerName=node0
   [junit4]   2> 1493726 INFO  (TEST-TestReplicationHandler.doTestHandlerPathUnchanged-seed#[EA2B0C83FDDF2B9B]) [    ] o.e.j.s.session No SessionScavenger set, using defaults
   [junit4]   2> 1493726 INFO  (TEST-TestReplicationHandler.doTestHandlerPathUnchanged-seed#[EA2B0C83FDDF2B9B]) [    ] o.e.j.s.session node0 Scavenging every 660000ms
   [junit4]   2> 1493758 INFO  (TEST-TestReplicationHandler.doTestHandlerPathUnchanged-seed#[EA2B0C83FDDF2B9B]) [    ] o.e.j.s.h.ContextHandler Started o.e.j.s.ServletContextHandler@369ed69b{/solr,null,AVAILABLE}
   [junit4]   2> 1493759 INFO  (TEST-TestReplicationHandler.doTestHandlerPathUnchanged-seed#[EA2B0C83FDDF2B9B]) [    ] o.e.j.s.AbstractConnector Started ServerConnector@6cf0259b{HTTP/1.1,[http/1.1, h2c]}{127.0.0.1:36143}
   [junit4]   2> 1493759 INFO  (TEST-TestReplicationHandler.doTestHandlerPathUnchanged-seed#[EA2B0C83FDDF2B9B]) [    ] o.e.j.s.Server Started @1494008ms
   [junit4]   2> 1493760 INFO  (TEST-TestReplicationHandler.doTestHandlerPathUnchanged-seed#[EA2B0C83FDDF2B9B]) [    ] o.a.s.c.s.e.JettySolrRunner Jetty properties: {solr.data.dir=/home/jenkins/jenkins-slave/workspace/Lucene-Solr-BadApples-Tests-8.x/solr/build/solr-core/test/J1/temp/solr.handler.TestReplicationHandler_EA2B0C83FDDF2B9B-001/solr-instance-001/collection1/data, hostContext=/solr, hostPort=36143}
   [junit4]   2> 1493760 ERROR (TEST-TestReplicationHandler.doTestHandlerPathUnchanged-seed#[EA2B0C83FDDF2B9B]) [    ] o.a.s.u.StartupLoggingUtils Missing Java Option solr.log.dir. Logging may be missing or incomplete.
   [junit4]   2> 1493760 INFO  (TEST-TestReplicationHandler.doTestHandlerPathUnchanged-seed#[EA2B0C83FDDF2B9B]) [    ] o.a.s.s.SolrDispatchFilter Using logger factory org.apache.logging.slf4j.Log4jLoggerFactory
   [junit4]   2> 1493760 INFO  (TEST-TestReplicationHandler.doTestHandlerPathUnchanged-seed#[EA2B0C83FDDF2B9B]) [    ] o.a.s.s.SolrDispatchFilter  ___      _       Welcome to Apache Solr? version 8.2.0
   [junit4]   2> 1493760 INFO  (TEST-TestReplicationHandler.doTestHandlerPathUnchanged-seed#[EA2B0C83FDDF2B9B]) [    ] o.a.s.s.SolrDispatchFilter / __| ___| |_ _   Starting in standalone mode on port null
   [junit4]   2> 1493760 INFO  (TEST-TestReplicationHandler.doTestHandlerPathUnchanged-seed#[EA2B0C83FDDF2B9B]) [    ] o.a.s.s.SolrDispatchFilter \__ \/ _ \ | '_|  Install dir: null
   [junit4]   2> 1493760 INFO  (TEST-TestReplicationHandler.doTestHandlerPathUnchanged-seed#[EA2B0C83FDDF2B9B]) [    ] o.a.s.s.SolrDispatchFilter |___/\___/_|_|    Start time: 2019-05-18T03:46:16.378Z
   [junit4]   2> 1493760 INFO  (TEST-TestReplicationHandler.doTestHandlerPathUnchanged-seed#[EA2B0C83FDDF2B9B]) [    ] o.a.s.c.SolrXmlConfig Loading container configuration from /home/jenkins/jenkins-slave/workspace/Lucene-Solr-BadApples-Tests-8.x/solr/build/solr-core/test/J1/temp/solr.handler.TestReplicationHandler_EA2B0C83FDDF2B9B-001/solr-instance-001/solr.xml
   [junit4]   2> 1493796 INFO  (TEST-TestReplicationHandler.doTestHandlerPathUnchanged-seed#[EA2B0C83FDDF2B9B]) [    ] o.a.s.c.SolrXmlConfig Configuration parameter autoReplicaFailoverWorkLoopDelay is ignored
   [junit4]   2> 1493796 INFO  (TEST-TestReplicationHandler.doTestHandlerPathUnchanged-seed#[EA2B0C83FDDF2B9B]) [    ] o.a.s.c.SolrXmlConfig Configuration parameter autoReplicaFailoverBadNodeExpiration is ignored
   [junit4]   2> 1493798 INFO  (TEST-TestReplicationHandler.doTestHandlerPathUnchanged-seed#[EA2B0C83FDDF2B9B]) [    ] o.a.s.c.SolrXmlConfig MBean server found: com.sun.jmx.mbeanserver.JmxMBeanServer@6fd4489, but no JMX reporters were configured - adding default JMX reporter.
   [junit4]   2> 1494386 INFO  (TEST-TestReplicationHandler.doTestHandlerPathUnchanged-seed#[EA2B0C83FDDF2B9B]) [    ] o.a.s.h.c.HttpShardHandlerFactory Host whitelist initialized: WhitelistHostChecker [whitelistHosts=null, whitelistHostCheckingEnabled=true]
   [junit4]   2> 1494388 WARN  (TEST-TestReplicationHandler.doTestHandlerPathUnchanged-seed#[EA2B0C83FDDF2B9B]) [    ] o.e.j.u.s.S.config No Client EndPointIdentificationAlgorithm configured for SslContextFactory@4e4a2321[provider=null,keyStore=null,trustStore=null]
   [junit4]   2> 1494415 WARN  (TEST-TestReplicationHandler.doTestHandlerPathUnchanged-seed#[EA2B0C83FDDF2B9B]) [    ] o.e.j.u.s.S.config No Client EndPointIdentificationAlgorithm configured for SslContextFactory@75a7a578[provider=null,keyStore=null,trustStore=null]
   [junit4]   2> 1494488 INFO  (TEST-TestReplicationHandler.doTestHandlerPathUnchanged-seed#[EA2B0C83FDDF2B9B]) [    ] o.a.s.c.TransientSolrCoreCacheDefault Allocating transient cache for 4 transient cores
   [junit4]   2> 1494488 INFO  (TEST-TestReplicationHandler.doTestHandlerPathUnchanged-seed#[EA2B0C83FDDF2B9B]) [    ] o.a.s.h.a.MetricsHistoryHandler No .system collection, keeping metrics history in memory.
   [junit4]   2> 1494543 INFO  (TEST-TestReplicationHandler.doTestHandlerPathUnchanged-seed#[EA2B0C83FDDF2B9B]) [    ] o.a.s.m.r.SolrJmxReporter JMX monitoring for 'solr.node' (registry 'solr.node') enabled at server: com.sun.jmx.mbeanserver.JmxMBeanServer@6fd4489
   [junit4]   2> 1494576 INFO  (TEST-TestReplicationHandler.doTestHandlerPathUnchanged-seed#[EA2B0C83FDDF2B9B]) [    ] o.a.s.m.r.SolrJmxReporter JMX monitoring for 'solr.jvm' (registry 'solr.jvm') enabled at server: com.sun.jmx.mbeanserver.JmxMBeanServer@6fd4489
   [junit4]   2> 1494576 INFO  (TEST-TestReplicationHandler.doTestHandlerPathUnchanged-seed#[EA2B0C83FDDF2B9B]) [    ] o.a.s.m.r.SolrJmxReporter JMX monitoring for 'solr.jetty' (registry 'solr.jetty') enabled at server: com.sun.jmx.mbeanserver.JmxMBeanServer@6fd4489
   [junit4]   2> 1494586 INFO  (TEST-TestReplicationHandler.doTestHandlerPathUnchanged-seed#[EA2B0C83FDDF2B9B]) [    ] o.a.s.c.CorePropertiesLocator Found 1 core definitions underneath /home/jenkins/jenkins-slave/workspace/Lucene-Solr-BadApples-Tests-8.x/solr/build/solr-core/test/J1/temp/solr.handler.TestReplicationHandler_EA2B0C83FDDF2B9B-001/solr-instance-001/.
   [junit4]   2> 1494586 INFO  (TEST-TestReplicationHandler.doTestHandlerPathUnchanged-seed#[EA2B0C83FDDF2B9B]) [    ] o.a.s.c.CorePropertiesLocator Cores are: [collection1]
   [junit4]   2> 1494610 INFO  (coreLoadExecutor-4026-thread-1) [    x:collection1] o.a.s.c.SolrConfig Using Lucene MatchVersion: 8.2.0
   [junit4]   2> 1494647 INFO  (coreLoadExecutor-4026-thread-1) [    x:collection1] o.a.s.s.IndexSchema [collection1] Schema name=test
   [junit4]   2> 1494661 INFO  (coreLoadExecutor-4026-thread-1) [    x:collection1] o.a.s.s.IndexSchema Loaded schema test/1.2 with uniqueid field id
   [junit4]   2> 1494661 INFO  (coreLoadExecutor-4026-thread-1) [    x:collection1] o.a.s.c.CoreContainer Creating SolrCore 'collection1' using configuration from instancedir /home/jenkins/jenkins-slave/workspace/Lucene-Solr-BadApples-Tests-8.x/solr/build/solr-core/test/J1/temp/solr.handler.TestReplicationHandler_EA2B0C83FDDF2B9B-001/solr-instance-001/./collection1, trusted=true
   [junit4]   2> 1494662 INFO  (coreLoadExecutor-4026-thread-1) [    x:collection1] o.a.s.m.r.SolrJmxReporter JMX monitoring for 'solr.core.collection1' (registry 'solr.core.collection1') enabled at server: com.sun.jmx.mbeanserver.JmxMBeanServer@6fd4489
   [junit4]   2> 1494662 INFO  (coreLoadExecutor-4026-thread-1) [    x:collection1] o.a.s.c.SolrCore [[collection1] ] Opening new SolrCore at [/home/jenkins/jenkins-slave/workspace/Lucene-Solr-BadApples-Tests-8.x/solr/build/solr-core/test/J1/temp/solr.handler.TestReplicationHandler_EA2B0C83FDDF2B9B-001/solr-instance-001/collection1], dataDir=[/home/jenkins/jenkins-slave/workspace/Lucene-Solr-BadApples-Tests-8.x/solr/build/solr-core/test/J1/temp/solr.handler.TestReplicationHandler_EA2B0C83FDDF2B9B-001/solr-instance-001/./collection1/data/]
   [junit4]   2> 1494663 INFO  (coreLoadExecutor-4026-thread-1) [    x:collection1] o.a.s.u.RandomMergePolicy RandomMergePolicy wrapping class org.apache.lucene.index.TieredMergePolicy: [TieredMergePolicy: maxMergeAtOnce=15, maxMergeAtOnceExplicit=35, maxMergedSegmentMB=18.646484375, floorSegmentMB=1.5458984375, forceMergeDeletesPctAllowed=28.88866695006085, segmentsPerTier=25.0, maxCFSSegmentSizeMB=8.796093022207999E12, noCFSRatio=0.0, deletesPctAllowed=21.478214096865635
   [junit4]   2> 1494915 INFO  (coreLoadExecutor-4026-thread-1) [    x:collection1] o.a.s.u.CommitTracker Hard AutoCommit: disabled
   [junit4]   2> 1494915 INFO  (coreLoadExecutor-4026-thread-1) [    x:collection1] o.a.s.u.CommitTracker Soft AutoCommit: disabled
   [junit4]   2> 1494915 INFO  (coreLoadExecutor-4026-thread-1) [    x:collection1] o.a.s.u.RandomMergePolicy RandomMergePolicy wrapping class org.apache.lucene.index.LogByteSizeMergePolicy: [LogByteSizeMergePolicy: minMergeSize=1677721, mergeFactor=47, maxMergeSize=2147483648, maxMergeSizeForForcedMerge=9223372036854775807, calibrateSizeByDeletes=false, maxMergeDocs=2147483647, maxCFSSegmentSizeMB=8.796093022207999E12, noCFSRatio=1.0]
   [junit4]   2> 1494916 INFO  (coreLoadExecutor-4026-thread-1) [    x:collection1] o.a.s.s.SolrIndexSearcher Opening [Searcher@6973e751[collection1] main]
   [junit4]   2> 1494916 INFO  (coreLoadExecutor-4026-thread-1) [    x:collection1] o.a.s.r.ManagedResourceStorage File-based storage initialized to use dir: /home/jenkins/jenkins-slave/workspace/Lucene-Solr-BadApples-Tests-8.x/solr/build/solr-core/test/J1/temp/solr.handler.TestReplicationHandler_EA2B0C83FDDF2B9B-001/solr-instance-001/collection1/conf
   [junit4]   2> 1494929 INFO  (coreLoadExecutor-4026-thread-1) [    x:collection1] o.a.s.h.ReplicationHandler Replication enabled for following config files: schema.xml,xslt/dummy.xsl
   [junit4]   2> 1494929 INFO  (coreLoadExecutor-4026-thread-1) [    x:collection1] o.a.s.h.ReplicationHandler Commits will be reserved for 10000ms.
   [junit4]   2> 1494931 INFO  (searcherExecutor-4027-thread-1-processing-x:collection1) [    x:collection1] o.a.s.c.SolrCore [collection1] Registered new searcher Searcher@6973e751[collection1] main{ExitableDirectoryReader(UninvertingDirectoryReader())}
   [junit4]   2> 1494944 INFO  (TEST-TestReplicationHandler.doTestHandlerPathUnchanged-seed#[EA2B0C83FDDF2B9B]) [    ] o.a.s.SolrTestCaseJ4 Writing core.properties file to /home/jenkins/jenkins-slave/workspace/Lucene-Solr-BadApples-Tests-8.x/solr/build/solr-core/test/J1/temp/solr.handler.TestReplicationHandler_EA2B0C83FDDF2B9B-001/solr-instance-002/collection1
   [junit4]   2> 1494946 WARN  (TEST-TestReplicationHandler.doTestHandlerPathUnchanged-seed#[EA2B0C83FDDF2B9B]) [    ] o.e.j.s.AbstractConnector Ignoring deprecated socket close linger time
   [junit4]   2> 1494947 INFO  (TEST-TestReplicationHandler.doTestHandlerPathUnchanged-seed#[EA2B0C83FDDF2B9B]) [    ] o.a.s.c.s.e.JettySolrRunner Start Jetty (original configured port=0)
   [junit4]   2> 1494947 INFO  (TEST-TestReplicationHandler.doTestHandlerPathUnchanged-seed#[EA2B0C83FDDF2B9B]) [    ] o.a.s.c.s.e.JettySolrRunner Trying to start Jetty on port 0 try number 1 ...
   [junit4]   2> 1494947 INFO  (TEST-TestReplicationHandler.doTestHandlerPathUnchanged-seed#[EA2B0C83FDDF2B9B]) [    ] o.e.j.s.Server jetty-9.4.14.v20181114; built: 2018-11-14T21:20:31.478Z; git: c4550056e785fb5665914545889f21dc136ad9e6; jvm 1.8.0_191-b12
   [junit4]   2> 1494962 INFO  (TEST-TestReplicationHandler.doTestHandlerPathUnchanged-seed#[EA2B0C83FDDF2B9B]) [    ] o.e.j.s.session DefaultSessionIdManager workerName=node0
   [junit4]   2> 1494962 INFO  (TEST-TestReplicationHandler.doTestHandlerPathUnchanged-seed#[EA2B0C83FDDF2B9B]) [    ] o.e.j.s.session No SessionScavenger set, using defaults
   [junit4]   2> 1494962 INFO  (TEST-TestReplicationHandler.doTestHandlerPathUnchanged-seed#[EA2B0C83FDDF2B9B]) [    ] o.e.j.s.session node0 Scavenging every 660000ms
   [junit4]   2> 1494962 INFO  (TEST-TestReplicationHandler.doTestHandlerPathUnchanged-seed#[EA2B0C83FDDF2B9B]) [    ] o.e.j.s.h.ContextHandler Started o.e.j.s.ServletContextHandler@6a3f38{/solr,null,AVAILABLE}
   [junit4]   2> 1494963 INFO  (TEST-TestReplicationHandler.doTestHandlerPathUnchanged-seed#[EA2B0C83FDDF2B9B]) [    ] o.e.j.s.AbstractConnector Started ServerConnector@6891b77b{HTTP/1.1,[http/1.1, h2c]}{127.0.0.1:40192}
   [junit4]   2> 1494963 INFO  (TEST-TestReplicationHandler.doTestHandlerPathUnchanged-seed#[EA2B0C83FDDF2B9B]) [    ] o.e.j.s.Server Started @1495212ms
   [junit4]   2> 1494963 INFO  (TEST-TestReplicationHandler.doTestHandlerPathUnchanged-seed#[EA2B0C83FDDF2B9B]) [    ] o.a.s.c.s.e.JettySolrRunner Jetty properties: {solr.data.dir=/home/jenkins/jenkins-slave/workspace/Lucene-Solr-BadApples-Tests-8.x/solr/build/solr-core/test/J1/temp/solr.handler.TestReplicationHandler_EA2B0C83FDDF2B9B-001/solr-instance-002/collection1/data, hostContext=/solr, hostPort=40192}
   [junit4]   2> 1494963 ERROR (TEST-TestReplicationHandler.doTestHandlerPathUnchanged-seed#[EA2B0C83FDDF2B9B]) [    ] o.a.s.u.StartupLoggingUtils Missing Java Option solr.log.dir. Logging may be missing or incomplete.
   [junit4]   2> 1494963 INFO  (TEST-TestReplicationHandler.doTestHandlerPathUnchanged-seed#[EA2B0C83FDDF2B9B]) [    ] o.a.s.s.SolrDispatchFilter Using logger factory org.apache.logging.slf4j.Log4jLoggerFactory
   [junit4]   2> 1494963 INFO  (TEST-TestReplicationHandler.doTestHandlerPathUnchanged-seed#[EA2B0C83FDDF2B9B]) [    ] o.a.s.s.SolrDispatchFilter  ___      _       Welcome to Apache Solr? version 8.2.0
   [junit4]   2> 1494963 INFO  (TEST-TestReplicationHandler.doTestHandlerPathUnchanged-seed#[EA2B0C83FDDF2B9B]) [    ] o.a.s.s.SolrDispatchFilter / __| ___| |_ _   Starting in standalone mode on port null
   [junit4]   2> 1494963 INFO  (TEST-TestReplicationHandler.doTestHandlerPathUnchanged-seed#[EA2B0C83FDDF2B9B]) [    ] o.a.s.s.SolrDispatchFilter \__ \/ _ \ | '_|  Install dir: null
   [junit4]   2> 1494963 INFO  (TEST-TestReplicationHandler.doTestHandlerPathUnchanged-seed#[EA2B0C83FDDF2B9B]) [    ] o.a.s.s.SolrDispatchFilter |___/\___/_|_|    Start time: 2019-05-18T03:46:17.581Z
   [junit4]   2> 1494963 INFO  (TEST-TestReplicationHandler.doTestHandlerPathUnchanged-seed#[EA2B0C83FDDF2B9B]) [    ] o.a.s.c.SolrXmlConfig Loading container configuration from /home/jenkins/jenkins-slave/workspace/Lucene-Solr-BadApples-Tests-8.x/solr/build/solr-core/test/J1/temp/solr.handler.TestReplicationHandler_EA2B0C83FDDF2B9B-001/solr-instance-002/solr.xml
   [junit4]   2> 1494987 INFO  (TEST-TestReplicationHandler.doTestHandlerPathUnchanged-seed#[EA2B0C83FDDF2B9B]) [    ] o.a.s.c.SolrXmlConfig Configuration parameter autoReplicaFailoverWorkLoopDelay is ignored
   [junit4]   2> 1494987 INFO  (TEST-TestReplicationHandler.doTestHandlerPathUnchanged-seed#[EA2B0C83FDDF2B9B]) [    ] o.a.s.c.SolrXmlConfig Configuration parameter autoReplicaFailoverBadNodeExpiration is ignored
   [junit4]   2> 1494989 INFO  (TEST-TestReplicationHandler.doTestHandlerPathUnchanged-seed#[EA2B0C83FDDF2B9B]) [    ] o.a.s.c.SolrXmlConfig MBean server found: com.sun.jmx.mbeanserver.JmxMBeanServer@6fd4489, but no JMX reporters were configured - adding default JMX reporter.
   [junit4]   2> 1496510 INFO  (TEST-TestReplicationHandler.doTestHandlerPathUnchanged-seed#[EA2B0C83FDDF2B9B]) [    ] o.a.s.h.c.HttpShardHandlerFactory Host whitelist initialized: WhitelistHostChecker [whitelistHosts=null, whitelistHostCheckingEnabled=true]
   [junit4]   2> 1496512 WARN  (TEST-TestReplicationHandler.doTestHandlerPathUnchanged-seed#[EA2B0C83FDDF2B9B]) [    ] o.e.j.u.s.S.config No Client EndPointIdentificationAlgorithm configured for SslContextFactory@3a3cfe2e[provider=null,keyStore=null,trustStore=null]
   [junit4]   2> 1496529 WARN  (TEST-TestReplicationHandler.doTestHandlerPathUnchanged-seed#[EA2B0C83FDDF2B9B]) [    ] o.e.j.u.s.S.config No Client EndPointIdentificationAlgorithm configured for SslContextFactory@ed6d857[provider=null,keyStore=null,trustStore=null]
   [junit4]   2> 1496597 INFO  (TEST-TestReplicationHandler.doTestHandlerPathUnchanged-seed#[EA2B0C83FDDF2B9B]) [    ] o.a.s.c.TransientSolrCoreCacheDefault Allocating transient cache for 4 transient cores
   [junit4]   2> 1496597 INFO  (TEST-TestReplicationHandler.doTestHandlerPathUnchanged-seed#[EA2B0C83FDDF2B9B]) [    ] o.a.s.h.a.MetricsHistoryHandler No .system collection, keeping metrics history in memory.
   [junit4]   2> 1496654 INFO  (TEST-TestReplicationHandler.doTestHandlerPathUnchanged-seed#[EA2B0C83FDDF2B9B]) [    ] o.a.s.m.r.SolrJmxReporter JMX monitoring for 'solr.node' (registry 'solr.node') enabled at server: com.sun.jmx.mbeanserver.JmxMBeanServer@6fd4489
   [junit4]   2> 1496700 INFO  (TEST-TestReplicationHandler.doTestHandlerPathUnchanged-seed#[EA2B0C83FDDF2B9B]) [    ] o.a.s.m.r.SolrJmxReporter JMX monitoring for 'solr.jvm' (registry 'solr.jvm') enabled at server: com.sun.jmx.mbeanserver.JmxMBeanServer@6fd4489
   [junit4]   2> 1496700 INFO  (TEST-TestReplicationHandler.doTestHandlerPathUnchanged-seed#[EA2B0C83FDDF2B9B]) [    ] o.a.s.m.r.SolrJmxReporter JMX monitoring for 'solr.jetty' (registry 'solr.jetty') enabled at server: com.sun.jmx.mbeanserver.JmxMBeanServer@6fd4489
   [junit4]   2> 1496702 INFO  (TEST-TestReplicationHandler.doTestHandlerPathUnchanged-seed#[EA2B0C83FDDF2B9B]) [    ] o.a.s.c.CorePropertiesLocator Found 1 core definitions underneath /home/jenkins/jenkins-slave/workspace/Lucene-Solr-BadApples-Tests-8.x/solr/build/solr-core/test/J1/temp/solr.handler.TestReplicationHandler_EA2B0C83FDDF2B9B-001/solr-instance-002/.
   [junit4]   2> 1496702 INFO  (TEST-TestReplicationHandler.doTestHandlerPathUnchanged-seed#[EA2B0C83FDDF2B9B]) [    ] o.a.s.c.CorePropertiesLocator Cores are: [collection1]
   [junit4]   2> 1496732 INFO  (coreLoadExecutor-4039-thread-1) [    x:collection1] o.a.s.c.SolrConfig Using Lucene MatchVersion: 8.2.0
   [junit4]   2> 1496769 INFO  (coreLoadExecutor-4039-thread-1) [    x:collection1] o.a.s.s.IndexSchema [collection1] Schema name=test
   [junit4]   2> 1496771 INFO  (coreLoadExecutor-4039-thread-1) [    x:collection1] o.a.s.s.IndexSchema Loaded schema test/1.2 with uniqueid field id
   [junit4]   2> 1496771 INFO  (coreLoadExecutor-4039-thread-1) [    x:collection1] o.a.s.c.CoreContainer Creating SolrCore 'collection1' using configuration from instancedir /home/jenkins/jenkins-slave/workspace/Lucene-Solr-BadApples-Tests-8.x/solr/build/solr-core/test/J1/temp/solr.handler.TestReplicationHandler_EA2B0C83FDDF2B9B-001/solr-instance-002/./collection1, trusted=true
   [junit4]   2> 1496771 INFO  (coreLoadExecutor-4039-thread-1) [    x:collection1] o.a.s.m.r.SolrJmxReporter JMX monitoring for 'solr.core.collection1' (registry 'solr.core.collection1') enabled at server: com.sun.jmx.mbeanserver.JmxMBeanServer@6fd4489
   [junit4]   2> 1496771 INFO  (coreLoadExecutor-4039-thread-1) [    x:collection1] o.a.s.c.SolrCore [[collection1] ] Opening new SolrCore at [/home/jenkins/jenkins-slave/workspace/Lucene-Solr-BadApples-Tests-8.x/solr/build/solr-core/test/J1/temp/solr.handler.TestReplicationHandler_EA2B0C83FDDF2B9B-001/solr-instance-002/collection1], dataDir=[/home/jenkins/jenkins-slave/workspace/Lucene-Solr-BadApples-Tests-8.x/solr/build/solr-core/test/J1/temp/solr.handler.TestReplicationHandler_EA2B0C83FDDF2B9B-001/solr-instance-002/./collection1/data/]
   [junit4]   2> 1496797 INFO  (coreLoadExecutor-4039-thread-1) [    x:collection1] o.a.s.u.RandomMergePolicy RandomMergePolicy wrapping class org.apache.lucene.index.TieredMergePolicy: [TieredMergePolicy: maxMergeAtOnce=15, maxMergeAtOnceExplicit=35, maxMergedSegmentMB=18.646484375, floorSegmentMB=1.5458984375, forceMergeDeletesPctAllowed=28.88866695006085, segmentsPerTier=25.0, maxCFSSegmentSizeMB=8.796093022207999E12, noCFSRatio=0.0, deletesPctAllowed=21.478214096865635
   [junit4]   2> 1496959 INFO  (coreLoadExecutor-4039-thread-1) [    x:collection1] o.a.s.u.CommitTracker Hard AutoCommit: disabled
   [junit4]   2> 1496959 INFO  (coreLoadExecutor-4039-thread-1) [    x:collection1] o.a.s.u.CommitTracker Soft AutoCommit: disabled
   [junit4]   2> 1496960 INFO  (coreLoadExecutor-4039-thread-1) [    x:collection1] o.a.s.u.RandomMergePolicy RandomMergePolicy wrapping class org.apache.lucene.index.LogByteSizeMergePolicy: [LogByteSizeMergePolicy: minMergeSize=1677721, mergeFactor=47, maxMergeSize=2147483648, maxMergeSizeForForcedMerge=9223372036854775807, calibrateSizeByDeletes=false, maxMergeDocs=2147483647, maxCFSSegmentSizeMB=8.796093022207999E12, noCFSRatio=1.0]
   [junit4]   2> 1496960 INFO  (coreLoadExecutor-4039-thread-1) [    x:collection1] o.a.s.s.SolrIndexSearcher Opening [Searcher@37adf74e[collection1] main]
   [junit4]   2> 1496960 INFO  (coreLoadExecutor-4039-thread-1) [    x:collection1] o.a.s.r.ManagedResourceStorage File-based storage initialized to use dir: /home/jenkins/jenkins-slave/workspace/Lucene-Solr-BadApples-Tests-8.x/solr/build/solr-core/test/J1/temp/solr.handler.TestReplicationHandler_EA2B0C83FDDF2B9B-001/solr-instance-002/collection1/conf
   [junit4]   2> 1496962 INFO  (coreLoadExecutor-4039-thread-1) [    x:collection1] o.a.s.h.ReplicationHandler Poll scheduled at an interval of 1000ms
   [junit4]   2> 1496962 INFO  (coreLoadExecutor-4039-thread-1) [    x:collection1] o.a.s.h.ReplicationHandler Commits will be reserved for 10000ms.
   [junit4]   2> 1496963 INFO  (searcherExecutor-4040-thread-1-processing-x:collection1) [    x:collection1] o.a.s.c.SolrCore [collection1] Registered new searcher Searcher@37adf74e[collection1] main{ExitableDirectoryReader(UninvertingDirectoryReader())}
   [junit4]   2> 1496975 INFO  (TEST-TestReplicationHandler.doTestHandlerPathUnchanged-seed#[EA2B0C83FDDF2B9B]) [    ] o.a.s.SolrTestCaseJ4 ###Ending doTestHandlerPathUnchanged
   [junit4]   2> 1496975 INFO  (TEST-TestReplicationHandler.doTestHandlerPathUnchanged-seed#[EA2B0C83FDDF2B9B]) [    ] o.a.s.c.CoreContainer Shutting down CoreContainer instance=1263779461
   [junit4]   2> 1496976 INFO  (coreCloseExecutor-4045-thread-1) [    x:collection1] o.a.s.c.SolrCore [collection1]  CLOSING SolrCore org.apache.solr.core.SolrCore@3b025513
   [junit4]   2> 1496976 INFO  (coreCloseExecutor-4045-thread-1) [    x:collection1] o.a.s.m.SolrMetricManager Closing metric reporters for registry=solr.core.collection1, tag=3b025513
   [junit4]   2> 1496976 INFO  (coreCloseExecutor-4045-thread-1) [    x:collection1] o.a.s.m.r.SolrJmxReporter Closing reporter [org.apache.solr.metrics.reporters.SolrJmxReporter@628c9ec1: rootName = null, domain = solr.core.collection1, service url = null, agent id = null] for registry solr.core.collection1 / com.codahale.metrics.MetricRegistry@781091e2
   [junit4]   2> 1496977 ERROR (qtp303486112-14357) [    ] o.a.s.s.SolrDispatchFilter Error processing the request. CoreContainer is either not initialized or shutting down.
   [junit4]   2> 1496977 WARN  (qtp303486112-14357) [    ] o.e.j.s.HttpChannel /solr/collection1/replication
   [junit4]   2>           => javax.servlet.UnavailableException: Error processing the request. CoreContainer is either not initialized or shutting down.
   [junit4]   2> 	at org.apache.solr.servlet.SolrDispatchFilter.doFilter(SolrDispatchFilter.java:361)
   [junit4]   2> javax.servlet.UnavailableException: Error processing the request. CoreContainer is either not initialized or shutting down.
   [junit4]   2> 	at org.apache.solr.servlet.SolrDispatchFilter.doFilter(SolrDispatchFilter.java:361) ~[java/:?]
   [junit4]   2> 	at org.apache.solr.servlet.SolrDispatchFilter.doFilter(SolrDispatchFilter.java:343) ~[java/:?]
   [junit4]   2> 	at org.eclipse.jetty.servlet.ServletHandler$CachedChain.doFilter(ServletHandler.java:1610) ~[jetty-servlet-9.4.14.v20181114.jar:9.4.14.v20181114]
   [junit4]   2> 	at org.apache.solr.client.solrj.embedded.JettySolrRunner$DebugFilter.doFilter(JettySolrRunner.java:165) ~[java/:?]
   [junit4]   2> 	at org.eclipse.jetty.servlet.ServletHandler$CachedChain.doFilter(ServletHandler.java:1610) ~[jetty-servlet-9.4.14.v20181114.jar:9.4.14.v20181114]
   [junit4]   2> 	at org.eclipse.jetty.servlet.ServletHandler.doHandle(ServletHandler.java:540) ~[jetty-servlet-9.4.14.v20181114.jar:9.4.14.v20181114]
   [junit4]   2> 	at org.eclipse.jetty.server.handler.ScopedHandler.nextHandle(ScopedHandler.java:255) ~[jetty-server-9.4.14.v20181114.jar:9.4.14.v20181114]
   [junit4]   2> 	at org.eclipse.jetty.server.session.SessionHandler.doHandle(SessionHandler.java:1588) ~[jetty-server-9.4.14.v20181114.jar:9.4.14.v20181114]
   [junit4]   2> 	at org.eclipse.jetty.server.handler.ScopedHandler.nextHandle(ScopedHandler.java:255) ~[jetty-server-9.4.14.v20181114.jar:9.4.14.v20181114]
   [junit4]   2> 	at org.eclipse.jetty.server.handler.ContextHandler.doHandle(ContextHandler.java:1345) ~[jetty-server-9.4.14.v20181114.jar:9.4.14.v20181114]
   [junit4]   2> 	at org.eclipse.jetty.server.handler.ScopedHandler.nextScope(ScopedHandler.java:203) ~[jetty-server-9.4.14.v20181114.jar:9.4.14.v20181114]
   [junit4]   2> 	at org.eclipse.jetty.servlet.ServletHandler.doScope(ServletHandler.java:480) ~[jetty-servlet-9.4.14.v20181114.jar:9.4.14.v20181114]
   [junit4]   2> 	at org.eclipse.jetty.server.session.SessionHandler.doScope(SessionHandler.java:1557) ~[jetty-server-9.4.14.v20181114.jar:9.4.14.v20181114]
   [junit4]   2> 	at org.eclipse.jetty.server.handler.ScopedHandler.nextScope(ScopedHandler.java:201) ~[jetty-server-9.4.14.v20181114.jar:9.4.14.v20181114]
   [junit4]   2> 	at org.eclipse.jetty.server.handler.ContextHandler.doScope(ContextHandler.java:1247) ~[jetty-server-9.4.14.v20181114.jar:9.4.14.v20181114]
   [junit4]   2> 	at org.eclipse.jetty.server.handler.ScopedHandler.handle(ScopedHandler.java:144) ~[jetty-server-9.4.14.v20181114.jar:9.4.14.v20181114]
   [junit4]   2> 	at org.eclipse.jetty.server.handler.gzip.GzipHandler.handle(GzipHandler.java:753) ~[jetty-server-9.4.14.v20181114.jar:9.4.14.v20181114]
   [junit4]   2> 	at org.eclipse.jetty.server.handler.HandlerWrapper.handle(HandlerWrapper.java:132) ~[jetty-server-9.4.14.v20181114.jar:9.4.14.v20181114]
   [junit4]   2> 	at org.eclipse.jetty.server.Server.handle(Server.java:502) ~[jetty-server-9.4.14.v20181114.jar:9.4.14.v20181114]
   [junit4]   2> 	at org.eclipse.jetty.server.HttpChannel.handle(HttpChannel.java:364) ~[jetty-server-9.4.14.v20181114.jar:9.4.14.v20181114]
   [junit4]   2> 	at org.eclipse.jetty.server.HttpConnection.onFillable(HttpConnection.java:260) ~[jetty-server-9.4.14.v20181114.jar:9.4.14.v20181114]
   [junit4]   2> 	at org.eclipse.jetty.io.AbstractConnection$ReadCallback.succeeded(AbstractConnection.java:305) ~[jetty-io-9.4.14.v20181114.jar:9.4.14.v20181114]
   [junit4]   2> 	at org.eclipse.jetty.io.FillInterest.fillable(FillInterest.java:103) ~[jetty-io-9.4.14.v20181114.jar:9.4.14.v20181114]
   [junit4]   2> 	at org.eclipse.jetty.io.ChannelEndPoint$2.run(ChannelEndPoint.java:118) ~[jetty-io-9.4.14.v20181114.jar:9.4.14.v20181114]
   [junit4]   2> 	at org.eclipse.jetty.util.thread.QueuedThreadPool.runJob(QueuedThreadPool.java:765) ~[jetty-util-9.4.14.v20181114.jar:9.4.14.v20181114]
   [junit4]   2> 	at org.eclipse.jetty.util.thread.QueuedThreadPool$2.run(QueuedThreadPool.java:683) ~[jetty-util-9.4.14.v20181114.jar:9.4.14.v20181114]
   [junit4]   2> 	at java.lang.Thread.run(Thread.java:748) [?:1.8.0_191]
   [junit4]   2> 1497004 WARN  (indexFetcher-4044-thread-1) [    ] o.a.s.h.IndexFetcher Master at: http://127.0.0.1:36143/solr/collection1 is not available. Index fetch failed by exception: org.apache.solr.client.solrj.impl.HttpSolrClient$RemoteSolrException: Error from server at http://127.0.0.1:36143/solr/collection1: Expected mime type application/octet-stream but got text/html. <html>
   [junit4]   2> <head>
   [junit4]   2> <meta http-equiv="Content-Type" content="text/html;charset=utf-8"/>
   [junit4]   2> <title>Error 404 Not Found</title>
   [junit4]   2> </head>
   [junit4]   2> <body><h2>HTTP ERROR 404</h2>
   [junit4]   2> <p>Problem accessing /solr/collection1/replication. Reason:
   [junit4]   2> <pre>    Not Found</pre></p><h3>Caused by:</h3><pre>javax.servlet.UnavailableException: Error processing the request. CoreContainer is either not initialized or shutting down.
   [junit4]   2> 	at org.apache.solr.servlet.SolrDispatchFilter.doFilter(SolrDispatchFilter.java:361)
   [junit4]   2> 	at org.apache.solr.servlet.SolrDispatchFilter.doFilter(SolrDispatchFilter.java:343)
   [junit4]   2> 	at org.eclipse.jetty.servlet.ServletHandler$CachedChain.doFilter(ServletHandler.java:1610)
   [junit4]   2> 	at org.apache.solr.client.solrj.embedded.JettySolrRunner$DebugFilter.doFilter(JettySolrRunner.java:165)
   [junit4]   2> 	at org.eclipse.jetty.servlet.ServletHandler$CachedChain.doFilter(ServletHandler.java:1610)
   [junit4]   2> 	at org.eclipse.jetty.servlet.ServletHandler.doHandle(ServletHandler.java:540)
   [junit4]   2> 	at org.eclipse.jetty.server.handler.ScopedHandler.nextHandle(ScopedHandler.java:255)
   [junit4]   2> 	at org.eclipse.jetty.server.session.SessionHandler.doHandle(SessionHandler.java:1588)
   [junit4]   2> 	at org.eclipse.jetty.server.handler.ScopedHandler.nextHandle(ScopedHandler.java:255)
   [junit4]   2> 	at org.eclipse.jetty.server.handler.ContextHandler.doHandle(ContextHandler.java:1345)
   [junit4]   2> 	at org.eclipse.jetty.server.handler.ScopedHandler.nextScope(ScopedHandler.java:203)
   [junit4]   2> 	at org.eclipse.jetty.servlet.ServletHandler.doScope(ServletHandler.java:480)
   [junit4]   2> 	at org.eclipse.jetty.server.session.SessionHandler.doScope(SessionHandler.java:1557)
   [junit4]   2> 	at org.eclipse.jetty.server.handler.ScopedHandler.nextScope(ScopedHandler.java:201)
   [junit4]   2> 	at org.eclipse.jetty.server.handler.ContextHandler.doScope(ContextHandler.java:1247)
   [junit4]   2> 	at org.eclipse.jetty.server.handler.ScopedHandler.handle(ScopedHandler.java:144)
   [junit4]   2> 	at org.eclipse.jetty.server.handler.gzip.GzipHandler.handle(GzipHandler.java:753)
   [junit4]   2> 	at org.eclipse.jetty.server.handler.HandlerWrapper.handle(HandlerWrapper.java:132)
   [junit4]   2> 	at org.eclipse.jetty.server.Server.handle(Server.java:502)
   [junit4]   2> 	at org.eclipse.jetty.server.HttpChannel.handle(HttpChannel.java:364)
   [junit4]   2> 	at org.eclipse.jetty.server.HttpConnection.onFillable(HttpConnection.java:260)
   [junit4]   2> 	at org.eclipse.jetty.io.AbstractConnection$ReadCallback.succeeded(AbstractConnection.java:305)
   [junit4]   2> 	at org.eclipse.jetty.io.FillInterest.fillable(FillInterest.java:103)
   [junit4]   2> 	at org.eclipse.jetty.io.ChannelEndPoint$2.run(ChannelEndPoint.java:118)
   [junit4]   2> 	at org.eclipse.jetty.util.thread.QueuedThreadPool.runJob(QueuedThreadPool.java:765)
   [junit4]   2> 	at org.eclipse.jetty.util.thread.QueuedThreadPool$2.run(QueuedThreadPool.java:683)
   [junit4]   2> 	at java.lang.Thread.run(Thread.java:748)
   [junit4]   2> </pre>
   [junit4]   2> <hr><a href="http://eclipse.org/jetty">Powered by Jetty:// 9.4.14.v20181114</a><hr/>
   [junit4]   2> 
   [junit4]   2> </body>
   [junit4]   2> </html>
   [junit4]   2> 
   [junit4]   2> 1497010 INFO  (TEST-TestReplicationHandler.doTestHandlerPathUnchanged-seed#[EA2B0C83FDDF2B9B]) [    ] o.a.s.m.SolrMetricManager Closing metric reporters for registry=solr.node, tag=null
   [junit4]   2> 1497010 INFO  (TEST-TestReplicationHandler.doTestHandlerPathUnchanged-seed#[EA2B0C83FDDF2B9B]) [    ] o.a.s.m.r.SolrJmxReporter Closing reporter [org.apache.solr.metrics.reporters.SolrJmxReporter@64de6715: rootName = null, domain = solr.node, service url = null, agent id = null] for registry solr.node / com.codahale.metrics.MetricRegistry@3503fc6e
   [junit4]   2> 1497029 INFO  (TEST-TestReplicationHandler.doTestHandlerPathUnchanged-seed#[EA2B0C83FDDF2B9B]) [    ] o.a.s.m.SolrMetricManager Closing metric reporters for registry=solr.jvm, tag=null
   [junit4]   2> 1497029 INFO  (TEST-TestReplicationHandler.doTestHandlerPathUnchanged-seed#[EA2B0C83FDDF2B9B]) [    ] o.a.s.m.r.SolrJmxReporter Closing reporter [org.apache.solr.metrics.reporters.SolrJmxReporter@73f3b1ec: rootName = null, domain = solr.jvm, service url = null, agent id = null] for registry solr.jvm / com.codahale.metrics.MetricRegistry@937664
   [junit4]   2> 1497043 INFO  (TEST-TestReplicationHandler.doTestHandlerPathUnchanged-seed#[EA2B0C83FDDF2B9B]) [    ] o.a.s.m.SolrMetricManager Closing metric reporters for registry=solr.jetty, tag=null
   [junit4]   2> 1497043 INFO  (TEST-TestReplicationHandler.doTestHandlerPathUnchanged-seed#[EA2B0C83FDDF2B9B]) [    ] o.a.s.m.r.SolrJmxReporter Closing reporter [org.apache.solr.metrics.reporters.SolrJmxReporter@10b65268: rootName = null, domain = solr.jetty, service url = null, agent id = null] for registry solr.jetty / com.codahale.metrics.MetricRegistry@2e46d142
   [junit4]   2> 1497046 INFO  (TEST-TestReplicationHandler.doTestHandlerPathUnchanged-seed#[EA2B0C83FDDF2B9B]) [    ] o.e.j.s.AbstractConnector Stopped ServerConnector@6cf0259b{HTTP/1.1,[http/1.1, h2c]}{127.0.0.1:0}
   [junit4]   2> 1497046 INFO  (TEST-TestReplicationHandler.doTestHandlerPathUnchanged-seed#[EA2B0C83FDDF2B9B]) [    ] o.e.j.s.h.ContextHandler Stopped o.e.j.s.ServletContextHandler@369ed69b{/solr,null,UNAVAILABLE}
   [junit4]   2> 1497046 INFO  (TEST-TestReplicationHandler.doTestHandlerPathUnchanged-seed#[EA2B0C83FDDF2B9B]) [    ] o.e.j.s.session node0 Stopped scavenging
   [junit4]   2> 1497047 INFO  (TEST-TestReplicationHandler.doTestHandlerPathUnchanged-seed#[EA2B0C83FDDF2B9B]) [    ] o.a.s.c.CoreContainer Shutting down CoreContainer instance=2144428188
   [junit4]   2> 1497076 INFO  (coreCloseExecutor-4047-thread-1) [    x:collection1] o.a.s.c.SolrCore [collection1]  CLOSING SolrCore org.apache.solr.core.SolrCore@4fd45a2b
   [junit4]   2> 1497076 INFO  (coreCloseExecutor-4047-thread-1) [    x:collection1] o.a.s.m.SolrMetricManager Closing metric reporters for registry=solr.core.collection1, tag=4fd45a2b
   [junit4]   2> 1497076 INFO  (coreCloseExecutor-4047-thread-1) [    x:collection1] o.a.s.m.r.SolrJmxReporter Closing reporter [org.apache.solr.metrics.reporters.SolrJmxReporter@5245d5c0: rootName = null, domain = solr.core.collection1, service url = null, agent id = null] for registry solr.core.collection1 / com.codahale.metrics.MetricRegistry@23b4d05
   [junit4]   2> 1497117 INFO  (TEST-TestReplicationHandler.doTestHandlerPathUnchanged-seed#[EA2B0C83FDDF2B9B]) [    ] o.a.s.m.SolrMetricManager Closing metric reporters for registry=solr.node, tag=null
   [junit4]   2> 1497117 INFO  (TEST-TestReplicationHandler.doTestHandlerPathUnchanged-seed#[EA2B0C83FDDF2B9B]) [    ] o.a.s.m.r.SolrJmxReporter Closing reporter [org.apache.solr.metrics.reporters.SolrJmxReporter@796c55c6: rootName = null, domain = solr.node, service url = null, agent id = null] for registry solr.node / com.codahale.metrics.MetricRegistry@455dd2c
   [junit4]   2> 1497133 INFO  (TEST-TestReplicationHandler.doTestHandlerPathUnchanged-seed#[EA2B0C83FDDF2B9B]) [    ] o.a.s.m.SolrMetricManager Closing metric reporters for registry=solr.jvm, tag=null
   [junit4]   2> 1497133 INFO  (TEST-TestReplicationHandler.doTestHandlerPathUnchanged-seed#[EA2B0C83FDDF2B9B]) [    ] o.a.s.m.r.SolrJmxReporter Closing reporter [org.apache.solr.metrics.reporters.SolrJmxReporter@5473dac1: rootName = null, domain = solr.jvm, service url = null, agent id = null] for registry solr.jvm / com.codahale.metrics.MetricRegistry@937664
   [junit4]   2> 1497136 INFO  (TEST-TestReplicationHandler.doTestHandlerPathUnchanged-seed#[EA2B0C83FDDF2B9B]) [    ] o.a.s.m.SolrMetricManager Closing metric reporters for registry=solr.jetty, tag=null
   [junit4]   2> 1497136 INFO  (TEST-TestReplicationHandler.doTestHandlerPathUnchanged-seed#[EA2B0C83FDDF2B9B]) [    ] o.a.s.m.r.SolrJmxReporter Closing reporter [org.apache.solr.metrics.reporters.SolrJmxReporter@49a54d80: rootName = null, domain = solr.jetty, service url = null, agent id = null] for registry solr.jetty / com.codahale.metrics.MetricRegistry@2e46d142
   [junit4]   2> 1497153 INFO  (TEST-TestReplicationHandler.doTestHandlerPathUnchanged-seed#[EA2B0C83FDDF2B9B]) [    ] o.e.j.s.AbstractConnector Stopped ServerConnector@6891b77b{HTTP/1.1,[http/1.1, h2c]}{127.0.0.1:0}
   [junit4]   2> 1497153 INFO  (TEST-TestReplicationHandler.doTestHandlerPathUnchanged-seed#[EA2B0C83FDDF2B9B]) [    ] o.e.j.s.h.ContextHandler Stopped o.e.j.s.ServletContextHandler@6a3f38{/solr,null,UNAVAILABLE}
   [junit4]   2> 1497153 INFO  (TEST-TestReplicationHandler.doTestHandlerPathUnchanged-seed#[EA2B0C83FDDF2B9B]) [    ] o.e.j.s.session node0 Stopped scavenging
   [junit4]   2> 1497205 INFO  (TEST-TestReplicationHandler.doTestIndexAndConfigAliasReplication-seed#[EA2B0C83FDDF2B9B]) [    ] o.a.s.SolrTestCaseJ4 ###Starting doTestIndexAndConfigAliasReplication
   [junit4]   2> 1497205 INFO  (TEST-TestReplicationHandler.doTestIndexAndConfigAliasReplication-seed#[EA2B0C83FDDF2B9B]) [    ] o.a.s.SolrTestCaseJ4 Writing core.properties file to /home/jenkins/jenkins-slave/workspace/Lucene-Solr-BadApples-Tests-8.x/solr/build/solr-core/test/J1/temp/solr.handler.TestReplicationHandler_EA2B0C83FDDF2B9B-001/solr-instance-003/collection1
   [junit4]   2> 1497208 WARN  (TEST-TestReplicationHandler.doTestIndexAndConfigAliasReplication-seed#[EA2B0C83FDDF2B9B]) [    ] o.e.j.s.AbstractConnector Ignoring deprecated socket close linger time
   [junit4]   2> 1497208 INFO  (TEST-TestReplicationHandler.doTestIndexAndConfigAliasReplication-seed#[EA2B0C83FDDF2B9B]) [    ] o.a.s.c.s.e.JettySolrRunner Start Jetty (original configured port=0)
   [junit4]   2> 1497208 INFO  (TEST-TestReplicationHandler.doTestIndexAndConfigAliasReplication-seed#[EA2B0C83FDDF2B9B]) [    ] o.a.s.c.s.e.JettySolrRunner Trying to start Jetty on port 0 try number 1 ...
   [junit4]   2> 1497208 INFO  (TEST-TestReplicationHandler.doTestIndexAndConfigAliasReplication-seed#[EA2B0C83FDDF2B9B]) [    ] o.e.j.s.Server jetty-9.4.14.v20181114; built: 2018-11-14T21:20:31.478Z; git: c4550056e785fb5665914545889f21dc136ad9e6; jvm 1.8.0_191-b12
   [junit4]   2> 1497209 INFO  (TEST-TestReplicationHandler.doTestIndexAndConfigAliasReplication-seed#[EA2B0C83FDDF2B9B]) [    ] o.e.j.s.session DefaultSessionIdManager workerName=node0
   [junit4]   2> 1497209 INFO  (TEST-TestReplicationHandler.doTestIndexAndConfigAliasReplication-seed#[EA2B0C83FDDF2B9B]) [    ] o.e.j.s.session No SessionScavenger set, using defaults
   [junit4]   2> 1497209 INFO  (TEST-TestReplicationHandler.doTestIndexAndConfigAliasReplication-seed#[EA2B0C83FDDF2B9B]) [    ] o.e.j.s.session node0 Scavenging every 600000ms
   [junit4]   2> 1497246 INFO  (TEST-TestReplicationHandler.doTestIndexAndConfigAliasReplication-seed#[EA2B0C83FDDF2B9B]) [    ] o.e.j.s.h.ContextHandler Started o.e.j.s.ServletContextHandler@312c3c4{/solr,null,AVAILABLE}
   [junit4]   2> 1497246 INFO  (TEST-TestReplicationHandler.doTestIndexAndConfigAliasReplication-seed#[EA2B0C83FDDF2B9B]) [    ] o.e.j.s.AbstractConnector Started ServerConnector@2fdd64c1{HTTP/1.1,[http/1.1, h2c]}{127.0.0.1:35380}
   [junit4]   2> 1497247 INFO  (TEST-TestReplicationHandler.doTestIndexAndConfigAliasReplication-seed#[EA2B0C83FDDF2B9B]) [    ] o.e.j.s.Server Started @1497496ms
   [junit4]   2> 1497247 INFO  (TEST-TestReplicationHandler.doTestIndexAndConfigAliasReplication-seed#[EA2B0C83FDDF2B9B]) [    ] o.a.s.c.s.e.JettySolrRunner Jetty properties: {solr.data.dir=/home/jenkins/jenkins-slave/workspace/Lucene-Solr-BadApples-Tests-8.x/solr/build/solr-core/test/J1/temp/solr.handler.TestReplicationHandler_EA2B0C83FDDF2B9B-001/solr-instance-003/collection1/data, hostContext=/solr, hostPort=35380}
   [junit4]   2> 1497247 ERROR (TEST-TestReplicationHandler.doTestIndexAndConfigAliasReplication-seed#[EA2B0C83FDDF2B9B]) [    ] o.a.s.u.StartupLoggingUtils Missing Java Option solr.log.dir. Logging may be missing or incomplete.
   [junit4]   2> 1497247 INFO  (TEST-TestReplicationHandler.doTestIndexAndConfigAliasReplication-seed#[EA2B0C83FDDF2B9B]) [    ] o.a.s.s.SolrDispatchFilter Using logger factory org.apache.logging.slf4j.Log4jLoggerFactory
   [junit4]   2> 1497247 INFO  (TEST-TestReplicationHandler.doTestIndexAndConfigAliasReplication-seed#[EA2B0C83FDDF2B9B]) [    ] o.a.s.s.SolrDispatchFilter  ___      _       Welcome to Apache Solr? version 8.2.0
   [junit4]   2> 1497247 INFO  (TEST-TestReplicationHandler.doTestIndexAndConfigAliasReplication-seed#[EA2B0C83FDDF2B9B]) [    ] o.a.s.s.SolrDispatchFilter / __| ___| |_ _   Starting in standalone mode on port null
   [junit4]   2> 1497247 INFO  (TEST-TestReplicationHandler.doTestIndexAndConfigAliasReplication-seed#[EA2B0C83FDDF2B9B]) [    ] o.a.s.s.SolrDispatchFilter \__ \/ _ \ | '_|  Install dir: null
   [junit4]   2> 1497247 INFO  (TEST-TestReplicationHandler.doTestIndexAndConfigAliasReplication-seed#[EA2B0C83FDDF2B9B]) [    ] o.a.s.s.SolrDispatchFilter |___/\___/_|_|    Start time: 2019-05-18T03:46:19.865Z
   [junit4]   2> 1497247 INFO  (TEST-TestReplicationHandler.doTestIndexAndConfigAliasReplication-seed#[EA2B0C83FDDF2B9B]) [    ] o.a.s.c.SolrXmlConfig Loading container configuration from /home/jenkins/jenkins-slave/workspace/Lucene-Solr-BadApples-Tests-8.x/solr/build/solr-core/test/J1/temp/solr.handler.TestReplicationHandler_EA2B0C83FDDF2B9B-001/solr-instance-003/solr.xml
   [junit4]   2> 1497269 INFO  (TEST-TestReplicationHandler.doTestIndexAndConfigAliasReplication-seed#[EA2B0C83FDDF2B9B]) [    ] o.a.s.c.SolrXmlConfig Configuration parameter autoReplicaFailoverWorkLoopDelay is ignored
   [junit4]   2> 1497269 INFO  (TEST-TestReplicationHandler.doTestIndexAndConfigAliasReplication-seed#[EA2B0C83FDDF2B9B]) [    ] o.a.s.c.SolrXmlConfig Configuration parameter autoReplicaFailoverBadNodeExpiration is ignored
   [junit4]   2> 1497283 INFO  (TEST-TestReplicationHandler.doTestIndexAndConfigAliasReplication-seed#[EA2B0C83FDDF2B9B]) [    ] o.a.s.c.SolrXmlConfig MBean server found: com.sun.jmx.mbeanserver.JmxMBeanServer@6fd4489, but no JMX reporters were configured - adding default JMX reporter.
   [junit4]   2> 1497745 INFO  (TEST-TestReplicationHandler.doTestIndexAndConfigAliasReplication-seed#[EA2B0C83FDDF2B9B]) [    ] o.a.s.h.c.HttpShardHandlerFactory Host whitelist initialized: WhitelistHostChecker [whitelistHosts=null, whitelistHostCheckingEnabled=true]
   [junit4]   2> 1497746 WARN  (TEST-TestReplicationHandler.doTestIndexAndConfigAliasReplication-seed#[EA2B0C83FDDF2B9B]) [    ] o.e.j.u.s.S.config No Client EndPointIdentificationAlgorithm configured for SslContextFactory@507ff1e8[provider=null,keyStore=null,trustStore=null]
   [junit4]   2> 1497761 WARN  (TEST-TestReplicationHandler.doTestIndexAndConfigAliasReplication-seed#[EA2B0C83FDDF2B9B]) [    ] o.e.j.u.s.S.config No Client EndPointIdentificationAlgorithm configured for SslContextFactory@537b6a53[provider=null,keyStore=null,trustStore=null]
   [junit4]   2> 1497814 INFO  (TEST-TestReplicationHandler.doTestIndexAndConfigAliasReplication-seed#[EA2B0C83FDDF2B9B]) [    ] o.a.s.c.TransientSolrCoreCacheDefault Allocating transient cache for 4 transient cores
   [junit4]   2> 1497814 INFO  (TEST-TestReplicationHandler.doTestIndexAndConfigAliasReplication-seed#[EA2B0C83FDDF2B9B]) [    ] o.a.s.h.a.MetricsHistoryHandler No .system collection, keeping metrics history in memory.
   [junit4]   2> 1497837 INFO  (TEST-TestReplicationHandler.doTestIndexAndConfigAliasReplication-seed#[EA2B0C83FDDF2B9B]) [    ] o.a.s.m.r.SolrJmxReporter JMX monitoring for 'solr.node' (registry 'solr.node') enabled at server: com.sun.jmx.mbeanserver.JmxMBeanServer@6fd4489
   [junit4]   2> 1497856 INFO  (TEST-TestReplicationHandler.doTestIndexAndConfigAliasReplication-seed#[EA2B0C83FDDF2B9B]) [    ] o.a.s.m.r.SolrJmxReporter JMX monitoring for 'solr.jvm' (registry 'solr.jvm') enabled at server: com.sun.jmx.mbeanserver.JmxMBeanServer@6fd4489
   [junit4]   2> 1497856 INFO  (TEST-TestReplicationHandler.doTestIndexAndConfigAliasReplication-seed#[EA2B0C83FDDF2B9B]) [    ] o.a.s.m.r.SolrJmxReporter JMX monitoring for 'solr.jetty' (registry 'solr.jetty') enabled at server: com.sun.jmx.mbeanserver.JmxMBeanServer@6fd4489
   [junit4]   2> 1497866 INFO  (TEST-TestReplicationHandler.doTestIndexAndConfigAliasReplication-seed#[EA2B0C83FDDF2B9B]) [    ] o.a.s.c.CorePropertiesLocator Found 1 core definitions underneath /home/jenkins/jenkins-slave/workspace/Lucene-Solr-BadApples-Tests-8.x/solr/build/solr-core/test/J1/temp/solr.handler.TestReplicationHandler_EA2B0C83FDDF2B9B-001/solr-instance-003/.
   [junit4]   2> 1497866 INFO  (TEST-TestReplicationHandler.doTestIndexAndConfigAliasReplication-seed#[EA2B0C83FDDF2B9B]) [    ] o.a.s.c.CorePropertiesLocator Cores are: [collection1]
   [junit4]   2> 1497894 INFO  (coreLoadExecutor-4057-thread-1) [    x:collection1] o.a.s.c.SolrConfig Using Lucene MatchVersion: 8.2.0
   [junit4]   2> 1497923 INFO  (coreLoadExecutor-4057-thread-1) [    x:collection1] o.a.s.s.IndexSchema [collection1] Schema name=test
   [junit4]   2> 1497925 INFO  (coreLoadExecutor-4057-thread-1) [    x:collection1] o.a.s.s.IndexSchema Loaded schema test/1.2 with uniqueid field id
   [junit4]   2> 1497925 INFO  (coreLoadExecutor-4057-thread-1) [    x:collection1] o.a.s.c.CoreContainer Creating SolrCore 'collection1' using configuration from instancedir /home/jenkins/jenkins-slave/workspace/Lucene-Solr-BadApples-Tests-8.x/solr/build/solr-core/test/J1/temp/solr.handler.TestReplicationHandler_EA2B0C83FDDF2B9B-001/solr-instance-003/./collection1, trusted=true
   [junit4]   2> 1497925 INFO  (coreLoadExecutor-4057-thread-1) [    x:collection1] o.a.s.m.r.SolrJmxReporter JMX monitoring for 'solr.core.collection1' (registry 'solr.core.collection1') enabled at server: com.sun.jmx.mbeanserver.JmxMBeanServer@6fd4489
   [junit4]   2> 1497925 INFO  (coreLoadExecutor-4057-thread-1) [    x:collection1] o.a.s.c.SolrCore [[collection1] ] Opening new SolrCore at [/home/jenkins/jenkins-slave/workspace/Lucene-Solr-BadApples-Tests-8.x/solr/build/solr-core/test/J1/temp/solr.handler.TestReplicationHandler_EA2B0C83FDDF2B9B-001/solr-instance-003/collection1], dataDir=[/home/jenkins/jenkins-slave/workspace/Lucene-Solr-BadApples-Tests-8.x/solr/build/solr-core/test/J1/temp/solr.handler.TestReplicationHandler_EA2B0C83FDDF2B9B-001/solr-instance-003/./collection1/data/]
   [junit4]   2> 1497935 INFO  (coreLoadExecutor-4057-thread-1) [    x:collection1] o.a.s.u.RandomMergePolicy RandomMergePolicy wrapping class org.apache.lucene.index.TieredMergePolicy: [TieredMergePolicy: maxMergeAtOnce=15, maxMergeAtOnceExplicit=35, maxMergedSegmentMB=18.646484375, floorSegmentMB=1.5458984375, forceMergeDeletesPctAllowed=28.88866695006085, segmentsPerTier=25.0, maxCFSSegmentSizeMB=8.796093022207999E12, noCFSRatio=0.0, deletesPctAllowed=21.478214096865635
   [junit4]   2> 1498033 INFO  (coreLoadExecutor-4057-thread-1) [    x:collection1] o.a.s.u.CommitTracker Hard AutoCommit: disabled
   [junit4]   2> 1498033 INFO  (coreLoadExecutor-4057-thread-1) [    x:collection1] o.a.s.u.CommitTracker Soft AutoCommit: disabled
   [junit4]   2> 1498034 INFO  (coreLoadExecutor-4057-thread-1) [    x:collection1] o.a.s.u.RandomMergePolicy RandomMergePolicy wrapping class org.apache.lucene.index.LogByteSizeMergePolicy: [LogByteSizeMergePolicy: minMergeSize=1677721, mergeFactor=47, maxMergeSize=2147483648, maxMergeSizeForForcedMerge=9223372036854775807, calibrateSizeByDeletes=false, maxMergeDocs=2147483647, maxCFSSegmentSizeMB=8.796093022207999E12, noCFSRatio=1.0]
   [junit4]   2> 1498034 INFO  (coreLoadExecutor-4057-thread-1) [    x:collection1] o.a.s.s.SolrIndexSearcher Opening [Searcher@6d72fa56[collection1] main]
   [junit4]   2> 1498034 INFO  (coreLoadExecutor-4057-thread-1) [    x:collection1] o.a.s.r.ManagedResourceStorage File-based storage initialized to use dir: /home/jenkins/jenkins-slave/workspace/Lucene-Solr-BadApples-Tests-8.x/solr/build/solr-core/test/J1/temp/solr.handler.TestReplicationHandler_EA2B0C83FDDF2B9B-001/solr-instance-003/collection1/conf
   [junit4]   2> 1498035 INFO  (coreLoadExecutor-4057-thread-1) [    x:collection1] o.a.s.h.ReplicationHandler Replication enabled for following config files: schema.xml,xslt/dummy.xsl
   [junit4]   2> 1498035 INFO  (coreLoadExecutor-4057-thread-1) [    x:collection1] o.a.s.h.ReplicationHandler Commits will be reserved for 10000ms.
   [junit4]   2> 1498035 INFO  (searcherExecutor-4058-thread-1-processing-x:collection1) [    x:collection1] o.a.s.c.SolrCore [collection1] Registered new searcher Searcher@6d72fa56[collection1] main{ExitableDirectoryReader(UninvertingDirectoryReader())}
   [junit4]   2> 1498036 INFO  (TEST-TestReplicationHandler.doTestIndexAndConfigAliasReplication-seed#[EA2B0C83FDDF2B9B]) [    ] o.a.s.SolrTestCaseJ4 Writing core.properties file to /home/jenkins/jenkins-slave/workspace/Lucene-Solr-BadApples-Tests-8.x/solr/build/solr-core/test/J1/temp/solr.handler.TestReplicationHandler_EA2B0C83FDDF2B9B-001/solr-instance-004/collection1
   [junit4]   2> 1498039 WARN  (TEST-TestReplicationHandler.doTestIndexAndConfigAliasReplication-seed#[EA2B0C83FDDF2B9B]) [    ] o.e.j.s.AbstractConnector Ignoring deprecated socket close linger time
   [junit4]   2> 1498039 INFO  (TEST-TestReplicationHandler.doTestIndexAndConfigAliasReplication-seed#[EA2B0C83FDDF2B9B]) [    ] o.a.s.c.s.e.JettySolrRunner Start Jetty (original configured port=0)
   [junit4]   2> 1498039 INFO  (TEST-TestReplicationHandler.doTestIndexAndConfigAliasReplication-seed#[EA2B0C83FDDF2B9B]) [    ] o.a.s.c.s.e.JettySolrRunner Trying to start Jetty on port 0 try number 1 ...
   [junit4]   2> 1498039 INFO  (TEST-TestReplicationHandler.doTestIndexAndConfigAliasReplication-seed#[EA2B0C83FDDF2B9B]) [    ] o.e.j.s.Server jetty-9.4.14.v20181114; built: 2018-11-14T21:20:31.478Z; git: c4550056e785fb5665914545889f21dc136ad9e6; jvm 1.8.0_191-b12
   [junit4]   2> 1498043 INFO  (TEST-TestReplicationHandler.doTestIndexAndConfigAliasReplication-seed#[EA2B0C83FDDF2B9B]) [    ] o.e.j.s.session DefaultSessionIdManager workerName=node0
   [junit4]   2> 1498043 INFO  (TEST-TestReplicationHandler.doTestIndexAndConfigAliasReplication-seed#[EA2B0C83FDDF2B9B]) [    ] o.e.j.s.session No SessionScavenger set, using defaults
   [junit4]   2> 1498043 INFO  (TEST-TestReplicationHandler.doTestIndexAndConfigAliasReplication-seed#[EA2B0C83FDDF2B9B]) [    ] o.e.j.s.session node0 Scavenging every 600000ms
   [junit4]   2> 1498043 INFO  (TEST-TestReplicationHandler.doTestIndexAndConfigAliasReplication-seed#[EA2B0C83FDDF2B9B]) [    ] o.e.j.s.h.ContextHandler Started o.e.j.s.ServletContextHandler@3d60b0a5{/solr,null,AVAILABLE}
   [junit4]   2> 1498043 INFO  (TEST-TestReplicationHandler.doTestIndexAndConfigAliasReplication-seed#[EA2B0C83FDDF2B9B]) [    ] o.e.j.s.AbstractConnector Started ServerConnector@5a55ad15{HTTP/1.1,[http/1.1, h2c]}{127.0.0.1:46058}
   [junit4]   2> 1498044 INFO  (TEST-TestReplicationHandler.doTestIndexAndConfigAliasReplication-seed#[EA2B0C83FDDF2B9B]) [    ] o.e.j.s.Server Started @1498293ms
   [junit4]   2> 1498044 INFO  (TEST-TestReplicationHandler.doTestIndexAndConfigAliasReplication-seed#[EA2B0C83FDDF2B9B]) [    ] o.a.s.c.s.e.JettySolrRunner Jetty properties: {solr.data.dir=/home/jenkins/jenkins-slave/workspace/Lucene-Solr-BadApples-Tests-8.x/solr/build/solr-core/test/J1/temp/solr.handler.TestReplicationHandler_EA2B0C83FDDF2B9B-001/solr-instance-004/collection1/data, hostContext=/solr, hostPort=46058}
   [junit4]   2> 1498044 ERROR (TEST-TestReplicationHandler.doTestIndexAndConfigAliasReplication-seed#[EA2B0C83FDDF2B9B]) [    ] o.a.s.u.StartupLoggingUtils Missing Java Option solr.log.dir. Logging may be missing or incomplete.
   [junit4]   2> 1498044 INFO  (TEST-TestReplicationHandler.doTestIndexAndConfigAliasReplication-seed#[EA2B0C83FDDF2B9B]) [    ] o.a.s.s.SolrDispatchFilter Using logger factory org.apache.logging.slf4j.Log4jLoggerFactory
   [junit4]   2> 1498044 INFO  (TEST-TestReplicationHandler.doTestIndexAndConfigAliasReplication-seed#[EA2B0C83FDDF2B9B]) [    ] o.a.s.s.SolrDispatchFilter  ___      _       Welcome to Apache Solr? version 8.2.0
   [junit4]   2> 1498044 INFO  (TEST-TestReplicationHandler.doTestIndexAndConfigAliasReplication-seed#[EA2B0C83FDDF2B9B]) [    ] o.a.s.s.SolrDispatchFilter / __| ___| |_ _   Starting in standalone mode on port null
   [junit4]   2> 1498044 INFO  (TEST-TestReplicationHandler.doTestIndexAndConfigAliasReplication-seed#[EA2B0C83FDDF2B9B]) [    ] o.a.s.s.SolrDispatchFilter \__ \/ _ \ | '_|  Install dir: null
   [junit4]   2> 1498044 INFO  (TEST-TestReplicationHandler.doTestIndexAndConfigAliasReplication-seed#[EA2B0C83FDDF2B9B]) [    ] o.a.s.s.SolrDispatchFilter |___/\___/_|_|    Start time: 2019-05-18T03:46:20.662Z
   [junit4]   2> 1498044 INFO  (TEST-TestReplicationHandler.doTestIndexAndConfigAliasReplication-seed#[EA2B0C83FDDF2B9B]) [    ] o.a.s.c.SolrXmlConfig Loading container configuration from /home/jenkins/jenkins-slave/workspace/Lucene-Solr-BadApples-Tests-8.x/solr/build/solr-core/test/J1/temp/solr.handler.TestReplicationHandler_EA2B0C83FDDF2B9B-001/solr-instance-004/solr.xml
   [junit4]   2> 1498047 INFO  (TEST-TestReplicationHandler.doTestIndexAndConfigAliasReplication-seed#[EA2B0C83FDDF2B9B]) [    ] o.a.s.c.SolrXmlConfig Configuration parameter autoReplicaFailoverWorkLoopDelay is ignored
   [junit4]   2> 1498047 INFO  (TEST-TestReplicationHandler.doTestIndexAndConfigAliasReplication-seed#[EA2B0C83FDDF2B9B]) [    ] o.a.s.c.SolrXmlConfig Configuration parameter autoReplicaFailoverBadNodeExpiration is ignored
   [junit4]   2> 1498069 INFO  (TEST-TestReplicationHandler.doTestIndexAndConfigAliasReplication-seed#[EA2B0C83FDDF2B9B]) [    ] o.a.s.c.SolrXmlConfig MBean server found: com.sun.jmx.mbeanserver.JmxMBeanServer@6fd4489, but no JMX reporters were configured - adding default JMX reporter.
   [junit4]   2> 1498198 INFO  (TEST-TestReplicationHandler.doTestIndexAndConfigAliasReplication-seed#[EA2B0C83FDDF2B9B]) [    ] o.a.s.h.c.HttpShardHandlerFactory Host whitelist initialized: WhitelistHostChecker [whitelistHosts=null, whitelistHostCheckingEnabled=true]
   [junit4]   2> 1498199 WARN  (TEST-TestReplicationHandler.doTestIndexAndConfigAliasReplication-seed#[EA2B0C83FDDF2B9B]) [    ] o.e.j.u.s.S.config No Client EndPointIdentificationAlgorithm configured for SslContextFactory@4c196973[provider=null,keyStore=null,trustStore=null]
   [junit4]   2> 1498215 WARN  (TEST-TestReplicationHandler.doTestIndexAndConfigAliasReplication-seed#[EA2B0C83FDDF2B9B]) [    ] o.e.j.u.s.S.config No Client EndPointIdentificationAlgorithm configured for SslContextFactory@381a85bf[provider=null,keyStore=null,trustStore=null]
   [junit4]   2> 1498251 INFO  (TEST-TestReplicationHandler.doTestIndexAndConfigAliasReplication-seed#[EA2B0C83FDDF2B9B]) [    ] o.a.s.c.TransientSolrCoreCacheDefault Allocating transient cache for 4 transient cores
   [junit4]   2> 1498251 INFO  (TEST-TestReplicationHandler.doTestIndexAndConfigAliasReplication-seed#[EA2B0C83FDDF2B9B]) [    ] o.a.s.h.a.MetricsHistoryHandler No .system collection, keeping metrics history in memory.
   [junit4]   2> 1498312 INFO  (TEST-TestReplicationHandler.doTestIndexAndConfigAliasReplication-seed#[EA2B0C83FDDF2B9B]) [    ] o.a.s.m.r.SolrJmxReporter JMX monitoring for 'solr.node' (registry 'solr.node') enabled at server: com.sun.jmx.mbeanserver.JmxMBeanServer@6fd4489
   [junit4]   2> 1498350 INFO  (TEST-TestReplicationHandler.doTestIndexAndConfigAliasReplication-seed#[EA2B0C83FDDF2B9B]) [    ] o.a.s.m.r.SolrJmxReporter JMX monitoring for 'solr.jvm' (registry 'solr.jvm') enabled at server: com.sun.jmx.mbeanserver.JmxMBeanServer@6fd4489
   [junit4]   2> 1498350 INFO  (TEST-TestReplicationHandler.doTestIndexAndConfigAliasReplication-seed#[EA2B0C83FDDF2B9B]) [    ] o.a.s.m.r.SolrJmxReporter JMX monitoring for 'solr.jetty' (registry 'solr.jetty') enabled at server: com.sun.jmx.mbeanserver.JmxMBeanServer@6fd4489
   [junit4]   2> 1498352 INFO  (TEST-TestReplicationHandler.doTestIndexAndConfigAli

[...truncated too long message...]

ThreadPoolExecutor.java:624)
   [junit4]    > 	at java.lang.Thread.run(Thread.java:748)
   [junit4]    > org.apache.solr.common.util.ObjectReleaseTracker$ObjectTrackerException: org.apache.lucene.store.MockDirectoryWrapper
   [junit4]    > 	at org.apache.solr.common.util.ObjectReleaseTracker.track(ObjectReleaseTracker.java:42)
   [junit4]    > 	at org.apache.solr.core.CachingDirectoryFactory.get(CachingDirectoryFactory.java:348)
   [junit4]    > 	at org.apache.solr.update.SolrIndexWriter.create(SolrIndexWriter.java:99)
   [junit4]    > 	at org.apache.solr.core.SolrCore.initIndex(SolrCore.java:779)
   [junit4]    > 	at org.apache.solr.core.SolrCore.<init>(SolrCore.java:976)
   [junit4]    > 	at org.apache.solr.core.SolrCore.<init>(SolrCore.java:883)
   [junit4]    > 	at org.apache.solr.core.CoreContainer.createFromDescriptor(CoreContainer.java:1238)
   [junit4]    > 	at org.apache.solr.core.CoreContainer.lambda$load$13(CoreContainer.java:749)
   [junit4]    > 	at com.codahale.metrics.InstrumentedExecutorService$InstrumentedCallable.call(InstrumentedExecutorService.java:202)
   [junit4]    > 	at java.util.concurrent.FutureTask.run(FutureTask.java:266)
   [junit4]    > 	at org.apache.solr.common.util.ExecutorUtil$MDCAwareThreadPoolExecutor.lambda$execute$0(ExecutorUtil.java:209)
   [junit4]    > 	at java.util.concurrent.ThreadPoolExecutor.runWorker(ThreadPoolExecutor.java:1149)
   [junit4]    > 	at java.util.concurrent.ThreadPoolExecutor$Worker.run(ThreadPoolExecutor.java:624)
   [junit4]    > 	at java.lang.Thread.run(Thread.java:748)
   [junit4]    >  expected null, but was:<ObjectTracker found 4 object(s) that were not released!!! [SolrCore, MockDirectoryWrapper, InternalHttpClient, MockDirectoryWrapper]
   [junit4]    > org.apache.solr.common.util.ObjectReleaseTracker$ObjectTrackerException: org.apache.solr.core.SolrCore
   [junit4]    > 	at org.apache.solr.common.util.ObjectReleaseTracker.track(ObjectReleaseTracker.java:42)
   [junit4]    > 	at org.apache.solr.core.SolrCore.<init>(SolrCore.java:1063)
   [junit4]    > 	at org.apache.solr.core.SolrCore.<init>(SolrCore.java:883)
   [junit4]    > 	at org.apache.solr.core.CoreContainer.createFromDescriptor(CoreContainer.java:1238)
   [junit4]    > 	at org.apache.solr.core.CoreContainer.lambda$load$13(CoreContainer.java:749)
   [junit4]    > 	at com.codahale.metrics.InstrumentedExecutorService$InstrumentedCallable.call(InstrumentedExecutorService.java:202)
   [junit4]    > 	at java.util.concurrent.FutureTask.run(FutureTask.java:266)
   [junit4]    > 	at org.apache.solr.common.util.ExecutorUtil$MDCAwareThreadPoolExecutor.lambda$execute$0(ExecutorUtil.java:209)
   [junit4]    > 	at java.util.concurrent.ThreadPoolExecutor.runWorker(ThreadPoolExecutor.java:1149)
   [junit4]    > 	at java.util.concurrent.ThreadPoolExecutor$Worker.run(ThreadPoolExecutor.java:624)
   [junit4]    > 	at java.lang.Thread.run(Thread.java:748)
   [junit4]    > org.apache.solr.common.util.ObjectReleaseTracker$ObjectTrackerException: org.apache.lucene.store.MockDirectoryWrapper
   [junit4]    > 	at org.apache.solr.common.util.ObjectReleaseTracker.track(ObjectReleaseTracker.java:42)
   [junit4]    > 	at org.apache.solr.core.CachingDirectoryFactory.get(CachingDirectoryFactory.java:348)
   [junit4]    > 	at org.apache.solr.core.SolrCore.initSnapshotMetaDataManager(SolrCore.java:517)
   [junit4]    > 	at org.apache.solr.core.SolrCore.<init>(SolrCore.java:968)
   [junit4]    > 	at org.apache.solr.core.SolrCore.<init>(SolrCore.java:883)
   [junit4]    > 	at org.apache.solr.core.CoreContainer.createFromDescriptor(CoreContainer.java:1238)
   [junit4]    > 	at org.apache.solr.core.CoreContainer.lambda$load$13(CoreContainer.java:749)
   [junit4]    > 	at com.codahale.metrics.InstrumentedExecutorService$InstrumentedCallable.call(InstrumentedExecutorService.java:202)
   [junit4]    > 	at java.util.concurrent.FutureTask.run(FutureTask.java:266)
   [junit4]    > 	at org.apache.solr.common.util.ExecutorUtil$MDCAwareThreadPoolExecutor.lambda$execute$0(ExecutorUtil.java:209)
   [junit4]    > 	at java.util.concurrent.ThreadPoolExecutor.runWorker(ThreadPoolExecutor.java:1149)
   [junit4]    > 	at java.util.concurrent.ThreadPoolExecutor$Worker.run(ThreadPoolExecutor.java:624)
   [junit4]    > 	at java.lang.Thread.run(Thread.java:748)
   [junit4]    > org.apache.solr.common.util.ObjectReleaseTracker$ObjectTrackerException: org.apache.http.impl.client.InternalHttpClient
   [junit4]    > 	at org.apache.solr.common.util.ObjectReleaseTracker.track(ObjectReleaseTracker.java:42)
   [junit4]    > 	at org.apache.solr.client.solrj.impl.HttpClientUtil.createClient(HttpClientUtil.java:321)
   [junit4]    > 	at org.apache.solr.client.solrj.impl.HttpClientUtil.createClient(HttpClientUtil.java:330)
   [junit4]    > 	at org.apache.solr.handler.IndexFetcher.createHttpClient(IndexFetcher.java:230)
   [junit4]    > 	at org.apache.solr.handler.IndexFetcher.<init>(IndexFetcher.java:272)
   [junit4]    > 	at org.apache.solr.handler.ReplicationHandler.inform(ReplicationHandler.java:1224)
   [junit4]    > 	at org.apache.solr.core.SolrResourceLoader.inform(SolrResourceLoader.java:696)
   [junit4]    > 	at org.apache.solr.core.SolrCore.<init>(SolrCore.java:1009)
   [junit4]    > 	at org.apache.solr.core.SolrCore.<init>(SolrCore.java:883)
   [junit4]    > 	at org.apache.solr.core.CoreContainer.createFromDescriptor(CoreContainer.java:1238)
   [junit4]    > 	at org.apache.solr.core.CoreContainer.lambda$load$13(CoreContainer.java:749)
   [junit4]    > 	at com.codahale.metrics.InstrumentedExecutorService$InstrumentedCallable.call(InstrumentedExecutorService.java:202)
   [junit4]    > 	at java.util.concurrent.FutureTask.run(FutureTask.java:266)
   [junit4]    > 	at org.apache.solr.common.util.ExecutorUtil$MDCAwareThreadPoolExecutor.lambda$execute$0(ExecutorUtil.java:209)
   [junit4]    > 	at java.util.concurrent.ThreadPoolExecutor.runWorker(ThreadPoolExecutor.java:1149)
   [junit4]    > 	at java.util.concurrent.ThreadPoolExecutor$Worker.run(ThreadPoolExecutor.java:624)
   [junit4]    > 	at java.lang.Thread.run(Thread.java:748)
   [junit4]    > org.apache.solr.common.util.ObjectReleaseTracker$ObjectTrackerException: org.apache.lucene.store.MockDirectoryWrapper
   [junit4]    > 	at org.apache.solr.common.util.ObjectReleaseTracker.track(ObjectReleaseTracker.java:42)
   [junit4]    > 	at org.apache.solr.core.CachingDirectoryFactory.get(CachingDirectoryFactory.java:348)
   [junit4]    > 	at org.apache.solr.update.SolrIndexWriter.create(SolrIndexWriter.java:99)
   [junit4]    > 	at org.apache.solr.core.SolrCore.initIndex(SolrCore.java:779)
   [junit4]    > 	at org.apache.solr.core.SolrCore.<init>(SolrCore.java:976)
   [junit4]    > 	at org.apache.solr.core.SolrCore.<init>(SolrCore.java:883)
   [junit4]    > 	at org.apache.solr.core.CoreContainer.createFromDescriptor(CoreContainer.java:1238)
   [junit4]    > 	at org.apache.solr.core.CoreContainer.lambda$load$13(CoreContainer.java:749)
   [junit4]    > 	at com.codahale.metrics.InstrumentedExecutorService$InstrumentedCallable.call(InstrumentedExecutorService.java:202)
   [junit4]    > 	at java.util.concurrent.FutureTask.run(FutureTask.java:266)
   [junit4]    > 	at org.apache.solr.common.util.ExecutorUtil$MDCAwareThreadPoolExecutor.lambda$execute$0(ExecutorUtil.java:209)
   [junit4]    > 	at java.util.concurrent.ThreadPoolExecutor.runWorker(ThreadPoolExecutor.java:1149)
   [junit4]    > 	at java.util.concurrent.ThreadPoolExecutor$Worker.run(ThreadPoolExecutor.java:624)
   [junit4]    > 	at java.lang.Thread.run(Thread.java:748)
   [junit4]    > >
   [junit4]    > 	at __randomizedtesting.SeedInfo.seed([EA2B0C83FDDF2B9B]:0)
   [junit4]    > 	at org.apache.solr.SolrTestCaseJ4.teardownTestCases(SolrTestCaseJ4.java:333)
   [junit4]    > 	at java.lang.Thread.run(Thread.java:748)
   [junit4] Completed [281/858 (2!)] on J1 in 274.87s, 20 tests, 1 failure <<< FAILURES!

[...truncated 51831 lines...]
[asciidoctor:convert] asciidoctor: ERROR: about-this-guide.adoc: line 1: invalid part, must have at least one section (e.g., chapter, appendix, etc.)
[asciidoctor:convert] asciidoctor: ERROR: solr-glossary.adoc: line 1: invalid part, must have at least one section (e.g., chapter, appendix, etc.)
     [java] Processed 2531 links (2070 relative) to 3359 anchors in 253 files
     [echo] Validated Links & Anchors via: /home/jenkins/jenkins-slave/workspace/Lucene-Solr-BadApples-Tests-8.x/solr/build/solr-ref-guide/bare-bones-html/

-documentation-lint:
    [jtidy] Checking for broken html (such as invalid tags)...
   [delete] Deleting directory /home/jenkins/jenkins-slave/workspace/Lucene-Solr-BadApples-Tests-8.x/lucene/build/jtidy_tmp
     [echo] Checking for broken links...
     [exec] 
     [exec] Crawl/parse...
     [exec] 
     [exec] Verify...
     [echo] Checking for malformed docs...
     [exec] 
     [exec] /home/jenkins/jenkins-slave/workspace/Lucene-Solr-BadApples-Tests-8.x/solr/build/docs/solr-solrj/overview-summary.html
     [exec]   missing description: org.noggit
     [exec] 
     [exec] Missing javadocs were found!

BUILD FAILED
/home/jenkins/jenkins-slave/workspace/Lucene-Solr-BadApples-Tests-8.x/build.xml:643: The following error occurred while executing this line:
/home/jenkins/jenkins-slave/workspace/Lucene-Solr-BadApples-Tests-8.x/build.xml:101: The following error occurred while executing this line:
/home/jenkins/jenkins-slave/workspace/Lucene-Solr-BadApples-Tests-8.x/solr/build.xml:660: The following error occurred while executing this line:
/home/jenkins/jenkins-slave/workspace/Lucene-Solr-BadApples-Tests-8.x/solr/build.xml:676: The following error occurred while executing this line:
/home/jenkins/jenkins-slave/workspace/Lucene-Solr-BadApples-Tests-8.x/lucene/common-build.xml:2530: exec returned: 1

Total time: 224 minutes 21 seconds
Build step 'Invoke Ant' marked build as failure
Archiving artifacts
Recording test results
Email was triggered for: Failure - Any
Sending email for trigger: Failure - Any

Mime
View raw message