lucene-dev mailing list archives

Site index · List index
Message view « Date » · « Thread »
Top « Date » · « Thread »
From Policeman Jenkins Server <jenk...@thetaphi.de>
Subject [JENKINS] Lucene-Solr-master-MacOSX (64bit/jdk-11.0.2) - Build # 5150 - Unstable!
Date Fri, 17 May 2019 23:36:25 GMT
Build: https://jenkins.thetaphi.de/job/Lucene-Solr-master-MacOSX/5150/
Java: 64bit/jdk-11.0.2 -XX:+UseCompressedOops -XX:+UseParallelGC

4 tests failed.
FAILED:  org.apache.solr.cloud.autoscaling.ScheduledTriggerIntegrationTest.testScheduledTrigger

Error Message:
expected:<1> but was:<2>

Stack Trace:
java.lang.AssertionError: expected:<1> but was:<2>
	at __randomizedtesting.SeedInfo.seed([1A059B6737127697:891ED31569EF2DA3]:0)
	at org.junit.Assert.fail(Assert.java:88)
	at org.junit.Assert.failNotEquals(Assert.java:834)
	at org.junit.Assert.assertEquals(Assert.java:645)
	at org.junit.Assert.assertEquals(Assert.java:631)
	at org.apache.solr.cloud.autoscaling.ScheduledTriggerIntegrationTest.testScheduledTrigger(ScheduledTriggerIntegrationTest.java:119)
	at java.base/jdk.internal.reflect.NativeMethodAccessorImpl.invoke0(Native Method)
	at java.base/jdk.internal.reflect.NativeMethodAccessorImpl.invoke(NativeMethodAccessorImpl.java:62)
	at java.base/jdk.internal.reflect.DelegatingMethodAccessorImpl.invoke(DelegatingMethodAccessorImpl.java:43)
	at java.base/java.lang.reflect.Method.invoke(Method.java:566)
	at com.carrotsearch.randomizedtesting.RandomizedRunner.invoke(RandomizedRunner.java:1750)
	at com.carrotsearch.randomizedtesting.RandomizedRunner$8.evaluate(RandomizedRunner.java:938)
	at com.carrotsearch.randomizedtesting.RandomizedRunner$9.evaluate(RandomizedRunner.java:974)
	at com.carrotsearch.randomizedtesting.RandomizedRunner$10.evaluate(RandomizedRunner.java:988)
	at com.carrotsearch.randomizedtesting.rules.SystemPropertiesRestoreRule$1.evaluate(SystemPropertiesRestoreRule.java:57)
	at org.apache.lucene.util.TestRuleSetupTeardownChained$1.evaluate(TestRuleSetupTeardownChained.java:49)
	at org.apache.lucene.util.AbstractBeforeAfterRule$1.evaluate(AbstractBeforeAfterRule.java:45)
	at org.apache.lucene.util.TestRuleThreadAndTestName$1.evaluate(TestRuleThreadAndTestName.java:48)
	at org.apache.lucene.util.TestRuleIgnoreAfterMaxFailures$1.evaluate(TestRuleIgnoreAfterMaxFailures.java:64)
	at org.apache.lucene.util.TestRuleMarkFailure$1.evaluate(TestRuleMarkFailure.java:47)
	at com.carrotsearch.randomizedtesting.rules.StatementAdapter.evaluate(StatementAdapter.java:36)
	at com.carrotsearch.randomizedtesting.ThreadLeakControl$StatementRunner.run(ThreadLeakControl.java:368)
	at com.carrotsearch.randomizedtesting.ThreadLeakControl.forkTimeoutingTask(ThreadLeakControl.java:817)
	at com.carrotsearch.randomizedtesting.ThreadLeakControl$3.evaluate(ThreadLeakControl.java:468)
	at com.carrotsearch.randomizedtesting.RandomizedRunner.runSingleTest(RandomizedRunner.java:947)
	at com.carrotsearch.randomizedtesting.RandomizedRunner$5.evaluate(RandomizedRunner.java:832)
	at com.carrotsearch.randomizedtesting.RandomizedRunner$6.evaluate(RandomizedRunner.java:883)
	at com.carrotsearch.randomizedtesting.RandomizedRunner$7.evaluate(RandomizedRunner.java:894)
	at com.carrotsearch.randomizedtesting.rules.StatementAdapter.evaluate(StatementAdapter.java:36)
	at com.carrotsearch.randomizedtesting.rules.SystemPropertiesRestoreRule$1.evaluate(SystemPropertiesRestoreRule.java:57)
	at org.apache.lucene.util.AbstractBeforeAfterRule$1.evaluate(AbstractBeforeAfterRule.java:45)
	at com.carrotsearch.randomizedtesting.rules.StatementAdapter.evaluate(StatementAdapter.java:36)
	at org.apache.lucene.util.TestRuleStoreClassName$1.evaluate(TestRuleStoreClassName.java:41)
	at com.carrotsearch.randomizedtesting.rules.NoShadowingOrOverridesOnMethodsRule$1.evaluate(NoShadowingOrOverridesOnMethodsRule.java:40)
	at com.carrotsearch.randomizedtesting.rules.NoShadowingOrOverridesOnMethodsRule$1.evaluate(NoShadowingOrOverridesOnMethodsRule.java:40)
	at com.carrotsearch.randomizedtesting.rules.StatementAdapter.evaluate(StatementAdapter.java:36)
	at com.carrotsearch.randomizedtesting.rules.StatementAdapter.evaluate(StatementAdapter.java:36)
	at org.apache.lucene.util.TestRuleAssertionsRequired$1.evaluate(TestRuleAssertionsRequired.java:53)
	at org.apache.lucene.util.TestRuleMarkFailure$1.evaluate(TestRuleMarkFailure.java:47)
	at org.apache.lucene.util.TestRuleIgnoreAfterMaxFailures$1.evaluate(TestRuleIgnoreAfterMaxFailures.java:64)
	at org.apache.lucene.util.TestRuleIgnoreTestSuites$1.evaluate(TestRuleIgnoreTestSuites.java:54)
	at com.carrotsearch.randomizedtesting.rules.StatementAdapter.evaluate(StatementAdapter.java:36)
	at com.carrotsearch.randomizedtesting.ThreadLeakControl$StatementRunner.run(ThreadLeakControl.java:368)
	at java.base/java.lang.Thread.run(Thread.java:834)


FAILED:  org.apache.solr.cloud.autoscaling.ScheduledTriggerIntegrationTest.testScheduledTrigger

Error Message:
expected:<1> but was:<2>

Stack Trace:
java.lang.AssertionError: expected:<1> but was:<2>
	at __randomizedtesting.SeedInfo.seed([1A059B6737127697:891ED31569EF2DA3]:0)
	at org.junit.Assert.fail(Assert.java:88)
	at org.junit.Assert.failNotEquals(Assert.java:834)
	at org.junit.Assert.assertEquals(Assert.java:645)
	at org.junit.Assert.assertEquals(Assert.java:631)
	at org.apache.solr.cloud.autoscaling.ScheduledTriggerIntegrationTest.testScheduledTrigger(ScheduledTriggerIntegrationTest.java:119)
	at java.base/jdk.internal.reflect.NativeMethodAccessorImpl.invoke0(Native Method)
	at java.base/jdk.internal.reflect.NativeMethodAccessorImpl.invoke(NativeMethodAccessorImpl.java:62)
	at java.base/jdk.internal.reflect.DelegatingMethodAccessorImpl.invoke(DelegatingMethodAccessorImpl.java:43)
	at java.base/java.lang.reflect.Method.invoke(Method.java:566)
	at com.carrotsearch.randomizedtesting.RandomizedRunner.invoke(RandomizedRunner.java:1750)
	at com.carrotsearch.randomizedtesting.RandomizedRunner$8.evaluate(RandomizedRunner.java:938)
	at com.carrotsearch.randomizedtesting.RandomizedRunner$9.evaluate(RandomizedRunner.java:974)
	at com.carrotsearch.randomizedtesting.RandomizedRunner$10.evaluate(RandomizedRunner.java:988)
	at com.carrotsearch.randomizedtesting.rules.SystemPropertiesRestoreRule$1.evaluate(SystemPropertiesRestoreRule.java:57)
	at org.apache.lucene.util.TestRuleSetupTeardownChained$1.evaluate(TestRuleSetupTeardownChained.java:49)
	at org.apache.lucene.util.AbstractBeforeAfterRule$1.evaluate(AbstractBeforeAfterRule.java:45)
	at org.apache.lucene.util.TestRuleThreadAndTestName$1.evaluate(TestRuleThreadAndTestName.java:48)
	at org.apache.lucene.util.TestRuleIgnoreAfterMaxFailures$1.evaluate(TestRuleIgnoreAfterMaxFailures.java:64)
	at org.apache.lucene.util.TestRuleMarkFailure$1.evaluate(TestRuleMarkFailure.java:47)
	at com.carrotsearch.randomizedtesting.rules.StatementAdapter.evaluate(StatementAdapter.java:36)
	at com.carrotsearch.randomizedtesting.ThreadLeakControl$StatementRunner.run(ThreadLeakControl.java:368)
	at com.carrotsearch.randomizedtesting.ThreadLeakControl.forkTimeoutingTask(ThreadLeakControl.java:817)
	at com.carrotsearch.randomizedtesting.ThreadLeakControl$3.evaluate(ThreadLeakControl.java:468)
	at com.carrotsearch.randomizedtesting.RandomizedRunner.runSingleTest(RandomizedRunner.java:947)
	at com.carrotsearch.randomizedtesting.RandomizedRunner$5.evaluate(RandomizedRunner.java:832)
	at com.carrotsearch.randomizedtesting.RandomizedRunner$6.evaluate(RandomizedRunner.java:883)
	at com.carrotsearch.randomizedtesting.RandomizedRunner$7.evaluate(RandomizedRunner.java:894)
	at com.carrotsearch.randomizedtesting.rules.StatementAdapter.evaluate(StatementAdapter.java:36)
	at com.carrotsearch.randomizedtesting.rules.SystemPropertiesRestoreRule$1.evaluate(SystemPropertiesRestoreRule.java:57)
	at org.apache.lucene.util.AbstractBeforeAfterRule$1.evaluate(AbstractBeforeAfterRule.java:45)
	at com.carrotsearch.randomizedtesting.rules.StatementAdapter.evaluate(StatementAdapter.java:36)
	at org.apache.lucene.util.TestRuleStoreClassName$1.evaluate(TestRuleStoreClassName.java:41)
	at com.carrotsearch.randomizedtesting.rules.NoShadowingOrOverridesOnMethodsRule$1.evaluate(NoShadowingOrOverridesOnMethodsRule.java:40)
	at com.carrotsearch.randomizedtesting.rules.NoShadowingOrOverridesOnMethodsRule$1.evaluate(NoShadowingOrOverridesOnMethodsRule.java:40)
	at com.carrotsearch.randomizedtesting.rules.StatementAdapter.evaluate(StatementAdapter.java:36)
	at com.carrotsearch.randomizedtesting.rules.StatementAdapter.evaluate(StatementAdapter.java:36)
	at org.apache.lucene.util.TestRuleAssertionsRequired$1.evaluate(TestRuleAssertionsRequired.java:53)
	at org.apache.lucene.util.TestRuleMarkFailure$1.evaluate(TestRuleMarkFailure.java:47)
	at org.apache.lucene.util.TestRuleIgnoreAfterMaxFailures$1.evaluate(TestRuleIgnoreAfterMaxFailures.java:64)
	at org.apache.lucene.util.TestRuleIgnoreTestSuites$1.evaluate(TestRuleIgnoreTestSuites.java:54)
	at com.carrotsearch.randomizedtesting.rules.StatementAdapter.evaluate(StatementAdapter.java:36)
	at com.carrotsearch.randomizedtesting.ThreadLeakControl$StatementRunner.run(ThreadLeakControl.java:368)
	at java.base/java.lang.Thread.run(Thread.java:834)


FAILED:  org.apache.solr.cloud.autoscaling.ScheduledTriggerIntegrationTest.testScheduledTrigger

Error Message:
expected:<1> but was:<3>

Stack Trace:
java.lang.AssertionError: expected:<1> but was:<3>
	at __randomizedtesting.SeedInfo.seed([1A059B6737127697:891ED31569EF2DA3]:0)
	at org.junit.Assert.fail(Assert.java:88)
	at org.junit.Assert.failNotEquals(Assert.java:834)
	at org.junit.Assert.assertEquals(Assert.java:645)
	at org.junit.Assert.assertEquals(Assert.java:631)
	at org.apache.solr.cloud.autoscaling.ScheduledTriggerIntegrationTest.testScheduledTrigger(ScheduledTriggerIntegrationTest.java:119)
	at java.base/jdk.internal.reflect.NativeMethodAccessorImpl.invoke0(Native Method)
	at java.base/jdk.internal.reflect.NativeMethodAccessorImpl.invoke(NativeMethodAccessorImpl.java:62)
	at java.base/jdk.internal.reflect.DelegatingMethodAccessorImpl.invoke(DelegatingMethodAccessorImpl.java:43)
	at java.base/java.lang.reflect.Method.invoke(Method.java:566)
	at com.carrotsearch.randomizedtesting.RandomizedRunner.invoke(RandomizedRunner.java:1750)
	at com.carrotsearch.randomizedtesting.RandomizedRunner$8.evaluate(RandomizedRunner.java:938)
	at com.carrotsearch.randomizedtesting.RandomizedRunner$9.evaluate(RandomizedRunner.java:974)
	at com.carrotsearch.randomizedtesting.RandomizedRunner$10.evaluate(RandomizedRunner.java:988)
	at com.carrotsearch.randomizedtesting.rules.SystemPropertiesRestoreRule$1.evaluate(SystemPropertiesRestoreRule.java:57)
	at org.apache.lucene.util.TestRuleSetupTeardownChained$1.evaluate(TestRuleSetupTeardownChained.java:49)
	at org.apache.lucene.util.AbstractBeforeAfterRule$1.evaluate(AbstractBeforeAfterRule.java:45)
	at org.apache.lucene.util.TestRuleThreadAndTestName$1.evaluate(TestRuleThreadAndTestName.java:48)
	at org.apache.lucene.util.TestRuleIgnoreAfterMaxFailures$1.evaluate(TestRuleIgnoreAfterMaxFailures.java:64)
	at org.apache.lucene.util.TestRuleMarkFailure$1.evaluate(TestRuleMarkFailure.java:47)
	at com.carrotsearch.randomizedtesting.rules.StatementAdapter.evaluate(StatementAdapter.java:36)
	at com.carrotsearch.randomizedtesting.ThreadLeakControl$StatementRunner.run(ThreadLeakControl.java:368)
	at com.carrotsearch.randomizedtesting.ThreadLeakControl.forkTimeoutingTask(ThreadLeakControl.java:817)
	at com.carrotsearch.randomizedtesting.ThreadLeakControl$3.evaluate(ThreadLeakControl.java:468)
	at com.carrotsearch.randomizedtesting.RandomizedRunner.runSingleTest(RandomizedRunner.java:947)
	at com.carrotsearch.randomizedtesting.RandomizedRunner$5.evaluate(RandomizedRunner.java:832)
	at com.carrotsearch.randomizedtesting.RandomizedRunner$6.evaluate(RandomizedRunner.java:883)
	at com.carrotsearch.randomizedtesting.RandomizedRunner$7.evaluate(RandomizedRunner.java:894)
	at com.carrotsearch.randomizedtesting.rules.StatementAdapter.evaluate(StatementAdapter.java:36)
	at com.carrotsearch.randomizedtesting.rules.SystemPropertiesRestoreRule$1.evaluate(SystemPropertiesRestoreRule.java:57)
	at org.apache.lucene.util.AbstractBeforeAfterRule$1.evaluate(AbstractBeforeAfterRule.java:45)
	at com.carrotsearch.randomizedtesting.rules.StatementAdapter.evaluate(StatementAdapter.java:36)
	at org.apache.lucene.util.TestRuleStoreClassName$1.evaluate(TestRuleStoreClassName.java:41)
	at com.carrotsearch.randomizedtesting.rules.NoShadowingOrOverridesOnMethodsRule$1.evaluate(NoShadowingOrOverridesOnMethodsRule.java:40)
	at com.carrotsearch.randomizedtesting.rules.NoShadowingOrOverridesOnMethodsRule$1.evaluate(NoShadowingOrOverridesOnMethodsRule.java:40)
	at com.carrotsearch.randomizedtesting.rules.StatementAdapter.evaluate(StatementAdapter.java:36)
	at com.carrotsearch.randomizedtesting.rules.StatementAdapter.evaluate(StatementAdapter.java:36)
	at org.apache.lucene.util.TestRuleAssertionsRequired$1.evaluate(TestRuleAssertionsRequired.java:53)
	at org.apache.lucene.util.TestRuleMarkFailure$1.evaluate(TestRuleMarkFailure.java:47)
	at org.apache.lucene.util.TestRuleIgnoreAfterMaxFailures$1.evaluate(TestRuleIgnoreAfterMaxFailures.java:64)
	at org.apache.lucene.util.TestRuleIgnoreTestSuites$1.evaluate(TestRuleIgnoreTestSuites.java:54)
	at com.carrotsearch.randomizedtesting.rules.StatementAdapter.evaluate(StatementAdapter.java:36)
	at com.carrotsearch.randomizedtesting.ThreadLeakControl$StatementRunner.run(ThreadLeakControl.java:368)
	at java.base/java.lang.Thread.run(Thread.java:834)


FAILED:  org.apache.solr.cloud.autoscaling.ScheduledTriggerIntegrationTest.testScheduledTrigger

Error Message:


Stack Trace:
java.lang.AssertionError
	at __randomizedtesting.SeedInfo.seed([1A059B6737127697:891ED31569EF2DA3]:0)
	at org.junit.Assert.fail(Assert.java:86)
	at org.junit.Assert.assertTrue(Assert.java:41)
	at org.junit.Assert.assertNotNull(Assert.java:712)
	at org.junit.Assert.assertNotNull(Assert.java:722)
	at org.apache.solr.cloud.autoscaling.ScheduledTriggerIntegrationTest.testScheduledTrigger(ScheduledTriggerIntegrationTest.java:124)
	at java.base/jdk.internal.reflect.NativeMethodAccessorImpl.invoke0(Native Method)
	at java.base/jdk.internal.reflect.NativeMethodAccessorImpl.invoke(NativeMethodAccessorImpl.java:62)
	at java.base/jdk.internal.reflect.DelegatingMethodAccessorImpl.invoke(DelegatingMethodAccessorImpl.java:43)
	at java.base/java.lang.reflect.Method.invoke(Method.java:566)
	at com.carrotsearch.randomizedtesting.RandomizedRunner.invoke(RandomizedRunner.java:1750)
	at com.carrotsearch.randomizedtesting.RandomizedRunner$8.evaluate(RandomizedRunner.java:938)
	at com.carrotsearch.randomizedtesting.RandomizedRunner$9.evaluate(RandomizedRunner.java:974)
	at com.carrotsearch.randomizedtesting.RandomizedRunner$10.evaluate(RandomizedRunner.java:988)
	at com.carrotsearch.randomizedtesting.rules.SystemPropertiesRestoreRule$1.evaluate(SystemPropertiesRestoreRule.java:57)
	at org.apache.lucene.util.TestRuleSetupTeardownChained$1.evaluate(TestRuleSetupTeardownChained.java:49)
	at org.apache.lucene.util.AbstractBeforeAfterRule$1.evaluate(AbstractBeforeAfterRule.java:45)
	at org.apache.lucene.util.TestRuleThreadAndTestName$1.evaluate(TestRuleThreadAndTestName.java:48)
	at org.apache.lucene.util.TestRuleIgnoreAfterMaxFailures$1.evaluate(TestRuleIgnoreAfterMaxFailures.java:64)
	at org.apache.lucene.util.TestRuleMarkFailure$1.evaluate(TestRuleMarkFailure.java:47)
	at com.carrotsearch.randomizedtesting.rules.StatementAdapter.evaluate(StatementAdapter.java:36)
	at com.carrotsearch.randomizedtesting.ThreadLeakControl$StatementRunner.run(ThreadLeakControl.java:368)
	at com.carrotsearch.randomizedtesting.ThreadLeakControl.forkTimeoutingTask(ThreadLeakControl.java:817)
	at com.carrotsearch.randomizedtesting.ThreadLeakControl$3.evaluate(ThreadLeakControl.java:468)
	at com.carrotsearch.randomizedtesting.RandomizedRunner.runSingleTest(RandomizedRunner.java:947)
	at com.carrotsearch.randomizedtesting.RandomizedRunner$5.evaluate(RandomizedRunner.java:832)
	at com.carrotsearch.randomizedtesting.RandomizedRunner$6.evaluate(RandomizedRunner.java:883)
	at com.carrotsearch.randomizedtesting.RandomizedRunner$7.evaluate(RandomizedRunner.java:894)
	at com.carrotsearch.randomizedtesting.rules.StatementAdapter.evaluate(StatementAdapter.java:36)
	at com.carrotsearch.randomizedtesting.rules.SystemPropertiesRestoreRule$1.evaluate(SystemPropertiesRestoreRule.java:57)
	at org.apache.lucene.util.AbstractBeforeAfterRule$1.evaluate(AbstractBeforeAfterRule.java:45)
	at com.carrotsearch.randomizedtesting.rules.StatementAdapter.evaluate(StatementAdapter.java:36)
	at org.apache.lucene.util.TestRuleStoreClassName$1.evaluate(TestRuleStoreClassName.java:41)
	at com.carrotsearch.randomizedtesting.rules.NoShadowingOrOverridesOnMethodsRule$1.evaluate(NoShadowingOrOverridesOnMethodsRule.java:40)
	at com.carrotsearch.randomizedtesting.rules.NoShadowingOrOverridesOnMethodsRule$1.evaluate(NoShadowingOrOverridesOnMethodsRule.java:40)
	at com.carrotsearch.randomizedtesting.rules.StatementAdapter.evaluate(StatementAdapter.java:36)
	at com.carrotsearch.randomizedtesting.rules.StatementAdapter.evaluate(StatementAdapter.java:36)
	at org.apache.lucene.util.TestRuleAssertionsRequired$1.evaluate(TestRuleAssertionsRequired.java:53)
	at org.apache.lucene.util.TestRuleMarkFailure$1.evaluate(TestRuleMarkFailure.java:47)
	at org.apache.lucene.util.TestRuleIgnoreAfterMaxFailures$1.evaluate(TestRuleIgnoreAfterMaxFailures.java:64)
	at org.apache.lucene.util.TestRuleIgnoreTestSuites$1.evaluate(TestRuleIgnoreTestSuites.java:54)
	at com.carrotsearch.randomizedtesting.rules.StatementAdapter.evaluate(StatementAdapter.java:36)
	at com.carrotsearch.randomizedtesting.ThreadLeakControl$StatementRunner.run(ThreadLeakControl.java:368)
	at java.base/java.lang.Thread.run(Thread.java:834)




Build Log:
[...truncated 14364 lines...]
   [junit4] Suite: org.apache.solr.cloud.autoscaling.ScheduledTriggerIntegrationTest
   [junit4]   2> 2998149 INFO  (SUITE-ScheduledTriggerIntegrationTest-seed#[1A059B6737127697]-worker) [    ] o.a.s.SolrTestCaseJ4 SecureRandom sanity checks: test.solr.allowed.securerandom=null & java.security.egd=file:/dev/./urandom
   [junit4]   2> Creating dataDir: /Users/jenkins/workspace/Lucene-Solr-master-MacOSX/solr/build/solr-core/test/J1/temp/solr.cloud.autoscaling.ScheduledTriggerIntegrationTest_1A059B6737127697-001/init-core-data-001
   [junit4]   2> 2998150 INFO  (SUITE-ScheduledTriggerIntegrationTest-seed#[1A059B6737127697]-worker) [    ] o.a.s.SolrTestCaseJ4 Using PointFields (NUMERIC_POINTS_SYSPROP=true) w/NUMERIC_DOCVALUES_SYSPROP=false
   [junit4]   2> 2998151 INFO  (SUITE-ScheduledTriggerIntegrationTest-seed#[1A059B6737127697]-worker) [    ] o.a.s.SolrTestCaseJ4 Randomized ssl (false) and clientAuth (false) via: @org.apache.solr.util.RandomizeSSL(reason="", value=0.0/0.0, ssl=0.0/0.0, clientAuth=0.0/0.0) w/ MAC_OS_X supressed clientAuth
   [junit4]   2> 2998153 INFO  (TEST-ScheduledTriggerIntegrationTest.testScheduledTrigger-seed#[1A059B6737127697]) [    ] o.a.s.SolrTestCaseJ4 ###Starting testScheduledTrigger
   [junit4]   2> 2998153 INFO  (TEST-ScheduledTriggerIntegrationTest.testScheduledTrigger-seed#[1A059B6737127697]) [    ] o.a.s.c.MiniSolrCloudCluster Starting cluster of 2 servers in /Users/jenkins/workspace/Lucene-Solr-master-MacOSX/solr/build/solr-core/test/J1/temp/solr.cloud.autoscaling.ScheduledTriggerIntegrationTest_1A059B6737127697-001/tempDir-001
   [junit4]   2> 2998153 INFO  (TEST-ScheduledTriggerIntegrationTest.testScheduledTrigger-seed#[1A059B6737127697]) [    ] o.a.s.c.ZkTestServer STARTING ZK TEST SERVER
   [junit4]   2> 2998154 INFO  (ZkTestServer Run Thread) [    ] o.a.s.c.ZkTestServer client port:0.0.0.0/0.0.0.0:0
   [junit4]   2> 2998154 INFO  (ZkTestServer Run Thread) [    ] o.a.s.c.ZkTestServer Starting server
   [junit4]   2> 2998255 INFO  (TEST-ScheduledTriggerIntegrationTest.testScheduledTrigger-seed#[1A059B6737127697]) [    ] o.a.s.c.ZkTestServer start zk server on port:57691
   [junit4]   2> 2998255 INFO  (TEST-ScheduledTriggerIntegrationTest.testScheduledTrigger-seed#[1A059B6737127697]) [    ] o.a.s.c.ZkTestServer parse host and port list: 127.0.0.1:57691
   [junit4]   2> 2998255 INFO  (TEST-ScheduledTriggerIntegrationTest.testScheduledTrigger-seed#[1A059B6737127697]) [    ] o.a.s.c.ZkTestServer connecting to 127.0.0.1 57691
   [junit4]   2> 2998277 INFO  (zkConnectionManagerCallback-19701-thread-1) [    ] o.a.s.c.c.ConnectionManager zkClient has connected
   [junit4]   2> 2998282 INFO  (zkConnectionManagerCallback-19703-thread-1) [    ] o.a.s.c.c.ConnectionManager zkClient has connected
   [junit4]   2> 2998285 INFO  (zkConnectionManagerCallback-19705-thread-1) [    ] o.a.s.c.c.ConnectionManager zkClient has connected
   [junit4]   2> 2998289 WARN  (jetty-launcher-19706-thread-1) [    ] o.e.j.s.AbstractConnector Ignoring deprecated socket close linger time
   [junit4]   2> 2998289 INFO  (jetty-launcher-19706-thread-1) [    ] o.a.s.c.s.e.JettySolrRunner Start Jetty (original configured port=0)
   [junit4]   2> 2998289 INFO  (jetty-launcher-19706-thread-1) [    ] o.a.s.c.s.e.JettySolrRunner Trying to start Jetty on port 0 try number 1 ...
   [junit4]   2> 2998289 INFO  (jetty-launcher-19706-thread-1) [    ] o.e.j.s.Server jetty-9.4.14.v20181114; built: 2018-11-14T21:20:31.478Z; git: c4550056e785fb5665914545889f21dc136ad9e6; jvm 11.0.2+9
   [junit4]   2> 2998290 WARN  (jetty-launcher-19706-thread-2) [    ] o.e.j.s.AbstractConnector Ignoring deprecated socket close linger time
   [junit4]   2> 2998290 INFO  (jetty-launcher-19706-thread-2) [    ] o.a.s.c.s.e.JettySolrRunner Start Jetty (original configured port=0)
   [junit4]   2> 2998290 INFO  (jetty-launcher-19706-thread-2) [    ] o.a.s.c.s.e.JettySolrRunner Trying to start Jetty on port 0 try number 1 ...
   [junit4]   2> 2998290 INFO  (jetty-launcher-19706-thread-2) [    ] o.e.j.s.Server jetty-9.4.14.v20181114; built: 2018-11-14T21:20:31.478Z; git: c4550056e785fb5665914545889f21dc136ad9e6; jvm 11.0.2+9
   [junit4]   2> 2998292 INFO  (jetty-launcher-19706-thread-2) [    ] o.e.j.s.session DefaultSessionIdManager workerName=node0
   [junit4]   2> 2998292 INFO  (jetty-launcher-19706-thread-2) [    ] o.e.j.s.session No SessionScavenger set, using defaults
   [junit4]   2> 2998292 INFO  (jetty-launcher-19706-thread-2) [    ] o.e.j.s.session node0 Scavenging every 660000ms
   [junit4]   2> 2998292 INFO  (jetty-launcher-19706-thread-2) [    ] o.e.j.s.h.ContextHandler Started o.e.j.s.ServletContextHandler@1cfcf236{/solr,null,AVAILABLE}
   [junit4]   2> 2998293 INFO  (jetty-launcher-19706-thread-2) [    ] o.e.j.s.AbstractConnector Started ServerConnector@750e432a{HTTP/1.1,[http/1.1, h2c]}{127.0.0.1:57696}
   [junit4]   2> 2998293 INFO  (jetty-launcher-19706-thread-2) [    ] o.e.j.s.Server Started @2998353ms
   [junit4]   2> 2998293 INFO  (jetty-launcher-19706-thread-2) [    ] o.a.s.c.s.e.JettySolrRunner Jetty properties: {hostContext=/solr, hostPort=57696}
   [junit4]   2> 2998293 ERROR (jetty-launcher-19706-thread-2) [    ] o.a.s.u.StartupLoggingUtils Missing Java Option solr.log.dir. Logging may be missing or incomplete.
   [junit4]   2> 2998293 INFO  (jetty-launcher-19706-thread-2) [    ] o.a.s.s.SolrDispatchFilter Using logger factory org.apache.logging.slf4j.Log4jLoggerFactory
   [junit4]   2> 2998294 INFO  (jetty-launcher-19706-thread-2) [    ] o.a.s.s.SolrDispatchFilter  ___      _       Welcome to Apache Solr™ version 9.0.0
   [junit4]   2> 2998294 INFO  (jetty-launcher-19706-thread-2) [    ] o.a.s.s.SolrDispatchFilter / __| ___| |_ _   Starting in cloud mode on port null
   [junit4]   2> 2998294 INFO  (jetty-launcher-19706-thread-2) [    ] o.a.s.s.SolrDispatchFilter \__ \/ _ \ | '_|  Install dir: null
   [junit4]   2> 2998294 INFO  (jetty-launcher-19706-thread-2) [    ] o.a.s.s.SolrDispatchFilter |___/\___/_|_|    Start time: 2019-05-17T22:49:28.036299Z
   [junit4]   2> 2998296 INFO  (jetty-launcher-19706-thread-1) [    ] o.e.j.s.session DefaultSessionIdManager workerName=node0
   [junit4]   2> 2998296 INFO  (jetty-launcher-19706-thread-1) [    ] o.e.j.s.session No SessionScavenger set, using defaults
   [junit4]   2> 2998296 INFO  (jetty-launcher-19706-thread-1) [    ] o.e.j.s.session node0 Scavenging every 660000ms
   [junit4]   2> 2998296 INFO  (jetty-launcher-19706-thread-1) [    ] o.e.j.s.h.ContextHandler Started o.e.j.s.ServletContextHandler@36e40b68{/solr,null,AVAILABLE}
   [junit4]   2> 2998296 INFO  (jetty-launcher-19706-thread-1) [    ] o.e.j.s.AbstractConnector Started ServerConnector@77706a78{HTTP/1.1,[http/1.1, h2c]}{127.0.0.1:57697}
   [junit4]   2> 2998296 INFO  (jetty-launcher-19706-thread-1) [    ] o.e.j.s.Server Started @2998357ms
   [junit4]   2> 2998296 INFO  (jetty-launcher-19706-thread-1) [    ] o.a.s.c.s.e.JettySolrRunner Jetty properties: {hostContext=/solr, hostPort=57697}
   [junit4]   2> 2998297 ERROR (jetty-launcher-19706-thread-1) [    ] o.a.s.u.StartupLoggingUtils Missing Java Option solr.log.dir. Logging may be missing or incomplete.
   [junit4]   2> 2998297 INFO  (jetty-launcher-19706-thread-1) [    ] o.a.s.s.SolrDispatchFilter Using logger factory org.apache.logging.slf4j.Log4jLoggerFactory
   [junit4]   2> 2998298 INFO  (jetty-launcher-19706-thread-1) [    ] o.a.s.s.SolrDispatchFilter  ___      _       Welcome to Apache Solr™ version 9.0.0
   [junit4]   2> 2998298 INFO  (jetty-launcher-19706-thread-1) [    ] o.a.s.s.SolrDispatchFilter / __| ___| |_ _   Starting in cloud mode on port null
   [junit4]   2> 2998298 INFO  (jetty-launcher-19706-thread-1) [    ] o.a.s.s.SolrDispatchFilter \__ \/ _ \ | '_|  Install dir: null
   [junit4]   2> 2998298 INFO  (jetty-launcher-19706-thread-1) [    ] o.a.s.s.SolrDispatchFilter |___/\___/_|_|    Start time: 2019-05-17T22:49:28.040085Z
   [junit4]   2> 2998303 INFO  (zkConnectionManagerCallback-19708-thread-1) [    ] o.a.s.c.c.ConnectionManager zkClient has connected
   [junit4]   2> 2998305 INFO  (zkConnectionManagerCallback-19710-thread-1) [    ] o.a.s.c.c.ConnectionManager zkClient has connected
   [junit4]   2> 2998305 INFO  (jetty-launcher-19706-thread-2) [    ] o.a.s.s.SolrDispatchFilter solr.xml found in ZooKeeper. Loading...
   [junit4]   2> 2998306 INFO  (jetty-launcher-19706-thread-1) [    ] o.a.s.s.SolrDispatchFilter solr.xml found in ZooKeeper. Loading...
   [junit4]   2> 2998451 INFO  (jetty-launcher-19706-thread-1) [    ] o.a.s.h.c.HttpShardHandlerFactory Host whitelist initialized: WhitelistHostChecker [whitelistHosts=null, whitelistHostCheckingEnabled=true]
   [junit4]   2> 2998452 WARN  (jetty-launcher-19706-thread-1) [    ] o.e.j.u.s.S.config No Client EndPointIdentificationAlgorithm configured for SslContextFactory@59fb9a96[provider=null,keyStore=null,trustStore=null]
   [junit4]   2> 2998460 WARN  (jetty-launcher-19706-thread-1) [    ] o.e.j.u.s.S.config No Client EndPointIdentificationAlgorithm configured for SslContextFactory@3e399f0b[provider=null,keyStore=null,trustStore=null]
   [junit4]   2> 2998461 INFO  (jetty-launcher-19706-thread-1) [    ] o.a.s.c.ZkContainer Zookeeper client=127.0.0.1:57691/solr
   [junit4]   2> 2998464 INFO  (zkConnectionManagerCallback-19718-thread-1) [    ] o.a.s.c.c.ConnectionManager zkClient has connected
   [junit4]   2> 2998469 INFO  (zkConnectionManagerCallback-19720-thread-1) [    ] o.a.s.c.c.ConnectionManager zkClient has connected
   [junit4]   2> 2998527 INFO  (jetty-launcher-19706-thread-2) [    ] o.a.s.h.c.HttpShardHandlerFactory Host whitelist initialized: WhitelistHostChecker [whitelistHosts=null, whitelistHostCheckingEnabled=true]
   [junit4]   2> 2998528 WARN  (jetty-launcher-19706-thread-2) [    ] o.e.j.u.s.S.config No Client EndPointIdentificationAlgorithm configured for SslContextFactory@1bf4426f[provider=null,keyStore=null,trustStore=null]
   [junit4]   2> 2998532 WARN  (jetty-launcher-19706-thread-2) [    ] o.e.j.u.s.S.config No Client EndPointIdentificationAlgorithm configured for SslContextFactory@2c688393[provider=null,keyStore=null,trustStore=null]
   [junit4]   2> 2998534 INFO  (jetty-launcher-19706-thread-2) [    ] o.a.s.c.ZkContainer Zookeeper client=127.0.0.1:57691/solr
   [junit4]   2> 2998536 INFO  (zkConnectionManagerCallback-19728-thread-1) [    ] o.a.s.c.c.ConnectionManager zkClient has connected
   [junit4]   2> 2998541 INFO  (zkConnectionManagerCallback-19730-thread-1) [    ] o.a.s.c.c.ConnectionManager zkClient has connected
   [junit4]   2> 2998559 INFO  (jetty-launcher-19706-thread-2) [n:127.0.0.1:57696_solr    ] o.a.s.c.OverseerElectionContext I am going to be the leader 127.0.0.1:57696_solr
   [junit4]   2> 2998560 INFO  (jetty-launcher-19706-thread-2) [n:127.0.0.1:57696_solr    ] o.a.s.c.Overseer Overseer (id=72157129149841416-127.0.0.1:57696_solr-n_0000000000) starting
   [junit4]   2> 2998571 INFO  (zkConnectionManagerCallback-19737-thread-1) [    ] o.a.s.c.c.ConnectionManager zkClient has connected
   [junit4]   2> 2998575 INFO  (jetty-launcher-19706-thread-2) [n:127.0.0.1:57696_solr    ] o.a.s.c.s.i.ZkClientClusterStateProvider Cluster at 127.0.0.1:57691/solr ready
   [junit4]   2> 2998576 INFO  (OverseerStateUpdate-72157129149841416-127.0.0.1:57696_solr-n_0000000000) [n:127.0.0.1:57696_solr    ] o.a.s.c.Overseer Starting to work on the main queue : 127.0.0.1:57696_solr
   [junit4]   2> 2998577 DEBUG (OverseerAutoScalingTriggerThread-72157129149841416-127.0.0.1:57696_solr-n_0000000000) [    ] o.a.s.c.a.OverseerTriggerThread Adding .auto_add_replicas and .scheduled_maintenance triggers
   [junit4]   2> 2998577 INFO  (jetty-launcher-19706-thread-2) [n:127.0.0.1:57696_solr    ] o.a.s.c.ZkController Register node as live in ZooKeeper:/live_nodes/127.0.0.1:57696_solr
   [junit4]   2> 2998578 DEBUG (OverseerAutoScalingTriggerThread-72157129149841416-127.0.0.1:57696_solr-n_0000000000) [    ] o.a.s.c.a.OverseerTriggerThread Refreshing /autoscaling.json with znode version 1
   [junit4]   2> 2998578 DEBUG (OverseerAutoScalingTriggerThread-72157129149841416-127.0.0.1:57696_solr-n_0000000000) [    ] o.a.s.c.a.OverseerTriggerThread Current znodeVersion 1, lastZnodeVersion 0
   [junit4]   2> 2998578 DEBUG (OverseerAutoScalingTriggerThread-72157129149841416-127.0.0.1:57696_solr-n_0000000000) [    ] o.a.s.c.a.OverseerTriggerThread Processed trigger updates upto znodeVersion 1
   [junit4]   2> 2998578 INFO  (OverseerStateUpdate-72157129149841416-127.0.0.1:57696_solr-n_0000000000) [n:127.0.0.1:57696_solr    ] o.a.s.c.c.ZkStateReader Updated live nodes from ZooKeeper... (0) -> (1)
   [junit4]   2> 2998580 INFO  (zkCallback-19736-thread-1) [    ] o.a.s.c.c.ZkStateReader Updated live nodes from ZooKeeper... (0) -> (1)
   [junit4]   2> 2998585 DEBUG (OverseerAutoScalingTriggerThread-72157129149841416-127.0.0.1:57696_solr-n_0000000000) [    ] o.a.s.c.a.NodeLostTrigger NodeLostTrigger .auto_add_replicas - Initial livenodes: [127.0.0.1:57696_solr]
   [junit4]   2> 2998586 DEBUG (OverseerAutoScalingTriggerThread-72157129149841416-127.0.0.1:57696_solr-n_0000000000) [    ] o.a.s.c.a.OverseerTriggerThread -- cleaning old nodeLost / nodeAdded markers
   [junit4]   2> 2998587 DEBUG (ScheduledTrigger-16251-thread-1) [    ] o.a.s.c.a.NodeLostTrigger Running NodeLostTrigger: .auto_add_replicas with currently live nodes: 1 and last live nodes: 1
   [junit4]   2> 2998587 DEBUG (OverseerAutoScalingTriggerThread-72157129149841416-127.0.0.1:57696_solr-n_0000000000) [    ] o.a.s.c.a.OverseerTriggerThread Current znodeVersion 1, lastZnodeVersion 1
   [junit4]   2> 2998661 INFO  (jetty-launcher-19706-thread-2) [n:127.0.0.1:57696_solr    ] o.a.s.h.a.MetricsHistoryHandler No .system collection, keeping metrics history in memory.
   [junit4]   2> 2998688 INFO  (jetty-launcher-19706-thread-1) [n:127.0.0.1:57697_solr    ] o.a.s.c.c.ZkStateReader Updated live nodes from ZooKeeper... (0) -> (1)
   [junit4]   2> 2998697 INFO  (jetty-launcher-19706-thread-1) [n:127.0.0.1:57697_solr    ] o.a.s.c.ZkController Publish node=127.0.0.1:57697_solr as DOWN
   [junit4]   2> 2998699 INFO  (jetty-launcher-19706-thread-1) [n:127.0.0.1:57697_solr    ] o.a.s.c.TransientSolrCoreCacheDefault Allocating transient cache for 2147483647 transient cores
   [junit4]   2> 2998699 INFO  (jetty-launcher-19706-thread-1) [n:127.0.0.1:57697_solr    ] o.a.s.c.ZkController Register node as live in ZooKeeper:/live_nodes/127.0.0.1:57697_solr
   [junit4]   2> 2998701 INFO  (zkCallback-19719-thread-1) [    ] o.a.s.c.c.ZkStateReader Updated live nodes from ZooKeeper... (1) -> (2)
   [junit4]   2> 2998701 INFO  (zkCallback-19729-thread-1) [    ] o.a.s.c.c.ZkStateReader Updated live nodes from ZooKeeper... (1) -> (2)
   [junit4]   2> 2998701 INFO  (zkCallback-19736-thread-1) [    ] o.a.s.c.c.ZkStateReader Updated live nodes from ZooKeeper... (1) -> (2)
   [junit4]   2> 2998704 INFO  (jetty-launcher-19706-thread-2) [n:127.0.0.1:57696_solr    ] o.a.s.m.r.SolrJmxReporter JMX monitoring for 'solr_57696.solr.node' (registry 'solr.node') enabled at server: com.sun.jmx.mbeanserver.JmxMBeanServer@7ba91a25
   [junit4]   2> 2998706 INFO  (zkConnectionManagerCallback-19743-thread-1) [    ] o.a.s.c.c.ConnectionManager zkClient has connected
   [junit4]   2> 2998710 INFO  (jetty-launcher-19706-thread-1) [n:127.0.0.1:57697_solr    ] o.a.s.c.c.ZkStateReader Updated live nodes from ZooKeeper... (0) -> (2)
   [junit4]   2> 2998713 INFO  (jetty-launcher-19706-thread-1) [n:127.0.0.1:57697_solr    ] o.a.s.c.s.i.ZkClientClusterStateProvider Cluster at 127.0.0.1:57691/solr ready
   [junit4]   2> 2998719 INFO  (jetty-launcher-19706-thread-2) [n:127.0.0.1:57696_solr    ] o.a.s.m.r.SolrJmxReporter JMX monitoring for 'solr_57696.solr.jvm' (registry 'solr.jvm') enabled at server: com.sun.jmx.mbeanserver.JmxMBeanServer@7ba91a25
   [junit4]   2> 2998719 INFO  (jetty-launcher-19706-thread-2) [n:127.0.0.1:57696_solr    ] o.a.s.m.r.SolrJmxReporter JMX monitoring for 'solr_57696.solr.jetty' (registry 'solr.jetty') enabled at server: com.sun.jmx.mbeanserver.JmxMBeanServer@7ba91a25
   [junit4]   2> 2998721 INFO  (jetty-launcher-19706-thread-2) [n:127.0.0.1:57696_solr    ] o.a.s.c.CorePropertiesLocator Found 0 core definitions underneath /Users/jenkins/workspace/Lucene-Solr-master-MacOSX/solr/build/solr-core/test/J1/temp/solr.cloud.autoscaling.ScheduledTriggerIntegrationTest_1A059B6737127697-001/tempDir-001/node2/.
   [junit4]   2> 2998736 INFO  (jetty-launcher-19706-thread-1) [n:127.0.0.1:57697_solr    ] o.a.s.h.a.MetricsHistoryHandler No .system collection, keeping metrics history in memory.
   [junit4]   2> 2998756 INFO  (jetty-launcher-19706-thread-1) [n:127.0.0.1:57697_solr    ] o.a.s.m.r.SolrJmxReporter JMX monitoring for 'solr_57697.solr.node' (registry 'solr.node') enabled at server: com.sun.jmx.mbeanserver.JmxMBeanServer@7ba91a25
   [junit4]   2> 2998769 INFO  (jetty-launcher-19706-thread-1) [n:127.0.0.1:57697_solr    ] o.a.s.m.r.SolrJmxReporter JMX monitoring for 'solr_57697.solr.jvm' (registry 'solr.jvm') enabled at server: com.sun.jmx.mbeanserver.JmxMBeanServer@7ba91a25
   [junit4]   2> 2998769 INFO  (jetty-launcher-19706-thread-1) [n:127.0.0.1:57697_solr    ] o.a.s.m.r.SolrJmxReporter JMX monitoring for 'solr_57697.solr.jetty' (registry 'solr.jetty') enabled at server: com.sun.jmx.mbeanserver.JmxMBeanServer@7ba91a25
   [junit4]   2> 2998771 INFO  (jetty-launcher-19706-thread-1) [n:127.0.0.1:57697_solr    ] o.a.s.c.CorePropertiesLocator Found 0 core definitions underneath /Users/jenkins/workspace/Lucene-Solr-master-MacOSX/solr/build/solr-core/test/J1/temp/solr.cloud.autoscaling.ScheduledTriggerIntegrationTest_1A059B6737127697-001/tempDir-001/node1/.
   [junit4]   2> 2998802 INFO  (zkConnectionManagerCallback-19749-thread-1) [    ] o.a.s.c.c.ConnectionManager zkClient has connected
   [junit4]   2> 2998805 INFO  (TEST-ScheduledTriggerIntegrationTest.testScheduledTrigger-seed#[1A059B6737127697]) [    ] o.a.s.c.c.ZkStateReader Updated live nodes from ZooKeeper... (0) -> (2)
   [junit4]   2> 2998806 INFO  (TEST-ScheduledTriggerIntegrationTest.testScheduledTrigger-seed#[1A059B6737127697]) [    ] o.a.s.c.s.i.ZkClientClusterStateProvider Cluster at 127.0.0.1:57691/solr ready
   [junit4]   2> 2998819 INFO  (qtp1864883380-50547) [n:127.0.0.1:57696_solr    ] o.a.s.s.HttpSolrCall [admin] webapp=null path=/admin/autoscaling params={wt=javabin&version=2} status=0 QTime=0
   [junit4]   2> 2998824 INFO  (qtp1864883380-50550) [n:127.0.0.1:57696_solr    ] o.a.s.s.HttpSolrCall [admin] webapp=null path=/admin/metrics params={prefix=CONTAINER.fs.usableSpace,CONTAINER.fs.totalSpace,CORE.coreName&wt=javabin&version=2&group=solr.node,solr.core} status=0 QTime=0
   [junit4]   2> 2998826 INFO  (qtp830439631-50557) [n:127.0.0.1:57697_solr    ] o.a.s.s.HttpSolrCall [admin] webapp=null path=/admin/metrics params={prefix=CONTAINER.fs.usableSpace,CONTAINER.fs.totalSpace,CORE.coreName&wt=javabin&version=2&group=solr.node,solr.core} status=0 QTime=0
   [junit4]   2> 2998826 DEBUG (qtp1864883380-50548) [n:127.0.0.1:57696_solr    ] o.a.s.c.a.AutoScalingHandler Verified autoscaling configuration
   [junit4]   2> 2998828 INFO  (qtp1864883380-50548) [n:127.0.0.1:57696_solr    ] o.a.s.s.HttpSolrCall [admin] webapp=null path=/admin/autoscaling params={wt=javabin&version=2} status=0 QTime=6
   [junit4]   2> 2998829 DEBUG (zkCallback-19736-thread-1) [    ] o.a.s.c.a.OverseerTriggerThread Refreshing /autoscaling.json with znode version 2
   [junit4]   2> 2998831 DEBUG (OverseerAutoScalingTriggerThread-72157129149841416-127.0.0.1:57696_solr-n_0000000000) [    ] o.a.s.c.a.OverseerTriggerThread Processed trigger updates upto znodeVersion 2
   [junit4]   2> 2998831 INFO  (qtp1864883380-50546) [n:127.0.0.1:57696_solr    ] o.a.s.h.a.CollectionsHandler Invoked Collection Action :create with params pullReplicas=0&maxShardsPerNode=5&name=testScheduledTrigger&nrtReplicas=3&action=CREATE&numShards=1&tlogReplicas=0&wt=javabin&version=2 and sendToOCPQueue=true
   [junit4]   2> 2998834 DEBUG (OverseerAutoScalingTriggerThread-72157129149841416-127.0.0.1:57696_solr-n_0000000000) [    ] o.a.s.c.a.OverseerTriggerThread -- cleaning old nodeLost / nodeAdded markers
   [junit4]   2> 2998835 DEBUG (OverseerAutoScalingTriggerThread-72157129149841416-127.0.0.1:57696_solr-n_0000000000) [    ] o.a.s.c.a.OverseerTriggerThread Current znodeVersion 2, lastZnodeVersion 2
   [junit4]   2> 2998836 INFO  (OverseerThreadFactory-16253-thread-1-processing-n:127.0.0.1:57696_solr) [n:127.0.0.1:57696_solr    ] o.a.s.c.a.c.CreateCollectionCmd Create collection testScheduledTrigger
   [junit4]   2> 2998837 INFO  (OverseerThreadFactory-16253-thread-1-processing-n:127.0.0.1:57696_solr) [n:127.0.0.1:57696_solr    ] o.a.s.c.c.ZkConfigManager Copying zk node /configs/_default/managed-schema to /configs/testScheduledTrigger.AUTOCREATED/managed-schema
   [junit4]   2> 2998840 INFO  (OverseerThreadFactory-16253-thread-1-processing-n:127.0.0.1:57696_solr) [n:127.0.0.1:57696_solr    ] o.a.s.c.c.ZkConfigManager Copying zk node /configs/_default/protwords.txt to /configs/testScheduledTrigger.AUTOCREATED/protwords.txt
   [junit4]   2> 2998843 INFO  (OverseerThreadFactory-16253-thread-1-processing-n:127.0.0.1:57696_solr) [n:127.0.0.1:57696_solr    ] o.a.s.c.c.ZkConfigManager Copying zk node /configs/_default/solrconfig.xml to /configs/testScheduledTrigger.AUTOCREATED/solrconfig.xml
   [junit4]   2> 2998846 INFO  (OverseerThreadFactory-16253-thread-1-processing-n:127.0.0.1:57696_solr) [n:127.0.0.1:57696_solr    ] o.a.s.c.c.ZkConfigManager Copying zk node /configs/_default/synonyms.txt to /configs/testScheduledTrigger.AUTOCREATED/synonyms.txt
   [junit4]   2> 2998848 INFO  (OverseerThreadFactory-16253-thread-1-processing-n:127.0.0.1:57696_solr) [n:127.0.0.1:57696_solr    ] o.a.s.c.c.ZkConfigManager Copying zk node /configs/_default/stopwords.txt to /configs/testScheduledTrigger.AUTOCREATED/stopwords.txt
   [junit4]   2> 2998851 INFO  (OverseerThreadFactory-16253-thread-1-processing-n:127.0.0.1:57696_solr) [n:127.0.0.1:57696_solr    ] o.a.s.c.c.ZkConfigManager Copying zk node /configs/_default/lang/contractions_it.txt to /configs/testScheduledTrigger.AUTOCREATED/lang/contractions_it.txt
   [junit4]   2> 2998855 INFO  (OverseerThreadFactory-16253-thread-1-processing-n:127.0.0.1:57696_solr) [n:127.0.0.1:57696_solr    ] o.a.s.c.c.ZkConfigManager Copying zk node /configs/_default/lang/contractions_ca.txt to /configs/testScheduledTrigger.AUTOCREATED/lang/contractions_ca.txt
   [junit4]   2> 2998858 INFO  (OverseerThreadFactory-16253-thread-1-processing-n:127.0.0.1:57696_solr) [n:127.0.0.1:57696_solr    ] o.a.s.c.c.ZkConfigManager Copying zk node /configs/_default/lang/stemdict_nl.txt to /configs/testScheduledTrigger.AUTOCREATED/lang/stemdict_nl.txt
   [junit4]   2> 2998861 INFO  (OverseerThreadFactory-16253-thread-1-processing-n:127.0.0.1:57696_solr) [n:127.0.0.1:57696_solr    ] o.a.s.c.c.ZkConfigManager Copying zk node /configs/_default/lang/stopwords_hy.txt to /configs/testScheduledTrigger.AUTOCREATED/lang/stopwords_hy.txt
   [junit4]   2> 2998864 INFO  (OverseerThreadFactory-16253-thread-1-processing-n:127.0.0.1:57696_solr) [n:127.0.0.1:57696_solr    ] o.a.s.c.c.ZkConfigManager Copying zk node /configs/_default/lang/stopwords_no.txt to /configs/testScheduledTrigger.AUTOCREATED/lang/stopwords_no.txt
   [junit4]   2> 2998867 INFO  (OverseerThreadFactory-16253-thread-1-processing-n:127.0.0.1:57696_solr) [n:127.0.0.1:57696_solr    ] o.a.s.c.c.ZkConfigManager Copying zk node /configs/_default/lang/stopwords_id.txt to /configs/testScheduledTrigger.AUTOCREATED/lang/stopwords_id.txt
   [junit4]   2> 2998871 INFO  (OverseerThreadFactory-16253-thread-1-processing-n:127.0.0.1:57696_solr) [n:127.0.0.1:57696_solr    ] o.a.s.c.c.ZkConfigManager Copying zk node /configs/_default/lang/stopwords_da.txt to /configs/testScheduledTrigger.AUTOCREATED/lang/stopwords_da.txt
   [junit4]   2> 2998874 INFO  (OverseerThreadFactory-16253-thread-1-processing-n:127.0.0.1:57696_solr) [n:127.0.0.1:57696_solr    ] o.a.s.c.c.ZkConfigManager Copying zk node /configs/_default/lang/stopwords_ga.txt to /configs/testScheduledTrigger.AUTOCREATED/lang/stopwords_ga.txt
   [junit4]   2> 2998877 INFO  (OverseerThreadFactory-16253-thread-1-processing-n:127.0.0.1:57696_solr) [n:127.0.0.1:57696_solr    ] o.a.s.c.c.ZkConfigManager Copying zk node /configs/_default/lang/stopwords_hi.txt to /configs/testScheduledTrigger.AUTOCREATED/lang/stopwords_hi.txt
   [junit4]   2> 2998880 INFO  (OverseerThreadFactory-16253-thread-1-processing-n:127.0.0.1:57696_solr) [n:127.0.0.1:57696_solr    ] o.a.s.c.c.ZkConfigManager Copying zk node /configs/_default/lang/stopwords_ja.txt to /configs/testScheduledTrigger.AUTOCREATED/lang/stopwords_ja.txt
   [junit4]   2> 2998883 INFO  (OverseerThreadFactory-16253-thread-1-processing-n:127.0.0.1:57696_solr) [n:127.0.0.1:57696_solr    ] o.a.s.c.c.ZkConfigManager Copying zk node /configs/_default/lang/stopwords_pt.txt to /configs/testScheduledTrigger.AUTOCREATED/lang/stopwords_pt.txt
   [junit4]   2> 2998887 INFO  (OverseerThreadFactory-16253-thread-1-processing-n:127.0.0.1:57696_solr) [n:127.0.0.1:57696_solr    ] o.a.s.c.c.ZkConfigManager Copying zk node /configs/_default/lang/stopwords_hu.txt to /configs/testScheduledTrigger.AUTOCREATED/lang/stopwords_hu.txt
   [junit4]   2> 2998891 INFO  (OverseerThreadFactory-16253-thread-1-processing-n:127.0.0.1:57696_solr) [n:127.0.0.1:57696_solr    ] o.a.s.c.c.ZkConfigManager Copying zk node /configs/_default/lang/stopwords_el.txt to /configs/testScheduledTrigger.AUTOCREATED/lang/stopwords_el.txt
   [junit4]   2> 2998894 INFO  (OverseerThreadFactory-16253-thread-1-processing-n:127.0.0.1:57696_solr) [n:127.0.0.1:57696_solr    ] o.a.s.c.c.ZkConfigManager Copying zk node /configs/_default/lang/stopwords_ru.txt to /configs/testScheduledTrigger.AUTOCREATED/lang/stopwords_ru.txt
   [junit4]   2> 2998898 INFO  (OverseerThreadFactory-16253-thread-1-processing-n:127.0.0.1:57696_solr) [n:127.0.0.1:57696_solr    ] o.a.s.c.c.ZkConfigManager Copying zk node /configs/_default/lang/stopwords_tr.txt to /configs/testScheduledTrigger.AUTOCREATED/lang/stopwords_tr.txt
   [junit4]   2> 2998902 INFO  (OverseerThreadFactory-16253-thread-1-processing-n:127.0.0.1:57696_solr) [n:127.0.0.1:57696_solr    ] o.a.s.c.c.ZkConfigManager Copying zk node /configs/_default/lang/stopwords_ar.txt to /configs/testScheduledTrigger.AUTOCREATED/lang/stopwords_ar.txt
   [junit4]   2> 2998906 INFO  (OverseerThreadFactory-16253-thread-1-processing-n:127.0.0.1:57696_solr) [n:127.0.0.1:57696_solr    ] o.a.s.c.c.ZkConfigManager Copying zk node /configs/_default/lang/userdict_ja.txt to /configs/testScheduledTrigger.AUTOCREATED/lang/userdict_ja.txt
   [junit4]   2> 2998910 INFO  (OverseerThreadFactory-16253-thread-1-processing-n:127.0.0.1:57696_solr) [n:127.0.0.1:57696_solr    ] o.a.s.c.c.ZkConfigManager Copying zk node /configs/_default/lang/stopwords_eu.txt to /configs/testScheduledTrigger.AUTOCREATED/lang/stopwords_eu.txt
   [junit4]   2> 2998913 INFO  (OverseerThreadFactory-16253-thread-1-processing-n:127.0.0.1:57696_solr) [n:127.0.0.1:57696_solr    ] o.a.s.c.c.ZkConfigManager Copying zk node /configs/_default/lang/stopwords_it.txt to /configs/testScheduledTrigger.AUTOCREATED/lang/stopwords_it.txt
   [junit4]   2> 2998916 INFO  (OverseerThreadFactory-16253-thread-1-processing-n:127.0.0.1:57696_solr) [n:127.0.0.1:57696_solr    ] o.a.s.c.c.ZkConfigManager Copying zk node /configs/_default/lang/stopwords_cz.txt to /configs/testScheduledTrigger.AUTOCREATED/lang/stopwords_cz.txt
   [junit4]   2> 2998920 INFO  (OverseerThreadFactory-16253-thread-1-processing-n:127.0.0.1:57696_solr) [n:127.0.0.1:57696_solr    ] o.a.s.c.c.ZkConfigManager Copying zk node /configs/_default/lang/stoptags_ja.txt to /configs/testScheduledTrigger.AUTOCREATED/lang/stoptags_ja.txt
   [junit4]   2> 2998924 INFO  (OverseerThreadFactory-16253-thread-1-processing-n:127.0.0.1:57696_solr) [n:127.0.0.1:57696_solr    ] o.a.s.c.c.ZkConfigManager Copying zk node /configs/_default/lang/contractions_fr.txt to /configs/testScheduledTrigger.AUTOCREATED/lang/contractions_fr.txt
   [junit4]   2> 2998928 INFO  (OverseerThreadFactory-16253-thread-1-processing-n:127.0.0.1:57696_solr) [n:127.0.0.1:57696_solr    ] o.a.s.c.c.ZkConfigManager Copying zk node /configs/_default/lang/stopwords_de.txt to /configs/testScheduledTrigger.AUTOCREATED/lang/stopwords_de.txt
   [junit4]   2> 2998932 INFO  (OverseerThreadFactory-16253-thread-1-processing-n:127.0.0.1:57696_solr) [n:127.0.0.1:57696_solr    ] o.a.s.c.c.ZkConfigManager Copying zk node /configs/_default/lang/stopwords_fa.txt to /configs/testScheduledTrigger.AUTOCREATED/lang/stopwords_fa.txt
   [junit4]   2> 2998935 INFO  (OverseerThreadFactory-16253-thread-1-processing-n:127.0.0.1:57696_solr) [n:127.0.0.1:57696_solr    ] o.a.s.c.c.ZkConfigManager Copying zk node /configs/_default/lang/contractions_ga.txt to /configs/testScheduledTrigger.AUTOCREATED/lang/contractions_ga.txt
   [junit4]   2> 2998939 INFO  (OverseerThreadFactory-16253-thread-1-processing-n:127.0.0.1:57696_solr) [n:127.0.0.1:57696_solr    ] o.a.s.c.c.ZkConfigManager Copying zk node /configs/_default/lang/stopwords_ca.txt to /configs/testScheduledTrigger.AUTOCREATED/lang/stopwords_ca.txt
   [junit4]   2> 2998942 INFO  (OverseerThreadFactory-16253-thread-1-processing-n:127.0.0.1:57696_solr) [n:127.0.0.1:57696_solr    ] o.a.s.c.c.ZkConfigManager Copying zk node /configs/_default/lang/stopwords_nl.txt to /configs/testScheduledTrigger.AUTOCREATED/lang/stopwords_nl.txt
   [junit4]   2> 2998945 INFO  (OverseerThreadFactory-16253-thread-1-processing-n:127.0.0.1:57696_solr) [n:127.0.0.1:57696_solr    ] o.a.s.c.c.ZkConfigManager Copying zk node /configs/_default/lang/stopwords_bg.txt to /configs/testScheduledTrigger.AUTOCREATED/lang/stopwords_bg.txt
   [junit4]   2> 2998948 INFO  (OverseerThreadFactory-16253-thread-1-processing-n:127.0.0.1:57696_solr) [n:127.0.0.1:57696_solr    ] o.a.s.c.c.ZkConfigManager Copying zk node /configs/_default/lang/stopwords_en.txt to /configs/testScheduledTrigger.AUTOCREATED/lang/stopwords_en.txt
   [junit4]   2> 2998951 INFO  (OverseerThreadFactory-16253-thread-1-processing-n:127.0.0.1:57696_solr) [n:127.0.0.1:57696_solr    ] o.a.s.c.c.ZkConfigManager Copying zk node /configs/_default/lang/stopwords_es.txt to /configs/testScheduledTrigger.AUTOCREATED/lang/stopwords_es.txt
   [junit4]   2> 2998954 INFO  (OverseerThreadFactory-16253-thread-1-processing-n:127.0.0.1:57696_solr) [n:127.0.0.1:57696_solr    ] o.a.s.c.c.ZkConfigManager Copying zk node /configs/_default/lang/stopwords_lv.txt to /configs/testScheduledTrigger.AUTOCREATED/lang/stopwords_lv.txt
   [junit4]   2> 2998957 INFO  (OverseerThreadFactory-16253-thread-1-processing-n:127.0.0.1:57696_solr) [n:127.0.0.1:57696_solr    ] o.a.s.c.c.ZkConfigManager Copying zk node /configs/_default/lang/stopwords_ro.txt to /configs/testScheduledTrigger.AUTOCREATED/lang/stopwords_ro.txt
   [junit4]   2> 2998960 INFO  (OverseerThreadFactory-16253-thread-1-processing-n:127.0.0.1:57696_solr) [n:127.0.0.1:57696_solr    ] o.a.s.c.c.ZkConfigManager Copying zk node /configs/_default/lang/stopwords_th.txt to /configs/testScheduledTrigger.AUTOCREATED/lang/stopwords_th.txt
   [junit4]   2> 2998963 INFO  (OverseerThreadFactory-16253-thread-1-processing-n:127.0.0.1:57696_solr) [n:127.0.0.1:57696_solr    ] o.a.s.c.c.ZkConfigManager Copying zk node /configs/_default/lang/stopwords_fr.txt to /configs/testScheduledTrigger.AUTOCREATED/lang/stopwords_fr.txt
   [junit4]   2> 2998966 INFO  (OverseerThreadFactory-16253-thread-1-processing-n:127.0.0.1:57696_solr) [n:127.0.0.1:57696_solr    ] o.a.s.c.c.ZkConfigManager Copying zk node /configs/_default/lang/stopwords_sv.txt to /configs/testScheduledTrigger.AUTOCREATED/lang/stopwords_sv.txt
   [junit4]   2> 2998970 INFO  (OverseerThreadFactory-16253-thread-1-processing-n:127.0.0.1:57696_solr) [n:127.0.0.1:57696_solr    ] o.a.s.c.c.ZkConfigManager Copying zk node /configs/_default/lang/stopwords_fi.txt to /configs/testScheduledTrigger.AUTOCREATED/lang/stopwords_fi.txt
   [junit4]   2> 2998973 INFO  (OverseerThreadFactory-16253-thread-1-processing-n:127.0.0.1:57696_solr) [n:127.0.0.1:57696_solr    ] o.a.s.c.c.ZkConfigManager Copying zk node /configs/_default/lang/hyphenations_ga.txt to /configs/testScheduledTrigger.AUTOCREATED/lang/hyphenations_ga.txt
   [junit4]   2> 2998997 INFO  (OverseerThreadFactory-16253-thread-1-processing-n:127.0.0.1:57696_solr) [n:127.0.0.1:57696_solr    ] o.a.s.c.c.ZkConfigManager Copying zk node /configs/_default/lang/stopwords_gl.txt to /configs/testScheduledTrigger.AUTOCREATED/lang/stopwords_gl.txt
   [junit4]   2> 2999000 INFO  (OverseerThreadFactory-16253-thread-1-processing-n:127.0.0.1:57696_solr) [n:127.0.0.1:57696_solr    ] o.a.s.c.c.ZkConfigManager Copying zk node /configs/_default/params.json to /configs/testScheduledTrigger.AUTOCREATED/params.json
   [junit4]   2> 2999114 WARN  (OverseerThreadFactory-16253-thread-1-processing-n:127.0.0.1:57696_solr) [n:127.0.0.1:57696_solr    ] o.a.s.c.a.c.CreateCollectionCmd Specified number of replicas of 3 on collection testScheduledTrigger is higher than the number of Solr instances currently live or live and part of your createNodeSet(2). It's unusual to run two replica of the same slice on the same Solr-instance.
   [junit4]   2> 2999138 INFO  (OverseerStateUpdate-72157129149841416-127.0.0.1:57696_solr-n_0000000000) [n:127.0.0.1:57696_solr    ] o.a.s.c.o.SliceMutator createReplica() {
   [junit4]   2>   "operation":"ADDREPLICA",
   [junit4]   2>   "collection":"testScheduledTrigger",
   [junit4]   2>   "shard":"shard1",
   [junit4]   2>   "core":"testScheduledTrigger_shard1_replica_n1",
   [junit4]   2>   "state":"down",
   [junit4]   2>   "base_url":"http://127.0.0.1:57696/solr",
   [junit4]   2>   "type":"NRT",
   [junit4]   2>   "waitForFinalState":"false"} 
   [junit4]   2> 2999142 INFO  (OverseerStateUpdate-72157129149841416-127.0.0.1:57696_solr-n_0000000000) [n:127.0.0.1:57696_solr    ] o.a.s.c.o.SliceMutator createReplica() {
   [junit4]   2>   "operation":"ADDREPLICA",
   [junit4]   2>   "collection":"testScheduledTrigger",
   [junit4]   2>   "shard":"shard1",
   [junit4]   2>   "core":"testScheduledTrigger_shard1_replica_n2",
   [junit4]   2>   "state":"down",
   [junit4]   2>   "base_url":"http://127.0.0.1:57697/solr",
   [junit4]   2>   "type":"NRT",
   [junit4]   2>   "waitForFinalState":"false"} 
   [junit4]   2> 2999146 INFO  (OverseerStateUpdate-72157129149841416-127.0.0.1:57696_solr-n_0000000000) [n:127.0.0.1:57696_solr    ] o.a.s.c.o.SliceMutator createReplica() {
   [junit4]   2>   "operation":"ADDREPLICA",
   [junit4]   2>   "collection":"testScheduledTrigger",
   [junit4]   2>   "shard":"shard1",
   [junit4]   2>   "core":"testScheduledTrigger_shard1_replica_n4",
   [junit4]   2>   "state":"down",
   [junit4]   2>   "base_url":"http://127.0.0.1:57696/solr",
   [junit4]   2>   "type":"NRT",
   [junit4]   2>   "waitForFinalState":"false"} 
   [junit4]   2> 2999365 INFO  (qtp1864883380-50547) [n:127.0.0.1:57696_solr    x:testScheduledTrigger_shard1_replica_n1] o.a.s.h.a.CoreAdminOperation core create command qt=/admin/cores&coreNodeName=core_node3&collection.configName=testScheduledTrigger.AUTOCREATED&newCollection=true&name=testScheduledTrigger_shard1_replica_n1&action=CREATE&numShards=1&collection=testScheduledTrigger&shard=shard1&wt=javabin&version=2&replicaType=NRT
   [junit4]   2> 2999365 INFO  (qtp830439631-50558) [n:127.0.0.1:57697_solr    x:testScheduledTrigger_shard1_replica_n2] o.a.s.h.a.CoreAdminOperation core create command qt=/admin/cores&coreNodeName=core_node5&collection.configName=testScheduledTrigger.AUTOCREATED&newCollection=true&name=testScheduledTrigger_shard1_replica_n2&action=CREATE&numShards=1&collection=testScheduledTrigger&shard=shard1&wt=javabin&version=2&replicaType=NRT
   [junit4]   2> 2999365 INFO  (qtp1864883380-50547) [n:127.0.0.1:57696_solr    x:testScheduledTrigger_shard1_replica_n1] o.a.s.c.TransientSolrCoreCacheDefault Allocating transient cache for 2147483647 transient cores
   [junit4]   2> 2999370 INFO  (qtp1864883380-50549) [n:127.0.0.1:57696_solr    x:testScheduledTrigger_shard1_replica_n4] o.a.s.h.a.CoreAdminOperation core create command qt=/admin/cores&coreNodeName=core_node6&collection.configName=testScheduledTrigger.AUTOCREATED&newCollection=true&name=testScheduledTrigger_shard1_replica_n4&action=CREATE&numShards=1&collection=testScheduledTrigger&shard=shard1&wt=javabin&version=2&replicaType=NRT
   [junit4]   2> 2999594 DEBUG (ScheduledTrigger-16251-thread-2) [    ] o.a.s.c.a.NodeLostTrigger Running NodeLostTrigger: .auto_add_replicas with currently live nodes: 2 and last live nodes: 1
   [junit4]   2> 3000401 INFO  (qtp830439631-50558) [n:127.0.0.1:57697_solr c:testScheduledTrigger s:shard1 r:core_node5 x:testScheduledTrigger_shard1_replica_n2] o.a.s.c.RequestParams conf resource params.json loaded . version : 0 
   [junit4]   2> 3000401 INFO  (qtp830439631-50558) [n:127.0.0.1:57697_solr c:testScheduledTrigger s:shard1 r:core_node5 x:testScheduledTrigger_shard1_replica_n2] o.a.s.c.RequestParams request params refreshed to version 0
   [junit4]   2> 3000402 WARN  (qtp830439631-50558) [n:127.0.0.1:57697_solr c:testScheduledTrigger s:shard1 r:core_node5 x:testScheduledTrigger_shard1_replica_n2] o.a.s.c.SolrConfig Couldn't add files from /Users/jenkins/workspace/Lucene-Solr-master-MacOSX/solr/build/solr-core/test/J1/temp/solr.cloud.autoscaling.ScheduledTriggerIntegrationTest_1A059B6737127697-001/tempDir-001/node1/testScheduledTrigger_shard1_replica_n2/../../../../contrib/extraction/lib filtered by .*\.jar to classpath: /Users/jenkins/workspace/Lucene-Solr-master-MacOSX/solr/build/solr-core/test/J1/temp/solr.cloud.autoscaling.ScheduledTriggerIntegrationTest_1A059B6737127697-001/tempDir-001/node1/testScheduledTrigger_shard1_replica_n2/../../../../contrib/extraction/lib
   [junit4]   2> 3000402 WARN  (qtp830439631-50558) [n:127.0.0.1:57697_solr c:testScheduledTrigger s:shard1 r:core_node5 x:testScheduledTrigger_shard1_replica_n2] o.a.s.c.SolrConfig Couldn't add files from /Users/jenkins/workspace/Lucene-Solr-master-MacOSX/solr/build/solr-core/test/J1/temp/solr.cloud.autoscaling.ScheduledTriggerIntegrationTest_1A059B6737127697-001/tempDir-001/node1/testScheduledTrigger_shard1_replica_n2/../../../../dist filtered by solr-cell-\d.*\.jar to classpath: /Users/jenkins/workspace/Lucene-Solr-master-MacOSX/solr/build/solr-core/test/J1/temp/solr.cloud.autoscaling.ScheduledTriggerIntegrationTest_1A059B6737127697-001/tempDir-001/node1/testScheduledTrigger_shard1_replica_n2/../../../../dist
   [junit4]   2> 3000402 WARN  (qtp830439631-50558) [n:127.0.0.1:57697_solr c:testScheduledTrigger s:shard1 r:core_node5 x:testScheduledTrigger_shard1_replica_n2] o.a.s.c.SolrConfig Couldn't add files from /Users/jenkins/workspace/Lucene-Solr-master-MacOSX/solr/build/solr-core/test/J1/temp/solr.cloud.autoscaling.ScheduledTriggerIntegrationTest_1A059B6737127697-001/tempDir-001/node1/testScheduledTrigger_shard1_replica_n2/../../../../contrib/clustering/lib filtered by .*\.jar to classpath: /Users/jenkins/workspace/Lucene-Solr-master-MacOSX/solr/build/solr-core/test/J1/temp/solr.cloud.autoscaling.ScheduledTriggerIntegrationTest_1A059B6737127697-001/tempDir-001/node1/testScheduledTrigger_shard1_replica_n2/../../../../contrib/clustering/lib
   [junit4]   2> 3000402 WARN  (qtp830439631-50558) [n:127.0.0.1:57697_solr c:testScheduledTrigger s:shard1 r:core_node5 x:testScheduledTrigger_shard1_replica_n2] o.a.s.c.SolrConfig Couldn't add files from /Users/jenkins/workspace/Lucene-Solr-master-MacOSX/solr/build/solr-core/test/J1/temp/solr.cloud.autoscaling.ScheduledTriggerIntegrationTest_1A059B6737127697-001/tempDir-001/node1/testScheduledTrigger_shard1_replica_n2/../../../../dist filtered by solr-clustering-\d.*\.jar to classpath: /Users/jenkins/workspace/Lucene-Solr-master-MacOSX/solr/build/solr-core/test/J1/temp/solr.cloud.autoscaling.ScheduledTriggerIntegrationTest_1A059B6737127697-001/tempDir-001/node1/testScheduledTrigger_shard1_replica_n2/../../../../dist
   [junit4]   2> 3000402 WARN  (qtp830439631-50558) [n:127.0.0.1:57697_solr c:testScheduledTrigger s:shard1 r:core_node5 x:testScheduledTrigger_shard1_replica_n2] o.a.s.c.SolrConfig Couldn't add files from /Users/jenkins/workspace/Lucene-Solr-master-MacOSX/solr/build/solr-core/test/J1/temp/solr.cloud.autoscaling.ScheduledTriggerIntegrationTest_1A059B6737127697-001/tempDir-001/node1/testScheduledTrigger_shard1_replica_n2/../../../../contrib/langid/lib filtered by .*\.jar to classpath: /Users/jenkins/workspace/Lucene-Solr-master-MacOSX/solr/build/solr-core/test/J1/temp/solr.cloud.autoscaling.ScheduledTriggerIntegrationTest_1A059B6737127697-001/tempDir-001/node1/testScheduledTrigger_shard1_replica_n2/../../../../contrib/langid/lib
   [junit4]   2> 3000403 WARN  (qtp830439631-50558) [n:127.0.0.1:57697_solr c:testScheduledTrigger s:shard1 r:core_node5 x:testScheduledTrigger_shard1_replica_n2] o.a.s.c.SolrConfig Couldn't add files from /Users/jenkins/workspace/Lucene-Solr-master-MacOSX/solr/build/solr-core/test/J1/temp/solr.cloud.autoscaling.ScheduledTriggerIntegrationTest_1A059B6737127697-001/tempDir-001/node1/testScheduledTrigger_shard1_replica_n2/../../../../dist filtered by solr-langid-\d.*\.jar to classpath: /Users/jenkins/workspace/Lucene-Solr-master-MacOSX/solr/build/solr-core/test/J1/temp/solr.cloud.autoscaling.ScheduledTriggerIntegrationTest_1A059B6737127697-001/tempDir-001/node1/testScheduledTrigger_shard1_replica_n2/../../../../dist
   [junit4]   2> 3000403 WARN  (qtp830439631-50558) [n:127.0.0.1:57697_solr c:testScheduledTrigger s:shard1 r:core_node5 x:testScheduledTrigger_shard1_replica_n2] o.a.s.c.SolrConfig Couldn't add files from /Users/jenkins/workspace/Lucene-Solr-master-MacOSX/solr/build/solr-core/test/J1/temp/solr.cloud.autoscaling.ScheduledTriggerIntegrationTest_1A059B6737127697-001/tempDir-001/node1/testScheduledTrigger_shard1_replica_n2/../../../../contrib/velocity/lib filtered by .*\.jar to classpath: /Users/jenkins/workspace/Lucene-Solr-master-MacOSX/solr/build/solr-core/test/J1/temp/solr.cloud.autoscaling.ScheduledTriggerIntegrationTest_1A059B6737127697-001/tempDir-001/node1/testScheduledTrigger_shard1_replica_n2/../../../../contrib/velocity/lib
   [junit4]   2> 3000403 WARN  (qtp830439631-50558) [n:127.0.0.1:57697_solr c:testScheduledTrigger s:shard1 r:core_node5 x:testScheduledTrigger_shard1_replica_n2] o.a.s.c.SolrConfig Couldn't add files from /Users/jenkins/workspace/Lucene-Solr-master-MacOSX/solr/build/solr-core/test/J1/temp/solr.cloud.autoscaling.ScheduledTriggerIntegrationTest_1A059B6737127697-001/tempDir-001/node1/testScheduledTrigger_shard1_replica_n2/../../../../dist filtered by solr-velocity-\d.*\.jar to classpath: /Users/jenkins/workspace/Lucene-Solr-master-MacOSX/solr/build/solr-core/test/J1/temp/solr.cloud.autoscaling.ScheduledTriggerIntegrationTest_1A059B6737127697-001/tempDir-001/node1/testScheduledTrigger_shard1_replica_n2/../../../../dist
   [junit4]   2> 3000403 WARN  (qtp830439631-50558) [n:127.0.0.1:57697_solr c:testScheduledTrigger s:shard1 r:core_node5 x:testScheduledTrigger_shard1_replica_n2] o.a.s.c.SolrConfig Couldn't add files from /Users/jenkins/workspace/Lucene-Solr-master-MacOSX/solr/build/solr-core/test/J1/temp/solr.cloud.autoscaling.ScheduledTriggerIntegrationTest_1A059B6737127697-001/tempDir-001/node1/testScheduledTrigger_shard1_replica_n2/../../../../dist filtered by solr-ltr-\d.*\.jar to classpath: /Users/jenkins/workspace/Lucene-Solr-master-MacOSX/solr/build/solr-core/test/J1/temp/solr.cloud.autoscaling.ScheduledTriggerIntegrationTest_1A059B6737127697-001/tempDir-001/node1/testScheduledTrigger_shard1_replica_n2/../../../../dist
   [junit4]   2> 3000403 INFO  (qtp1864883380-50547) [n:127.0.0.1:57696_solr c:testScheduledTrigger s:shard1 r:core_node3 x:testScheduledTrigger_shard1_replica_n1] o.a.s.c.RequestParams conf resource params.json loaded . version : 0 
   [junit4]   2> 3000403 INFO  (qtp1864883380-50547) [n:127.0.0.1:57696_solr c:testScheduledTrigger s:shard1 r:core_node3 x:testScheduledTrigger_shard1_replica_n1] o.a.s.c.RequestParams request params refreshed to version 0
   [junit4]   2> 3000404 INFO  (qtp1864883380-50549) [n:127.0.0.1:57696_solr c:testScheduledTrigger s:shard1 r:core_node6 x:testScheduledTrigger_shard1_replica_n4] o.a.s.c.RequestParams conf resource params.json loaded . version : 0 
   [junit4]   2> 3000404 INFO  (qtp1864883380-50549) [n:127.0.0.1:57696_solr c:testScheduledTrigger s:shard1 r:core_node6 x:testScheduledTrigger_shard1_replica_n4] o.a.s.c.RequestParams request params refreshed to version 0
   [junit4]   2> 3000404 WARN  (qtp1864883380-50547) [n:127.0.0.1:57696_solr c:testScheduledTrigger s:shard1 r:core_node3 x:testScheduledTrigger_shard1_replica_n1] o.a.s.c.SolrConfig Couldn't add files from /Users/jenkins/workspace/Lucene-Solr-master-MacOSX/solr/build/solr-core/test/J1/temp/solr.cloud.autoscaling.ScheduledTriggerIntegrationTest_1A059B6737127697-001/tempDir-001/node2/testScheduledTrigger_shard1_replica_n1/../../../../contrib/extraction/lib filtered by .*\.jar to classpath: /Users/jenkins/workspace/Lucene-Solr-master-MacOSX/solr/build/solr-core/test/J1/temp/solr.cloud.autoscaling.ScheduledTriggerIntegrationTest_1A059B6737127697-001/tempDir-001/node2/testScheduledTrigger_shard1_replica_n1/../../../../contrib/extraction/lib
   [junit4]   2> 3000404 WARN  (qtp1864883380-50547) [n:127.0.0.1:57696_solr c:testScheduledTrigger s:shard1 r:core_node3 x:testScheduledTrigger_shard1_replica_n1] o.a.s.c.SolrConfig Couldn't add files from /Users/jenkins/workspace/Lucene-Solr-master-MacOSX/solr/build/solr-core/test/J1/temp/solr.cloud.autoscaling.ScheduledTriggerIntegrationTest_1A059B6737127697-001/tempDir-001/node2/testScheduledTrigger_shard1_replica_n1/../../../../dist filtered by solr-cell-\d.*\.jar to classpath: /Users/jenkins/workspace/Lucene-Solr-master-MacOSX/solr/build/solr-core/test/J1/temp/solr.cloud.autoscaling.ScheduledTriggerIntegrationTest_1A059B6737127697-001/tempDir-001/node2/testScheduledTrigger_shard1_replica_n1/../../../../dist
   [junit4]   2> 3000404 WARN  (qtp1864883380-50547) [n:127.0.0.1:57696_solr c:testScheduledTrigger s:shard1 r:core_node3 x:testScheduledTrigger_shard1_replica_n1] o.a.s.c.SolrConfig Couldn't add files from /Users/jenkins/workspace/Lucene-Solr-master-MacOSX/solr/build/solr-core/test/J1/temp/solr.cloud.autoscaling.ScheduledTriggerIntegrationTest_1A059B6737127697-001/tempDir-001/node2/testScheduledTrigger_shard1_replica_n1/../../../../contrib/clustering/lib filtered by .*\.jar to classpath: /Users/jenkins/workspace/Lucene-Solr-master-MacOSX/solr/build/solr-core/test/J1/temp/solr.cloud.autoscaling.ScheduledTriggerIntegrationTest_1A059B6737127697-001/tempDir-001/node2/testScheduledTrigger_shard1_replica_n1/../../../../contrib/clustering/lib
   [junit4]   2> 3000404 WARN  (qtp1864883380-50549) [n:127.0.0.1:57696_solr c:testScheduledTrigger s:shard1 r:core_node6 x:testScheduledTrigger_shard1_replica_n4] o.a.s.c.SolrConfig Couldn't add files from /Users/jenkins/workspace/Lucene-Solr-master-MacOSX/solr/build/solr-core/test/J1/temp/solr.cloud.autoscaling.ScheduledTriggerIntegrationTest_1A059B6737127697-001/tempDir-001/node2/testScheduledTrigger_shard1_replica_n4/../../../../contrib/extraction/lib filtered by .*\.jar to classpath: /Users/jenkins/workspace/Lucene-Solr-master-MacOSX/solr/build/solr-core/test/J1/temp/solr.cloud.autoscaling.ScheduledTriggerIntegrationTest_1A059B6737127697-001/tempDir-001/node2/testScheduledTrigger_shard1_replica_n4/../../../../contrib/extraction/lib
   [junit4]   2> 3000404 WARN  (qtp1864883380-50549) [n:127.0.0.1:57696_solr c:testScheduledTrigger s:shard1 r:core_node6 x:testScheduledTrigger_shard1_replica_n4] o.a.s.c.SolrConfig Couldn't add files from /Users/jenkins/workspace/Lucene-Solr-master-MacOSX/solr/build/solr-core/test/J1/temp/solr.cloud.autoscaling.ScheduledTriggerIntegrationTest_1A059B6737127697-001/tempDir-001/node2/testScheduledTrigger_shard1_replica_n4/../../../../dist filtered by solr-cell-\d.*\.jar to classpath: /Users/jenkins/workspace/Lucene-Solr-master-MacOSX/solr/build/solr-core/test/J1/temp/solr.cloud.autoscaling.ScheduledTriggerIntegrationTest_1A059B6737127697-001/tempDir-001/node2/testScheduledTrigger_shard1_replica_n4/../../../../dist
   [junit4]   2> 3000404 WARN  (qtp1864883380-50547) [n:127.0.0.1:57696_solr c:testScheduledTrigger s:shard1 r:core_node3 x:testScheduledTrigger_shard1_replica_n1] o.a.s.c.SolrConfig Couldn't add files from /Users/jenkins/workspace/Lucene-Solr-master-MacOSX/solr/build/solr-core/test/J1/temp/solr.cloud.autoscaling.ScheduledTriggerIntegrationTest_1A059B6737127697-001/tempDir-001/node2/testScheduledTrigger_shard1_replica_n1/../../../../dist filtered by solr-clustering-\d.*\.jar to classpath: /Users/jenkins/workspace/Lucene-Solr-master-MacOSX/solr/build/solr-core/test/J1/temp/solr.cloud.autoscaling.ScheduledTriggerIntegrationTest_1A059B6737127697-001/tempDir-001/node2/testScheduledTrigger_shard1_replica_n1/../../../../dist
   [junit4]   2> 3000405 INFO  (qtp830439631-50558) [n:127.0.0.1:57697_solr c:testScheduledTrigger s:shard1 r:core_node5 x:testScheduledTrigger_shard1_replica_n2] o.a.s.c.SolrConfig Using Lucene MatchVersion: 9.0.0
   [junit4]   2> 3000405 WARN  (qtp1864883380-50549) [n:127.0.0.1:57696_solr c:testScheduledTrigger s:shard1 r:core_node6 x:testScheduledTrigger_shard1_replica_n4] o.a.s.c.SolrConfig Couldn't add files from /Users/jenkins/workspace/Lucene-Solr-master-MacOSX/solr/build/solr-core/test/J1/temp/solr.cloud.autoscaling.ScheduledTriggerIntegrationTest_1A059B6737127697-001/tempDir-001/node2/testScheduledTrigger_shard1_replica_n4/../../../../contrib/clustering/lib filtered by .*\.jar to classpath: /Users/jenkins/workspace/Lucene-Solr-master-MacOSX/solr/build/solr-core/test/J1/temp/solr.cloud.autoscaling.ScheduledTriggerIntegrationTest_1A059B6737127697-001/tempDir-001/node2/testScheduledTrigger_shard1_replica_n4/../../../../contrib/clustering/lib
   [junit4]   2> 3000405 WARN  (qtp1864883380-50547) [n:127.0.0.1:57696_solr c:testScheduledTrigger s:shard1 r:core_node3 x:testScheduledTrigger_shard1_replica_n1] o.a.s.c.SolrConfig Couldn't add files from /Users/jenkins/workspace/Lucene-Solr-master-MacOSX/solr/build/solr-core/test/J1/temp/solr.cloud.autoscaling.ScheduledTriggerIntegrationTest_1A059B6737127697-001/tempDir-001/node2/testScheduledTrigger_shard1_replica_n1/../../../../contrib/langid/lib filtered by .*\.jar to classpath: /Users/jenkins/workspace/Lucene-Solr-master-MacOSX/solr/build/solr-core/test/J1/temp/solr.cloud.autoscaling.ScheduledTriggerIntegrationTest_1A059B6737127697-001/tempDir-001/node2/testScheduledTrigger_shard1_replica_n1/../../../../contrib/langid/lib
   [junit4]   2> 3000405 WARN  (qtp1864883380-50549) [n:127.0.0.1:57696_solr c:testScheduledTrigger s:shard1 r:core_node6 x:testScheduledTrigger_shard1_replica_n4] o.a.s.c.SolrConfig Couldn't add files from /Users/jenkins/workspace/Lucene-Solr-master-MacOSX/solr/build/solr-core/test/J1/temp/solr.cloud.autoscaling.ScheduledTriggerIntegrationTest_1A059B6737127697-001/tempDir-001/node2/testScheduledTrigger_shard1_replica_n4/../../../../dist filtered by solr-clustering-\d.*\.jar to classpath: /Users/jenkins/workspace/Lucene-Solr-master-MacOSX/solr/build/solr-core/test/J1/temp/solr.cloud.autoscaling.ScheduledTriggerIntegrationTest_1A059B6737127697-001/tempDir-001/node2/testScheduledTrigger_shard1_replica_n4/../../../../dist
   [junit4]   2> 3000405 WARN  (qtp1864883380-50547) [n:127.0.0.1:57696_solr c:testScheduledTrigger s:shard1 r:core_node3 x:testScheduledTrigger_shard1_replica_n1] o.a.s.c.SolrConfig Couldn't add files from /Users/jenkins/workspace/Lucene-Solr-master-MacOSX/solr/build/solr-core/test/J1/temp/solr.cloud.autoscaling.ScheduledTriggerIntegrationTest_1A059B6737127697-001/tempDir-001/node2/testScheduledTrigger_shard1_replica_n1/../../../../dist filtered by solr-langid-\d.*\.jar to classpath: /Users/jenkins/workspace/Lucene-Solr-master-MacOSX/solr/build/solr-core/test/J1/temp/solr.cloud.autoscaling.ScheduledTriggerIntegrationTest_1A059B6737127697-001/tempDir-001/node2/testScheduledTrigger_shard1_replica_n1/../../../../dist
   [junit4]   2> 3000405 WARN  (qtp1864883380-50549) [n:127.0.0.1:57696_solr c:testScheduledTrigger s:shard1 r:core_node6 x:testScheduledTrigger_shard1_replica_n4] o.a.s.c.SolrConfig Couldn't add files from /Users/jenkins/workspace/Lucene-Solr-master-MacOSX/solr/build/solr-core/test/J1/temp/solr.cloud.autoscaling.ScheduledTriggerIntegrationTest_1A059B6737127697-001/tempDir-001/node2/testScheduledTrigger_shard1_replica_n4/../../../../contrib/langid/lib filtered by .*\.jar to classpath: /Users/jenkins/workspace/Lucene-Solr-master-MacOSX/solr/build/solr-core/test/J1/temp/solr.cloud.autoscaling.ScheduledTriggerIntegrationTest_1A059B6737127697-001/tempDir-001/node2/testScheduledTrigger_shard1_replica_n4/../../../../contrib/langid/lib
   [junit4]   2> 3000405 WARN  (qtp1864883380-50547) [n:127.0.0.1:57696_solr c:testScheduledTrigger s:shard1 r:core_node3 x:testScheduledTrigger_shard1_replica_n1] o.a.s.c.SolrConfig Couldn't add files from /Users/jenkins/workspace/Lucene-Solr-master-MacOSX/solr/build/solr-core/test/J1/temp/solr.cloud.autoscaling.ScheduledTriggerIntegrationTest_1A059B6737127697-001/tempDir-001/node2/testScheduledTrigger_shard1_replica_n1/../../../../contrib/velocity/lib filtered by .*\.jar to classpath: /Users/jenkins/workspace/Lucene-Solr-master-MacOSX/solr/build/solr-core/test/J1/temp/solr.cloud.autoscaling.ScheduledTriggerIntegrationTest_1A059B6737127697-001/tempDir-001/node2/testScheduledTrigger_shard1_replica_n1/../../../../contrib/velocity/lib
   [junit4]   2> 3000405 WARN  (qtp1864883380-50549) [n:127.0.0.1:57696_solr c:testScheduledTrigger s:shard1 r:core_node6 x:testScheduledTrigger_shard1_replica_n4] o.a.s.c.SolrConfig Couldn't add files from /Users/jenkins/workspace/Lucene-Solr-master-MacOSX/solr/build/solr-core/test/J1/temp/solr.cloud.autoscaling.ScheduledTriggerIntegrationTest_1A059B6737127697-001/tempDir-001/node2/testScheduledTrigger_shard1_replica_n4/../../../../dist filtered by solr-langid-\d.*\.jar to classpath: /Users/jenkins/workspace/Lucene-Solr-master-MacOSX/solr/build/solr-core/test/J1/temp/solr.cloud.autoscaling.ScheduledTriggerIntegrationTest_1A059B6737127697-001/tempDir-001/node2/testScheduledTrigger_shard1_replica_n4/../../../../dist
   [junit4]   2> 3000405 WARN  (qtp1864883380-50547) [n:127.0.0.1:57696_solr c:testScheduledTrigger s:shard1 r:core_node3 x:testScheduledTrigger_shard1_replica_n1] o.a.s.c.SolrConfig Couldn't add files from /Users/jenkins/workspace/Lucene-Solr-master-MacOSX/solr/build/solr-core/test/J1/temp/solr.cloud.autoscaling.ScheduledTriggerIntegrationTest_1A059B6737127697-001/tempDir-001/node2/testScheduledTrigger_shard1_replica_n1/../../../../dist filtered by solr-velocity-\d.*\.jar to classpath: /Users/jenkins/workspace/Lucene-Solr-master-MacOSX/solr/build/solr-core/test/J1/temp/solr.cloud.autoscaling.ScheduledTriggerIntegrationTest_1A059B6737127697-001/tempDir-001/node2/testScheduledTrigger_shard1_replica_n1/../../../../dist
   [junit4]   2> 3000405 WARN  (qtp1864883380-50549) [n:127.0.0.1:57696_solr c:testScheduledTrigger s:shard1 r:core_node6 x:testScheduledTrigger_shard1_replica_n4] o.a.s.c.SolrConfig Couldn't add files from /Users/jenkins/workspace/Lucene-Solr-master-MacOSX/solr/build/solr-core/test/J1/temp/solr.cloud.autoscaling.ScheduledTriggerIntegrationTest_1A059B6737127697-001/tempDir-001/node2/testScheduledTrigger_shard1_replica_n4/../../../../contrib/velocity/lib filtered by .*\.jar to classpath: /Users/jenkins/workspace/Lucene-Solr-master-MacOSX/solr/build/solr-core/test/J1/temp/solr.cloud.autoscaling.ScheduledTriggerIntegrationTest_1A059B6737127697-001/tempDir-001/node2/testScheduledTrigger_shard1_replica_n4/../../../../contrib/velocity/lib
   [junit4]   2> 3000405 WARN  (qtp1864883380-50547) [n:127.0.0.1:57696_solr c:testScheduledTrigger s:shard1 r:core_node3 x:testScheduledTrigger_shard1_replica_n1] o.a.s.c.SolrConfig Couldn't add files from /Users/jenkins/workspace/Lucene-Solr-master-MacOSX/solr/build/solr-core/test/J1/temp/solr.cloud.autoscaling.ScheduledTriggerIntegrationTest_1A059B6737127697-001/tempDir-001/node2/testScheduledTrigger_shard1_replica_n1/../../../../dist filtered by solr-ltr-\d.*\.jar to classpath: /Users/jenkins/workspace/Lucene-Solr-master-MacOSX/solr/build/solr-core/test/J1/temp/solr.cloud.autoscaling.ScheduledTriggerIntegrationTest_1A059B6737127697-001/tempDir-001/node2/testScheduledTrigger_shard1_replica_n1/../../../../dist
   [junit4]   2> 3000405 WARN  (qtp1864883380-50549) [n:127.0.0.1:57696_solr c:testScheduledTrigger s:shard1 r:core_node6 x:testScheduledTrigger_shard1_replica_n4] o.a.s.c.SolrConfig Couldn't add files from /Users/jenkins/workspace/Lucene-Solr-master-MacOSX/solr/build/solr-core/test/J1/temp/solr.cloud.autoscaling.ScheduledTriggerIntegrationTest_1A059B6737127697-001/tempDir-001/node2/testScheduledTrigger_shard1_replica_n4/../../../../dist filtered by solr-velocity-\d.*\.jar to classpath: /Users/jenkins/workspace/Lucene-Solr-master-MacOSX/solr/build/solr-core/test/J1/temp/solr.cloud.autoscaling.ScheduledTriggerIntegrationTest_1A059B6737127697-001/tempDir-001/node2/testScheduledTrigger_shard1_replica_n4/../../../../dist
   [junit4]   2> 3000405 WARN  (qtp1864883380-50549) [n:127.0.0.1:57696_solr c:testScheduledTrigger s:shard1 r:core_node6 x:testScheduledTrigger_shard1_replica_n4] o.a.s.c.SolrConfig Couldn't add files from /Users/jenkins/workspace/Lucene-Solr-master-MacOSX/solr/build/solr-core/test/J1/temp/solr.cloud.autoscaling.ScheduledTriggerIntegrationTest_1A059B6737127697-001/tempDir-001/node2/testScheduledTrigger_shard1_replica_n4/../../../../dist filtered by solr-ltr-\d.*\.jar to classpath: /Users/jenkins/workspace/Lucene-Solr-master-MacOSX/solr/build/solr-core/test/J1/temp/solr.cloud.autoscaling.ScheduledTriggerIntegrationTest_1A059B6737127697-001/tempDir-001/node2/testScheduledTrigger_shard1_replica_n4/../../../../dist
   [junit4]   2> 3000405 INFO  (qtp1864883380-50547) [n:127.0.0.1:57696_solr c:testScheduledTrigger s:shard1 r:core_node3 x:testScheduledTrigger_shard1_replica_n1] o.a.s.c.SolrConfig Using Lucene MatchVersion: 9.0.0
   [junit4]   2> 3000406 INFO  (qtp1864883380-50549) [n:127.0.0.1:57696_solr c:testScheduledTrigger s:shard1 r:core_node6 x:testScheduledTrigger_shard1_replica_n4] o.a.s.c.SolrConfig Using Lucene MatchVersion: 9.0.0
   [junit4]   2> 3000451 INFO  (qtp830439631-50558) [n:127.0.0.1:57697_solr c:testScheduledTrigger s:shard1 r:core_node5 x:testScheduledTrigger_shard1_replica_n2] o.a.s.s.IndexSchema [testScheduledTrigger_shard1_replica_n2] Schema name=default-config
   [junit4]   2> 3000451 INFO  (qtp1864883380-50549) [n:127.0.0.1:57696_solr c:testScheduledTrigger s:shard1 r:core_node6 x:testScheduledTrigger_shard1_replica_n4] o.a.s.s.IndexSchema [testScheduledTrigger_shard1_replica_n4] Schema name=default-config
   [junit4]   2> 3000456 INFO  (qtp1864883380-50547) [n:127.0.0.1:57696_solr c:testScheduledTrigger s:shard1 r:core_node3 x:testScheduledTrigger_shard1_replica_n1] o.a.s.s.IndexSchema [testScheduledTrigger_shard1_replica_n1] Schema name=default-config
   [junit4]   2> 3000598 DEBUG (ScheduledTrigger-16251-thread-2) [    ] o.a.s.c.a.NodeLostTrigger Running NodeLostTrigger: .auto_add_replicas with currently live nodes: 2 and last live nodes: 2
   [junit4]   2> 3000749 INFO  (qtp1864883380-50547) [n:127.0.0.1:57696_solr c:testScheduledTrigger s:shard1 r:core_node3 x:testScheduledTrigger_shard1_replica_n1] o.a.s.s.IndexSchema Loaded schema default-config/1.6 with uniqueid field id
   [junit4]   2> 3000765 INFO  (qtp1864883380-50549) [n:127.0.0.1:57696_solr c:testScheduledTrigger s:shard1 r:core_node6 x:testScheduledTrigger_shard1_replica_n4] o.a.s.s.IndexSchema Loaded schema default-config/1.6 with uniqueid field id
   [junit4]   2> 3000768 INFO  (qtp830439631-50558) [n:127.0.0.1:57697_solr c:testScheduledTrigger s:shard1 r:core_node5 x:testScheduledTrigger_shard1_replica_n2] o.a.s.s.IndexSchema Loaded schema default-config/1.6 with uniqueid field id
   [junit4]   2> 3000834 INFO  (qtp1864883380-50547) [n:127.0.0.1:57696_solr c:testScheduledTrigger s:shard1 r:core_node3 x:testScheduledTrigger_shard1_replica_n1] o.a.s.c.CoreContainer Creating SolrCore 'testScheduledTrigger_shard1_replica_n1' using configuration from collection testScheduledTrigger, trusted=true
   [junit4]   2> 3000834 INFO  (qtp1864883380-50547) [n:127.0.0.1:57696_solr c:testScheduledTrigger s:shard1 r:core_node3 x:testScheduledTrigger_shard1_replica_n1] o.a.s.m.r.SolrJmxReporter JMX monitoring for 'solr_57696.solr.core.testScheduledTrigger.shard1.replica_n1' (registry 'solr.core.testScheduledTrigger.shard1.replica_n1') enabled at server: com.sun.jmx.mbeanserver.JmxMBeanServer@7ba91a25
   [junit4]   2> 3000835 INFO  (qtp1864883380-50547) [n:127.0.0.1:57696_solr c:testScheduledTrigger s:shard1 r:core_node3 x:testScheduledTrigger_shard1_replica_n1] o.a.s.c.SolrCore [[testScheduledTrigger_shard1_replica_n1] ] Opening new SolrCore at [/Users/jenkins/workspace/Lucene-Solr-master-MacOSX/solr/build/solr-core/test/J1/temp/solr.cloud.autoscaling.ScheduledTriggerIntegrationTest_1A059B6737127697-001/tempDir-001/node2/testScheduledTrigger_shard1_replica_n1], dataDir=[/Users/jenkins/workspace/Lucene-Solr-master-MacOSX/solr/build/solr-core/test/J1/temp/solr.cloud.autoscaling.ScheduledTriggerIntegrationTest_1A059B6737127697-001/tempDir-001/node2/./testScheduledTrigger_shard1_replica_n1/data/]
   [junit4]   2> 3000846 INFO  (qtp1864883380-50547) [n:127.0.0.1:57696_solr c:testScheduledTrigger s:shard1 r:core_node3 x:testScheduledTrigger_shard1_replica_n1] o.a.s.r.XSLTResponseWriter xsltCacheLifetimeSeconds=5
   [junit4]   2> 3000857 INFO  (qtp1864883380-50549) [n:127.0.0.1:57696_solr c:testScheduledTrigger s:shard1 r:core_node6 x:testScheduledTrigger_shard1_replica_n4] o.a.s.c.CoreContainer Creating SolrCore 'testScheduledTrigger_shard1_replica_n4' using configuration from collection testScheduledTrigger, trusted=true
   [junit4]   2> 3000857 INFO  (qtp1864883380-50549) [n:127.0.0.1:57696_solr c:testScheduledTrigger s:shard1 r:core_node6 x:testScheduledTrigger_shard1_replica_n4] o.a.s.m.r.SolrJmxReporter JMX monitoring for 'solr_57696.solr.core.testScheduledTrigger.shard1.replica_n4' (registry 'solr.core.testScheduledTrigger.shard1.replica_n4') enabled at server: com.sun.jmx.mbeanserver.JmxMBeanServer@7ba91a25
   [junit4]   2> 3000857 INFO  (qtp1864883380-50549) [n:127.0.0.1:57696_solr c:testScheduledTrigger s:shard1 r:core_node6 x:testScheduledTrigger_shard1_replica_n4] o.a.s.c.SolrCore [[testScheduledTrigger_shard1_replica_n4] ] Opening new SolrCore at [/Users/jenkins/workspace/Lucene-Solr-master-MacOSX/solr/build/solr-core/test/J1/temp/solr.cloud.autoscaling.ScheduledTriggerIntegrationTest_1A059B6737127697-001/tempDir-001/node2/testScheduledTrigger_shard1_replica_n4], dataDir=[/Users/jenkins/workspace/Lucene-Solr-master-MacOSX/solr/build/solr-core/test/J1/temp/solr.cloud.autoscaling.ScheduledTriggerIntegrationTest_1A059B6737127697-001/tempDir-001/node2/./testScheduledTrigger_shard1_replica_n4/data/]
   [junit4]   2> 3000864 INFO  (qtp1864883380-50549) [n:127.0.0.1:57696_solr c:testScheduledTrigger s:shard1 r:core_node6 x:testScheduledTrigger_shard1_replica_n4] o.a.s.r.XSLTResponseWriter xsltCacheLifetimeSeconds=5
   [junit4]   2> 3000906 INFO  (qtp830439631-50558) [n:127.0.0.1:57697_solr c:testScheduledTrigger s:shard1 r:core_node5 x:testScheduledTrigger_shard1_replica_n2] o.a.s.c.CoreContainer Creating SolrCore 'testScheduledTrigger_shard1_replica_n2' using configuration from collection testScheduledTrigger, trusted=true
   [junit4]   2> 3000906 INFO  (qtp830439631-50558) [n:127.0.0.1:57697_solr c:testScheduledTrigger s:shard1 r:core_node5 x:testScheduledTrigger_shard1_replica_n2] o.a.s.m.r.SolrJmxReporter JMX monitoring for 'solr_57697.solr.core.testScheduledTrigger.shard1.replica_n2' (registry 'solr.core.testScheduledTrigger.shard1.replica_n2') enabled at server: com.sun.jmx.mbeanserver.JmxMBeanServer@7ba91a25
   [junit4]   2> 3000906 INFO  (qtp830439631-50558) [n:127.0.0.1:57697_solr c:testScheduledTrigger s:shard1 r:core_node5 x:testScheduledTrigger_shard1_replica_n2] o.a.s.c.SolrCore [[testScheduledTrigger_shard1_replica_n2] ] Opening new SolrCore at [/Users/jenkins/workspace/Lucene-Solr-master-MacOSX/solr/build/solr-core/test/J1/temp/solr.cloud.autoscaling.ScheduledTriggerIntegrationTest_1A059B6737127697-001/tempDir-001/node1/testScheduledTrigger_shard1_replica_n2], dataDir=[/Users/jenkins/workspace/Lucene-Solr-master-MacOSX/solr/build/solr-core/test/J1/temp/solr.cloud.autoscaling.ScheduledTriggerIntegrationTest_1A059B6737127697-001/tempDir-001/node1/./testScheduledTrigger_shard1_replica_n2/data/]
   [junit4]   2> 3000910 INFO  (qtp830439631-50558) [n:127.0.0.1:57697_solr c:testScheduledTrigger s:shard1 r:core_node5 x:testScheduledTrigger_shard1_replica_n2] o.a.s.r.XSLTResponseWriter xsltCacheLifetimeSeconds=5
   [junit4]   2> 3001163 INFO  (qtp1864883380-50549) [n:127.0.0.1:57696_solr c:testScheduledTrigger s:shard1 r:core_node6 x:testScheduledTrigger_shard1_replica_n4] o.a.s.u.UpdateHandler Using UpdateLog implementation: org.apache.solr.update.UpdateLog
   [junit4]   2> 3001163 INFO  (qtp1864883380-50549) [n:127.0.0.1:57696_solr c:testScheduledTrigger s:shard1 r:core_node6 x:testScheduledTrigger_shard1_replica_n4] o.a.s.u.UpdateLog Initializing UpdateLog: dataDir= defaultSyncLevel=FLUSH numRecordsToKeep=100 maxNumLogsToKeep=10 numVersionBuckets=65536
   [junit4]   2> 3001167 INFO  (qtp1864883380-50549) [n:127.0.0.1:57696_solr c:testScheduledTrigger s:shard1 r:core_node6 x:testScheduledTrigger_shard1_replica_n4] o.a.s.u.CommitTracker Hard AutoCommit: if uncommitted for 15000ms; 
   [junit4]   2> 3001167 INFO  (qtp1864883380-50549) [n:127.0.0.1:57696_solr c:testScheduledTrigger s:shard1 r:core_node6 x:testScheduledTrigger_shard1_replica_n4] o.a.s.u.CommitTracker Soft AutoCommit: disabled
   [junit4]   2> 3001171 INFO  (qtp830439631-50558) [n:127.0.0.1:57697_solr c:testScheduledTrigger s:shard1 r:core_node5 x:testScheduledTrigger_shard1_replica_n2] o.a.s.u.UpdateHandler Using UpdateLog implementation: org.apache.solr.update.UpdateLog
   [junit4]   2> 3001171 INFO  (qtp830439631-50558) [n:127.0.0.1:57697_solr c:testScheduledTrigger s:shard1 r:core_node5 x:testScheduledTrigger_shard1_replica_n2] o.a.s.u.UpdateLog Initializing UpdateLog: dataDir= defaultSyncLevel=FLUSH numRecordsToKeep=100 maxNumLogsToKeep=10 numVersionBuckets=65536
   [junit4]   2> 3001173 INFO  (qtp830439631-50558) [n:127.0.0.1:57697_solr c:testScheduledTrigger s:shard1 r:core_node5 x:testScheduledTrigger_shard1_replica_n2] o.a.s.u.CommitTracker Hard AutoCommit: if uncommitted for 15000ms; 
   [junit4]   2> 3001173 INFO  (qtp830439631-50558) [n:127.0.0.1:57697_solr c:testScheduledTrigger s:shard1 r:core_node5 x:testScheduledTrigger_shard1_replica_n2] o.a.s.u.CommitTracker Soft AutoCommit: disabled
   [junit4]   2> 3001175 INFO  (qtp1864883380-50549) [n:127.0.0.1:57696_solr c:testScheduledTrigger s:shard1 r:core_node6 x:testScheduledTrigger_shard1_replica_n4] o.a.s.s.SolrIndexSearcher Opening [Searcher@307ba95e[testScheduledTrigger_shard1_replica_n4] main]
   [junit4]   2> 3001176 INFO  (qtp830439631-50558) [n:127.0.0.1:57697_solr c:testScheduledTrigger s:shard1 r:core_node5 x:testScheduledTrigger_shard1_replica_n2] o.a.s.s.SolrIndexSearcher Opening [Searcher@366a1995[testScheduledTrigger_shard1_replica_n2] main]
   [junit4]   2> 3001177 INFO  (qtp1864883380-50549) [n:127.0.0.1:57696_solr c:testScheduledTrigger s:shard1 r:core_node6 x:testScheduledTrigger_shard1_replica_n4] o.a.s.r.ManagedResourceStorage Configured ZooKeeperStorageIO with znodeBase: /configs/testScheduledTrigger.AUTOCREATED
   [junit4]   2> 3001183 INFO  (qtp1864883380-50547) [n:127.0.0.1:57696_solr c:testScheduledTrigger s:shard1 r:core_node3 x:testScheduledTrigger_shard1_replica_n1] o.a.s.u.UpdateHandler Using UpdateLog implementation: org.apache.solr.update.UpdateLog
   [junit4]   2> 3001184 INFO  (qtp830439631-50558) [n:127.0.0.1:57697_solr c:testScheduledTrigger s:shard1 r:core_node5 x:testScheduledTrigger_shard1_replica_n2] o.a.s.r.ManagedResourceStorage Configured ZooKeeperStorageIO with znodeBase: /configs/testScheduledTrigger.AUTOCREATED
   [junit4]   2> 3001185 INFO  (qtp1864883380-50549) [n:127.0.0.1:57696_solr c:testScheduledTrigger s:shard1 r:core_node6 x:testScheduledTrigger_shard1_replica_n4] o.a.s.r.ManagedResourceStorage Loaded null at path _rest_managed.json using ZooKeeperStorageIO:path=/configs/testScheduledTrigger.AUTOCREATED
   [junit4]   2> 3001185 INFO  (qtp1864883380-50549) [n:127.0.0.1:57696_solr c:testScheduledTrigger s:shard1 r:core_node6 x:testScheduledTrigger_shard1_replica_n4] o.a.s.s.ZkIndexSchemaReader Creating ZooKeeper watch for the managed schema at /configs/testScheduledTrigger.AUTOCREATED/managed-schema
   [junit4]   2> 3001186 INFO  (qtp1864883380-50547) [n:127.0.0.1:57696_solr c:testScheduledTrigger s:shard1 r:core_node3 x:testScheduledTrigger_shard1_replica_n1] o.a.s.u.UpdateLog Initializing UpdateLog: dataDir= defaultSyncLevel=FLUSH numRecordsToKeep=100 maxNumLogsToKeep=10 numVersionBuckets=65536
   [junit4]   2> 3001186 INFO  (qtp830439631-50558) [n:127.0.0.1:57697_solr c:testScheduledTrigger s:shard1 r:core_node5 x:testScheduledTrigger_shard1_replica_n2] o.a.s.r.ManagedResourceStorage Loaded null at path _rest_managed.json using ZooKeeperStorageIO:path=/configs/testScheduledTrigger.AUTOCREATED
   [junit4]   2> 3001187 INFO  (qtp830439631-50558) [n:127.0.0.1:57697_solr c:testScheduledTrigger s:shard1 r:core_node5 x:testScheduledTrigger_shard1_replica_n2] o.a.s.s.ZkIndexSchemaReader Creating ZooKeeper watch for the managed schema at /configs/testScheduledTrigger.AUTOCREATED/managed-schema
   [junit4]   2> 3001187 INFO  (qtp1864883380-50549) [n:127.0.0.1:57696_solr c:testScheduledTrigger s:shard1 r:core_node6 x:testScheduledTrigger_shard1_replica_n4] o.a.s.s.ZkIndexSchemaReader Current schema version 0 is already the latest
   [junit4]   2> 3001187 INFO  (qtp1864883380-50549) [n:127.0.0.1:57696_solr c:testScheduledTrigger s:shard1 r:core_node6 x:testScheduledTrigger_shard1_replica_n4] o.a.s.h.c.SpellCheckComponent Initializing spell checkers
   [junit4]   2> 3001188 INFO  (qtp1864883380-50549) [n:127.0.0.1:57696_solr c:testScheduledTrigger s:shard1 r:core_node6 x:testScheduledTrigger_shard1_replica_n4] o.a.s.s.DirectSolrSpellChecker init: {name=default,field=_text_,classname=solr.DirectSolrSpellChecker,distanceMeasure=internal,accuracy=0.5,maxEdits=2,minPrefix=1,maxInspections=5,minQueryLength=4,maxQueryFrequency=0.01}
   [junit4]   2> 3001188 INFO  (qtp830439631-50558) [n:127.0.0.1:57697_solr c:testScheduledTrigger s:shard1 r:core_node5 x:testScheduledTrigger_shard1_replica_n2] o.a.s.s.ZkIndexSchemaReader Current schema version 0 is already the latest
   [junit4]   2> 3001189 INFO  (qtp1864883380-50549) [n:127.0.0.1:57696_solr c:testScheduledTrigger s:shard1 r:core_node6 x:testScheduledTrigger_shard1_replica_n4] o.a.s.h.ReplicationHandler Commits will be reserved for 10000ms.
   [junit4]   2> 3001204 INFO  (qtp1864883380-50549) [n:127.0.0.1:57696_solr c:testScheduledTrigger s:shard1 r:core_node6 x:testScheduledTrigger_shard1_replica_n4] o.a.s.u.UpdateLog Could not find max version in index or recent updates, using new clock 1633821257573072896
   [junit4]   2> 3001205 INFO  (qtp1864883380-50547) [n:127.0.0.1:57696_solr c:testScheduledTrigger s:shard1 r:core_node3 x:testScheduledTrigger_shard1_replica_n1] o.a.s.u.CommitTracker Hard AutoCommit: if uncommitted for 15000ms; 
   [junit4]   2> 3001205 INFO  (qtp1864883380-50547) [n:127.0.0.1:57696_solr c:testScheduledTrigger s:shard1 r:core_node3 x:testScheduledTrigger_shard1_replica_n1] o.a.s.u.CommitTracker Soft AutoCommit: disabled
   [junit4]   2> 3001209 INFO  (searcherExecutor-16263-thread-1-processing-n:127.0.0.1:57696_solr x:testScheduledTrigger_shard1_replica_n4 c:testScheduledTrigger s:shard1 r:core_node6) [n:127.0.0.1:57696_solr c:testScheduledTrigger s:shard1 r:core_node6 x:testScheduledTrigger_shard1_replica_n4] o.a.s.c.QuerySenderListener QuerySenderListener sending requests to Searche

[...truncated too long message...]

> 60526 INFO  (jetty-closer-252-thread-1) [    ] o.e.j.s.h.ContextHandler Stopped o.e.j.s.ServletContextHandler@2067b052{/solr,null,UNAVAILABLE}
   [junit4]   2> 60527 INFO  (jetty-closer-252-thread-1) [    ] o.e.j.s.session node0 Stopped scavenging
   [junit4]   2> 60529 INFO  (zkCallback-247-thread-1) [    ] o.a.s.c.c.ZkStateReader Updated live nodes from ZooKeeper... (2) -> (1)
   [junit4]   2> 60529 INFO  (zkCallback-240-thread-2) [    ] o.a.s.c.OverseerElectionContext I am going to be the leader 127.0.0.1:51651_solr
   [junit4]   2> 60529 INFO  (zkCallback-240-thread-1) [    ] o.a.s.c.c.ZkStateReader Updated live nodes from ZooKeeper... (2) -> (1)
   [junit4]   2> 60530 INFO  (jetty-closer-252-thread-3) [    ] o.a.s.m.SolrMetricManager Closing metric reporters for registry=solr.node, tag=null
   [junit4]   2> 60530 INFO  (jetty-closer-252-thread-3) [    ] o.a.s.m.r.SolrJmxReporter Closing reporter [org.apache.solr.metrics.reporters.SolrJmxReporter@6ebf55b9: rootName = solr_51651, domain = solr.node, service url = null, agent id = null] for registry solr.node / com.codahale.metrics.MetricRegistry@648b7574
   [junit4]   2> 60532 INFO  (jetty-closer-252-thread-2) [    ] o.e.j.s.AbstractConnector Stopped ServerConnector@30e574c7{HTTP/1.1,[http/1.1, h2c]}{127.0.0.1:0}
   [junit4]   2> 60533 INFO  (jetty-closer-252-thread-2) [    ] o.e.j.s.h.ContextHandler Stopped o.e.j.s.ServletContextHandler@1440771b{/solr,null,UNAVAILABLE}
   [junit4]   2> 60534 INFO  (jetty-closer-252-thread-2) [    ] o.e.j.s.session node0 Stopped scavenging
   [junit4]   2> 60537 INFO  (jetty-closer-252-thread-3) [    ] o.a.s.m.SolrMetricManager Closing metric reporters for registry=solr.jvm, tag=null
   [junit4]   2> 60537 INFO  (jetty-closer-252-thread-3) [    ] o.a.s.m.r.SolrJmxReporter Closing reporter [org.apache.solr.metrics.reporters.SolrJmxReporter@1e7aaa3: rootName = solr_51651, domain = solr.jvm, service url = null, agent id = null] for registry solr.jvm / com.codahale.metrics.MetricRegistry@2912696d
   [junit4]   2> 60540 INFO  (jetty-closer-252-thread-3) [    ] o.a.s.m.SolrMetricManager Closing metric reporters for registry=solr.jetty, tag=null
   [junit4]   2> 60540 INFO  (jetty-closer-252-thread-3) [    ] o.a.s.m.r.SolrJmxReporter Closing reporter [org.apache.solr.metrics.reporters.SolrJmxReporter@2fa0943d: rootName = solr_51651, domain = solr.jetty, service url = null, agent id = null] for registry solr.jetty / com.codahale.metrics.MetricRegistry@56c6d70a
   [junit4]   2> 60540 INFO  (jetty-closer-252-thread-3) [    ] o.a.s.m.SolrMetricManager Closing metric reporters for registry=solr.cluster, tag=null
   [junit4]   2> 60550 INFO  (jetty-closer-252-thread-3) [    ] o.e.j.s.AbstractConnector Stopped ServerConnector@ca631d7{HTTP/1.1,[http/1.1, h2c]}{127.0.0.1:0}
   [junit4]   2> 60550 INFO  (jetty-closer-252-thread-3) [    ] o.e.j.s.h.ContextHandler Stopped o.e.j.s.ServletContextHandler@1492b90f{/solr,null,UNAVAILABLE}
   [junit4]   2> 60551 INFO  (jetty-closer-252-thread-3) [    ] o.e.j.s.session node0 Stopped scavenging
   [junit4]   2> 60553 INFO  (TEST-ScheduledTriggerIntegrationTest.testScheduledTrigger-seed#[1A059B6737127697]) [    ] o.a.s.c.ZkTestServer Shutting down ZkTestServer.
   [junit4]   2> 60558 WARN  (ZkTestServer Run Thread) [    ] o.a.s.c.ZkTestServer Watch limit violations: 
   [junit4]   2> Maximum concurrent create/delete watches above limit:
   [junit4]   2> 
   [junit4]   2> 	14	/solr/collections/testScheduledTrigger/terms/shard1
   [junit4]   2> 	7	/solr/aliases.json
   [junit4]   2> 	7	/solr/clusterprops.json
   [junit4]   2> 	4	/solr/configs/testScheduledTrigger.AUTOCREATED/managed-schema
   [junit4]   2> 	3	/solr/security.json
   [junit4]   2> 	3	/solr/configs/testScheduledTrigger.AUTOCREATED
   [junit4]   2> 
   [junit4]   2> Maximum concurrent data watches above limit:
   [junit4]   2> 
   [junit4]   2> 	36	/solr/collections/testScheduledTrigger/state.json
   [junit4]   2> 	7	/solr/clusterstate.json
   [junit4]   2> 	3	/solr/collections/testScheduledTrigger/leader_elect/shard1/election/72157308085993480-core_node5-n_0000000000
   [junit4]   2> 
   [junit4]   2> Maximum concurrent children watches above limit:
   [junit4]   2> 
   [junit4]   2> 	7	/solr/live_nodes
   [junit4]   2> 	7	/solr/collections
   [junit4]   2> 
   [junit4]   2> 60775 INFO  (TEST-ScheduledTriggerIntegrationTest.testScheduledTrigger-seed#[1A059B6737127697]) [    ] o.a.s.c.ZkTestServer parse host and port list: 127.0.0.1:51628
   [junit4]   2> 60776 INFO  (TEST-ScheduledTriggerIntegrationTest.testScheduledTrigger-seed#[1A059B6737127697]) [    ] o.a.s.c.ZkTestServer connecting to 127.0.0.1 51628
   [junit4]   2> 60777 INFO  (TEST-ScheduledTriggerIntegrationTest.testScheduledTrigger-seed#[1A059B6737127697]) [    ] o.a.s.SolrTestCaseJ4 ###Ending testScheduledTrigger
   [junit4]   2> NOTE: reproduce with: ant test  -Dtestcase=ScheduledTriggerIntegrationTest -Dtests.method=testScheduledTrigger -Dtests.seed=1A059B6737127697 -Dtests.slow=true -Dtests.badapples=true -Dtests.locale=so -Dtests.timezone=Africa/Mogadishu -Dtests.asserts=true -Dtests.file.encoding=UTF-8
   [junit4] FAILURE 13.2s J1 | ScheduledTriggerIntegrationTest.testScheduledTrigger <<<
   [junit4]    > Throwable #1: java.lang.AssertionError: expected:<1> but was:<3>
   [junit4]    > 	at __randomizedtesting.SeedInfo.seed([1A059B6737127697:891ED31569EF2DA3]:0)
   [junit4]    > 	at org.apache.solr.cloud.autoscaling.ScheduledTriggerIntegrationTest.testScheduledTrigger(ScheduledTriggerIntegrationTest.java:119)
   [junit4]    > 	at java.base/jdk.internal.reflect.NativeMethodAccessorImpl.invoke0(Native Method)
   [junit4]    > 	at java.base/jdk.internal.reflect.NativeMethodAccessorImpl.invoke(NativeMethodAccessorImpl.java:62)
   [junit4]    > 	at java.base/jdk.internal.reflect.DelegatingMethodAccessorImpl.invoke(DelegatingMethodAccessorImpl.java:43)
   [junit4]    > 	at java.base/java.lang.reflect.Method.invoke(Method.java:566)
   [junit4]    > 	at java.base/java.lang.Thread.run(Thread.java:834)
   [junit4]   2> NOTE: leaving temporary files on disk at: /Users/jenkins/workspace/Lucene-Solr-master-MacOSX/solr/build/solr-core/test/J1/temp/solr.cloud.autoscaling.ScheduledTriggerIntegrationTest_1A059B6737127697-002
   [junit4]   2> May 17, 2019 11:35:11 PM com.carrotsearch.randomizedtesting.ThreadLeakControl checkThreadLeaks
   [junit4]   2> WARNING: Will linger awaiting termination of 1 leaked thread(s).
   [junit4]   2> NOTE: test params are: codec=FastCompressingStoredFields(storedFieldsFormat=CompressingStoredFieldsFormat(compressionMode=FAST, chunkSize=3, maxDocsPerChunk=5, blockSize=2), termVectorsFormat=CompressingTermVectorsFormat(compressionMode=FAST, chunkSize=3, blockSize=2)), sim=Asserting(org.apache.lucene.search.similarities.AssertingSimilarity@63affd7e), locale=so, timezone=Africa/Mogadishu
   [junit4]   2> NOTE: Mac OS X 10.11.6 x86_64/Oracle Corporation 11.0.2 (64-bit)/cpus=3,threads=1,free=121430960,total=261095424
   [junit4]   2> NOTE: All tests run in this JVM: [ScheduledTriggerIntegrationTest, ScheduledTriggerIntegrationTest, ScheduledTriggerIntegrationTest]
   [junit4] Completed [5/5 (3!)] on J1 in 13.58s, 1 test, 1 failure <<< FAILURES!
   [junit4] 
   [junit4] 
   [junit4] Tests with failures [seed: 1A059B6737127697]:
   [junit4]   - org.apache.solr.cloud.autoscaling.ScheduledTriggerIntegrationTest.testScheduledTrigger
   [junit4]   - org.apache.solr.cloud.autoscaling.ScheduledTriggerIntegrationTest.testScheduledTrigger
   [junit4]   - org.apache.solr.cloud.autoscaling.ScheduledTriggerIntegrationTest.testScheduledTrigger
   [junit4] 
   [junit4] 
   [junit4] JVM J0:     1.28 ..    48.23 =    46.95s
   [junit4] JVM J1:     1.51 ..    61.77 =    60.26s
   [junit4] Execution time total: 1 minute 1 second
   [junit4] Tests summary: 5 suites, 5 tests, 3 failures

BUILD FAILED
/Users/jenkins/workspace/Lucene-Solr-master-MacOSX/lucene/common-build.xml:1493: The following error occurred while executing this line:
/Users/jenkins/workspace/Lucene-Solr-master-MacOSX/lucene/common-build.xml:1020: There were test failures: 5 suites, 5 tests, 3 failures [seed: 1A059B6737127697]

Total time: 1 minute 5 seconds

[repro] Setting last failure code to 256

[repro] Failures:
[repro]   3/5 failed: org.apache.solr.cloud.autoscaling.ScheduledTriggerIntegrationTest
[repro] Exiting with code 256
+ mv lucene/build lucene/build.repro
+ mv solr/build solr/build.repro
+ mv lucene/build.orig lucene/build
+ mv solr/build.orig solr/build
Archiving artifacts
Setting ANT_1_8_2_HOME=/Users/jenkins/tools/hudson.tasks.Ant_AntInstallation/ANT_1.8.2
[WARNINGS] Parsing warnings in console log with parser Java Compiler (javac)
Setting ANT_1_8_2_HOME=/Users/jenkins/tools/hudson.tasks.Ant_AntInstallation/ANT_1.8.2
No credentials specified
Setting ANT_1_8_2_HOME=/Users/jenkins/tools/hudson.tasks.Ant_AntInstallation/ANT_1.8.2
<Git Blamer> Using GitBlamer to create author and commit information for all warnings.
<Git Blamer> GIT_COMMIT=18cb42ee80854e2159201fe550b13d894425a4f8, workspace=/Users/jenkins/workspace/Lucene-Solr-master-MacOSX
[WARNINGS] Computing warning deltas based on reference build #5148
Recording test results
Setting ANT_1_8_2_HOME=/Users/jenkins/tools/hudson.tasks.Ant_AntInstallation/ANT_1.8.2
Build step 'Publish JUnit test result report' changed build result to UNSTABLE
Email was triggered for: Unstable (Test Failures)
Sending email for trigger: Unstable (Test Failures)
Setting ANT_1_8_2_HOME=/Users/jenkins/tools/hudson.tasks.Ant_AntInstallation/ANT_1.8.2
Setting ANT_1_8_2_HOME=/Users/jenkins/tools/hudson.tasks.Ant_AntInstallation/ANT_1.8.2
Setting ANT_1_8_2_HOME=/Users/jenkins/tools/hudson.tasks.Ant_AntInstallation/ANT_1.8.2
Setting ANT_1_8_2_HOME=/Users/jenkins/tools/hudson.tasks.Ant_AntInstallation/ANT_1.8.2
Setting ANT_1_8_2_HOME=/Users/jenkins/tools/hudson.tasks.Ant_AntInstallation/ANT_1.8.2
Setting ANT_1_8_2_HOME=/Users/jenkins/tools/hudson.tasks.Ant_AntInstallation/ANT_1.8.2

Mime
View raw message